<svg width="32" height="32" viewBox="0 0 32 32"  xmlns="http://www.w3.org/2000/svg">
<path d="M9.6 4.48C5.0125 4.48 1.28 8.2125 1.28 12.8C1.28 22.2475 11.965 26.91 15.6 29.94L16 30.28L16.4 29.94C20.035 26.91 30.72 22.2475 30.72 12.8C30.72 8.2125 26.9875 4.48 22.4 4.48C19.805 4.48 17.525 5.7125 16 7.58C14.475 5.7125 12.195 4.48 9.6 4.48ZM9.6 5.76C12.055 5.76 14.2 7.02 15.46 8.92L16 9.72L16.54 8.92C17.8 7.02 19.945 5.76 22.4 5.76C26.295 5.76 29.44 8.905 29.44 12.8C29.44 21.055 20.22 25.3275 16 28.66C11.78 25.3275 2.56 21.055 2.56 12.8C2.56 8.905 5.705 5.76 9.6 5.76Z" />
</svg>
