<svg width="32" height="32" viewBox="0 0 32 32"  xmlns="http://www.w3.org/2000/svg">
<path d="M9.59249 2.555C9.33249 2.555 9.09999 2.7125 8.99999 2.9525C8.90249 3.195 8.95999 3.47 9.14749 3.6525L21.495 16L9.14749 28.3475C8.97999 28.5075 8.91249 28.7475 8.97249 28.97C9.02999 29.195 9.20499 29.37 9.42999 29.4275C9.65249 29.4875 9.89249 29.42 10.0525 29.2525L22.8525 16.4525C23.1025 16.2025 23.1025 15.7975 22.8525 15.5475L10.0525 2.7475C9.93249 2.6225 9.76749 2.555 9.59249 2.555Z" />
</svg>
