<svg width="32" height="32" viewBox="0 0 32 32"  xmlns="http://www.w3.org/2000/svg">
<path d="M16.56 2.17999C13.57 2.23499 11.66 3.44249 10.84 5.31999C10.0575 7.10749 10.2325 9.36499 10.8 11.7C10.495 12.0575 10.2525 12.5375 10.34 13.26C10.435 14.0475 10.6525 14.6075 10.96 15C11.13 15.215 11.3525 15.235 11.56 15.34C11.6725 16.01 11.86 16.68 12.14 17.24C12.3 17.5625 12.4825 17.86 12.66 18.1C12.74 18.2075 12.855 18.27 12.94 18.36C12.945 19.15 12.9475 19.8075 12.88 20.64C12.6725 21.1425 12.1875 21.5475 11.4 21.94C10.5875 22.345 9.52999 22.72 8.45999 23.18C7.38999 23.64 6.28999 24.2 5.41999 25.08C4.54999 25.96 3.93499 27.1675 3.83999 28.76L3.79999 29.44H29.48L29.44 28.76C29.345 27.1675 28.7275 25.96 27.86 25.08C26.9925 24.2 25.905 23.64 24.84 23.18C23.775 22.72 22.73 22.345 21.92 21.94C21.1425 21.55 20.6525 21.155 20.44 20.66C20.37 19.8175 20.375 19.1575 20.38 18.36C20.465 18.2675 20.58 18.2075 20.66 18.1C20.835 17.8575 21.0025 17.56 21.16 17.24C21.4325 16.68 21.63 16.0075 21.74 15.34C21.94 15.235 22.155 15.21 22.32 15C22.6275 14.6075 22.845 14.0475 22.94 13.26C23.025 12.56 22.79 12.0975 22.5 11.74C22.8125 10.725 23.2125 9.08499 23.08 7.39999C23.0075 6.47999 22.7725 5.56249 22.22 4.79999C21.715 4.09999 20.895 3.58999 19.86 3.37999C19.1875 2.50749 17.9775 2.17999 16.58 2.17999H16.56ZM16.58 3.45999C16.5875 3.45999 16.5925 3.45999 16.6 3.45999C17.8875 3.46499 18.7225 3.84249 18.96 4.25999L19.12 4.51999L19.42 4.55999C20.31 4.68249 20.82 5.04249 21.18 5.53999C21.54 6.03749 21.74 6.73249 21.8 7.49999C21.92 9.03499 21.4775 10.8225 21.2 11.66L21.04 12.16L21.48 12.42C21.4525 12.4025 21.725 12.5875 21.66 13.12C21.585 13.7475 21.435 14.0725 21.32 14.22C21.205 14.3675 21.145 14.36 21.14 14.36L20.6 14.4L20.54 14.92C20.48 15.4725 20.2575 16.15 20 16.68C19.87 16.945 19.7375 17.1775 19.62 17.34C19.5025 17.5025 19.38 17.5925 19.44 17.56L19.1 17.74V18.12C19.1 19.0475 19.0625 19.8075 19.16 20.88V20.96L19.2 21.04C19.565 22.0225 20.41 22.635 21.34 23.1C22.27 23.565 23.3375 23.9075 24.34 24.34C25.3425 24.7725 26.26 25.29 26.94 25.98C27.48 26.5275 27.82 27.2525 28 28.16H5.27999C5.45999 27.255 5.79749 26.5275 6.33999 25.98C7.02249 25.29 7.95249 24.7725 8.95999 24.34C9.96749 23.9075 11.0275 23.565 11.96 23.1C12.8925 22.635 13.755 22.0225 14.12 21.04L14.16 20.88C14.2575 19.8075 14.22 19.0475 14.22 18.12V17.74L13.88 17.56C13.9375 17.59 13.8 17.5025 13.68 17.34C13.56 17.1775 13.4125 16.945 13.28 16.68C13.015 16.15 12.7975 15.4675 12.74 14.92L12.68 14.4L12.14 14.36C12.135 14.36 12.075 14.3675 11.96 14.22C11.845 14.0725 11.695 13.7475 11.62 13.12C11.5575 12.5875 11.8275 12.4025 11.8 12.42L12.22 12.16L12.1 11.7C11.4975 9.37999 11.3925 7.27249 12.02 5.83999C12.645 4.41249 13.92 3.51499 16.58 3.45999Z" />
</svg>
