<svg width="32" height="32" viewBox="0 0 32 32"  xmlns="http://www.w3.org/2000/svg">
<path d="M26.24 1.28C23.7734 1.28 21.76 3.29334 21.76 5.76C21.76 6.93951 22.2236 8.01212 22.9738 8.81375L17.6163 15.36H10.1888C9.87571 13.1952 8.00888 11.52 5.76003 11.52C3.29337 11.52 1.28003 13.5333 1.28003 16C1.28003 18.4667 3.29337 20.48 5.76003 20.48C8.00888 20.48 9.87571 18.8048 10.1888 16.64H17.6013L22.7425 23.45C22.1291 24.2167 21.76 25.1861 21.76 26.24C21.76 28.7067 23.7734 30.72 26.24 30.72C28.7067 30.72 30.72 28.7067 30.72 26.24C30.72 23.7733 28.7067 21.76 26.24 21.76C25.2898 21.76 24.409 22.0616 23.6825 22.57L18.7338 16.0162L23.9713 9.61375C24.6381 10.0084 25.4121 10.24 26.24 10.24C28.7067 10.24 30.72 8.22665 30.72 5.76C30.72 3.29334 28.7067 1.28 26.24 1.28ZM26.24 2.56C28.0149 2.56 29.44 3.98511 29.44 5.76C29.44 7.53489 28.0149 8.96 26.24 8.96C24.4651 8.96 23.04 7.53489 23.04 5.76C23.04 3.98511 24.4651 2.56 26.24 2.56ZM5.76003 12.8C7.53492 12.8 8.96003 14.2251 8.96003 16C8.96003 17.7749 7.53492 19.2 5.76003 19.2C3.98514 19.2 2.56003 17.7749 2.56003 16C2.56003 14.2251 3.98514 12.8 5.76003 12.8ZM26.24 23.04C28.0149 23.04 29.44 24.4651 29.44 26.24C29.44 28.0149 28.0149 29.44 26.24 29.44C24.4651 29.44 23.04 28.0149 23.04 26.24C23.04 24.4651 24.4651 23.04 26.24 23.04Z" />
</svg>
