%YAML 1.1
%TAG !u! tag:unity3d.com,2011:
--- !u!1001 &194165301794048218
PrefabInstance:
  m_ObjectHideFlags: 0
  serializedVersion: 2
  m_Modification:
    m_TransformParent: {fileID: 0}
    m_Modifications:
    - target: {fileID: 941460555903308124, guid: 514874908782cae419e2427ad82da8ce,
        type: 3}
      propertyPath: m_Name
      value: Platform_Wall
      objectReference: {fileID: 0}
    - target: {fileID: 941460555903308125, guid: 514874908782cae419e2427ad82da8ce,
        type: 3}
      propertyPath: m_LocalPosition.x
      value: 0
      objectReference: {fileID: 0}
    - target: {fileID: 941460555903308125, guid: 514874908782cae419e2427ad82da8ce,
        type: 3}
      propertyPath: m_LocalPosition.y
      value: 0
      objectReference: {fileID: 0}
    - target: {fileID: 941460555903308125, guid: 514874908782cae419e2427ad82da8ce,
        type: 3}
      propertyPath: m_LocalPosition.z
      value: 0
      objectReference: {fileID: 0}
    - target: {fileID: 941460555903308125, guid: 514874908782cae419e2427ad82da8ce,
        type: 3}
      propertyPath: m_LocalRotation.x
      value: 0
      objectReference: {fileID: 0}
    - target: {fileID: 941460555903308125, guid: 514874908782cae419e2427ad82da8ce,
        type: 3}
      propertyPath: m_LocalRotation.y
      value: 0
      objectReference: {fileID: 0}
    - target: {fileID: 941460555903308125, guid: 514874908782cae419e2427ad82da8ce,
        type: 3}
      propertyPath: m_LocalRotation.z
      value: 0
      objectReference: {fileID: 0}
    - target: {fileID: 941460555903308125, guid: 514874908782cae419e2427ad82da8ce,
        type: 3}
      propertyPath: m_LocalRotation.w
      value: 1
      objectReference: {fileID: 0}
    - target: {fileID: 941460555903308125, guid: 514874908782cae419e2427ad82da8ce,
        type: 3}
      propertyPath: m_RootOrder
      value: 0
      objectReference: {fileID: 0}
    - target: {fileID: 941460555903308125, guid: 514874908782cae419e2427ad82da8ce,
        type: 3}
      propertyPath: m_LocalEulerAnglesHint.x
      value: 0
      objectReference: {fileID: 0}
    - target: {fileID: 941460555903308125, guid: 514874908782cae419e2427ad82da8ce,
        type: 3}
      propertyPath: m_LocalEulerAnglesHint.y
      value: 0
      objectReference: {fileID: 0}
    - target: {fileID: 941460555903308125, guid: 514874908782cae419e2427ad82da8ce,
        type: 3}
      propertyPath: m_LocalEulerAnglesHint.z
      value: 0
      objectReference: {fileID: 0}
    - target: {fileID: 941460555903308126, guid: 514874908782cae419e2427ad82da8ce,
        type: 3}
      propertyPath: m_Sprite
      value: 
      objectReference: {fileID: 21300000, guid: 427c40dd59a0189429ac0ced6539b4fe,
        type: 3}
    - target: {fileID: 941460555903308127, guid: 514874908782cae419e2427ad82da8ce,
        type: 3}
      propertyPath: m_SpriteTilingProperty.pivot.y
      value: 0
      objectReference: {fileID: 0}
    - target: {fileID: 941460555903308127, guid: 514874908782cae419e2427ad82da8ce,
        type: 3}
      propertyPath: m_Enabled
      value: 0
      objectReference: {fileID: 0}
    m_RemovedComponents: []
  m_SourcePrefab: {fileID: 100100000, guid: 514874908782cae419e2427ad82da8ce, type: 3}
