%YAML 1.1
%TAG !u! tag:unity3d.com,2011:
--- !u!114 &11400000
MonoBehaviour:
  m_ObjectHideFlags: 0
  m_CorrespondingSourceObject: {fileID: 0}
  m_PrefabInstance: {fileID: 0}
  m_PrefabAsset: {fileID: 0}
  m_GameObject: {fileID: 0}
  m_Enabled: 1
  m_EditorHideFlags: 0
  m_Script: {fileID: 11500000, guid: b5352ce06d10fa24fbc7ff0b260c0dba, type: 3}
  m_Name: Mars
  m_EditorClassIdentifier: 
  Name: Mars
  Sprite: {fileID: 21300000, guid: d609789ebea206448a52f422ce448749, type: 3}
  MovementCost: 0
  CanMoveOver: 0
