BodyweightKg,Name,WeightClassKg,Division,Team,Squat1Kg,Squat2Kg,Squat3Kg,Best3SquatKg,Bench1Kg,Bench2Kg,Bench3Kg,Best3BenchKg,Deadlift1Kg,Deadlift2Kg,Deadlift3Kg,Best3DeadliftKg,TotalKg,Place,Event,Equipment,Sex
50.26,John Carpernter,51.71,Junior Varsity,Climax-Scotts,102.06,108.86,113.4,113.4,52.16,56.7,61.23,61.23,113.4,122.47,142.88,142.88,317.51,1,SBD,Single-ply,M
51.71,Jarrett Keller,51.71,Junior Varsity,Morenci,92.99,,106.59,106.59,58.97,65.77,,65.77,92.99,106.59,115.67,115.67,288.03,2,SBD,Single-ply,M
51.3,John Los,51.71,Junior Varsity,Whitmore Lake,79.38,90.72,,90.72,49.9,54.43,56.7,56.7,102.06,108.86,120.2,120.2,267.62,3,SBD,Single-ply,M
51.39,Ben Schuller,51.71,Junior Varsity,Sag. Nouvel,,92.99,97.52,97.52,49.9,54.43,,54.43,102.06,108.86,115.67,115.67,267.62,4,SBD,Single-ply,M
50.89,James Hamlin,51.71,Junior Varsity,Whitmore Lake,74.84,83.91,,83.91,63.5,70.31,,70.31,102.06,106.59,111.13,111.13,265.35,5,SBD,Single-ply,M
50.35,Joel Missentzis,51.71,Junior Varsity,Montrose,83.91,,97.52,97.52,54.43,58.97,,58.97,90.72,99.79,,99.79,256.28,6,SBD,Single-ply,M
47.63,Yerick White,51.71,Junior Varsity,Muskegon,68.04,74.84,86.18,86.18,47.63,49.9,52.16,52.16,70.31,79.38,90.72,90.72,229.06,7,SBD,Single-ply,M
44,Matt Kapala,51.71,Junior Varsity,Powers,52.16,58.97,63.5,63.5,31.75,38.56,,38.56,83.91,90.72,99.79,99.79,201.85,8,SBD,Single-ply,M
49.62,Jacob Gross,51.71,Junior Varsity,Dexter,61.23,,,61.23,43.09,,,43.09,92.99,,,92.99,197.31,9,SBD,Single-ply,M
48.81,Justin Ware,51.71,Junior Varsity,Flushing,47.63,52.16,,52.16,27.22,,,27.22,77.11,86.18,,86.18,165.56,10,SBD,Single-ply,M
55.07,David Rodriquez,55.79,Junior Varsity,Genesee,92.99,-97.52,97.52,97.52,88.45,-95.25,99.79,99.79,113.4,131.54,136.08,136.08,333.39,1,SBD,Single-ply,M
55.38,James Person,55.79,Junior Varsity,Montrose,-124.74,124.74,-136.08,124.74,72.57,-77.11,79.38,79.38,129.27,-142.88,-142.88,129.27,333.39,2,SBD,Single-ply,M
54.79,Mitch Schneider,55.79,Junior Varsity,Montrose,124.74,-136.08,-136.08,124.74,-74.84,79.38,-81.65,79.38,117.93,-124.74,-129.27,117.93,322.05,3,SBD,Single-ply,M
53.84,Colter Lubben,55.79,Junior Varsity,Saugatuck,108.86,120.2,-124.74,120.2,58.97,63.5,-68.04,63.5,124.74,133.81,-142.88,133.81,317.51,4,SBD,Single-ply,M
55.02,Buddy Henika,55.79,Junior Varsity,Essexville-Garber,90.72,99.79,-104.33,99.79,65.77,-70.31,-70.31,65.77,127.01,133.81,142.88,142.88,308.44,5,SBD,Single-ply,M
55.66,Benny Manns,55.79,Junior Varsity,Mt. Morris,108.86,-113.4,113.4,113.4,70.31,72.57,-74.84,72.57,115.67,122.47,-136.08,122.47,308.44,6,SBD,Single-ply,M
55.66,Dan Bradburn,55.79,Junior Varsity,Goodrich,86.18,97.52,106.59,106.59,45.36,52.16,-58.97,52.16,92.99,111.13,124.74,124.74,283.5,7,SBD,Single-ply,M
55.34,Elan Banks,55.79,Junior Varsity,Muskegon,83.91,90.72,99.79,99.79,47.63,56.7,-61.23,56.7,102.06,113.4,-131.54,113.4,269.89,8,SBD,Single-ply,M
52.84,Greg Porter,55.79,Junior Varsity,Linden,74.84,-83.91,-83.91,74.84,65.77,-70.31,70.31,70.31,120.2,-124.74,-124.74,120.2,265.35,9,SBD,Single-ply,M
55.07,Reece Kurdyla,55.79,Junior Varsity,Goodrich,92.99,-106.59,-106.59,92.99,58.97,-63.5,-63.5,58.97,108.86,-117.93,-117.93,108.86,260.82,10,SBD,Single-ply,M
59.28,Mark Mersino,59.87,Junior Varsity,Almont,138.35,147.42,-151.95,147.42,86.18,-92.99,-92.99,86.18,161.03,170.1,174.63,174.63,408.23,1,SBD,Single-ply,M
59.33,Kelby Allen,59.87,Junior Varsity,Morenci,147.42,158.76,-165.56,158.76,77.11,83.91,-90.72,83.91,147.42,156.49,-167.83,156.49,399.16,2,SBD,Single-ply,M
59.06,Matt Fauth,59.87,Junior Varsity,Goodrich,142.88,158.76,-167.83,158.76,61.23,65.77,-72.57,65.77,156.49,170.1,-183.7,170.1,394.63,3,SBD,Single-ply,M
57.74,Rob Bonardelli,59.87,Junior Varsity,Flushing,-129.27,136.08,-138.35,136.08,83.91,90.72,-99.79,90.72,136.08,154.22,-163.29,154.22,381.02,4,SBD,Single-ply,M
59.1,Zac Dubay,59.87,Junior Varsity,Goodrich,124.74,-136.08,140.61,140.61,65.77,70.31,-74.84,70.31,133.81,151.95,-161.03,151.95,362.87,5,SBD,Single-ply,M
59.69,Josiah Fallot,59.87,Junior Varsity,Morenci,-117.93,124.74,-131.54,124.74,77.11,81.65,86.18,86.18,147.42,-151.95,151.95,151.95,362.87,6,SBD,Single-ply,M
58.15,Nick Dicenzo,59.87,Junior Varsity,Whitehall,104.33,117.93,-133.81,117.93,86.18,-90.72,90.72,90.72,151.95,-158.76,-158.76,151.95,360.61,7,SBD,Single-ply,M
59.15,Casey Potts,59.87,Junior Varsity,Standish,124.74,129.27,-136.08,129.27,77.11,-83.91,-83.91,77.11,133.81,136.08,145.15,145.15,351.53,8,SBD,Single-ply,M
59.6,Chas Frey,59.87,Junior Varsity,Morenci,-102.06,102.06,111.13,111.13,77.11,83.91,-88.45,83.91,136.08,147.42,-151.95,147.42,342.46,9,SBD,Single-ply,M
59.06,Brandon Hood,59.87,Junior Varsity,Lake Orion,106.59,111.13,113.4,113.4,-70.31,72.57,-77.11,72.57,142.88,-151.95,151.95,151.95,337.93,10,SBD,Single-ply,M
59.69,Kyle Feetham,59.87,Junior Varsity,Linden,-106.59,111.13,120.2,120.2,-63.5,63.5,-72.57,63.5,129.27,136.08,145.15,145.15,328.85,11,SBD,Single-ply,M
58.6,Richie Masianka,59.87,Junior Varsity,Saugatuck,111.13,124.74,-136.08,124.74,70.31,-83.91,-86.18,70.31,113.4,127.01,-136.08,127.01,322.05,12,SBD,Single-ply,M
58.97,Cody Marks,59.87,Junior Varsity,Linden,-111.13,117.93,-124.74,117.93,-61.23,61.23,-65.77,61.23,136.08,142.88,-147.42,142.88,322.05,13,SBD,Single-ply,M
59.87,Brandon Smith,59.87,Junior Varsity,Montague,-92.99,102.06,-104.33,102.06,61.23,-70.31,-70.31,61.23,113.4,133.81,-142.88,133.81,297.1,14,SBD,Single-ply,M
57.92,Renaldo Powell,59.87,Junior Varsity,Wayne Mem,-145.15,145.15,-149.69,145.15,-68.04,-68.04,-68.04,,-145.15,,,,,DQ,SBD,Single-ply,M
65.45,Shane Kerkes,65.77,Junior Varsity,Ithaca,136.08,145.15,147.42,147.42,106.59,115.67,-122.47,115.67,183.7,195.04,-199.58,195.04,458.13,1,SBD,Single-ply,M
65.77,Garnett,65.77,Junior Varsity,Harper Creek,142.88,151.95,-154.22,151.95,88.45,92.99,-97.52,92.99,154.22,174.63,-183.7,174.63,419.57,2,SBD,Single-ply,M
65.09,Tyler Roots,65.77,Junior Varsity,Berrian Springs,124.74,136.08,-145.15,136.08,90.72,99.79,-104.33,99.79,124.74,156.49,176.9,176.9,412.77,3,SBD,Single-ply,M
65.59,Jeremy Near,65.77,Junior Varsity,Montague,-120.2,-120.2,131.54,131.54,102.06,108.86,-115.67,108.86,142.88,165.56,,165.56,405.97,4,SBD,Single-ply,M
64.5,Codey Vican,65.77,Junior Varsity,Merrill,136.08,-145.15,-145.15,136.08,86.18,-90.72,90.72,90.72,158.76,167.83,-174.63,167.83,394.63,5,SBD,Single-ply,M
65.77,Garrett Hudson,65.77,Junior Varsity,Linden,124.74,136.08,-142.88,136.08,79.38,86.18,-95.25,86.18,163.29,167.83,-172.37,167.83,390.09,6,SBD,Single-ply,M
65.77,Cole Mossman,65.77,Junior Varsity,Plainwell,136.08,142.88,-147.42,142.88,77.11,81.65,-86.18,81.65,147.42,158.76,-163.29,158.76,383.29,7,SBD,Single-ply,M
64.77,Dustin Humphreys,65.77,Junior Varsity,Clarkston,-133.81,-133.81,133.81,133.81,83.91,-88.45,-88.45,83.91,161.03,,,161.03,378.75,8,SBD,Single-ply,M
64.91,Jack Brady,65.77,Junior Varsity,Powers,113.4,-122.47,-167.83,113.4,83.91,95.25,-104.33,95.25,165.56,,,165.56,374.21,9,SBD,Single-ply,M
65.23,Blake Hudak,65.77,Junior Varsity,Goodrich,-136.08,136.08,-147.42,136.08,83.91,88.45,-92.99,88.45,147.42,-170.1,-170.1,147.42,371.95,10,SBD,Single-ply,M
64.32,Siva,65.77,Junior Varsity,Saugatuck,111.13,-120.2,-122.47,111.13,95.25,-108.86,-113.4,95.25,151.95,163.29,-167.83,163.29,369.68,10,SBD,Single-ply,M
64.86,Jesse Meininger,65.77,Junior Varsity,Richmond,-127.01,129.27,-133.81,129.27,83.91,88.45,-90.72,88.45,151.95,-158.76,-158.76,151.95,369.68,10,SBD,Single-ply,M
65.68,Bobby Sanchez,65.77,Junior Varsity,Davison,-104.33,113.4,-127.01,113.4,92.99,97.52,-102.06,97.52,158.76,-183.7,-183.7,158.76,369.68,10,SBD,Single-ply,M
63.87,Adam Riles,65.77,Junior Varsity,Morenci,117.93,-127.01,-127.01,117.93,83.91,92.99,97.52,97.52,138.35,149.69,-161.03,149.69,365.14,10,SBD,Single-ply,M
63.46,Adam Sharp,65.77,Junior Varsity,Clarkston,115.67,,,115.67,83.91,,,83.91,156.49,,,156.49,356.07,10,SBD,Single-ply,M
65.41,Mike White,65.77,Junior Varsity,Muskegon,88.45,-106.59,-117.93,88.45,77.11,86.18,-92.99,86.18,151.95,-163.29,-181.44,151.95,326.59,10,SBD,Single-ply,M
65.36,Wendall Bailey,65.77,Junior Varsity,Muskegon,-102.06,102.06,117.93,117.93,-86.18,86.18,-97.52,86.18,113.4,-122.47,-131.54,113.4,317.51,10,SBD,Single-ply,M
65.54,Andrew Dangel,65.77,Junior Varsity,Powers,81.65,88.45,92.99,92.99,43.09,47.63,52.16,52.16,95.25,102.06,-106.59,102.06,247.21,10,SBD,Single-ply,M
63.87,Cody Lyon,65.77,Junior Varsity,Flushing,-122.47,122.47,131.54,131.54,-77.11,-81.65,-81.65,,167.83,-176.9,-176.9,167.83,,DQ,SBD,Single-ply,M
64.77,Joe D'Haene,65.77,Junior Varsity,Richmond,124.74,129.27,138.35,138.35,83.91,-88.45,-88.45,83.91,-170.1,-170.1,-170.1,,,DQ,SBD,Single-ply,M
63.32,Michael Ball,65.77,Junior Varsity,Montague,120.2,122.47,-124.74,122.47,70.31,74.84,-79.38,74.84,,-142.88,,,,DQ,SBD,Single-ply,M
62.55,Aaron Sharp,65.77,Junior Varsity,Clarkston,-129.27,-136.08,136.08,136.08,-83.91,-83.91,-83.91,,-161.03,,,,,DQ,SBD,Single-ply,M
65.14,Justin Swett,65.77,Junior Varsity,Morenci,-142.88,-142.88,-142.88,,-86.18,,,,-142.88,,,,,DQ,SBD,Single-ply,M
63.64,Robert Welsby,65.77,Junior Varsity,Flushing,-147.42,-147.42,-147.42,,-92.99,,,,-129.27,,,,,DQ,SBD,Single-ply,M
69.81,Ricky Parcels,70.31,Junior Varsity,Flushing,147.42,170.1,174.63,174.63,120.2,127.01,-131.54,127.01,174.63,-185.97,-185.97,174.63,476.27,1,SBD,Single-ply,M
70.31,Craig Watz,70.31,Junior Varsity,Essexville-Gerber,174.63,188.24,195.04,195.04,92.99,97.52,-99.79,97.52,170.1,-179.17,179.17,179.17,471.74,2,SBD,Single-ply,M
70.31,Eric Mann,70.31,Junior Varsity,Almont,142.88,149.69,-154.22,149.69,-95.25,95.25,-99.79,95.25,156.49,174.63,185.97,185.97,430.91,3,SBD,Single-ply,M
69.94,Don Ellis,70.31,Junior Varsity,Wayne Mem,-151.95,151.95,-158.76,151.95,83.91,92.99,-97.52,92.99,165.56,-183.7,183.7,183.7,428.64,4,SBD,Single-ply,M
68.27,Smith Nathan,70.31,Junior Varsity,Montague,136.08,-142.88,-142.88,136.08,90.72,-92.99,-92.99,90.72,183.7,190.51,199.58,199.58,426.38,5,SBD,Single-ply,M
67.63,Phil Eggert,70.31,Junior Varsity,Atherton,142.88,154.22,163.29,163.29,95.25,104.33,-106.59,104.33,138.35,149.69,156.49,156.49,424.11,6,SBD,Single-ply,M
67.86,Josh Pierson,70.31,Junior Varsity,Essexville-Gerber,124.74,131.54,140.61,140.61,92.99,97.52,-99.79,97.52,165.56,176.9,183.7,183.7,421.84,7,SBD,Single-ply,M
69.58,Michael Barkley,70.31,Junior Varsity,Climax-Scotts,124.74,131.54,138.35,138.35,88.45,92.99,95.25,95.25,154.22,167.83,-174.63,167.83,401.43,8,SBD,Single-ply,M
69.22,Justin Hogg,70.31,Junior Varsity,Richmond,133.81,142.88,151.95,151.95,74.84,79.38,83.91,83.91,156.49,-170.1,-170.1,156.49,392.36,9,SBD,Single-ply,M
68.86,Justin Dunsmore,70.31,Junior Varsity,Richmond,117.93,124.74,131.54,131.54,90.72,92.99,-95.25,92.99,163.29,-172.37,-172.37,163.29,387.82,10,SBD,Single-ply,M
69.13,Ted Marsh,70.31,Junior Varsity,Plainwell,113.4,129.27,136.08,136.08,61.23,72.57,83.91,83.91,136.08,165.56,167.83,167.83,387.82,11,SBD,Single-ply,M
70.31,David Boardwell,70.31,Junior Varsity,Montague,120.2,124.74,129.27,129.27,92.99,95.25,-99.79,95.25,142.88,158.76,-170.1,158.76,383.29,12,SBD,Single-ply,M
70.31,Cameron O'Mara,70.31,Junior Varsity,Deckerville,-90.72,108.86,127.01,127.01,83.91,-90.72,90.72,90.72,158.76,-183.7,-183.7,158.76,376.48,13,SBD,Single-ply,M
70.31,Curtis Holden,70.31,Junior Varsity,Montague,102.06,108.86,-136.08,108.86,68.04,90.72,-95.25,90.72,163.29,-174.63,174.63,174.63,374.21,14,SBD,Single-ply,M
67.77,Dexter Hobdy,70.31,Junior Varsity,Powers,127.01,-133.81,133.81,133.81,61.23,-68.04,-68.04,61.23,154.22,161.03,167.83,167.83,362.87,15,SBD,Single-ply,M
68.49,Chris Crawford,70.31,Junior Varsity,Muskegon,106.59,-117.93,120.2,120.2,79.38,-86.18,-86.18,79.38,142.88,151.95,158.76,158.76,358.34,16,SBD,Single-ply,M
66.77,Dylan Fackler,70.31,Junior Varsity,Vassar,83.91,-102.06,-106.59,83.91,61.23,65.77,-72.57,65.77,106.59,-124.74,,106.59,256.28,17,SBD,Single-ply,M
69.44,Tovales Allaway,70.31,Junior Varsity,Muskegon,102.06,111.13,-131.54,111.13,-68.04,-68.04,-68.04,,183.7,190.51,201.85,201.85,,DQ,SBD,Single-ply,M
70.22,Winston Adkins,70.31,Junior Varsity,Vassar,-136.08,-142.88,142.88,142.88,-83.91,-83.91,-83.91,,151.95,,,151.95,,DQ,SBD,Single-ply,M
74.66,Levi Hoffman,74.84,Junior Varsity,Morenci,183.7,195.04,,195.04,115.67,122.47,,122.47,197.31,201.85,,201.85,519.36,1,SBD,Single-ply,M
72.03,Scott Trybe,74.84,Junior Varsity,Montrose,172.37,183.7,195.04,195.04,92.99,,,92.99,206.38,217.72,226.8,226.8,514.83,2,SBD,Single-ply,M
72.85,Justin Woolwine,74.84,Junior Varsity,Vassar,170.1,181.44,190.51,190.51,115.67,122.47,,122.47,174.63,183.7,,183.7,496.68,3,SBD,Single-ply,M
73.12,Cortez McKinney,74.84,Junior Varsity,Lake Orion,147.42,158.76,172.37,172.37,92.99,102.06,,102.06,190.51,210.92,,210.92,485.34,4,SBD,Single-ply,M
74.66,Alick Steel,74.84,Junior Varsity,Davison,,,181.44,181.44,83.91,90.72,,90.72,181.44,213.19,,213.19,485.34,5,SBD,Single-ply,M
74.75,Max Aparicio,74.84,Junior Varsity,Newaygo,149.69,163.29,,163.29,106.59,113.4,117.93,117.93,154.22,183.7,195.04,195.04,476.27,6,SBD,Single-ply,M
73.94,Bobby Miller,74.84,Junior Varsity,Muskegon,149.69,,163.29,163.29,104.33,106.59,,106.59,183.7,192.78,204.12,204.12,474,7,SBD,Single-ply,M
74.03,Zach Kuznior,74.84,Junior Varsity,Montrose,147.42,156.49,,156.49,113.4,,,113.4,174.63,183.7,,183.7,453.59,8,SBD,Single-ply,M
74.71,Orion Reed,74.84,Junior Varsity,Plainwell,147.42,158.76,165.56,165.56,99.79,,104.33,104.33,147.42,158.76,170.1,170.1,439.98,9,SBD,Single-ply,M
74.84,John Wells #4,74.84,Junior Varsity,Grant,142.88,,151.95,151.95,,102.06,106.59,106.59,158.76,174.63,179.17,179.17,437.72,10,SBD,Single-ply,M
74.84,David Lamie,74.84,Junior Varsity,Whitehall,156.49,,,156.49,111.13,117.93,,117.93,154.22,,,154.22,428.64,11,SBD,Single-ply,M
73.3,James Miller #7,74.84,Junior Varsity,Lake Orion,142.88,149.69,156.49,156.49,88.45,90.72,,90.72,151.95,170.1,,170.1,417.3,12,SBD,Single-ply,M
73.71,Brent Bomers,74.84,Junior Varsity,Whitehall,142.88,151.95,,151.95,,88.45,,88.45,151.95,165.56,176.9,176.9,417.3,13,SBD,Single-ply,M
73.53,Will Gardener,74.84,Junior Varsity,Muskegon,131.54,,,131.54,,92.99,97.52,97.52,,170.1,183.7,183.7,412.77,14,SBD,Single-ply,M
74.84,Thomas Chandler,74.84,Junior Varsity,Muskegon,111.13,124.74,,124.74,,,113.4,113.4,163.29,174.63,,174.63,412.77,15,SBD,Single-ply,M
74.57,Brendon Ferrell,74.84,Junior Varsity,Plainwell,129.27,136.08,145.15,145.15,90.72,,,90.72,,170.1,,170.1,405.97,16,SBD,Single-ply,M
74.62,Derek Brettingham,74.84,Junior Varsity,Farwell,131.54,142.88,,142.88,86.18,92.99,102.06,102.06,161.03,,,161.03,405.97,17,SBD,Single-ply,M
74.75,Derrick Carson,74.84,Junior Varsity,Muskegon,133.81,142.88,,142.88,102.06,,,102.06,142.88,147.42,,147.42,392.36,18,SBD,Single-ply,M
73.8,Sean Rodgers,74.84,Junior Varsity,Lake Orion,142.88,149.69,,149.69,79.38,81.65,,81.65,142.88,154.22,,154.22,385.55,19,SBD,Single-ply,M
81.19,Ryan Peters,82.1,Junior Varsity,Mt. Morris,192.78,201.85,-210.92,201.85,111.13,117.93,-122.47,117.93,206.38,222.26,231.33,231.33,551.11,1,SBD,Single-ply,M
79.7,Joe Stachowicz,82.1,Junior Varsity,Whitehall,192.78,-215.46,215.46,215.46,-104.33,106.59,115.67,115.67,195.04,208.65,217.72,217.72,548.85,2,SBD,Single-ply,M
79.56,Cody Groulx,82.1,Junior Varsity,Montrose,183.7,-192.78,192.78,192.78,-102.06,102.06,-108.86,102.06,183.7,201.85,217.72,217.72,512.56,3,SBD,Single-ply,M
77.43,Abraham Bargouthy,82.1,Junior Varsity,Garber,-163.29,174.63,183.7,183.7,102.06,111.13,124.74,124.74,179.17,190.51,-206.38,190.51,498.95,4,SBD,Single-ply,M
81.15,Richard Kirksey,82.1,Junior Varsity,Davison,-149.69,158.76,-170.1,158.76,104.33,113.4,-120.2,113.4,158.76,183.7,204.12,204.12,476.27,5,SBD,Single-ply,M
79.38,Zach Newmeyer,82.1,Junior Varsity,Plainwell,158.76,-167.83,167.83,167.83,83.91,95.25,102.06,102.06,165.56,174.63,179.17,179.17,449.06,6,SBD,Single-ply,M
82.01,Dan Howard #3,82.1,Junior Varsity,Montague,-151.95,151.95,163.29,163.29,92.99,102.06,-108.86,102.06,-165.56,174.63,-183.7,174.63,439.98,7,SBD,Single-ply,M
81.92,Dan Gustinis,82.1,Junior Varsity,Goodrich,142.88,174.63,-183.7,174.63,88.45,-92.99,92.99,92.99,142.88,170.1,-176.9,170.1,437.72,8,SBD,Single-ply,M
78.74,Mike Tebedo,82.1,Junior Varsity,Vassar,129.27,142.88,-156.49,142.88,106.59,111.13,-115.67,111.13,-179.17,-179.17,179.17,179.17,433.18,9,SBD,Single-ply,M
81.78,Wes Dunn,82.1,Junior Varsity,Standish,136.08,142.88,-149.69,142.88,102.06,106.59,-113.4,106.59,158.76,170.1,181.44,181.44,430.91,10,SBD,Single-ply,M
80.15,Chad Blackston,82.1,Junior Varsity,Clarkston,154.22,158.76,165.56,165.56,81.65,86.18,-92.99,86.18,174.63,176.9,-179.17,176.9,428.64,11,SBD,Single-ply,M
81.65,Ben Wood,82.1,Junior Varsity,Montague,133.81,145.15,158.76,158.76,83.91,92.99,95.25,95.25,154.22,167.83,-181.44,167.83,421.84,12,SBD,Single-ply,M
81.74,Darius Bankhead,82.1,Junior Varsity,Muskegon,136.08,147.42,154.22,154.22,90.72,-97.52,-97.52,90.72,163.29,170.1,176.9,176.9,421.84,13,SBD,Single-ply,M
81.92,Joel Whaley,82.1,Junior Varsity,Kenowa Hills,142.88,-151.95,154.22,154.22,72.57,83.91,-86.18,83.91,151.95,170.1,181.44,181.44,419.57,14,SBD,Single-ply,M
79.33,Casey Kelly,82.1,Junior Varsity,Flushing,136.08,142.88,-147.42,142.88,83.91,-88.45,-88.45,83.91,170.1,-181.44,-181.44,170.1,396.89,15,SBD,Single-ply,M
78.93,Tony Corwin,82.1,Junior Varsity,Maple Valley,129.27,133.81,145.15,145.15,70.31,74.84,-79.38,74.84,149.69,163.29,170.1,170.1,390.09,16,SBD,Single-ply,M
80.88,Brandon Castillo,82.1,Junior Varsity,Grant,136.08,-151.95,-151.95,136.08,83.91,90.72,-97.52,90.72,156.49,-179.17,-179.17,156.49,383.29,17,SBD,Single-ply,M
81.47,Brian Wood,82.1,Junior Varsity,Grant,124.74,131.54,-142.88,131.54,74.84,79.38,81.65,81.65,156.49,-167.83,167.83,167.83,381.02,18,SBD,Single-ply,M
87.36,Jacob Winston,88,Junior Varsity,Goodrich,192.78,217.72,-229.06,217.72,115.67,129.27,-136.08,129.27,226.8,251.74,-274.42,251.74,598.74,1,SBD,Single-ply,M
85.5,Abb Curruthers,88,Junior Varsity,Muskegon,170.1,179.17,-188.24,179.17,108.86,117.93,-124.74,117.93,199.58,213.19,-226.8,213.19,510.29,2,SBD,Single-ply,M
83.91,Jordan Langs,88,Junior Varsity,Climax-Scotts,183.7,190.51,-195.04,190.51,92.99,104.33,-108.86,104.33,183.7,204.12,-215.46,204.12,498.95,3,SBD,Single-ply,M
87.45,Adam Pallesch,88,Junior Varsity,Cros Lex,149.69,158.76,163.29,163.29,104.33,113.4,-120.2,113.4,158.76,181.44,195.04,195.04,471.74,4,SBD,Single-ply,M
86.59,Chirs Perez,88,Junior Varsity,Mt. Morris,131.54,140.61,145.15,145.15,104.33,-108.86,108.86,108.86,192.78,201.85,208.65,208.65,462.66,5,SBD,Single-ply,M
86.82,Derek Elston,88,Junior Varsity,Montrose,133.81,-142.88,149.69,149.69,108.86,117.93,122.47,122.47,174.63,183.7,-188.24,183.7,455.86,6,SBD,Single-ply,M
88,Cameron Johns,88,Junior Varsity,Montague,-142.88,142.88,-165.56,142.88,102.06,106.59,108.86,108.86,170.1,192.78,204.12,204.12,455.86,7,SBD,Single-ply,M
84.46,Mike Petherbridge,88,Junior Varsity,Lakeville,131.54,147.42,-158.76,147.42,81.65,88.45,-92.99,88.45,201.85,210.92,217.72,217.72,453.59,8,SBD,Single-ply,M
85.37,Josh Gonzalez,88,Junior Varsity,Wayne Mem,-174.63,174.63,-183.7,174.63,-83.91,83.91,-88.45,83.91,183.7,192.78,-199.58,192.78,451.32,9,SBD,Single-ply,M
83.42,Cody Stephens,88,Junior Varsity,Atherton,136.08,140.61,-145.15,140.61,97.52,99.79,-106.59,99.79,181.44,192.78,201.85,201.85,442.25,10,SBD,Single-ply,M
86,Pat Farrell,88,Junior Varsity,Dexter,136.08,-140.61,140.61,140.61,97.52,-104.33,104.33,104.33,174.63,183.7,197.31,197.31,442.25,11,SBD,Single-ply,M
85.73,Jordan Ford,88,Junior Varsity,Lakeville,127.01,136.08,-142.88,136.08,90.72,102.06,-108.86,102.06,-181.44,181.44,-188.24,181.44,419.57,12,SBD,Single-ply,M
83.37,Major Graham,88,Junior Varsity,Morenci,138.35,-147.42,-147.42,138.35,97.52,102.06,-106.59,102.06,170.1,174.63,-181.44,174.63,415.04,13,SBD,Single-ply,M
85.77,Ryan Wolfe,88,Junior Varsity,Richmond,133.81,142.88,-151.95,142.88,77.11,-81.65,-81.65,77.11,174.63,185.97,195.04,195.04,415.04,14,SBD,Single-ply,M
85.77,Cody Leach,88,Junior Varsity,Mt. Morris,113.4,122.47,-129.27,122.47,97.52,102.06,104.33,104.33,167.83,176.9,-185.97,176.9,403.7,15,SBD,Single-ply,M
88,Tom Stautz,88,Junior Varsity,Witmore Lake,124.74,133.81,142.88,142.88,77.11,-81.65,-81.65,77.11,142.88,-161.03,-161.03,142.88,362.87,16,SBD,Single-ply,M
87.27,Aaron Bigler,88,Junior Varsity,Goodrich,170.1,179.17,-185.97,179.17,-95.25,-102.06,-102.06,,181.44,192.78,-197.31,192.78,,DQ,SBD,Single-ply,M
84.19,Eddy Zapinski,88,Junior Varsity,Deckerville,-142.88,-142.88,-142.88,,97.52,102.06,-104.33,102.06,165.56,172.37,-181.44,172.37,,DQ,SBD,Single-ply,M
88,Kyle Hall,88,Junior Varsity,Newaygo,158.76,174.63,183.7,183.7,-113.4,-133.81,-133.81,,-158.76,,,,,DQ,SBD,Single-ply,M
92.08,Kevin Williams,93.89,Junior Varsity,Lake Fenton,183.7,204.12,-219.99,204.12,102.06,-122.47,127.01,127.01,197.31,201.85,-210.92,201.85,532.97,1,SBD,Single-ply,M
89.99,John Ingamells,93.89,Junior Varsity,Linden,183.7,197.31,-204.12,197.31,124.74,131.54,-136.08,131.54,183.7,199.58,-210.92,199.58,528.44,2,SBD,Single-ply,M
93.08,Mark Stawowy,93.89,Junior Varsity,Standish,165.56,174.63,183.7,183.7,120.2,127.01,-133.81,127.01,174.63,183.7,192.78,192.78,503.49,3,SBD,Single-ply,M
88.72,Brett Ross,93.89,Junior Varsity,Deckerville,165.56,-172.37,-172.37,165.56,113.4,-117.93,117.93,117.93,183.7,195.04,-204.12,195.04,478.54,4,SBD,Single-ply,M
91.08,Brandon Marshall,93.89,Junior Varsity,Armada,183.7,-190.51,-190.51,183.7,86.18,92.99,97.52,97.52,183.7,192.78,-204.12,192.78,474,5,SBD,Single-ply,M
93.89,Josh Alverson,93.89,Junior Varsity,Grant,145.15,161.03,176.9,176.9,92.99,106.59,-115.67,106.59,170.1,176.9,-190.51,176.9,460.4,6,SBD,Single-ply,M
89.95,Carl Tibbitts,93.89,Junior Varsity,Holton,154.22,-158.76,-158.76,154.22,117.93,-120.2,-120.2,117.93,183.7,185.97,-188.24,185.97,458.13,7,SBD,Single-ply,M
91.58,Josh Long,93.89,Junior Varsity,Flushing,190.51,-206.38,-206.38,190.51,102.06,-108.86,-108.86,102.06,156.49,-174.63,,156.49,449.06,8,SBD,Single-ply,M
93.17,Steve Henes,93.89,Junior Varsity,Dexter,129.27,142.88,147.42,147.42,97.52,102.06,106.59,106.59,170.1,179.17,195.04,195.04,449.06,9,SBD,Single-ply,M
88.54,Matt Grammer,93.89,Junior Varsity,Linden,145.15,156.49,165.56,165.56,115.67,-120.2,-120.2,115.67,145.15,165.56,-179.17,165.56,446.79,10,SBD,Single-ply,M
93.35,Todd Bigler,93.89,Junior Varsity,Goodrich,145.15,156.49,165.56,165.56,83.91,92.99,95.25,95.25,172.37,176.9,181.44,181.44,442.25,11,SBD,Single-ply,M
91.31,Matt Krcmarink,93.89,Junior Varsity,Powers,124.74,131.54,138.35,138.35,127.01,133.81,-138.35,133.81,147.42,154.22,163.29,163.29,435.45,12,SBD,Single-ply,M
93.71,Tyler Teague,93.89,Junior Varsity,Goodrich,172.37,-183.7,-183.7,172.37,81.65,-86.18,-86.18,81.65,151.95,158.76,-165.56,158.76,412.77,13,SBD,Single-ply,M
93.89,Jason Bartlett,93.89,Junior Varsity,Kenowa Hills,-124.74,-124.74,129.27,129.27,83.91,-92.99,-92.99,83.91,-142.88,142.88,163.29,163.29,376.48,14,SBD,Single-ply,M
91.26,Cory Psycher,93.89,Junior Varsity,Alma,-167.83,170.1,-172.37,170.1,-117.93,-117.93,-117.93,,,,,,,DQ,SBD,Single-ply,M
93.26,Brock DeSander,93.89,Junior Varsity,Vassar,-142.88,-145.15,-151.95,,,,,,,,,,,DQ,SBD,Single-ply,M
98.93,Rickie Crosby,99.79,Junior Varsity,Muskegon,165.56,179.17,183.7,183.7,131.54,-136.08,-136.08,131.54,217.72,235.87,-244.94,235.87,551.11,1,SBD,Single-ply,M
99.79,Mac Parker,99.79,Junior Varsity,Muskegon,-165.56,165.56,-181.44,165.56,104.33,113.4,-122.47,113.4,165.56,174.63,185.97,185.97,464.93,2,SBD,Single-ply,M
95.44,Paul Rivard,99.79,Junior Varsity,Essexville-Gerber,-163.29,167.83,172.37,172.37,-113.4,113.4,-117.93,113.4,163.29,172.37,-181.44,172.37,458.13,3,SBD,Single-ply,M
98.61,Wayne Blair,99.79,Junior Varsity,Harper Creek,142.88,-151.95,-151.95,142.88,113.4,122.47,-129.27,122.47,158.76,174.63,183.7,183.7,449.06,4,SBD,Single-ply,M
98.47,Justin Lacy,99.79,Junior Varsity,Cros. Lex.,-154.22,154.22,-158.76,154.22,97.52,99.79,-102.06,99.79,174.63,179.17,183.7,183.7,437.72,5,SBD,Single-ply,M
95.71,Kyle Pilbeam,99.79,Junior Varsity,Morenci,165.56,174.63,-183.7,174.63,-79.38,-83.91,83.91,83.91,-174.63,-174.63,174.63,174.63,433.18,6,SBD,Single-ply,M
96.34,Phil Tucker,99.79,Junior Varsity,Flushing,192.78,206.38,226.8,226.8,-124.74,-124.74,-124.74,,183.7,192.78,-204.12,192.78,419.57,7,SBD,Single-ply,M
97.02,Chris Burch,99.79,Junior Varsity,Whitehall,-108.86,136.08,-158.76,136.08,79.38,-83.91,83.91,83.91,199.58,-249.48,-249.48,199.58,419.57,8,SBD,Single-ply,M
99.11,Mike Zuckelski,99.79,Junior Varsity,Lake Fenton,122.47,-136.08,136.08,136.08,81.65,-90.72,-90.72,81.65,151.95,167.83,-183.7,167.83,385.55,9,SBD,Single-ply,M
97.52,Anderson,99.79,Junior Varsity,Montague,-111.13,111.13,-122.47,111.13,-79.38,83.91,-88.45,83.91,158.76,167.83,-181.44,167.83,362.87,10,SBD,Single-ply,M
95.89,Ben Harris,99.79,Junior Varsity,Dexter,-106.59,-106.59,106.59,106.59,-74.84,77.11,-79.38,77.11,136.08,142.88,147.42,147.42,331.12,11,SBD,Single-ply,M
95.53,Phil Bingham,99.79,Junior Varsity,Comstock,83.91,-97.52,-97.52,83.91,58.97,-61.23,61.23,61.23,97.52,115.67,124.74,124.74,269.89,12,SBD,Single-ply,M
106.68,Tanner Pray,109.77,Junior Varsity,Mt. Morris,-197.31,199.58,206.38,206.38,122.47,-127.01,127.01,127.01,192.78,201.85,215.46,215.46,548.85,1,SBD,Single-ply,M
99.97,Zach Balwinski,109.77,Junior Varsity,Essexville-Gerber,199.58,210.92,219.99,219.99,120.2,122.47,-124.74,122.47,-197.31,197.31,204.12,204.12,546.58,2,SBD,Single-ply,M
102.51,Zach Kyle,109.77,Junior Varsity,Wayne Mem,183.7,-192.78,-192.78,183.7,-108.86,108.86,-113.4,108.86,224.53,229.06,-235.87,229.06,521.63,3,SBD,Single-ply,M
103.37,Billy Howard,109.77,Junior Varsity,Deckerville,-165.56,170.1,174.63,174.63,127.01,129.27,-131.54,129.27,199.58,201.85,208.65,208.65,512.56,4,SBD,Single-ply,M
100.43,Aaron Navarro,109.77,Junior Varsity,Sandusky,-183.7,185.97,195.04,195.04,-122.47,-122.47,122.47,122.47,172.37,183.7,190.51,190.51,508.02,5,SBD,Single-ply,M
104.64,Jacob Jones,109.77,Junior Varsity,Holton,174.63,183.7,195.04,195.04,104.33,-113.4,-113.4,104.33,165.56,183.7,-197.31,183.7,483.08,6,SBD,Single-ply,M
105.73,JoeTiseo,109.77,Junior Varsity,Almont,154.22,-174.63,174.63,174.63,99.79,-108.86,-108.86,99.79,199.58,208.65,-219.99,208.65,483.08,7,SBD,Single-ply,M
109.41,Jeff Stanton,109.77,Junior Varsity,Harper Creek,154.22,161.03,-167.83,161.03,104.33,-111.13,-111.13,104.33,161.03,-179.17,183.7,183.7,449.06,8,SBD,Single-ply,M
109.54,John Thompson-Sweeter,109.77,Junior Varsity,Plainwell,154.22,170.1,176.9,176.9,72.57,86.18,-95.25,86.18,163.29,176.9,-185.97,176.9,439.98,9,SBD,Single-ply,M
102.01,Vertalka,109.77,Junior Varsity,Dewitt,-156.49,-156.49,156.49,156.49,-104.33,104.33,-113.4,104.33,165.56,172.37,-183.7,172.37,433.18,10,SBD,Single-ply,M
107.55,Aaron Psujek,109.77,Junior Varsity,Dexter,136.08,142.88,147.42,147.42,92.99,-97.52,-97.52,92.99,-149.69,154.22,167.83,167.83,408.23,11,SBD,Single-ply,M
103.1,Joseph Troutman,109.77,Junior Varsity,Climax-Scotts,124.74,-131.54,-138.35,124.74,74.84,79.38,81.65,81.65,142.88,161.03,172.37,172.37,378.75,12,SBD,Single-ply,M
104.73,Justin Horst,109.77,Junior Varsity,Sandusky,176.9,183.7,188.24,188.24,-115.67,-117.93,-117.93,,129.27,183.7,-188.24,183.7,,DQ,SBD,Single-ply,M
105.78,Kyle Grant,109.77,Junior Varsity,Whitehall,151.95,165.56,174.63,174.63,-106.59,-117.93,-117.93,,154.22,170.1,183.7,183.7,,DQ,SBD,Single-ply,M
108,Demarrio Wyrick,109.77,Junior Varsity,Muskegon,-122.47,-122.47,-142.88,,83.91,-92.99,92.99,92.99,158.76,165.56,167.83,167.83,,DQ,SBD,Single-ply,M
102.97,Kyle Sams,109.77,Junior Varsity,Grant,-151.95,-161.03,-163.29,,-124.74,,,,-158.76,,,,,DQ,SBD,Single-ply,M
117.39,Steve Bonor,124.74,Junior Varsity,Powers,190.51,197.31,-201.85,197.31,117.93,124.74,129.27,129.27,174.63,181.44,185.97,185.97,512.56,1,SBD,Single-ply,M
124.74,Carlin Landingham,124.74,Junior Varsity,Muskegon,-161.03,161.03,174.63,174.63,108.86,115.67,120.2,120.2,183.7,190.51,204.12,204.12,498.95,2,SBD,Single-ply,M
112.58,Matt Evans,124.74,Junior Varsity,Dewitt,174.63,183.7,-192.78,183.7,113.4,-124.74,-124.74,113.4,174.63,183.7,-201.85,183.7,480.81,3,SBD,Single-ply,M
121.2,John Wright #9,124.74,Junior Varsity,Clarkston,-142.88,-145.15,149.69,149.69,88.45,97.52,102.06,102.06,183.7,185.97,188.24,188.24,439.98,4,SBD,Single-ply,M
115.3,Matt Fischer,124.74,Junior Varsity,Clarkston,142.88,151.95,-154.22,151.95,106.59,-111.13,111.13,111.13,-163.29,-163.29,163.29,163.29,426.38,5,SBD,Single-ply,M
110.54,Andrew Grant,124.74,Junior Varsity,Almont,151.95,-156.49,156.49,156.49,86.18,90.72,-95.25,90.72,158.76,172.37,-176.9,172.37,419.57,6,SBD,Single-ply,M
118.75,Kyle Beclunas,124.74,Junior Varsity,Kenowa Hills,102.06,127.01,136.08,136.08,61.23,68.04,83.91,83.91,142.88,154.22,165.56,165.56,385.55,7,SBD,Single-ply,M
117.93,Vetoe Tate,124.74,Junior Varsity,Wayne Mem,-183.7,-183.7,183.7,183.7,65.77,70.31,79.38,79.38,-195.04,-195.04,-195.04,,,DQ,SBD,Single-ply,M
153.13,Joe Stepka,124.74+,Junior Varsity,Ubly,181.44,199.58,215.46,215.46,124.74,129.27,-138.35,129.27,201.85,-210.92,210.92,210.92,555.65,1,SBD,Single-ply,M
152.59,Ryan Millikan,124.74+,Junior Varsity,Waterford Mott,170.1,192.78,-215.46,192.78,124.74,147.42,-161.03,147.42,185.97,206.38,-226.8,206.38,546.58,2,SBD,Single-ply,M
146.24,Ben Ward,124.74+,Junior Varsity,Vassar,192.78,199.58,-206.38,199.58,115.67,-117.93,-117.93,115.67,201.85,222.26,-231.33,222.26,537.51,3,SBD,Single-ply,M
135.49,James Victory,124.74+,Junior Varsity,Holton,142.88,158.76,183.7,183.7,97.52,-104.33,-104.33,97.52,158.76,-174.63,174.63,174.63,455.86,4,SBD,Single-ply,M
129.91,Kevin Ireland,124.74+,Junior Varsity,Mt. Morris,161.03,170.1,174.63,174.63,72.57,77.11,79.38,79.38,181.44,190.51,199.58,199.58,453.59,5,SBD,Single-ply,M
156.9,Dana D'alasandro,124.74+,Junior Varsity,Standish,158.76,163.29,-170.1,163.29,117.93,122.47,127.01,127.01,129.27,154.22,163.29,163.29,453.59,6,SBD,Single-ply,M
127.05,Mark Kleinbriel,124.74+,Junior Varsity,Carrollton,136.08,149.69,-158.76,149.69,102.06,108.86,-113.4,108.86,181.44,-206.38,-222.26,181.44,439.98,7,SBD,Single-ply,M
140.61,James Mcleese,124.74+,Junior Varsity,Mt. Morris,129.27,138.35,142.88,142.88,83.91,88.45,-90.72,88.45,140.61,149.69,154.22,154.22,385.55,8,SBD,Single-ply,M
127.23,Kevin Meeks,124.74+,Junior Varsity,Muskegon,-106.59,-111.13,111.13,111.13,83.91,90.72,-97.52,90.72,-117.93,122.47,136.08,136.08,337.93,9,SBD,Single-ply,M
144.02,Curtis Walker,124.74+,Junior Varsity,Waterford Mott,183.7,-224.53,226.8,226.8,111.13,129.27,136.08,136.08,183.7,204.12,-217.72,204.12,,DQ,SBD,Single-ply,M
125.65,Michael Davis #13,124.74+,Junior Varsity,Wayne Mem,170.1,183.7,-192.78,183.7,-92.99,97.52,102.06,102.06,-192.78,-192.78,-192.78,,,DQ,SBD,Single-ply,M
51.07,Max Grohosski,51.71,Varsity,Powers,122.47,,129.27,129.27,72.57,79.38,-83.91,79.38,127.01,133.81,140.61,140.61,349.27,1,SBD,Single-ply,M
51.3,Eldon Pierson,51.71,Varsity,Ubly,,120.2,,120.2,68.04,-72.57,-72.57,68.04,131.54,136.08,-140.61,136.08,324.32,2,SBD,Single-ply,M
51.21,Steve Kapala,51.71,Varsity,Powers,86.18,92.99,,92.99,,63.5,72.57,72.57,129.27,138.35,142.88,142.88,308.44,3,SBD,Single-ply,M
50.48,Dillon Robyler,51.71,Varsity,Plainwell,97.52,,104.33,104.33,56.7,61.23,65.77,65.77,108.86,115.67,122.47,122.47,292.57,4,SBD,Single-ply,M
50.35,Blayne Frey,51.71,Varsity,Harper Creek,83.91,,,83.91,47.63,52.16,-61.23,52.16,115.67,131.54,-138.35,131.54,267.62,5,SBD,Single-ply,M
34.97,Scottie Cool,51.71,Varsity,Lake Fenton,27.22,34.02,,34.02,11.34,15.88,-20.41,15.88,34.02,-47.63,47.63,47.63,97.52,6,SBD,Single-ply,M
55.7,Zach Wood,55.79,Varsity,Plainwell,117.93,127.01,136.08,136.08,70.31,77.11,81.65,81.65,142.88,149.69,-156.49,149.69,367.41,1,SBD,Single-ply,M
55.7,Shane Rummer,55.79,Varsity,Alma,113.4,,,113.4,92.99,-97.52,97.52,97.52,133.81,-142.88,142.88,142.88,353.8,2,SBD,Single-ply,M
,Dan Kagey,55.79,Varsity,Montrose,,124.74,,124.74,83.91,-86.18,-86.18,83.91,142.88,145.15,-149.69,145.15,353.8,3,SBD,Single-ply,M
54.84,Jozef Kolzik,55.79,Varsity,South Haven,,,117.93,117.93,70.31,77.11,-86.18,77.11,145.15,151.95,-163.29,151.95,347,4,SBD,Single-ply,M
52.39,Baylor,55.79,Varsity,Lakeview,,104.33,,104.33,58.97,70.31,-79.38,70.31,122.47,126.55,147.42,147.42,322.05,5,SBD,Single-ply,M
55.75,Kyle Daniels,55.79,Varsity,Powers,97.52,104.33,,104.33,54.43,61.23,-65.77,61.23,115.67,122.47,-129.27,122.47,288.03,6,SBD,Single-ply,M
,Andrew Miller #11,55.79,Varsity,Colon,83.91,,90.72,90.72,47.63,52.16,56.7,56.7,124.74,-136.08,-136.08,124.74,272.16,7,SBD,Single-ply,M
59.74,Kyle Spiekerman,59.87,Varsity,Plainwell,149.69,158.76,167.83,167.83,86.18,92.99,-97.52,92.99,172.37,185.97,-195.04,185.97,446.79,1,SBD,Single-ply,M
59.1,Jared Badour,59.87,Varsity,Powers`,136.08,142.88,147.42,147.42,77.11,83.91,88.45,88.45,156.49,163.29,167.83,167.83,403.7,2,SBD,Single-ply,M
59.01,Andrew McCarthy,59.87,Varsity,Powers`,127.01,133.81,142.88,142.88,83.91,90.72,-95.25,90.72,156.49,163.29,167.83,167.83,401.43,3,SBD,Single-ply,M
59.87,James Laird,59.87,Varsity,Mt. Morris,131.54,-140.61,-140.61,131.54,74.84,79.38,-83.91,79.38,181.44,-190.51,-190.51,181.44,392.36,4,SBD,Single-ply,M
58.38,Mike Chapman,59.87,Varsity,Maple Valley,124.74,131.54,133.81,133.81,65.77,70.31,72.57,72.57,158.76,167.83,-176.9,167.83,374.21,5,SBD,Single-ply,M
59.83,Stege,59.87,Varsity,Clarkston,129.27,-133.81,-136.08,129.27,74.84,-83.91,83.91,83.91,154.22,158.76,-163.29,158.76,371.95,6,SBD,Single-ply,M
,Ryan Palm,59.87,Varsity,Vassar,117.93,-124.74,127.01,127.01,79.38,83.91,-90.72,83.91,136.08,142.88,147.42,147.42,358.34,7,SBD,Single-ply,M
,Nick Compeau,59.87,Varsity,Goodrich,117.93,-122.47,122.47,122.47,65.77,70.31,-74.84,70.31,124.74,-136.08,-142.88,124.74,317.51,8,SBD,Single-ply,M
65.73,Josh Townsend,65.77,Varsity,Plainwell,195.04,208.65,-213.19,208.65,102.06,108.86,113.4,113.4,192.78,206.38,210.92,210.92,532.97,1,SBD,Single-ply,M
64.73,Dan Scheussler,65.77,Varsity,Flushing,174.63,190.51,197.31,197.31,124.74,138.35,142.88,142.88,183.7,190.51,-199.58,190.51,530.7,2,SBD,Single-ply,M
64,Ryan Bettingham,65.77,Varsity,Farwell,176.9,-183.7,-183.7,176.9,111.13,-113.4,113.4,113.4,183.7,201.85,206.38,206.38,496.68,3,SBD,Single-ply,M
65.5,Travis Wallace,65.77,Varsity,Plainwell,167.83,176.9,183.7,183.7,102.06,108.86,113.4,113.4,167.83,179.17,185.97,185.97,483.08,4,SBD,Single-ply,M
65.73,Mike Howard,65.77,Varsity,Montague,-149.69,156.49,-163.29,156.49,113.4,-120.2,-124.74,113.4,-183.7,188.24,197.31,197.31,467.2,5,SBD,Single-ply,M
65.09,Jacob Cesar,65.77,Varsity,Ithaca,149.69,163.29,-174.63,163.29,92.99,-97.52,97.52,97.52,183.7,195.04,-206.38,195.04,455.86,6,SBD,Single-ply,M
,Jones,65.77,Varsity,Saugatuck,122.47,142.88,156.49,156.49,86.18,97.52,102.06,102.06,167.83,176.9,-179.17,176.9,435.45,7,SBD,Single-ply,M
,Shae Hamilton,65.77,Varsity,Harper Creek,149.69,156.49,-165.56,156.49,95.25,-102.06,-102.06,95.25,147.42,158.76,170.1,170.1,421.84,8,SBD,Single-ply,M
65.32,Dan Silva,65.77,Varsity,Saugatuck,102.06,127.01,-140.61,127.01,97.52,-115.67,-115.67,97.52,158.76,176.9,-181.44,176.9,401.43,9,SBD,Single-ply,M
64.09,DeWayne Jackson,65.77,Varsity,Genesee,147.42,-149.69,-149.69,147.42,79.38,86.18,-90.72,86.18,163.29,-174.63,-174.63,163.29,396.89,10,SBD,Single-ply,M
61.92,Tim Savonne,65.77,Varsity,Almont,-129.27,-136.08,136.08,136.08,-83.91,-83.91,83.91,83.91,174.63,-181.44,-181.44,174.63,394.63,11,SBD,Single-ply,M
65.77,Lyle Hewitt,65.77,Varsity,Montague,129.27,-142.88,-147.42,129.27,102.06,-108.86,-108.86,102.06,142.88,151.95,158.76,158.76,390.09,12,SBD,Single-ply,M
62.37,Darvin Hughes,65.77,Varsity,Muskegon,129.27,142.88,147.42,147.42,88.45,92.99,-97.52,92.99,136.08,142.88,147.42,147.42,387.82,13,SBD,Single-ply,M
63.5,Dwight Olejnik,65.77,Varsity,Mt Morris,95.25,104.33,-108.86,104.33,88.45,92.99,-97.52,92.99,127.01,136.08,140.61,140.61,337.93,14,SBD,Single-ply,M
,Keith Pfeiffer,65.77,Varsity,Bendle,,,,,,,,,,,,,,NS,SBD,Single-ply,M
,Cory Bolsby,65.77,Varsity,Sandusky,,,,,,,,,,,,,,NS,SBD,Single-ply,M
,Thomas Walls,65.77,Varsity,Vassar,,,,,,,,,,,,,,NS,SBD,Single-ply,M
,Graham,65.77,Varsity,Dewitt,,,,,,,,,,,,,,NS,SBD,Single-ply,M
68.58,Steve Soeder,70.31,Varsity,Clarkston,145.15,151.95,,151.95,95.25,,,95.25,197.31,204.12,210.92,210.92,458.13,1,SBD,Single-ply,M
70.22,James Patille,70.31,Varsity,Genesee,147.42,161.03,165.56,165.56,102.06,106.59,,106.59,174.63,181.44,185.97,185.97,458.13,2,SBD,Single-ply,M
69.58,Ben Sprowl,70.31,Varsity,Colon,124.74,165.56,,165.56,92.99,106.59,,106.59,142.88,183.7,,183.7,455.86,4,SBD,Single-ply,M
68.81,Jared Pfieffer,70.31,Varsity,Linden,138.35,151.95,,151.95,97.52,102.06,108.86,108.86,183.7,195.04,,195.04,455.86,3,SBD,Single-ply,M
68.49,Tony Prough,70.31,Varsity,Wayne Mem,124.74,151.95,158.76,158.76,97.52,102.06,,102.06,172.37,,,172.37,433.18,5,SBD,Single-ply,M
70.22,Dustin Meert,70.31,Varsity,Plainwell,158.76,-170.1,170.1,170.1,88.45,,95.25,95.25,149.69,163.29,,163.29,428.64,6,SBD,Single-ply,M
,Travis Hendrix,70.31,Varsity,Battle Creek Central,102.06,-124.74,124.74,124.74,90.72,99.79,,99.79,161.03,170.1,,170.1,394.63,7,SBD,Single-ply,M
,Lamar Hughes,70.31,Varsity,Muskegon,102.06,113.4,,113.4,,115.67,,115.67,136.08,149.69,158.76,158.76,387.82,8,SBD,Single-ply,M
70.31,Andrew Adkins,70.31,Varsity,Vassar,115.67,124.74,,124.74,77.11,86.18,,86.18,147.42,,,147.42,358.34,9,SBD,Single-ply,M
69.17,Tony Zelinski,70.31,Varsity,Farwell,,,,,,,,,226.8,,,226.8,,DQ,SBD,Single-ply,M
69.9,Xavier DeLassantos,70.31,Varsity,Clarkston,145.15,149.69,,149.69,,,,,,,,,,DQ,SBD,Single-ply,M
74.84,Josh Vyvermann,74.84,Varsity,Plainwell,195.04,206.38,-213.19,206.38,117.93,136.08,142.88,142.88,210.92,226.8,-238.14,226.8,576.06,1,SBD,Single-ply,M
72.98,Scott Chevalier,74.84,Varsity,Dexter,206.38,215.46,224.53,224.53,113.4,127.01,-133.81,127.01,206.38,-210.92,210.92,210.92,562.45,2,SBD,Single-ply,M
72.48,Nicholas Sorise,74.84,Varsity,Clarkston,201.85,210.92,217.72,217.72,97.52,102.06,106.59,106.59,206.38,-215.46,-215.46,206.38,530.7,3,SBD,Single-ply,M
74.84,Ryan Vincent,74.84,Varsity,Whitehall,174.63,195.04,-213.19,195.04,-115.67,120.2,124.74,124.74,183.7,206.38,-217.72,206.38,526.17,4,SBD,Single-ply,M
71.94,Shannon Evans #3,74.84,Varsity,Muskegon,154.22,165.56,-172.37,165.56,115.67,127.01,131.54,131.54,197.31,-217.72,217.72,217.72,514.83,5,SBD,Single-ply,M
73.62,Schaar,74.84,Varsity,Dewitt,197.31,206.38,210.92,210.92,106.59,115.67,120.2,120.2,183.7,-192.78,-192.78,183.7,514.83,6,SBD,Single-ply,M
,Ross Stokes,74.84,Varsity,Muskegon,165.56,185.97,195.04,195.04,108.86,124.74,-136.08,124.74,192.78,-215.46,-215.46,192.78,512.56,7,SBD,Single-ply,M
,Bobby Miller,74.84,Varsity,Powers,195.04,206.38,210.92,210.92,95.25,-99.79,99.79,99.79,195.04,201.85,-210.92,201.85,512.56,8,SBD,Single-ply,M
73.3,Brad Nettle,74.84,Varsity,Clarkston,165.56,174.63,-185.97,174.63,108.86,113.4,-115.67,113.4,210.92,219.99,-224.53,219.99,508.02,9,SBD,Single-ply,M
74.34,Derek Robyler,74.84,Varsity,Plainwell,149.69,-165.56,174.63,174.63,99.79,108.86,117.93,117.93,183.7,204.12,215.46,215.46,508.02,10,SBD,Single-ply,M
72.12,Maslanka,74.84,Varsity,Saugatuck,167.83,176.9,-185.97,176.9,-136.08,136.08,-145.15,136.08,172.37,179.17,188.24,188.24,501.22,11,SBD,Single-ply,M
74.57,Blake Fowler,74.84,Varsity,Richmond,-174.63,174.63,183.7,183.7,106.59,-111.13,113.4,113.4,183.7,190.51,-201.85,190.51,487.61,12,SBD,Single-ply,M
73.8,Chase Wiechmann,74.84,Varsity,Birch Run,149.69,154.22,-158.76,154.22,120.2,124.74,129.27,129.27,179.17,192.78,-206.38,192.78,476.27,13,SBD,Single-ply,M
74.48,Robert Towery,74.84,Varsity,Standish,163.29,167.83,-174.63,167.83,102.06,106.59,111.13,111.13,-183.7,183.7,190.51,190.51,469.47,14,SBD,Single-ply,M
73.62,Chris Mullins,74.84,Varsity,Holton,151.95,156.49,165.56,165.56,104.33,111.13,-113.4,111.13,174.63,183.7,190.51,190.51,467.2,15,SBD,Single-ply,M
73.16,Bailey,74.84,Varsity,Muskegon,156.49,165.56,-181.44,165.56,108.86,-117.93,-117.93,108.86,183.7,185.97,-190.51,185.97,460.4,16,SBD,Single-ply,M
73.39,Jeff Martin,74.84,Varsity,Holton,174.63,-183.7,-183.7,174.63,106.59,-111.13,111.13,111.13,174.63,-183.7,-183.7,174.63,460.4,17,SBD,Single-ply,M
73.12,Kody Kelso,74.84,Varsity,Mt. Morris,147.42,156.49,163.29,163.29,113.4,-140.61,-142.88,113.4,172.37,181.44,-197.31,181.44,458.13,18,SBD,Single-ply,M
74.07,Joshua McCarthy,74.84,Varsity,Mt. Morris,120.2,129.27,133.81,133.81,74.84,79.38,83.91,83.91,181.44,190.51,199.58,199.58,417.3,19,SBD,Single-ply,M
73.62,Justin Tino,74.84,Varsity,Sandusky,142.88,149.69,158.76,158.76,-95.25,-102.06,-102.06,,158.76,-183.7,183.7,183.7,342.46,20,SBD,Single-ply,M
81.87,Justin Tuinstra,82.1,Varsity,Plainwell,226.8,244.94,,244.94,151.95,156.49,161.03,161.03,210.92,224.53,,224.53,630.49,1,SBD,Single-ply,M
79.83,Matt Wozny,82.1,Varsity,Walled Lake W,183.7,192.78,199.58,199.58,102.06,120.2,,120.2,206.38,229.06,,229.06,548.85,2,SBD,Single-ply,M
80.78,Jimmy Marker,82.1,Varsity,Vassar,183.7,195.04,204.12,204.12,113.4,120.2,,120.2,210.92,217.72,219.99,219.99,544.31,3,SBD,Single-ply,M
80.24,Tom Zintsmaster,82.1,Varsity,Powers,172.37,,183.7,183.7,129.27,138.35,142.88,142.88,208.65,215.46,,215.46,542.04,4,SBD,Single-ply,M
79.83,Bill Deola,82.1,Varsity,Lakeville,158.76,,188.24,188.24,113.4,,,113.4,204.12,215.46,,215.46,517.1,5,SBD,Single-ply,M
80.78,Cam Wiechmann,82.1,Varsity,Birch Run,151.95,161.03,165.56,165.56,120.2,127.01,131.54,131.54,183.7,201.85,217.72,217.72,514.83,6,SBD,Single-ply,M
,Steven Tyler,82.1,Varsity,Muskegon,165.56,183.7,190.51,190.51,104.33,113.4,120.2,120.2,176.9,190.51,201.85,201.85,512.56,7,SBD,Single-ply,M
,Matt Embury,82.1,Varsity,Atherton,172.37,,,172.37,,117.93,122.47,122.47,217.72,,,217.72,512.56,8,SBD,Single-ply,M
80.42,George McArthur,82.1,Varsity,Clarkston,149.69,158.76,165.56,165.56,,,117.93,117.93,206.38,219.99,226.8,226.8,510.29,9,SBD,Single-ply,M
79.38,Rolly Taft,82.1,Varsity,Harper Creek,165.56,183.7,188.24,188.24,97.52,102.06,,102.06,190.51,199.58,204.12,204.12,494.42,10,SBD,Single-ply,M
80.65,Zac Blankenship,82.1,Varsity,Dewitt,165.56,174.63,,174.63,106.59,111.13,,111.13,183.7,204.12,,204.12,489.88,11,SBD,Single-ply,M
78.47,Andrew Opperman,82.1,Varsity,Vassar,151.95,165.56,183.7,183.7,88.45,97.52,102.06,102.06,174.63,185.97,199.58,199.58,485.34,12,SBD,Single-ply,M
80.88,Matt Howland,82.1,Varsity,Comstock,,167.83,183.7,183.7,111.13,122.47,,122.47,,172.37,179.17,179.17,485.34,13,SBD,Single-ply,M
80.42,Aaron Kroh,82.1,Varsity,Whitmore Lake,154.22,163.29,165.56,165.56,117.93,122.47,,122.47,185.97,195.04,,195.04,483.08,14,SBD,Single-ply,M
81.37,Aaron Seelman,82.1,Varsity,Climax Scotts,170.1,,,170.1,92.99,97.52,,97.52,183.7,206.38,,206.38,474,15,SBD,Single-ply,M
80.83,Zach Johnson,82.1,Varsity,Morenci,147.42,154.22,,154.22,,113.4,,113.4,183.7,192.78,204.12,204.12,471.74,16,SBD,Single-ply,M
80.69,Donnie Bisel,82.1,Varsity,Newaygo,,165.56,,165.56,97.52,,,97.52,192.78,,,192.78,455.86,17,SBD,Single-ply,M
81.69,Caleb Kozicki,82.1,Varsity,Montague,,142.88,,142.88,108.86,115.67,,115.67,176.9,188.24,197.31,197.31,455.86,18,SBD,Single-ply,M
77.56,James Williams #19,82.1,Varsity,Battle Creek Cen.,124.74,133.81,,133.81,97.52,102.06,,102.06,147.42,188.24,190.51,190.51,426.38,19,SBD,Single-ply,M
86.23,Tony Thompson,88,Varsity,Lake Orion,204.12,208.65,-215.46,208.65,113.4,124.74,127.01,127.01,210.92,231.33,240.4,240.4,576.06,1,SBD,Single-ply,M
88,Cory Schmidt,88,Varsity,Esse-ville-Garber,206.38,217.72,-222.26,217.72,127.01,136.08,138.35,138.35,210.92,219.99,-229.06,219.99,576.06,2,SBD,Single-ply,M
86.05,Casey Dressel-House,88,Varsity,Clarkston,195.04,199.58,204.12,204.12,120.2,124.74,-131.54,124.74,224.53,231.33,235.87,235.87,564.72,3,SBD,Single-ply,M
85.28,Justin Peterson,88,Varsity,Lake Fenton,-192.78,-210.92,210.92,210.92,113.4,-117.93,122.47,122.47,197.31,210.92,-226.8,210.92,544.31,4,SBD,Single-ply,M
86.41,Dan Diem,88,Varsity,Montrose,174.63,183.7,192.78,192.78,127.01,-140.61,140.61,140.61,183.7,197.31,,197.31,530.7,5,SBD,Single-ply,M
83.69,Darius Whitehead,88,Varsity,Berrien Springs,165.56,179.17,-188.24,179.17,136.08,142.88,-149.69,142.88,185.97,204.12,-219.99,204.12,526.17,6,SBD,Single-ply,M
87.09,Vernon Bryan,88,Varsity,Wayne Mem,174.63,-183.7,-188.24,174.63,106.59,113.4,-120.2,113.4,226.8,238.14,-242.67,238.14,526.17,7,SBD,Single-ply,M
86.59,Joe Riley,88,Varsity,Plainwell,165.56,179.17,-188.24,179.17,113.4,120.2,-124.74,120.2,192.78,204.12,213.19,213.19,512.56,9,SBD,Single-ply,M
87.63,Robert Hasman,88,Varsity,Flushing,174.63,188.24,-199.58,188.24,113.4,-120.2,,113.4,197.31,210.92,-219.99,210.92,512.56,8,SBD,Single-ply,M
87.86,Aaron Howland,88,Varsity,Linden,172.37,179.17,-183.7,179.17,133.81,142.88,-151.95,142.88,183.7,-190.51,-190.51,183.7,505.76,10,SBD,Single-ply,M
88,Chuck England,88,Varsity,Montague,158.76,179.17,-188.24,179.17,113.4,120.2,-124.74,120.2,183.7,204.12,-215.46,204.12,503.49,11,SBD,Single-ply,M
87.91,Matt McCormick,88,Varsity,Lake Fenton,156.49,167.83,-183.7,167.83,-111.13,-111.13,111.13,111.13,183.7,192.78,206.38,206.38,485.34,12,SBD,Single-ply,M
84.73,Tyler Christenson,88,Varsity,Maple Valley,154.22,161.03,165.56,165.56,97.52,102.06,106.59,106.59,185.97,192.78,-199.58,192.78,464.93,13,SBD,Single-ply,M
86.27,Ryan Johnson #13,88,Varsity,Climax Scotts,158.76,174.63,-183.7,174.63,92.99,97.52,-102.06,97.52,170.1,183.7,190.51,190.51,462.66,14,SBD,Single-ply,M
86.5,Brandon Sutherland,88,Varsity,Battle Creek Central,-124.74,124.74,142.88,142.88,102.06,106.59,111.13,111.13,204.12,-226.8,-226.8,204.12,458.13,15,SBD,Single-ply,M
85.73,Brady Rupprecht,88,Varsity,Vassar,151.95,165.56,-172.37,165.56,90.72,92.99,-95.25,92.99,158.76,-170.1,-170.1,158.76,417.3,16,SBD,Single-ply,M
85,Cory Evanauski,88,Varsity,Holton,149.69,-154.22,154.22,154.22,92.99,-95.25,-95.25,92.99,158.76,165.56,-167.83,165.56,412.77,17,SBD,Single-ply,M
88,Terrian Kelly,88,Varsity,Muskegon,111.13,124.74,142.88,142.88,102.06,108.86,-120.2,108.86,151.95,158.76,-179.17,158.76,410.5,18,SBD,Single-ply,M
86.41,David Prosser,88,Varsity,Mt. Morris,165.56,-174.63,-174.63,165.56,-133.81,-133.81,-133.81,,,,,,,DQ,SBD,Single-ply,M
92.4,Steve Mcissac,93.89,Varsity,Clarkston,254.01,260.82,265.35,265.35,129.27,136.08,138.35,138.35,276.69,288.03,-292.57,288.03,691.73,1,SBD,Single-ply,M
92.94,Matt Short,93.89,Varsity,Mt. Morris,215.46,224.53,-235.87,224.53,147.42,151.95,156.49,156.49,217.72,-226.8,-249.48,217.72,598.74,2,SBD,Single-ply,M
93.76,Josh DeHaan,93.89,Varsity,Plainwell,210.92,222.26,-226.8,222.26,127.01,133.81,138.35,138.35,210.92,222.26,-226.8,222.26,582.87,3,SBD,Single-ply,M
92.58,Austin Toy,93.89,Varsity,Sandusky,204.12,-226.8,231.33,231.33,158.76,-163.29,-163.29,158.76,185.97,190.51,-197.31,190.51,580.6,4,SBD,Single-ply,M
91.72,Dan Taylor,93.89,Varsity,Lakeland,188.24,204.12,-215.46,204.12,122.47,124.74,129.27,129.27,192.78,204.12,215.46,215.46,548.85,5,SBD,Single-ply,M
90.26,Josh Anderson,93.89,Varsity,De-ter,174.63,181.44,188.24,188.24,129.27,133.81,-136.08,133.81,185.97,197.31,208.65,208.65,530.7,6,SBD,Single-ply,M
93.58,Chase Goff,93.89,Varsity,Lake Orion,183.7,192.78,-206.38,192.78,122.47,-129.27,-129.27,122.47,188.24,204.12,215.46,215.46,530.7,7,SBD,Single-ply,M
92.49,Drew McNamar,93.89,Varsity,Lake Orion,174.63,188.24,-197.31,188.24,115.67,-120.2,-122.47,115.67,210.92,-229.06,,210.92,514.83,8,SBD,Single-ply,M
92.26,Coplin,93.89,Varsity,Maple Valley,165.56,174.63,-181.44,174.63,102.06,-104.33,104.33,104.33,181.44,199.58,-204.12,199.58,478.54,9,SBD,Single-ply,M
90.85,Jarred Goris,93.89,Varsity,Maple Valley,158.76,165.56,-172.37,165.56,111.13,115.67,120.2,120.2,163.29,170.1,-176.9,170.1,455.86,10,SBD,Single-ply,M
90.26,Marcus Olsen,93.89,Varsity,Battle Creek Central,124.74,145.15,156.49,156.49,90.72,97.52,-102.06,97.52,170.1,190.51,-199.58,190.51,444.52,11,SBD,Single-ply,M
93.35,Kyle Brooks,93.89,Varsity,Holton,151.95,158.76,-165.56,158.76,99.79,104.33,-108.86,104.33,165.56,179.17,-190.51,179.17,442.25,12,SBD,Single-ply,M
91.63,Jake Vance,93.89,Varsity,Lake Fenton,142.88,158.76,-167.83,158.76,83.91,88.45,90.72,90.72,142.88,167.83,183.7,183.7,433.18,13,SBD,Single-ply,M
92.35,Dan Anderson,93.89,Varsity,Montague,113.4,-133.81,133.81,133.81,99.79,106.59,-111.13,106.59,190.51,-206.38,-210.92,190.51,430.91,14,SBD,Single-ply,M
90.95,Endrit Cela,93.89,Varsity,Walled Lake W,174.63,183.7,188.24,188.24,-136.08,-136.08,-136.08,,183.7,-192.78,192.78,192.78,,DQ,SBD,Single-ply,M
90.81,Brian Stawowy,93.89,Varsity,Standish,170.1,183.7,-190.51,183.7,-104.33,-111.13,-111.13,,190.51,195.04,-199.58,195.04,,DQ,SBD,Single-ply,M
98.2,Brandon Fiebiger,99.79,Varsity,Plainwell,242.67,251.74,258.55,258.55,136.08,-145.15,,136.08,281.23,-294.84,-294.84,281.23,675.85,1,SBD,Single-ply,M
96.8,Curtis Bohne,99.79,Varsity,Colon,-174.63,183.7,,183.7,124.74,-158.76,158.76,158.76,226.8,242.67,-244.94,242.67,585.13,2,SBD,Single-ply,M
96.52,Jeremy Riley,99.79,Varsity,Maple Valley,192.78,206.38,222.26,222.26,115.67,120.2,-122.47,120.2,206.38,224.53,229.06,229.06,571.53,3,SBD,Single-ply,M
96.39,Brad Leverenz,99.79,Varsity,Wayne Memorial,188.24,195.04,204.12,204.12,136.08,-140.61,-140.61,136.08,208.65,219.99,229.06,229.06,569.26,4,SBD,Single-ply,M
99.79,Devere Enoch,99.79,Varsity,Clarkston,-226.8,226.8,-242.67,226.8,122.47,127.01,133.81,133.81,201.85,-206.38,-206.38,201.85,562.45,5,SBD,Single-ply,M
99.02,Dustin Hippensteel,99.79,Varsity,Atherton,-183.7,183.7,195.04,195.04,129.27,136.08,-142.88,136.08,190.51,210.92,-226.8,210.92,542.04,6,SBD,Single-ply,M
98.88,Scott Edwards,99.79,Varsity,Goodrich,163.29,176.9,190.51,190.51,136.08,145.15,147.42,147.42,185.97,197.31,201.85,201.85,539.77,7,SBD,Single-ply,M
96.03,James Monko,99.79,Varsity,Lake Orion,170.1,183.7,-197.31,183.7,127.01,-136.08,-136.08,127.01,217.72,226.8,-231.33,226.8,537.51,8,SBD,Single-ply,M
99.34,Andy Hasenfratz,99.79,Varsity,Lake Fenton,192.78,-204.12,204.12,204.12,113.4,124.74,131.54,131.54,183.7,-195.04,195.04,195.04,530.7,9,SBD,Single-ply,M
96.16,Ryan Ingle,99.79,Varsity,Wayne Memorial,183.7,192.78,-199.58,192.78,104.33,-108.86,-108.86,104.33,229.06,-238.14,-238.14,229.06,526.17,10,SBD,Single-ply,M
97.2,Amir Abu-Aita,99.79,Varsity,Genesee,-174.63,-174.63,174.63,174.63,124.74,-129.27,-129.27,124.74,204.12,215.46,219.99,219.99,519.36,11,SBD,Single-ply,M
,Chris Abu-Aita,99.79,Varsity,Lakeville,165.56,-183.7,183.7,183.7,113.4,-124.74,-124.74,113.4,-204.12,-204.12,-204.12,,297.1,12,SBD,Single-ply,M
99.65,Ashton Leggett,99.79,Varsity,Muskegon,-161.03,-167.83,-172.37,,131.54,136.08,138.35,138.35,201.85,208.65,217.72,217.72,,DQ,SBD,Single-ply,M
99.93,Mark Ziliski,109.77,Varsity,Montrose,249.48,272.16,294.84,294.84,183.7,197.31,204.12,204.12,240.4,256.28,272.16,272.16,771.11,1,SBD,Single-ply,M
106.96,Tom Birchmeier,109.77,Varsity,Powers,231.33,238.14,244.94,244.94,142.88,149.69,156.49,156.49,249.48,256.28,-272.16,256.28,657.71,2,SBD,Single-ply,M
102.38,Dune Cook,109.77,Varsity,Colon,204.12,226.8,-238.14,226.8,142.88,161.03,-165.56,161.03,204.12,226.8,240.4,240.4,628.23,3,SBD,Single-ply,M
104.87,Trevor Onken,109.77,Varsity,Saugatuck,183.7,206.38,-213.19,206.38,142.88,158.76,167.83,167.83,206.38,226.8,235.87,235.87,610.08,4,SBD,Single-ply,M
101.51,Alan Easton,109.77,Varsity,Goodrich,215.46,-226.8,226.8,226.8,136.08,142.88,154.22,154.22,204.12,217.72,226.8,226.8,607.81,5,SBD,Single-ply,M
106.14,Josh Perusse,109.77,Varsity,Wayne Mem,215.46,-226.8,-226.8,215.46,113.4,124.74,-131.54,124.74,226.8,249.48,-265.35,249.48,589.67,6,SBD,Single-ply,M
105.51,Brandon Reynolds,109.77,Varsity,Battle Creek Central,190.51,197.31,204.12,204.12,115.67,120.2,-122.47,120.2,229.06,235.87,-242.67,235.87,560.19,7,SBD,Single-ply,M
106.96,Anthony Ullman,109.77,Varsity,Harper Creek,172.37,188.24,-195.04,188.24,108.86,115.67,-120.2,115.67,210.92,222.26,-231.33,222.26,526.17,8,SBD,Single-ply,M
102.33,Mike Rose #3,109.77,Varsity,Richmond,-165.56,-174.63,174.63,174.63,106.59,111.13,-115.67,111.13,210.92,-219.99,-219.99,210.92,496.68,9,SBD,Single-ply,M
109.77,Robert Gonzalez,109.77,Varsity,Montague,174.63,-183.7,-183.7,174.63,111.13,113.4,115.67,115.67,183.7,192.78,-204.12,192.78,483.08,10,SBD,Single-ply,M
108.27,Eric Nierderer,109.77,Varsity,Essexville Garber,156.49,165.56,-170.1,165.56,102.06,111.13,-113.4,111.13,192.78,-238.14,-238.14,192.78,469.47,11,SBD,Single-ply,M
99.74,Rick Lutrell,109.77,Varsity,Holton,154.22,-165.56,-165.56,154.22,95.25,99.79,-102.06,99.79,158.76,165.56,-170.1,165.56,419.57,12,SBD,Single-ply,M
108.09,Dan Crist,109.77,Varsity,Lakeville,-213.19,-213.19,-213.19,,142.88,158.76,-181.44,158.76,217.72,226.8,-233.6,226.8,385.55,13,SBD,Single-ply,M
120.93,Anthony Galczak,124.74,Varsity,Newaygo,219.99,244.94,-260.82,244.94,-147.42,154.22,167.83,167.83,-222.26,238.14,249.48,249.48,662.24,1,SBD,Single-ply,M
124.74,Rex West,124.74,Varsity,Colon,183.7,215.46,226.8,226.8,113.4,-142.88,142.88,142.88,226.8,242.67,251.74,251.74,621.42,2,SBD,Single-ply,M
119.84,Nick Coppersmith,124.74,Varsity,Harper Creek,199.58,208.65,217.72,217.72,138.35,-145.15,-147.42,138.35,188.24,199.58,-206.38,199.58,555.65,3,SBD,Single-ply,M
116.75,Nick Helmstetter,124.74,Varsity,Flushing,197.31,215.46,-224.53,215.46,117.93,-127.01,-127.01,117.93,210.92,-219.99,-222.26,210.92,544.31,4,SBD,Single-ply,M
118.84,Michael Meyers,124.74,Varsity,Climax Scotts,183.7,195.04,204.12,204.12,102.06,-106.59,-106.59,102.06,229.06,238.14,-249.48,238.14,544.31,5,SBD,Single-ply,M
116.44,Zack Sterling,124.74,Varsity,Montague,158.76,170.1,176.9,176.9,-120.2,120.2,-122.47,120.2,226.8,-235.87,238.14,238.14,535.24,6,SBD,Single-ply,M
111.86,David Huggett,124.74,Varsity,Harper Creek,-165.56,176.9,-195.04,176.9,127.01,129.27,-133.81,129.27,195.04,208.65,215.46,215.46,521.63,7,SBD,Single-ply,M
118.93,Andy Goble,124.74,Varsity,Lakeland,174.63,-188.24,190.51,190.51,115.67,117.93,-120.2,117.93,188.24,-204.12,-204.12,188.24,496.68,8,SBD,Single-ply,M
119.93,John Harris,124.74,Varsity,Muskegon,174.63,-185.97,-192.78,174.63,111.13,-117.93,-117.93,111.13,201.85,-226.8,-226.8,201.85,487.61,9,SBD,Single-ply,M
111.13,Rob Luke,124.74,Varsity,Lake Fenton,233.6,-242.67,244.94,244.94,-142.88,-142.88,-142.88,,-226.8,,,,,DQ,SBD,Single-ply,M
119.88,Dave Filipouch,124.74,Varsity,Powers,199.58,210.92,215.46,215.46,-138.35,-138.35,-138.35,,-213.19,,,,,DQ,SBD,Single-ply,M
115.85,Shane Larkin,124.74,Varsity,Williamston,-188.24,-192.78,-195.04,,-138.35,,,,183.7,,,183.7,,DQ,SBD,Single-ply,M
126.1,Gilde,124.74+,Varsity,McBain,272.16,317.51,-324.32,317.51,172.37,195.04,199.58,199.58,272.16,285.76,299.37,299.37,816.47,1,SBD,Single-ply,M
139.25,Jake Cannon,124.74+,Varsity,Flushing,294.84,-317.51,-317.51,294.84,185.97,197.31,-201.85,197.31,256.28,-272.16,-278.96,256.28,748.43,2,SBD,Single-ply,M
156.08,Rashaad White,124.74+,Varsity,Battle Creek Central,-219.99,226.8,-265.35,226.8,170.1,174.63,179.17,179.17,256.28,269.89,283.5,283.5,689.46,3,SBD,Single-ply,M
172.59,Chase Dunham,124.74+,Varsity,Mt. Morris,242.67,-251.74,-251.74,242.67,161.03,165.56,-167.83,165.56,222.26,231.33,235.87,235.87,644.1,4,SBD,Single-ply,M
165.33,Wade Lambertson,124.74+,Varsity,Flushing,190.51,208.65,215.46,215.46,129.27,138.35,-147.42,138.35,185.97,195.04,210.92,210.92,564.72,5,SBD,Single-ply,M
145.29,Swan Swanson,124.74+,Varsity,Whitehall,142.88,165.56,179.17,179.17,142.88,-151.95,-156.49,142.88,183.7,206.38,-226.8,206.38,528.44,6,SBD,Single-ply,M
139.34,Keith Smith,124.74+,Varsity,Muskegon,181.44,-197.31,197.31,197.31,111.13,120.2,-124.74,120.2,206.38,-217.72,-217.72,206.38,523.9,7,SBD,Single-ply,M
136.26,Cecil Dubay,124.74+,Varsity,Mt. Morris,176.9,-185.97,185.97,185.97,120.2,124.74,-127.01,124.74,192.78,201.85,208.65,208.65,519.36,8,SBD,Single-ply,M
130.14,Komar,124.74+,Varsity,Kenowa Hills,158.76,-183.7,183.7,183.7,88.45,95.25,-102.06,95.25,-183.7,195.04,-204.12,195.04,474,9,SBD,Single-ply,M
136.17,John Najjar,124.74+,Varsity,Flushing,151.95,-161.03,-161.03,151.95,92.99,99.79,104.33,104.33,161.03,-170.1,-170.1,161.03,417.3,10,SBD,Single-ply,M
43.36,Kendra Miller #1,44,Open,Plainwell,113.4,127.01,136.08,136.08,61.23,65.77,68.04,68.04,117.93,127.01,-136.08,127.01,331.12,1,SBD,Single-ply,F
43.09,Nicky Riniger,44,Open,Plainwell,79.38,86.18,-90.72,86.18,43.09,-47.63,47.63,47.63,81.65,88.45,92.99,92.99,226.8,2,SBD,Single-ply,F
43.91,Mary Hitt,44,Open,Lake Fenton,61.23,-72.57,72.57,72.57,29.48,-38.56,-38.56,29.48,97.52,104.33,-122.47,104.33,206.38,3,SBD,Single-ply,F
43.95,Alexandria Hommer,44,Open,Lake Fenton,52.16,61.23,-65.77,61.23,24.95,29.48,-34.02,29.48,68.04,77.11,83.91,83.91,174.63,4,SBD,Single-ply,F
44,Brandi Hammond,44,Open,Lakeview,38.56,45.36,49.9,49.9,31.75,34.02,-38.56,34.02,77.11,-79.38,-79.38,77.11,161.03,5,SBD,Single-ply,F
42.64,Erin Shoemaker,44,Open,Maple Valley,36.29,43.09,49.9,49.9,24.95,27.22,29.48,29.48,58.97,61.23,63.5,63.5,142.88,6,SBD,Single-ply,F
44,Erin Voltz,44,Open,Goodrich,29.48,34.02,49.9,49.9,22.68,-34.02,-34.02,22.68,47.63,-58.97,61.23,61.23,133.81,7,SBD,Single-ply,F
37.83,Maryalice Berry,44,Open,Lake Fenton,20.41,24.95,29.48,29.48,20.41,22.68,-27.22,22.68,20.41,36.29,45.36,45.36,97.52,8,SBD,Single-ply,F
42.5,Jennelle Hickmott,44,Open,Flushing,-24.95,-24.95,-24.95,,,,,,,,,,,DQ,SBD,Single-ply,F
,Lanna Brasure,44,Open,Almont,,,,,,,,,,,,,,NS,SBD,Single-ply,F
46.81,Kayla Paff,47.63,Open,Plainwell,90.72,99.79,104.33,104.33,49.9,54.43,56.7,56.7,97.52,108.86,-117.93,108.86,269.89,1,SBD,Single-ply,F
47.45,Ashlee Doan,47.63,Open,Richmond,-81.65,81.65,-90.72,81.65,43.09,47.63,-49.9,47.63,108.86,-120.2,-120.2,108.86,238.14,2,SBD,Single-ply,F
47.54,Chelsea Goodman,47.63,Open,Vassar,-45.36,-45.36,45.36,45.36,40.82,43.09,-45.36,43.09,68.04,77.11,86.18,86.18,174.63,3,SBD,Single-ply,F
46.86,Mary Haidener,47.63,Open,Goodrich,43.09,47.63,-61.23,47.63,29.48,-31.75,-31.75,29.48,52.16,61.23,83.91,83.91,161.03,4,SBD,Single-ply,F
47.63,Danielle Audie,47.63,Open,Lake Fenton,29.48,34.02,38.56,38.56,24.95,-27.22,27.22,27.22,49.9,61.23,68.04,68.04,133.81,5,SBD,Single-ply,F
,Roxanne Shankster,47.63,Open,Morenci,,,,,,,,,,,,,,NS,SBD,Single-ply,F
,Hannah Gillish,47.63,Open,Montague,,,,,,,,,,,,,,NS,SBD,Single-ply,F
,Andrea Janos,47.63,Open,Flushing,,,,,,,,,,,,,,NS,SBD,Single-ply,F
51.44,Sara Beebe,51.71,Open,Plainwell,97.52,106.59,115.67,115.67,61.23,65.77,-68.04,65.77,106.59,120.2,-122.47,120.2,301.64,1,SBD,Single-ply,F
51.35,Angela Watson,51.71,Open,Richmond,86.18,92.99,-99.79,92.99,45.36,49.9,54.43,54.43,102.06,111.13,-117.93,111.13,258.55,2,SBD,Single-ply,F
50.62,Alea Carlson,51.71,Open,Richmond,79.38,88.45,-92.99,88.45,45.36,-49.9,49.9,49.9,106.59,111.13,117.93,117.93,256.28,3,SBD,Single-ply,F
51.35,Jennie Jaynes,51.71,Open,Richmond,70.31,-79.38,79.38,79.38,38.56,43.09,-45.36,43.09,106.59,115.67,-120.2,115.67,238.14,4,SBD,Single-ply,F
51.66,Whitney Peters,51.71,Open,Lake Fenton,-81.65,-81.65,86.18,86.18,34.02,38.56,-43.09,38.56,99.79,108.86,-117.93,108.86,233.6,5,SBD,Single-ply,F
51.71,Heather McFanin,51.71,Open,Plainwell,83.91,95.25,99.79,99.79,38.56,40.82,43.09,43.09,81.65,-88.45,88.45,88.45,231.33,6,SBD,Single-ply,F
50.58,Stephanie Altom,51.71,Open,Montrose,-65.77,65.77,77.11,77.11,43.09,49.9,-54.43,49.9,77.11,92.99,-102.06,92.99,219.99,7,SBD,Single-ply,F
50.85,Jessica Lozelle,51.71,Open,Atherton,63.5,-72.57,72.57,72.57,43.09,-47.63,-47.63,43.09,86.18,92.99,-95.25,92.99,208.65,8,SBD,Single-ply,F
50.08,Hannah Gillish,51.71,Open,Montague,54.43,58.97,65.77,65.77,-47.63,47.63,-49.9,47.63,-79.38,83.91,92.99,92.99,206.38,9,SBD,Single-ply,F
51.03,Samantha Brown #5,51.71,Open,Whitmore Lake,54.43,61.23,-68.04,61.23,40.82,-43.09,-43.09,40.82,77.11,92.99,-95.25,92.99,195.04,10,SBD,Single-ply,F
49.99,Angie Dally,51.71,Open,Whitmore Lake,-58.97,58.97,63.5,63.5,40.82,43.09,-45.36,43.09,70.31,-74.84,-74.84,70.31,176.9,11,SBD,Single-ply,F
50.53,Kayla Yenglin,51.71,Open,Essexville-Gerber,-56.7,56.7,-61.23,56.7,29.48,-34.02,-34.02,29.48,72.57,79.38,86.18,86.18,172.37,12,SBD,Single-ply,F
,Julie Brickel,51.71,Open,Richmond,,,,,,,,,,,,,,NS,SBD,Single-ply,F
,Catie Owens,51.71,Open,Flushing,,,,,,,,,,,,,,NS,SBD,Single-ply,F
54.43,Kim Douglas,55.79,Open,Plainwell,127.01,136.08,-147.42,136.08,-68.04,68.04,-74.84,68.04,136.08,-145.15,145.15,145.15,349.27,1,SBD,Single-ply,F
55.7,Jessica Steele,55.79,Open,Plainwell,108.86,117.93,-124.74,117.93,47.63,54.43,-58.97,54.43,92.99,104.33,111.13,111.13,283.5,2,SBD,Single-ply,F
55.38,Shanna Lee,55.79,Open,Lake Fenton,97.52,106.59,113.4,113.4,36.29,43.09,-45.36,43.09,111.13,-120.2,120.2,120.2,276.69,3,SBD,Single-ply,F
55.79,Cori Daugherty,55.79,Open,Montague,-79.38,88.45,92.99,92.99,40.82,45.36,-47.63,45.36,111.13,124.74,138.35,138.35,276.69,4,SBD,Single-ply,F
55.34,Laura Wagner,55.79,Open,Lake Fenton,74.84,-86.18,-86.18,74.84,52.16,-56.7,-56.7,52.16,86.18,-92.99,92.99,92.99,219.99,5,SBD,Single-ply,F
54.88,Alecia Yaklin,55.79,Open,Richmond,61.23,65.77,70.31,70.31,40.82,-43.09,-43.09,40.82,92.99,102.06,-108.86,102.06,213.19,6,SBD,Single-ply,F
55.61,Cassie Shepherd,55.79,Open,Goodrich,61.23,74.84,-83.91,74.84,34.02,38.56,-43.09,38.56,68.04,83.91,97.52,97.52,210.92,7,SBD,Single-ply,F
55.79,Catie Owens,55.79,Open,Flushing,-58.97,58.97,63.5,63.5,36.29,-40.82,-40.82,36.29,106.59,-115.67,-115.67,106.59,206.38,8,SBD,Single-ply,F
53.07,Amber Cain,55.79,Open,Flushing,61.23,-65.77,-65.77,61.23,38.56,43.09,-47.63,43.09,97.52,99.79,-106.59,99.79,204.12,9,SBD,Single-ply,F
53.48,Rosa Berry,55.79,Open,Richmond,61.23,65.77,-68.04,65.77,38.56,40.82,-43.09,40.82,-88.45,88.45,-102.06,88.45,195.04,10,SBD,Single-ply,F
55.02,Sam Ansenauh,55.79,Open,Goodrich,49.9,-56.7,56.7,56.7,-31.75,31.75,-36.29,31.75,83.91,90.72,-97.52,90.72,179.17,11,SBD,Single-ply,F
55.79,Alex Arebalo,55.79,Open,Essexville-Gerber,61.23,-65.77,-65.77,61.23,31.75,-38.56,-38.56,31.75,-79.38,83.91,-92.99,83.91,176.9,12,SBD,Single-ply,F
55.7,Laura Smith #4,55.79,Open,Whitehall,-90.72,-97.52,-97.52,,49.9,-54.43,-54.43,49.9,104.33,120.2,-124.74,120.2,,DQ,SBD,Single-ply,F
,Kady Allen,55.79,Open,Climax-Scotts,,,,,,,,,,,,,,NS,SBD,Single-ply,F
57.74,Caitlin Miller,59.87,Open,Plainwell,147.42,161.03,170.1,170.1,70.31,74.84,79.38,79.38,158.76,172.37,176.9,176.9,426.38,1,SBD,Single-ply,F
58.56,Amanda Vig,59.87,Open,Lake Fenton,97.52,-108.86,108.86,108.86,43.09,47.63,-56.7,47.63,106.59,113.4,-115.67,113.4,269.89,2,SBD,Single-ply,F
56.34,April Monaweck,59.87,Open,Plainwell,77.11,81.65,92.99,92.99,43.09,47.63,49.9,49.9,88.45,102.06,113.4,113.4,256.28,3,SBD,Single-ply,F
58.2,Laura Macko,59.87,Open,Flushing,88.45,-97.52,97.52,97.52,47.63,-49.9,-49.9,47.63,102.06,106.59,111.13,111.13,256.28,4,SBD,Single-ply,F
59.15,Amanda Mathews,59.87,Open,Richmond,-104.33,104.33,-111.13,104.33,38.56,43.09,-45.36,43.09,97.52,-111.13,-111.13,97.52,244.94,5,SBD,Single-ply,F
59.87,Kerry Esckelson,59.87,Open,Vassar,61.23,65.77,-70.31,65.77,43.09,47.63,-52.16,47.63,102.06,117.93,-122.47,117.93,231.33,6,SBD,Single-ply,F
58.83,Holly Beck,59.87,Open,Lake Fenton,70.31,83.91,-88.45,83.91,36.29,43.09,-45.36,43.09,90.72,-95.25,-99.79,90.72,217.72,7,SBD,Single-ply,F
59.87,Dhaneille Tobias,59.87,Open,Maple Valley,56.7,61.23,-65.77,61.23,47.63,-52.16,-52.16,47.63,95.25,102.06,108.86,108.86,217.72,8,SBD,Single-ply,F
57.65,Heather Cardneau,59.87,Open,Goodrich,61.23,-68.04,68.04,68.04,34.02,36.29,-38.56,36.29,102.06,111.13,-117.93,111.13,215.46,9,SBD,Single-ply,F
59.24,Rachel Compton,59.87,Open,Whitmore Lake,74.84,81.65,-88.45,81.65,43.09,-45.36,-45.36,43.09,74.84,83.91,-97.52,83.91,208.65,10,SBD,Single-ply,F
58.92,Natalie Cook,59.87,Open,Goodrich,68.04,-86.18,-86.18,68.04,31.75,-36.29,-36.29,31.75,83.91,92.99,102.06,102.06,201.85,11,SBD,Single-ply,F
59.33,Jazalyn Freeman,59.87,Open,Whitmore Lake,-65.77,65.77,70.31,70.31,38.56,-40.82,-40.82,38.56,88.45,92.99,-102.06,92.99,201.85,12,SBD,Single-ply,F
59.74,Hannah Rodgers,59.87,Open,Montague,-61.23,63.5,65.77,65.77,38.56,40.82,-45.36,40.82,83.91,88.45,,88.45,195.04,13,SBD,Single-ply,F
58.69,Jessika Brinkman,59.87,Open,Maple Valley,47.63,54.43,-61.23,54.43,43.09,45.36,-47.63,45.36,83.91,88.45,92.99,92.99,192.78,14,SBD,Single-ply,F
59.87,Courtney Brejnak,59.87,Open,Goodrich,61.23,-92.99,-92.99,61.23,31.75,-38.56,-38.56,31.75,83.91,90.72,-99.79,90.72,183.7,15,SBD,Single-ply,F
59.78,Christine Fielder,59.87,Open,Goodrich,56.7,61.23,-70.31,61.23,24.95,-31.75,-31.75,24.95,83.91,92.99,-99.79,92.99,179.17,16,SBD,Single-ply,F
59.01,Hannah Curruthers,59.87,Open,Standish,77.11,-92.99,-92.99,77.11,-49.9,-49.9,-49.9,,-102.06,102.06,104.33,104.33,,DQ,SBD,Single-ply,F
,Andi Zielenski,59.87,Open,Montague,,,,,,,,,,,,,,NS,SBD,Single-ply,F
,Angela Jennings,59.87,Open,Linden,,,,,,,,,,,,,,NS,SBD,Single-ply,F
62.96,Kata Howarth,67.13,Open,Powers,99.79,106.59,113.4,113.4,58.97,65.77,-72.57,65.77,138.35,142.88,154.22,154.22,333.39,1,SBD,Single-ply,F
67.13,Christina Sweet,67.13,Open,Goodrich,113.4,129.27,136.08,136.08,52.16,-58.97,-58.97,52.16,124.74,133.81,-140.61,133.81,322.05,2,SBD,Single-ply,F
66.36,Heather Petolick,67.13,Open,Whitehall,-102.06,106.59,-115.67,106.59,70.31,74.84,-79.38,74.84,104.33,117.93,131.54,131.54,312.98,3,SBD,Single-ply,F
66.36,Alyssa Myner,67.13,Open,Plainwell,102.06,113.4,117.93,117.93,45.36,49.9,54.43,54.43,106.59,113.4,120.2,120.2,292.57,4,SBD,Single-ply,F
67.13,Amber Holland,67.13,Open,Whitehall,99.79,-113.4,-120.2,99.79,-83.91,-83.91,83.91,83.91,108.86,-120.2,-127.01,108.86,292.57,5,SBD,Single-ply,F
61.69,Alyssa Delorenzo,67.13,Open,Richmond,102.06,108.86,-113.4,108.86,38.56,43.09,-45.36,43.09,129.27,136.08,-142.88,136.08,288.03,6,SBD,Single-ply,F
64.59,Meredith Mayberry,67.13,Open,Goodrich,-99.79,99.79,-113.4,99.79,54.43,61.23,-63.5,61.23,102.06,115.67,-124.74,115.67,276.69,7,SBD,Single-ply,F
64.64,Anglea Jennings,67.13,Open,Linden,79.38,90.72,-102.06,90.72,52.16,56.7,-58.97,56.7,106.59,115.67,127.01,127.01,274.42,8,SBD,Single-ply,F
66.09,Sara Schunter,67.13,Open,Flushing,74.84,-90.72,90.72,90.72,54.43,-58.97,-58.97,54.43,102.06,117.93,122.47,122.47,267.62,9,SBD,Single-ply,F
66.9,Ashly Barron,67.13,Open,Montrose,81.65,88.45,97.52,97.52,38.56,43.09,-45.36,43.09,106.59,113.4,122.47,122.47,263.08,10,SBD,Single-ply,F
64.82,Noel McAuliffe,67.13,Open,Goodrich,92.99,-102.06,102.06,102.06,36.29,-38.56,-38.56,36.29,102.06,106.59,113.4,113.4,251.74,11,SBD,Single-ply,F
66.5,Andra Sivil,67.13,Open,Flushing,63.5,70.31,79.38,79.38,-63.5,63.5,-65.77,63.5,108.86,,,108.86,251.74,12,SBD,Single-ply,F
66.9,Sarah Sparby,67.13,Open,Richmond,79.38,88.45,92.99,92.99,47.63,52.16,-54.43,52.16,92.99,-99.79,-99.79,92.99,238.14,13,SBD,Single-ply,F
62.46,Jolynn Zimhelt,67.13,Open,Goodrich,65.77,72.57,86.18,86.18,34.02,40.82,-45.36,40.82,83.91,92.99,102.06,102.06,229.06,14,SBD,Single-ply,F
66.59,Beth Wenkel,67.13,Open,Standish,68.04,-81.65,-86.18,68.04,49.9,52.16,-54.43,52.16,99.79,104.33,-108.86,104.33,224.53,15,SBD,Single-ply,F
65.77,Sarah Rinks,67.13,Open,Lake Fenton,70.31,-79.38,-79.38,70.31,-34.02,-34.02,34.02,34.02,77.11,81.65,90.72,90.72,195.04,16,SBD,Single-ply,F
65.32,Chelsey Smith,67.13,Open,Whitmore Lake,54.43,-58.97,58.97,58.97,36.29,-38.56,-38.56,36.29,74.84,88.45,-97.52,88.45,183.7,17,SBD,Single-ply,F
60.37,Melissa Lyon,67.13,Open,Flushing,65.77,70.31,-72.57,70.31,45.36,-49.9,-49.9,45.36,-111.13,-111.13,-111.13,,,DQ,SBD,Single-ply,F
62.96,Brittany Goodling,67.13,Open,Montrose,-56.7,56.7,-58.97,56.7,-40.82,-40.82,-40.82,,77.11,81.65,88.45,88.45,,DQ,SBD,Single-ply,F
64.46,Christina Riske,67.13,Open,Flushing,70.31,74.84,,74.84,-43.09,-49.9,-49.9,,-83.91,-83.91,,,,DQ,SBD,Single-ply,F
65,Andi Zielenski,67.13,Open,Montague,77.11,-81.65,81.65,81.65,-45.36,-52.16,-52.16,,-88.45,90.72,104.33,104.33,,DQ,SBD,Single-ply,F
74.39,Jessica Johnson,74.84,Open,Montague,106.59,113.4,120.2,120.2,61.23,-65.77,-65.77,61.23,124.74,133.81,142.88,142.88,324.32,1,SBD,Single-ply,F
71.12,Danielle Roden,74.84,Open,Climax-Scotts,92.99,102.06,108.86,108.86,56.7,63.5,-65.77,63.5,127.01,-136.08,-136.08,127.01,299.37,2,SBD,Single-ply,F
74.34,Cofissa Carlson,74.84,Open,Flushing,74.84,92.99,97.52,97.52,45.36,52.16,-56.7,52.16,124.74,136.08,145.15,145.15,294.84,3,SBD,Single-ply,F
74.3,Sarah Sweet,74.84,Open,Goodrich,102.06,113.4,-127.01,113.4,47.63,54.43,-58.97,54.43,102.06,113.4,124.74,124.74,292.57,4,SBD,Single-ply,F
71.62,Jami Harper,74.84,Open,Montague,83.91,88.45,97.52,97.52,38.56,45.36,47.63,47.63,113.4,133.81,142.88,142.88,288.03,5,SBD,Single-ply,F
73.21,Bailey Wandug,74.84,Open,Dexter,81.65,-88.45,-92.99,81.65,61.23,-65.77,-65.77,61.23,108.86,117.93,129.27,129.27,272.16,6,SBD,Single-ply,F
73.12,Tammy Davis,74.84,Open,Muskegon,79.38,83.91,90.72,90.72,54.43,61.23,-65.77,61.23,-102.06,102.06,115.67,115.67,267.62,7,SBD,Single-ply,F
68.86,Chelsi Morey,74.84,Open,Lake Fenton,97.52,-106.59,-106.59,97.52,45.36,49.9,-52.16,49.9,117.93,-131.54,-131.54,117.93,265.35,8,SBD,Single-ply,F
74.84,Andrea Howland,74.84,Open,Linden,77.11,86.18,-92.99,86.18,56.7,-63.5,63.5,63.5,102.06,111.13,-120.2,111.13,260.82,9,SBD,Single-ply,F
67.45,Laura Gallagher,74.84,Open,Flushing,68.04,81.65,95.25,95.25,43.09,45.36,-47.63,45.36,113.4,,,113.4,254.01,10,SBD,Single-ply,F
72.48,Emily Kutsley,74.84,Open,Morenci,83.91,95.25,-102.06,95.25,45.36,49.9,-52.16,49.9,-102.06,102.06,-111.13,102.06,247.21,11,SBD,Single-ply,F
74.48,Kara Rudgers,74.84,Open,Cros. Lex.,86.18,-95.25,-95.25,86.18,45.36,49.9,-54.43,49.9,99.79,111.13,-113.4,111.13,247.21,12,SBD,Single-ply,F
73.71,Stacy Lasinski,74.84,Open,Richmond,61.23,-68.04,68.04,68.04,45.36,49.9,-52.16,49.9,111.13,115.67,-117.93,115.67,233.6,13,SBD,Single-ply,F
71.3,Rachel Little,74.84,Open,Flushing,-68.04,68.04,79.38,79.38,43.09,-45.36,-45.36,43.09,-102.06,102.06,104.33,104.33,226.8,14,SBD,Single-ply,F
72.62,Sam Longeran,74.84,Open,Almont,-70.31,70.31,74.84,74.84,38.56,43.09,-45.36,43.09,102.06,-106.59,-108.86,102.06,219.99,15,SBD,Single-ply,F
75.75,Alyssa Marriner,82.1,Open,Bendle,131.54,-138.35,-142.88,131.54,72.57,77.11,-81.65,77.11,131.54,136.08,138.35,138.35,347,1,SBD,Single-ply,F
81.69,Amanda Buckner,82.1,Open,Whitmore Lake,111.13,120.2,131.54,131.54,-74.84,74.84,79.38,79.38,113.4,124.74,136.08,136.08,347,2,SBD,Single-ply,F
79.56,Laura Ottenbacher,82.1,Open,Richmond,70.31,77.11,88.45,88.45,38.56,43.09,-45.36,43.09,97.52,106.59,113.4,113.4,244.94,3,SBD,Single-ply,F
79.74,Sankawana Ervin,82.1,Open,Muskegon,70.31,77.11,81.65,81.65,-54.43,54.43,-61.23,54.43,83.91,90.72,99.79,99.79,235.87,4,SBD,Single-ply,F
75.39,Elisa Goss,82.1,Open,Lake Fenton,74.84,-81.65,81.65,81.65,-38.56,38.56,-43.09,38.56,90.72,95.25,106.59,106.59,226.8,5,SBD,Single-ply,F
80.78,Kelly Houghton,82.1,Open,Whitmore Lake,54.43,-61.23,65.77,65.77,45.36,49.9,-52.16,49.9,108.86,-115.67,-115.67,108.86,224.53,6,SBD,Single-ply,F
76.7,Kelly Proctor,82.1,Open,Whitmore Lake,61.23,68.04,-72.57,68.04,-43.09,43.09,-47.63,43.09,81.65,88.45,95.25,95.25,206.38,7,SBD,Single-ply,F
,Lindsay Haggerty,82.1,Open,Harper Creek,,,,,,,,,,,,,,NS,SBD,Single-ply,F
,Sarah Williams,82.1,Open,Flushing,,,,,,,,,,,,,,NS,SBD,Single-ply,F
,Marisa Jensen,82.1,Open,Deckerville,,,,,,,,,,,,,,NS,SBD,Single-ply,F
87.5,Bonica Brown,89.81,Open,Climax-Scotts,183.7,204.12,210.92,210.92,106.59,120.2,-124.74,120.2,170.1,199.58,208.65,208.65,539.77,1,SBD,Single-ply,F
88.36,Ann Nelson,89.81,Open,Montague,104.33,111.13,120.2,120.2,52.16,-58.97,58.97,58.97,113.4,124.74,136.08,136.08,315.25,2,SBD,Single-ply,F
,Tiffany Lashbrook,89.81,Open,Cros. Lex.,,,,,,,,,,,,,,NS,SBD,Single-ply,F
95.71,Meson Keinath,99.79,Open,Flushing,74.84,92.99,-102.06,92.99,-47.63,-47.63,47.63,47.63,106.59,-108.86,-108.86,106.59,247.21,1,SBD,Single-ply,F
96.16,Kaitlyn Larue,99.79,Open,Whitmore Lake,52.16,56.7,65.77,65.77,49.9,56.7,-63.5,56.7,102.06,104.33,106.59,106.59,229.06,2,SBD,Single-ply,F
87.5,Cori Hanson,99.79,Open,Richmond,-52.16,61.23,-65.77,61.23,36.29,40.82,-43.09,40.82,70.31,79.38,-95.25,79.38,181.44,3,SBD,Single-ply,F
112.67,Ashlee Terry,99.79+,Open,Muskegon,79.38,90.72,102.06,102.06,63.5,65.77,-70.31,65.77,-124.74,124.74,131.54,131.54,299.37,1,SBD,Single-ply,F
109.54,Joann Carter,99.79+,Open,Goodrich,-61.23,61.23,65.77,65.77,45.36,-49.9,-49.9,45.36,117.93,129.27,136.08,136.08,247.21,2,SBD,Single-ply,F
100.74,Amber Askin,99.79+,Open,Lake Fenton,40.82,-49.9,49.9,49.9,40.82,49.9,-54.43,49.9,104.33,-108.86,-113.4,104.33,204.12,3,SBD,Single-ply,F
