{
  "clientId": "608388971439-36suc9k3tqm51pdnuu9rdq5d2gcr7vfp.apps.googleusercontent.com",
  "apiKey": "AIzaSyCfmd_TiMMtA9zEdvoERBRYr5jnNa-v-pk",
  "scope": "https://www.googleapis.com/auth/calendar",
  "discoveryDocs": ["https://www.googleapis.com/discovery/v1/apis/calendar/v3/rest"],
  "redirectUris":["http://localhost:3000","https://localhost:3000","http://127.0.0.1"],
  "JavascriptOrigins":["http://localhost:3000","https://localhost:3000","http://127.0.0.1"]
}