<?xml version="1.0" encoding="iso-8859-1"?>
<!-- Generator: Adobe Illustrator 19.0.0, SVG Export Plug-In . SVG Version: 6.00 Build 0)  -->
<svg xmlns="http://www.w3.org/2000/svg" xmlns:xlink="http://www.w3.org/1999/xlink" version="1.1" id="Capa_1" x="0px" y="0px" viewBox="0 0 59 59" style="enable-background:new 0 0 59 59;" xml:space="preserve" width="512px" height="512px">
<g>
	<g>
		<g>
			<polygon points="47.977,33.712 36.479,37.161 37.581,41.618 48.958,37.68    " fill="#FFFFFF"/>
			<path d="M45.444,23.47c-0.408-2.011-2.19-3.47-4.239-3.47c-0.289,0-0.58,0.029-0.865,0.087l-0.569,0.115l-2.709-7.223     c0.596-1.202,0.939-2.549,0.939-3.979c0-4.963-4.037-9-9-9s-9,4.037-9,9c0,1.43,0.344,2.778,0.939,3.979l-2.661,7.095     C18.04,20.032,17.796,20,17.553,20c-2.049,0-3.831,1.459-4.231,3.436l-1.964,8.219l11.448,3.693l2.268-9.491     c0.476-2.34-1.041-4.63-3.381-5.105l-1.421-0.288l2.044-5.452c0.027,0.03,0.058,0.056,0.086,0.086     c0.162,0.176,0.331,0.344,0.507,0.506c0.048,0.044,0.095,0.088,0.144,0.131c0.19,0.168,0.387,0.327,0.591,0.479     c0.038,0.028,0.076,0.058,0.114,0.086c0.224,0.161,0.455,0.311,0.693,0.452c0.023,0.014,0.045,0.028,0.069,0.042     c0.257,0.148,0.521,0.284,0.792,0.407c0.009,0.004,0.017,0.008,0.025,0.012c0.56,0.251,1.149,0.449,1.763,0.582     c0.005,0.001,0.01,0.003,0.015,0.004c0.284,0.061,0.573,0.107,0.867,0.141c0.024,0.003,0.048,0.008,0.072,0.011     C28.365,17.982,28.681,18,29.002,18s0.637-0.018,0.949-0.051c0.024-0.003,0.048-0.008,0.072-0.011     c0.293-0.033,0.583-0.08,0.867-0.141c0.005-0.001,0.01-0.003,0.015-0.004c0.614-0.133,1.203-0.33,1.763-0.582     c0.008-0.004,0.016-0.008,0.024-0.012c0.272-0.123,0.536-0.259,0.793-0.407c0.023-0.013,0.046-0.028,0.069-0.042     c0.238-0.141,0.469-0.291,0.693-0.452c0.039-0.028,0.076-0.057,0.114-0.086c0.204-0.152,0.401-0.311,0.591-0.479     c0.049-0.043,0.096-0.087,0.144-0.131c0.176-0.162,0.344-0.331,0.507-0.506c0.028-0.03,0.059-0.055,0.086-0.086l2.097,5.594     l-0.72,0.146c-2.34,0.475-3.856,2.765-3.372,5.146l2.305,9.32l11.498-3.449L45.444,23.47z M28.869,4c2.757,0,5,2.243,5,5     s-2.243,5-5,5s-5-2.243-5-5S26.112,4,28.869,4z" fill="#FFFFFF"/>
			<path d="M52.772,53.103L49.441,39.63l-11.377,3.938l2.958,11.962c0.408,2.011,2.19,3.47,4.239,3.47     c0.289,0,0.58-0.029,0.865-0.087l3.273-0.664c1.134-0.23,2.109-0.888,2.749-1.852C52.787,55.433,53.012,54.277,52.772,53.103z" fill="#FFFFFF"/>
			<polygon points="9.928,37.633 21.35,41.44 22.339,37.299 10.89,33.606    " fill="#FFFFFF"/>
			<path d="M6.221,53.145c-0.474,2.34,1.044,4.63,3.383,5.104l3.273,0.664C13.162,58.971,13.453,59,13.742,59     c2.048,0,3.831-1.459,4.232-3.436l2.909-12.173L9.462,39.585L6.221,53.145z" fill="#FFFFFF"/>
			<circle cx="28.869" cy="9" r="3" fill="#FFFFFF"/>
		</g>
	</g>
</g>
<g>
</g>
<g>
</g>
<g>
</g>
<g>
</g>
<g>
</g>
<g>
</g>
<g>
</g>
<g>
</g>
<g>
</g>
<g>
</g>
<g>
</g>
<g>
</g>
<g>
</g>
<g>
</g>
<g>
</g>
</svg>
