index,baseMean,log2FoldChange,lfcSE
ENSG00000169084,75.99790723,-0.5293205,0.32302896
ENSG00000169084,75.99790723,-0.5293205,0.32302896
ENSG00000223773,23.65737346,-1.25587326,0.4312163
ENSG00000223773,23.65737346,-1.25587326,0.4312163
ENSG00000185291,268.26373001,-0.37445643,0.32821665
ENSG00000185291,268.26373001,-0.37445643,0.32821665
