{
  "default": {
    "jobs": [
      {
        "name": "dbx-scala-example",
        "new_cluster": {
          "spark_version": "8.3.x-scala2.12",
          "node_type_id": "i3.xlarge",
          "aws_attributes": {
            "first_on_demand": 0,
            "availability": "SPOT",
            "zone_id": "us-west-2a"
          },
          "num_workers": 0,
          "spark_conf": {
            "spark.master": "local[*, 4]",
            "spark.databricks.cluster.profile": "singleNode"
          },
          "custom_tags": {
            "ResourceClass": "SingleNode"
          }
        },
        "libraries": [
          {
            "jar": "target/dbx-maven-demo-0.0.1-jar-with-dependencies.jar"
          }
        ],
        "max_retries": 0,
        "spark_jar_task": {
          "main_class_name": "net.kuch.demos.SampleApp"
        }
      },
      {
        "name": "dbx-notebook-test",
        "new_cluster": {
          "spark_version": "8.3.x-scala2.12",
          "node_type_id": "i3.xlarge",
          "aws_attributes": {
            "first_on_demand": 0,
            "availability": "SPOT",
            "zone_id": "us-west-2a"
          },
          "num_workers": 0,
          "spark_conf": {
            "spark.master": "local[*, 4]",
            "spark.databricks.cluster.profile": "singleNode"
          },
          "custom_tags": {
            "ResourceClass": "SingleNode"
          }
        },
        "libraries": [
          {
            "jar": "target/dbx-maven-demo-0.0.1-jar-with-dependencies.jar"
          }
        ],
        "max_retries": 0,
        "notebook_task": {
          "notebook_path": "/Shared/dbx/notebooks/date_dimension_test"
        }
      },
      {
        "name": "dbx-notebook-jar-copy",
        "new_cluster": {
          "spark_version": "8.3.x-cpu-ml-scala2.12",
          "node_type_id": "i3.xlarge",
          "aws_attributes": {
            "first_on_demand": 0,
            "availability": "SPOT",
            "zone_id": "us-west-2a"
          },
          "num_workers": 0,
          "spark_conf": {
            "spark.master": "local[*, 4]",
            "spark.databricks.cluster.profile": "singleNode"
          },
          "custom_tags": {
            "ResourceClass": "SingleNode"
          }
        },
        "libraries": [
          {
            "jar": "target/dbx-maven-demo-0.0.1-jar-with-dependencies.jar"
          }
        ],
        "max_retries": 0,
        "notebook_task": {
          "notebook_path": "/Shared/dbx/notebooks/jar_copy_to_s3",
          "base_parameters": {"WIDGET_BUCKET_PATH":"/mnt/my-bucket/dbx",
            "MLFLOW_EXPERIMENT_NAME":"/Shared/dbx/projects/dbx-scala-example-gitlab"}
        }
      },
      {
        "name": "multi-task-job",
        "email_notifications": {},
        "timeout_seconds": 0,
        "max_concurrent_runs": 1,
        "tasks": [
          {
            "task_key": "spark_jar_task",
            "description": "first task in job",
            "spark_jar_task": {
              "main_class_name": "net.kuch.demos.SampleApp"
            },
            "new_cluster": {
              "spark_version": "8.3.x-scala2.12",
              "node_type_id": "i3.xlarge",
              "aws_attributes": {
                "first_on_demand": 0,
                "availability": "SPOT",
                "zone_id": "us-west-2a"
              },
              "num_workers": 0,
              "spark_conf": {
                "spark.master": "local[*, 4]",
                "spark.databricks.cluster.profile": "singleNode"
              },
              "custom_tags": {
                "ResourceClass": "SingleNode"
              }
            },
            "max_retries": 0,
            "email_notifications": {},
            "libraries": [
              {
                "jar": "target/dbx-maven-demo-0.0.1-jar-with-dependencies.jar"
              }
            ]
          },
          {
            "task_key": "notebook_task",
            "description": "second task in job",
            "notebook_task": {
              "notebook_path": "/Shared/dbx/notebooks/date_dimension_test"
            },
            "new_cluster": {
              "spark_version": "8.3.x-scala2.12",
              "node_type_id": "i3.xlarge",
              "aws_attributes": {
                "first_on_demand": 0,
                "availability": "SPOT",
                "zone_id": "us-west-2a"
              },
              "num_workers": 0,
              "spark_conf": {
                "spark.master": "local[*, 4]",
                "spark.databricks.cluster.profile": "singleNode"
              },
              "custom_tags": {
                "ResourceClass": "SingleNode"
              }
            },
            "max_retries": 0,
            "email_notifications": {},
            "libraries": [
              {
                "jar": "target/dbx-maven-demo-0.0.1-jar-with-dependencies.jar"
              }
            ],
            "depends_on": [
              {
                "task_key": "spark_jar_task"
              }
            ]
          }
        ],
        "format": "MULTI_TASK"
      }
    ]
  }
}