%YAML 1.1
%TAG !u! tag:unity3d.com,2011:
--- !u!1001 &6010798764343177046
PrefabInstance:
  m_ObjectHideFlags: 0
  serializedVersion: 2
  m_Modification:
    m_TransformParent: {fileID: 0}
    m_Modifications:
    - target: {fileID: 1050309316047676898, guid: 37b58610b1da7e7418b5656c2e410f0c,
        type: 3}
      propertyPath: m_Materials.Array.data[0]
      value: 
      objectReference: {fileID: 2100000, guid: 230bf82e5c438f14ba00f5e798061c23, type: 2}
    - target: {fileID: 4510423286763513284, guid: 37b58610b1da7e7418b5656c2e410f0c,
        type: 3}
      propertyPath: m_Mesh
      value: 
      objectReference: {fileID: -8615917597214984304, guid: 1831517e5830c814ebd77c062854a13d,
        type: 3}
    - target: {fileID: 6096289538185454081, guid: 37b58610b1da7e7418b5656c2e410f0c,
        type: 3}
      propertyPath: m_Name
      value: Koni_VR Variant
      objectReference: {fileID: 0}
    - target: {fileID: 6904457644879722683, guid: 37b58610b1da7e7418b5656c2e410f0c,
        type: 3}
      propertyPath: m_RootOrder
      value: 0
      objectReference: {fileID: 0}
    - target: {fileID: 6904457644879722683, guid: 37b58610b1da7e7418b5656c2e410f0c,
        type: 3}
      propertyPath: m_LocalPosition.x
      value: 0
      objectReference: {fileID: 0}
    - target: {fileID: 6904457644879722683, guid: 37b58610b1da7e7418b5656c2e410f0c,
        type: 3}
      propertyPath: m_LocalPosition.y
      value: 1.1437
      objectReference: {fileID: 0}
    - target: {fileID: 6904457644879722683, guid: 37b58610b1da7e7418b5656c2e410f0c,
        type: 3}
      propertyPath: m_LocalPosition.z
      value: -0.7574
      objectReference: {fileID: 0}
    - target: {fileID: 6904457644879722683, guid: 37b58610b1da7e7418b5656c2e410f0c,
        type: 3}
      propertyPath: m_LocalRotation.w
      value: 1
      objectReference: {fileID: 0}
    - target: {fileID: 6904457644879722683, guid: 37b58610b1da7e7418b5656c2e410f0c,
        type: 3}
      propertyPath: m_LocalRotation.x
      value: 0
      objectReference: {fileID: 0}
    - target: {fileID: 6904457644879722683, guid: 37b58610b1da7e7418b5656c2e410f0c,
        type: 3}
      propertyPath: m_LocalRotation.y
      value: 0
      objectReference: {fileID: 0}
    - target: {fileID: 6904457644879722683, guid: 37b58610b1da7e7418b5656c2e410f0c,
        type: 3}
      propertyPath: m_LocalRotation.z
      value: 0
      objectReference: {fileID: 0}
    - target: {fileID: 6904457644879722683, guid: 37b58610b1da7e7418b5656c2e410f0c,
        type: 3}
      propertyPath: m_LocalEulerAnglesHint.x
      value: 0
      objectReference: {fileID: 0}
    - target: {fileID: 6904457644879722683, guid: 37b58610b1da7e7418b5656c2e410f0c,
        type: 3}
      propertyPath: m_LocalEulerAnglesHint.y
      value: 0
      objectReference: {fileID: 0}
    - target: {fileID: 6904457644879722683, guid: 37b58610b1da7e7418b5656c2e410f0c,
        type: 3}
      propertyPath: m_LocalEulerAnglesHint.z
      value: 0
      objectReference: {fileID: 0}
    m_RemovedComponents: []
  m_SourcePrefab: {fileID: 100100000, guid: 37b58610b1da7e7418b5656c2e410f0c, type: 3}
