<?xml version="1.0" encoding="UTF-8" standalone="no"?>
<svg xmlns:rdf="http://www.w3.org/1999/02/22-rdf-syntax-ns#" xmlns="http://www.w3.org/2000/svg" version="1.1" xmlns:cc="http://creativecommons.org/ns#" xmlns:xlink="http://www.w3.org/1999/xlink" viewBox="0 0 24 24.0244" xmlns:dc="http://purl.org/dc/elements/1.1/">
<metadata>
<rdf:RDF>
<cc:Work rdf:about="">
<dc:format>image/svg+xml</dc:format>
<dc:type rdf:resource="http://purl.org/dc/dcmitype/StillImage"/>
</cc:Work>
</rdf:RDF>
</metadata>
<defs>
<linearGradient id="a">
<stop stop-color="#5a5a5a" offset="0"/>
<stop offset="1"/>
</linearGradient>
<linearGradient id="b" y2="137.4738" xlink:href="#a" gradientUnits="userSpaceOnUse" x2="42.18301" gradientTransform="translate(-1.5,7.5244)" y1="137.5165" x1="34.5194"/>
<linearGradient id="c" y2="138.5" xlink:href="#a" gradientUnits="userSpaceOnUse" x2="36.18673" y1="132.9464" x1="31.37247"/>
</defs>
<g transform="translate(-25,-127)">
<path fill-rule="evenodd" fill="#fff" d="m41.91177 127.0244v3h2v18h-2v3h7v-3h-2v-18h2v-3h-7z"/>
<path stroke-linejoin="round" d="m45.41177 129.5v19.0369" stroke="#000" stroke-linecap="round" stroke-width=".9999999" fill="none"/>
<path stroke-linejoin="round" d="m46.38747 128.5244 1.30813-0.0111" stroke="#000" stroke-linecap="round" stroke-miterlimit="0" stroke-width="1.0000006" fill="none"/>
<path stroke-linejoin="round" d="m46.39879 149.5244h1.12625" stroke="#000" stroke-linecap="round" stroke-width="1.0000005" fill="none"/>
<path stroke-linejoin="round" d="m44.5 149.5244h-1.17647" stroke="#000" stroke-linecap="round" stroke-width="1.0000002" fill="none"/>
<path stroke-linejoin="round" d="m44.46788 128.5244h-1.15635" stroke="#000" stroke-linecap="round" stroke-width="1.0000001" fill="none"/>
<rect style="color:#000000" height="24" width="24" y="127" x="25" fill="none"/>
<path fill="url(#c)" stroke="#000" d="m33 129.5h5l6.5 18h-4l-1-2.5h-8l-1 2.5h-4l6.5-18zm5.5 12-3-8.5-3 8.5h6z"/>
<path d="m33.5 130.5-5.5 15.5" fill-opacity=".75" fill-rule="evenodd" stroke="#646464" stroke-linecap="round" stroke-width="1.0000002px" fill="#fff"/>
<path d="m38 142.5244h-5.5" fill-opacity=".75" fill-rule="evenodd" stroke="url(#b)" stroke-linecap="round" stroke-width="1.0000002px" fill="#fff"/>
</g>
</svg>
