<?xml version="1.0" encoding="UTF-8" standalone="no"?>
<svg xmlns:rdf="http://www.w3.org/1999/02/22-rdf-syntax-ns#" xmlns="http://www.w3.org/2000/svg" version="1.1" xmlns:cc="http://creativecommons.org/ns#" viewBox="0 0 19.99975 19.999967" xmlns:dc="http://purl.org/dc/elements/1.1/">
<metadata>
<rdf:RDF>
<cc:Work rdf:about="">
<dc:format>image/svg+xml</dc:format>
<dc:type rdf:resource="http://purl.org/dc/dcmitype/StillImage"/>
</cc:Work>
</rdf:RDF>
</metadata>
<g transform="matrix(.79999 0 0 .799999 -619.09636 -9.20133)" fill="none">
<rect height="24.99999" width="25" y="11.50168" x="773.8801"/>
<path d="m781.3777 19.00161 10.0031 10.00004" stroke="#000" stroke-linecap="round" stroke-width="2.9587891"/>
<path d="m791.3808 19.00161-10.0031 10.00003" stroke="#000" stroke-linecap="round" stroke-width="2.9587891"/>
</g>
</svg>
