<?xml version="1.0" encoding="UTF-8" standalone="no"?>
<svg xmlns:rdf="http://www.w3.org/1999/02/22-rdf-syntax-ns#" xmlns="http://www.w3.org/2000/svg" version="1.1" xmlns:cc="http://creativecommons.org/ns#" viewBox="0 0 16 16" xmlns:dc="http://purl.org/dc/elements/1.1/">
<metadata>
<rdf:RDF>
<cc:Work rdf:about="">
<dc:format>image/svg+xml</dc:format>
<dc:type rdf:resource="http://purl.org/dc/dcmitype/StillImage"/>
</cc:Work>
</rdf:RDF>
</metadata>
<g transform="translate(-314,-210)">
<rect height="16" width="16" y="210" x="314" fill="none"/>
<path stroke-linejoin="round" style="color:#000000" d="m220.5 155.5625v9.9375h10.0937v-4.125c-0.206 0.0234-0.3814 0.125-0.5937 0.125-3.036 0-5.5-2.464-5.5-5.5 0-0.1565 0.0809-0.2843 0.0937-0.4375h-4.0937z" transform="translate(94.91614,59)" stroke="#c80000" stroke-miterlimit="0" stroke-dasharray="1, 1" stroke-width="1.0000002" fill="none"/>
<g transform="translate(-652.541 41.46088)">
<path d="m972 171 1-1h7l1 1v7l-1 1h-7l-1-1v-7z" fill-rule="evenodd" stroke="#a00" stroke-width="1px" fill="#a00"/>
<path d="m974 171.85 5 5" stroke="#fff" stroke-width="1.7" fill="none"/>
<path stroke-linejoin="round" d="m979 171.85-5 5" stroke="#fff" stroke-width="1.8" fill="none"/>
</g>
</g>
</svg>
