<?xml version="1.0" encoding="UTF-8" standalone="no"?>
<svg xmlns:rdf="http://www.w3.org/1999/02/22-rdf-syntax-ns#" xmlns="http://www.w3.org/2000/svg" version="1.1" xmlns:cc="http://creativecommons.org/ns#" xmlns:xlink="http://www.w3.org/1999/xlink" viewBox="0 0 16 16" xmlns:dc="http://purl.org/dc/elements/1.1/">
<metadata>
<rdf:RDF>
<cc:Work rdf:about="">
<dc:format>image/svg+xml</dc:format>
<dc:type rdf:resource="http://purl.org/dc/dcmitype/StillImage"/>
</cc:Work>
</rdf:RDF>
</metadata>
<defs>
<linearGradient id="a" y2="206.9573" gradientUnits="userSpaceOnUse" x2="1095.32" gradientTransform="matrix(.6644326 0 0 .6364719 -764.818 59.51422)" y1="178.1412" x1="1095.32">
<stop offset="0"/>
<stop stop-color="#7f7f7f" offset=".35076979"/>
<stop stop-color="#bfbfbf" offset=".59668732"/>
<stop stop-color="#dfdfdf" offset=".78382427"/>
<stop stop-color="#fff" offset="1"/>
</linearGradient>
</defs>
<g transform="translate(45,-175)">
<rect style="color:#000000" height="16" width="16" y="175" x="-45" fill="none"/>
<path style="color:#000000" stroke-width=".6138721" fill="url(#a)" d="m-44.25871 182.3053c3.11679 0.0401 2.6059-3.4751 7.25315-3.4309 4.64725 0.0443 3.22096 3.5317 7.16093 3.4309v4.0749c-3.54547 0-4.29717-3.6915-7.16674-3.6953-3.18827-0.004-3.78523 3.6953-7.24734 3.6953v-4.0749z"/>
<path style="color:#000000" d="m-29.84463 186.3802c-3.54547 0-4.29717-3.6915-7.16674-3.6953-3.18827-0.004-3.78523 3.6953-7.24734 3.6953m0-4.0749c3.11679 0.0401 2.6059-3.4751 7.25315-3.4309 4.64725 0.0443 3.22096 3.5317 7.16093 3.4309" stroke="#000" stroke-width=".6138721" fill="none"/>
</g>
</svg>
