<?xml version="1.0" encoding="UTF-8" standalone="no"?>
<!-- Created with Inkscape (http://www.inkscape.org/) -->

<svg
   xmlns:dc="http://purl.org/dc/elements/1.1/"
   xmlns:cc="http://creativecommons.org/ns#"
   xmlns:rdf="http://www.w3.org/1999/02/22-rdf-syntax-ns#"
   xmlns:svg="http://www.w3.org/2000/svg"
   xmlns="http://www.w3.org/2000/svg"
   xmlns:xlink="http://www.w3.org/1999/xlink"
   xmlns:sodipodi="http://sodipodi.sourceforge.net/DTD/sodipodi-0.dtd"
   xmlns:inkscape="http://www.inkscape.org/namespaces/inkscape"
   id="svg4155"
   version="1.1"
   inkscape:version="0.48+devel r"
   width="1038.75"
   height="761.25"
   viewBox="0 0 1038.75 761.25"
   sodipodi:docname="octopus.svg.2014_04_29_14_47_05.1.svg">
  <metadata
     id="metadata4161">
    <rdf:RDF>
      <cc:Work
         rdf:about="">
        <dc:format>image/svg+xml</dc:format>
        <dc:type
           rdf:resource="http://purl.org/dc/dcmitype/StillImage" />
        <dc:title />
      </cc:Work>
    </rdf:RDF>
  </metadata>
  <defs
     id="defs4159">
    <marker
       inkscape:stockid="Arrow1Mend"
       orient="auto"
       refY="0.0"
       refX="0.0"
       id="Arrow1Mend"
       style="overflow:visible;"
       inkscape:isstock="true">
      <path
         id="path16139"
         d="M 0.0,0.0 L 5.0,-5.0 L -12.5,0.0 L 5.0,5.0 L 0.0,0.0 z "
         style="fill-rule:evenodd;stroke:#000000;stroke-width:1pt;stroke-opacity:1;fill:#000000;fill-opacity:1"
         transform="scale(0.4) rotate(180) translate(10,0)" />
    </marker>
    <linearGradient
       id="linearGradient5672"
       inkscape:collect="always">
      <stop
         id="stop5674"
         offset="0"
         style="stop-color:#fce800;stop-opacity:1" />
      <stop
         style="stop-color:#dfdf17;stop-opacity:1;"
         offset="0.21549772"
         id="stop5680" />
      <stop
         id="stop5682"
         offset="0.25472772"
         style="stop-color:#bfd531;stop-opacity:1;" />
      <stop
         style="stop-color:#11a3c0;stop-opacity:1;"
         offset="0.34626433"
         id="stop5686" />
      <stop
         style="stop-color:#009fcf;stop-opacity:1"
         offset="0.67110103"
         id="stop5676" />
      <stop
         id="stop5684"
         offset="0.69061643"
         style="stop-color:#00cd21;stop-opacity:1;" />
      <stop
         id="stop5678"
         offset="1"
         style="stop-color:#00d115;stop-opacity:1" />
    </linearGradient>
    <linearGradient
       inkscape:collect="always"
       id="linearGradient5656">
      <stop
         style="stop-color:#fce800;stop-opacity:1"
         offset="0"
         id="stop5658" />
      <stop
         id="stop5664"
         offset="0.52289885"
         style="stop-color:#009fcf;stop-opacity:1" />
      <stop
         style="stop-color:#00d115;stop-opacity:1"
         offset="1"
         id="stop5660" />
    </linearGradient>
    <pattern
       inkscape:collect="always"
       xlink:href="#pattern5629"
       id="pattern5636"
       patternTransform="translate(198.11455,-109.98725)" />
    <pattern
       patternUnits="userSpaceOnUse"
       width="115.56174"
       height="54.065575"
       patternTransform="translate(213.04102,-153.40971)"
       id="pattern5629">
      <path
         id="path5622"
         d="m 115.5332,0.00737022 c -0.10842,0.03594 -0.21808,0.0964 -0.32813,0.16796 0.15617,-0.07493 0.44908,-0.20806 0.32813,-0.16796 z m -0.32813,0.16796 C 113.49175,0.99745022 96.64462,8.4483202 91.87109,18.7476 85.74189,10.8706 64.73147,9.4311902 46.81445,9.4311902 25.57844,9.4311902 12.21257,11.45438 0,23.81987 c 13.56951,9.65159 28.29327,15.60546 49.52929,15.60546 17.6479,0 36.40801,-2.24273 42.24805,-10.0957 3.19999,8.10808 12.27736,16.4633 17.53711,21.08789 -4.9607,-11.63194 1.14565,-47.1563398 5.89062,-50.24218978 z M 109.31445,50.41752 c 0.89669,2.10258 2.14793,3.439677 3.8418,3.646487 0.45735,0.05584 -1.26899,-1.384357 -3.8418,-3.646487 z"
         style="color:#000000;clip-rule:nonzero;display:inline;overflow:visible;visibility:visible;opacity:1;color-interpolation:sRGB;color-interpolation-filters:linearRGB;fill:#f57900;fill-opacity:1;fill-rule:nonzero;stroke:none;stroke-width:10;stroke-linecap:round;stroke-linejoin:round;stroke-miterlimit:4;stroke-dasharray:none;stroke-dashoffset:0;stroke-opacity:1;marker:none;enable-background:accumulate"
         inkscape:connector-curvature="0" />
    </pattern>
    <linearGradient
       inkscape:collect="always"
       xlink:href="#linearGradient5656"
       id="linearGradient5662"
       x1="221.89841"
       y1="-611.31122"
       x2="797.83307"
       y2="-615.38208"
       gradientUnits="userSpaceOnUse" />
    <radialGradient
       inkscape:collect="always"
       xlink:href="#linearGradient5672"
       id="radialGradient5670"
       cx="521.39984"
       cy="-1372.64"
       fx="521.39984"
       fy="-1372.64"
       r="496.25946"
       gradientTransform="matrix(1,0,0,0.62730681,0,-511.57357)"
       gradientUnits="userSpaceOnUse" />
  </defs>
  <sodipodi:namedview
     pagecolor="#ffffff"
     bordercolor="#666666"
     borderopacity="1"
     objecttolerance="10"
     gridtolerance="10"
     guidetolerance="10"
     inkscape:pageopacity="0"
     inkscape:pageshadow="2"
     inkscape:window-width="1366"
     inkscape:window-height="718"
     id="namedview4157"
     showgrid="false"
     inkscape:zoom="0.85"
     inkscape:cx="521.39984"
     inkscape:cy="2351.6722"
     inkscape:window-x="0"
     inkscape:window-y="27"
     inkscape:window-maximized="1"
     inkscape:current-layer="svg4155" />
  <path
     style="fill:#000000;fill-opacity:1;stroke:#000000;stroke-opacity:1;stroke-width:10;stroke-miterlimit:4;stroke-dasharray:none"
     d="m 725.56925,686.86664 c -7.5287,-8.4464 -9.9667,-16.74659 -7.8763,-26.81562 1.3183,-6.35057 2.374,-8.02848 9.1563,-14.55274 4.2164,-4.056 8.6468,-8.8527 9.8454,-10.65934 3.1074,-4.68374 2.9259,-15.5582 -0.348,-20.85547 -4.526,-7.32327 -20.3514,-10.83064 -55.5813,-12.31851 -17.1208,-0.72306 -23.1239,-2.44196 -39.2792,-11.24708 -5.7911,-3.1563 -10.9006,-5.73874 -11.3545,-5.73874 -1.5158,0 -10.5882,-9.32612 -12.768,-13.125 -1.1834,-2.0625 -2.6651,-4.59375 -3.2926,-5.625 -3.7827,-6.21641 -4.5557,-9.90702 -4.5557,-21.75174 0,-11.22058 0.39,-13.45624 3.5097,-20.11957 1.9304,-4.12298 4.5388,-8.62298 5.7965,-10 1.2577,-1.37703 3.4866,-4.89432 4.9532,-7.81619 1.4665,-2.92188 3.1731,-5.3125 3.7923,-5.3125 1.8931,0 12.3635,-11.11259 13.2697,-14.08366 0.4683,-1.53524 1.9663,-5.27593 3.3289,-8.31265 3.3326,-7.42703 2.2567,-13.83358 -3.4408,-20.48985 -2.384,-2.78511 -4.3345,-5.45975 -4.3345,-5.94366 0,-1.47074 -12.7389,-5.91434 -19.1425,-6.67732 -19.4466,-2.31701 -31.987,-7.90898 -37.6022,-16.76745 -1.6038,-2.53022 -5.8524,-7.33928 -9.4413,-10.6868 -6.3166,-5.89178 -6.723,-6.06738 -12.7104,-5.49207 -11.2866,1.0845 -16.2359,8.80545 -16.5146,25.76316 -0.2525,15.35467 1.3561,28.60475 5.5152,45.42941 4.6516,18.8168 3.7627,23.4883 -6.98,36.68531 -4.4059,5.41247 -18.26035,13.07558 -23.63981,13.07558 -1.68754,0 -5.7775,1.64351 -9.0888,3.65224 -5.7282,3.47487 -6.40581,3.59632 -13.95389,2.5009 -4.36332,-0.63324 -8.3779,-0.87657 -8.92127,-0.54074 -1.67486,1.03511 -15.43703,-2.18398 -19.2931,-4.51283 -2.26934,-1.37054 -4.94605,-1.94332 -7.08371,-1.51578 -2.55194,0.51038 -4.02558,-0.0163 -5.72732,-2.04674 -3.50875,-4.18663 -8.45923,-6.28705 -14.81791,-6.28705 -5.4747,0 -6.18336,0.42394 -13.59414,8.13226 -4.30008,4.47274 -9.01645,10.51962 -10.48081,13.4375 -3.07406,6.12539 -9.83079,13.39587 -17.08982,18.38928 -5.21328,3.58615 -26.3113,10.04096 -32.8196,10.04096 -4.20934,0 -19.79384,-4.5779 -31.39299,-9.22159 -6.31324,-2.5275 -9.62025,-3.08858 -16.43158,-2.78791 -9.70296,0.42834 -11.53413,1.35586 -25.56073,12.947 -5.1997,4.29687 -9.89149,7.8125 -10.42618,7.8125 -0.5347,0 -3.04166,1.40625 -5.57102,3.125 -6.42797,4.36791 -16.9553,4.41319 -22.62739,0.0974 -2.1885,-1.66523 -5.53129,-3.41504 -7.42841,-3.88848 -4.21173,-1.05106 -5.08943,-2.3111 -4.00024,-5.74282 0.75209,-2.36962 1.42479,-2.54524 6.64319,-1.73441 17.69032,2.74872 19.71997,1.60739 46.09453,-25.92006 13.17817,-13.75422 17.06039,-14.41281 46.58683,-7.90302 31.982,7.05116 42.06322,1.87803 63.15667,-32.40854 3.26703,-5.31044 12.52138,-12.50952 22.46833,-17.47844 4.7458,-2.37072 8.20546,-3.12105 14.375,-3.11762 7.93682,0.005 13.4704,1.56342 35,9.86085 9.07856,3.49885 19.75105,5.14299 23.68224,3.64835 10.87417,-4.13435 14.30648,-20.17969 7.57535,-35.41314 -2.09994,-4.75244 -4.51654,-14.1593 -7.54637,-29.375 -1.42417,-7.15215 -1.14645,-26.73144 0.40113,-28.27901 1.32624,-1.32629 1.07097,-5.47104 -0.33695,-5.47104 -0.67352,0 -2.37162,2.24837 -3.77356,4.99639 -3.20361,6.2796 -14.75176,17.92287 -20.93547,21.1079 -2.58026,1.32901 -7.50387,3.86531 -10.94137,5.63622 -3.56207,1.8351 -10.28189,3.78309 -15.625,4.5295 -10.66141,1.48935 -29.39095,0.45344 -33.125,-1.83212 -3.41485,-2.09018 -16.52804,-4.45214 -21.875,-3.94015 -2.40625,0.2304 -6.625,1.03583 -9.375,1.78986 -13.65679,3.74452 -56.87741,4.04128 -65.80897,0.45183 -5.67352,-2.28009 -5.02427,-0.11888 1.95452,6.50616 12.02605,11.41646 17.96515,26.39276 15.78314,39.79951 -1.59278,9.78641 -4.14087,15.06183 -8.2979,17.1795 -1.99693,1.01728 -5.42715,3.16918 -7.6227,4.78201 -4.7412,3.48285 -15.41059,6.69214 -21.90424,6.58867 -7.00695,-0.11163 -15.04856,-3.65098 -32.90509,-14.4824 -13.32845,-8.08478 -17.32166,-9.9197 -22.53587,-10.35547 -4.86329,-0.40644 -6.8443,-0.0224 -8.51787,1.65114 -1.32205,1.32205 -2.63203,1.72944 -3.32685,1.03463 -1.83186,-1.83187 2.77053,-9.61993 6.82244,-11.5448 7.2051,-3.42282 11.66943,-2.42438 30.07,6.72508 16.40949,8.15943 17.95211,8.67667 25.625,8.59202 11.34429,-0.12518 19.30425,-3.82544 21.31126,-9.90674 0.81168,-2.45943 1.13954,-6.26403 0.72858,-8.45465 -1.07985,-5.75609 -13.75909,-22.89166 -25.62321,-34.62891 -9.9148,-9.80878 -10.60761,-10.24305 -21.74665,-13.63124 -6.32808,-1.92483 -14.88059,-5.03721 -19.00559,-6.91643 -9.43056,-4.29625 -18.68458,-4.58066 -24.85998,-0.76405 -4.18295,2.5852 -4.24028,2.74269 -4.47421,12.29015 -0.3227,13.17077 -0.22877,17.64736 0.67498,32.17139 0.73431,11.8009 0.59457,12.86301 -2.49865,18.9906 -1.80207,3.56984 -5.87235,8.70949 -9.04509,11.42146 -10.55351,9.02086 -32.86418,13.9252 -38.98429,8.56953 -1.13451,-0.99281 -3.84347,-2.70663 -6.0199,-3.80846 -2.17644,-1.10185 -7.52019,-5.13934 -11.875,-8.97222 -12.58535,-11.07691 -21.97927,-13.63968 -29.74013,-8.11346 -3.6395,2.59155 -4.19921,2.67679 -5.96721,0.90879 -1.768,-1.768 -1.63188,-2.33027 1.45124,-5.99434 4.42499,-5.25879 10.8087,-8.60816 18.03598,-9.46303 4.99257,-0.59052 7.34203,0.0351 16.83637,4.48392 6.06876,2.84362 12.53751,6.27975 14.375,7.63582 4.41063,3.25509 12.74788,3.516 18.21801,0.57015 5.7255,-3.08339 9.96537,-11.49105 8.9886,-17.82445 -1.69198,-10.97112 -2.6105,-24.30202 -2.53762,-36.83014 0.0769,-13.22047 0.14381,-13.51962 4.375,-19.55916 9.78955,-13.97346 23.37335,-21.14282 37.27891,-19.67534 7.72186,0.8149 18.94394,2.65347 24.0478,3.93984 3.27264,0.82484 3.28175,0.80585 4.17079,-8.68142 1.37014,-14.62137 8.87064,-26.75063 21.9244,-35.45452 10.56045,-7.04142 23.86201,-12.15656 26.01461,-10.00396 0.69716,0.69716 1.92808,0.85933 2.73539,0.36039 1.05699,-0.65325 1.08747,-1.28753 0.10887,-2.26609 -1.83847,-1.83847 -1.71963,-5.50502 0.20359,-6.28106 0.85938,-0.34676 0.28794,-0.67489 -1.26985,-0.72916 -2.35077,-0.0819 -2.78439,-0.72827 -2.55022,-3.80144 0.17646,-2.3158 -0.69469,-4.77393 -2.3257,-6.5625 -1.43432,-1.57286 -4.05903,-5.20029 -5.8327,-8.06094 -2.36208,-3.80967 -4.32634,-5.43429 -7.34194,-6.07246 -4.76981,-1.0094 -9.74205,-5.12784 -9.74205,-8.06924 0,-1.11766 -0.675,-2.70711 -1.5,-3.53211 -2.08961,-2.08961 -9.76225,-1.87639 -12.21059,0.33934 -1.24155,1.12357 -5.6462,2.07185 -11.31902,2.43685 -9.92047,0.6383 -12.47039,2.22586 -12.47039,7.76395 0,3.7579 -2.49624,5.11562 -4.46219,2.42702 -2.02247,-2.76591 -5.50399,-1.11337 -8.08729,3.83874 -1.00403,1.92471 -3.66903,5.1338 -5.92222,7.13131 -3.4097,3.02279 -4.03856,4.39115 -3.75,8.15981 0.33804,4.41478 0.24514,4.51817 -3.7158,4.13552 -3.01893,-0.29165 -4.0625,0.10975 -4.0625,1.5625 0,1.07522 0.5625,1.95496 1.25,1.95496 0.6875,0 1.25,0.84375 1.25,1.875 0,1.7679 -2.21245,2.47086 -6.08694,1.93399 -0.94156,-0.13047 -3.75406,1.38498 -6.25,3.36766 -2.49594,1.98269 -7.91306,5.73311 -12.03806,8.33427 -4.125,2.60118 -9.34203,6.03489 -11.59339,7.63048 -3.01162,2.13441 -6.64537,3.13202 -13.75,3.77492 -5.6329,0.50973 -10.53937,1.64939 -11.77517,2.73512 -1.49402,1.31256 -3.70503,1.65563 -7.5,1.16373 -12.67155,-1.64242 -19.23133,-2.82731 -20.69175,-3.73753 -0.86333,-0.53808 -2.68819,-0.18247 -4.08528,0.7961 -4.02758,2.82102 -13.15825,-0.66727 -15.68518,-5.99239 -1.48243,-3.12399 -3.71853,-4.82316 -9.673681,-7.35088 -4.26005,-1.80821 -9.30032,-3.28603 -11.20058,-3.28406 -4.28555,0.005 -11.60657,-4.65247 -13.36276,-8.50011 -1.22808,-2.69059 -8.03486,-6.20611 -10.56113,-5.45455 -0.6209,0.18472 -5.1209,0.58995 -10,0.9005 -7.31102,0.46534 -9.81857,1.22829 -14.25882,4.33846 -4.96413,3.4771 -7.73726,3.92377 -7.73726,1.24623 0,-0.59152 2.83968,-4.18256 6.31041,-7.98009 7.13077,-7.8022 13.58166,-10.4093 28.94283,-11.69712 8.15013,-0.68329 24.98426,1.39316 27.87176,3.43791 0.6875,0.48684 5.46875,2.1165 10.625001,3.62147 5.15625,1.50497 11.03923,3.64846 13.07329,4.76331 3.6826,2.01841 11.90723,4.36572 23.80171,6.79302 11.6335,2.37404 19.36919,0.1803 33.66255,-9.54626 11.663,-7.93662 20.13829,-16.3144 33.36142,-32.9776 14.03353,-17.68442 22.78125,-25.84416 33.60067,-31.3422 10.13155,-5.14847 16.03826,-6.48211 28.98695,-6.54472 11.90753,-0.0576 13.61085,0.47626 32.88841,10.30783 11.09335,5.65762 11.38489,5.92567 20.9375,19.25075 5.32812,7.43229 9.6875,14.27993 9.6875,15.21697 0,0.93702 0.51755,2.68043 1.15011,3.87423 0.63256,1.1938 2.35055,5.54554 3.81776,9.67054 4.47923,12.5931 6.82142,16.19895 10.83007,16.67311 1.96738,0.2327 4.13956,0.85827 4.82706,1.39014 0.6875,0.53186 2.72785,1.31924 4.53411,1.74971 1.80628,0.43048 4.20983,2.19548 5.34124,3.92224 2.33107,3.55765 17.59011,13.96826 25.12465,17.14151 8.42339,3.5476 19.58752,6.21597 22.71875,5.43008 1.63479,-0.4103 6.19185,-1.04055 10.1268,-1.40055 11.15922,-1.02093 16.15891,-2.78019 20.57384,-7.23938 2.24433,-2.26685 7.17436,-6.38683 10.95561,-9.15553 12.9562,-9.48675 16.61224,-13.97359 19.69999,-24.17659 1.55374,-5.13411 2.81934,-10.17849 2.81246,-11.20974 -0.007,-1.03125 -1.98126,-3.44585 -4.38749,-5.36579 -5.7044,-4.55155 -6.0909,-10.83136 -0.99405,-16.15132 3.29398,-3.43818 3.32697,-3.62024 1.28294,-7.08052 -1.15389,-1.95337 -1.75406,-3.89549 -1.33373,-4.31582 0.42033,-0.42034 -0.97911,-7.95239 -3.10986,-16.7379 -9.3973,-38.74684 -9.95892,-48.53756 -3.92781,-68.47365 1.45589,-4.8125 3.45025,-11.5625 4.43193,-15 3.11353,-10.90255 18.2212,-39.4323 26.03417,-49.16366 21.65755,-26.975339 51.09052,-40.234569 85.76652,-38.636931 22.6492,1.043521 41.811,8.297412 59.6256,22.571861 17.6203,14.11878 27.9706,30.63534 36.1765,57.72873 3.2306,10.66646 2.8352,45.60906 -0.7114,62.87267 -1.3703,6.67003 -2.8666,14.93983 -3.3252,18.37733 -0.8988,6.73828 -13.8886,35.16409 -18.6678,40.85129 -1.549,1.84321 -4.1028,6.00894 -5.6753,9.25717 -1.5724,3.24824 -6.351,9.61515 -10.619,14.14872 -5.1249,5.44367 -8.0722,9.72851 -8.6792,12.61782 -1.3037,6.20512 -5.1904,10 -10.2422,10 -2.6591,0 -5.1526,1.01346 -6.9199,2.8125 -1.5195,1.54687 -4.4726,3.42519 -6.5625,4.17403 -2.0898,0.74883 -3.7134,1.87383 -3.608,2.5 0.1054,0.62616 3.1992,2.33469 6.875,3.79674 4.8107,1.91346 7.7128,4.10244 10.3577,7.8125 2.0208,2.83483 4.5521,5.16242 5.625,5.17242 1.0728,0.01 4.2032,0.80342 6.9563,1.76315 2.7532,0.95972 8.4676,2.05298 12.6989,2.42946 4.2312,0.37649 9.067,1.02933 10.7461,1.45076 6.382,1.60179 23.3382,-4.57855 36.7039,-13.37817 9.5518,-6.28861 13.7943,-10.76764 15.0833,-15.92399 0.692,-2.7683 3.1287,-8.83639 7.8241,-19.4844 0.6063,-1.375 3.0955,-8.50105 5.5314,-15.83566 3.3593,-10.1149 6.4004,-16.26364 12.5916,-25.45904 8.8457,-13.13774 12.0541,-15.77539 30.065,-24.71645 8.4612,-4.20031 11.6351,-5.08222 20.625,-5.73089 22.81,-1.64583 40.8386,7.39708 60.7581,30.47549 22.8408,26.46307 37.9457,38.96895 54.0707,44.76715 7.6856,2.76359 18.7285,2.33106 25.1405,-0.98471 2.0111,-1.03999 4.7142,-1.89089 6.0068,-1.89089 1.2926,0 5.1174,-1.4039 8.4996,-3.11976 3.3821,-1.71588 6.6421,-3.12213 7.2443,-3.125 0.6023,-0.002 5.946,-1.88641 11.875,-4.18564 14.5204,-5.63089 22.2221,-7.32104 33.1653,-7.27811 8.9763,0.0352 18.86555,1.86417 19.89775,3.67997 0.2824,0.49695 0.9094,3.09419 1.3933,5.77165 l 0.8797,4.86813 -9.4326,-0.85476 c -10.84155,-0.98244 -15.77145,0.7207 -18.49075,6.38795 -1.8992,3.95827 -10.262,9.06653 -13.4696,8.22771 -1.2125,-0.31708 -5.6953,1.18561 -9.9617,3.33929 -5.8721,2.96425 -8.1781,4.92327 -9.4894,8.06177 -2.1727,5.20002 -11.4421,8.98929 -15.3294,6.26655 -1.468,-1.02824 -2.932,-1.19499 -4.0853,-0.46529 -0.9885,0.62549 -3.766,1.1658 -6.1723,1.20069 -2.4062,0.0349 -5.7812,0.86732 -7.5,1.84985 -4.1821,2.39071 -13.0159,2.39071 -15,0 -1.1223,-1.35234 -4.0917,-1.875 -10.6524,-1.875 -8.2416,0 -9.6795,-0.39241 -15.3018,-4.17598 -3.413,-2.29678 -7.2167,-4.56401 -8.4526,-5.03827 -1.2359,-0.47425 -6.0287,-3.37631 -10.6507,-6.44901 -5.3613,-3.56415 -9.7869,-5.58674 -12.2243,-5.58674 -4.5673,0 -6.409,-2.28776 -3.5341,-4.38994 3.2808,-2.39902 2.4311,-3.33752 -2.6216,-2.89531 -4.6828,0.40984 -4.6871,0.4057 -4.3408,-4.11773 0.2888,-3.77105 -0.3381,-5.13248 -3.75,-8.14405 -2.2532,-1.98883 -5.081,-5.13457 -6.2842,-6.99053 -2.8646,-4.41902 -6.979,-6.6709 -8.8217,-4.82824 -2.0757,2.07576 -3.3658,1.64105 -3.3658,-1.1342 0,-4.91038 -3.9677,-7.11357 -13.0906,-7.26904 -5.2863,-0.0901 -9.5654,-0.86473 -11.3936,-2.06261 -5.1412,-3.3686 -13.0158,-1.61906 -13.0158,2.89176 0,3.18258 -6.1625,8.52613 -11.0124,9.54892 -2.8038,0.59128 -4.5179,1.873 -5.3176,3.97633 -0.649,1.70709 -2.8653,5.5532 -4.925,8.54694 -4.2373,6.15872 -4.5482,8.22976 -1.8529,12.34326 1.6914,2.58144 1.6876,3.37669 -0.035,7.50039 -1.0864,2.60009 -3.2225,5.10519 -4.8957,5.74131 -4.3138,1.6401 -5.1881,3.78274 -1.5436,3.78274 1.6858,0 3.3888,0.84375 3.7846,1.875 0.3957,1.03125 2.0027,1.88109 3.5712,1.88853 1.5685,0.007 5.383,0.81623 8.4767,1.79731 28.4597,9.02499 43.614,24.42409 45.6744,46.41225 0.8891,9.48727 0.8982,9.50626 4.1708,8.68142 4.5718,-1.15227 15.8054,-3.03521 23.4991,-3.93881 13.8535,-1.62709 28.1842,5.62093 37.309,18.86974 l 4.8171,6.99412 0.077,13.39772 c 0.072,12.50377 -0.8476,25.83862 -2.5384,36.80203 -0.9768,6.3334 3.2631,14.74106 8.9886,17.82445 5.4701,2.94585 13.8074,2.68494 18.218,-0.57015 1.8375,-1.35607 8.3062,-4.7922 14.375,-7.63582 9.4943,-4.44873 11.8438,-5.07444 16.8364,-4.48391 7.2272,0.85486 13.6109,4.20423 18.0359,9.46302 3.0832,3.66408 3.2193,4.22634 1.4513,5.99434 -1.768,1.768 -2.3277,1.68276 -5.9672,-0.90879 -7.7609,-5.52622 -17.1548,-2.96345 -29.7402,8.11346 -4.3548,3.83288 -9.6985,7.87037 -11.875,8.97222 -2.1764,1.10183 -4.8854,2.81565 -6.0199,3.80846 -6.1201,5.35567 -28.4307,0.45134 -38.9843,-8.56953 -3.1727,-2.71197 -7.243,-7.85162 -9.045,-11.42146 -3.0933,-6.12759 -3.233,-7.1897 -2.4987,-18.9906 0.9038,-14.52402 0.9977,-19.00062 0.675,-32.17139 -0.2339,-9.54746 -0.2913,-9.70495 -4.4742,-12.29015 -6.1754,-3.81661 -15.4294,-3.5322 -24.86,0.76405 -4.125,1.87922 -12.6775,4.9916 -19.0056,6.91643 -11.139,3.38819 -11.8318,3.82246 -21.7466,13.63124 -11.8642,11.73725 -24.5434,28.87282 -25.6233,34.62891 -0.4109,2.19062 -0.083,5.99522 0.7286,8.45465 2.007,6.0813 9.967,9.78156 21.3113,9.90674 7.6729,0.0846 9.2155,-0.43259 25.625,-8.59202 18.4006,-9.14946 22.8649,-10.1479 30.07,-6.72508 4.0519,1.92487 8.6543,9.71293 6.8224,11.5448 -0.6948,0.69481 -2.0048,0.28742 -3.3268,-1.03463 -1.6736,-1.67356 -3.6546,-2.05757 -8.5179,-1.65114 -5.2142,0.43577 -9.2074,2.27069 -22.5359,10.35547 -17.8565,10.83142 -25.8981,14.37073 -32.9051,14.4824 -6.4936,0.1035 -17.163,-3.10582 -21.9042,-6.58867 -2.1955,-1.61284 -5.6258,-3.76473 -7.6227,-4.78201 -4.157,-2.11767 -6.7051,-7.39309 -8.2979,-17.1795 -2.182,-13.40675 3.7571,-28.38305 15.7831,-39.79951 3.6961,-3.50869 6.4205,-6.67905 6.0542,-7.04528 -0.3662,-0.36622 -3.2137,0.101 -6.3277,1.03813 -6.5929,1.98416 -37.7411,2.74082 -51.3934,1.24847 -10.4059,-1.13748 -10.7132,-0.75598 -6.6789,8.29215 5.9114,13.25827 6.9226,18.83762 5.196,28.67032 -3.0238,17.21958 -5.7544,23.00832 -15.5535,32.97265 -4.8956,4.97811 -10.1667,9.43255 -11.7136,9.89877 -1.5469,0.46621 -2.8125,1.32758 -2.8125,1.91411 0,0.58655 -1.8281,1.46504 -4.0625,1.95219 -13.0612,2.84771 -22.1782,10.27295 -22.1782,18.0629 0,6.24044 7.686,16.238 15.6157,20.31229 9.6288,4.94726 16.8357,6.22577 36.875,6.54166 23.3615,0.36826 29.2396,1.15871 40.625,5.46305 11.503,4.34878 18.4977,11.42041 25.7228,26.00548 4.7651,9.61912 5.4656,12.07642 5.4645,19.16806 0,15.30941 -8.8747,29.36231 -20.5166,32.49716 -5.3176,1.43186 -7.4269,3.49392 -11.1501,10.9 -3.3256,6.61535 -3.3791,12.84268 -0.1456,16.95339 1.375,1.74802 2.5,3.79264 2.5,4.54357 0,2.44022 -5.747,1.44073 -8.3211,-1.44716 z m 17.0711,-271.02024 c 9.2861,-3.37827 22.3687,-7.45924 26.5223,-8.27335 1.8685,-0.36622 3.9974,-1.38886 4.7307,-2.27254 1.9946,-2.40326 3.178,-14.37137 1.4211,-14.37137 -0.7832,0 -1.4241,-1.10543 -1.4241,-2.4565 0,-4.07662 -7.1879,-10.96443 -16.0894,-15.41766 -9.2503,-4.62775 -15.1089,-5.38936 -24.5282,-3.18863 -7.1009,1.65908 -14.6008,8.70604 -22.8232,21.44501 -2.5763,3.99148 -6.7935,9.79132 -9.3717,12.88853 -2.5781,3.09721 -4.6875,6.09071 -4.6875,6.65221 0,6.96836 31.4798,10.3677 46.25,4.9943 z m -377.60032,-6.80372 c 2.35106,-1.3813 4.48605,-3.14563 4.74441,-3.92071 0.25836,-0.7751 -1.66522,-3.97296 -4.27465,-7.10633 -2.60942,-3.13338 -6.8523,-8.9628 -9.4286,-12.95428 -8.22239,-12.73897 -15.72224,-19.78593 -22.82321,-21.44501 -9.41928,-2.20073 -15.27789,-1.43912 -24.52821,3.18863 -8.9015,4.45323 -16.08939,11.34104 -16.08939,15.41766 0,1.35107 -0.64085,2.4565 -1.42411,2.4565 -1.75689,0 -0.57343,11.96811 1.4211,14.37137 0.73339,0.88368 2.86221,1.90632 4.73072,2.27254 4.3678,0.85609 17.71304,5.05079 26.52229,8.33653 9.61696,3.58702 34.63265,3.212 41.14965,-0.6169 z m 293.64472,-3.74274 c 7.1582,-3.33238 8.2532,-6.56046 1.9716,-5.81195 -2.0026,0.23861 -4.2049,0.89511 -4.8942,1.45889 -1.6303,1.33342 -11.3526,-0.5319 -16.6328,-3.19115 -2.6124,-1.31573 -8.0851,-2.23619 -14.8569,-2.49885 -9.8376,-0.38159 -11.0418,-0.71596 -14.6141,-4.05789 -8.7217,-8.15946 -14.7104,-10.4084 -11.5366,-4.33235 1.6658,3.18909 13.0005,12.8125 15.0909,12.8125 0.5087,0 2.7401,0.86139 4.9588,1.9142 14.6998,6.97555 30.4048,8.4124 40.5133,3.7066 z m -222.9264,-5.69851 c 5.16773,-1.41775 10.93963,-3.38304 12.82646,-4.3673 1.88681,-0.98428 3.93178,-1.79305 4.54438,-1.79729 2.25018,-0.0156 13.53869,-9.48694 15.27982,-12.8202 3.17381,-6.07605 -2.81489,-3.82711 -11.53665,4.33235 -3.57223,3.34193 -4.77647,3.6763 -14.61402,4.05789 -6.77187,0.26266 -12.2445,1.18312 -14.85697,2.49885 -5.28015,2.65925 -15.00249,4.52457 -16.63275,3.19115 -2.16688,-1.77233 -8.49986,-1.99749 -9.06351,-0.32223 -0.83528,2.48263 11.89605,7.77818 18.73382,7.79228 3.25796,0.006 10.1517,-1.14777 15.31943,-2.5655 z"
     id="path4165"
     inkscape:connector-curvature="0" />
  <rect
     style="fill:url(#pattern5636);stroke:none"
     width="115.56174"
     height="54.065575"
     x="198.11453"
     y="-109.98725"
     id="rect5632" />
  <path
     inkscape:connector-curvature="0"
     id="path5638"
     d="m 725.56925,-307.77908 c -7.5287,-8.4464 -9.9667,-16.74659 -7.8763,-26.81562 1.3183,-6.35057 2.374,-8.02848 9.1563,-14.55274 4.2164,-4.056 8.6468,-8.8527 9.8454,-10.65934 3.1074,-4.68374 2.9259,-15.5582 -0.348,-20.85547 -4.526,-7.32327 -20.3514,-10.83064 -55.5813,-12.31851 -17.1208,-0.72306 -23.1239,-2.44196 -39.2792,-11.24708 -5.7911,-3.1563 -10.9006,-5.73874 -11.3545,-5.73874 -1.5158,0 -10.5882,-9.32612 -12.768,-13.125 -1.1834,-2.0625 -2.6651,-4.59375 -3.2926,-5.625 -3.7827,-6.21641 -4.5557,-9.90702 -4.5557,-21.75174 0,-11.22058 0.39,-13.45624 3.5097,-20.11957 1.9304,-4.12298 4.5388,-8.62298 5.7965,-10 1.2577,-1.37703 3.4866,-4.89432 4.9532,-7.81619 1.4665,-2.92188 3.1731,-5.3125 3.7923,-5.3125 1.8931,0 12.3635,-11.11259 13.2697,-14.08366 0.4683,-1.53524 1.9663,-5.27593 3.3289,-8.31265 3.3326,-7.42703 2.2567,-13.83358 -3.4408,-20.48985 -2.384,-2.78511 -4.3345,-5.45975 -4.3345,-5.94366 0,-1.47074 -12.7389,-5.91434 -19.1425,-6.67732 -19.4466,-2.31701 -31.987,-7.90898 -37.6022,-16.76745 -1.6038,-2.53022 -5.8524,-7.33928 -9.4413,-10.6868 -6.3166,-5.89178 -6.723,-6.06738 -12.7104,-5.49207 -11.2866,1.0845 -16.2359,8.80545 -16.5146,25.76316 -0.2525,15.35467 1.3561,28.60475 5.5152,45.42941 4.6516,18.8168 3.7627,23.4883 -6.98,36.68531 -4.4059,5.41247 -18.26035,13.07558 -23.63981,13.07558 -1.68754,0 -5.7775,1.64351 -9.0888,3.65224 -5.7282,3.47487 -6.40581,3.59632 -13.95389,2.5009 -4.36332,-0.63324 -8.3779,-0.87657 -8.92127,-0.54074 -1.67486,1.03511 -15.43703,-2.18398 -19.2931,-4.51283 -2.26934,-1.37054 -4.94605,-1.94332 -7.08371,-1.51578 -2.55194,0.51038 -4.02558,-0.0163 -5.72732,-2.04674 -3.50875,-4.18663 -8.45923,-6.28705 -14.81791,-6.28705 -5.4747,0 -6.18336,0.42394 -13.59414,8.13226 -4.30008,4.47274 -9.01645,10.51962 -10.48081,13.4375 -3.07406,6.12539 -9.83079,13.39587 -17.08982,18.38928 -5.21328,3.58615 -26.3113,10.04096 -32.8196,10.04096 -4.20934,0 -19.79384,-4.5779 -31.39299,-9.22159 -6.31324,-2.5275 -9.62025,-3.08858 -16.43158,-2.78791 -9.70296,0.42834 -11.53413,1.35586 -25.56073,12.947 -5.1997,4.29687 -9.89149,7.8125 -10.42618,7.8125 -0.5347,0 -3.04166,1.40625 -5.57102,3.125 -6.42797,4.36791 -16.9553,4.41319 -22.62739,0.0974 -2.1885,-1.66523 -5.53129,-3.41504 -7.42841,-3.88848 -4.21173,-1.05106 -5.08943,-2.3111 -4.00024,-5.74282 0.75209,-2.36962 1.42479,-2.54524 6.64319,-1.73441 17.69032,2.74872 19.71997,1.60739 46.09453,-25.92006 13.17817,-13.75422 17.06039,-14.41281 46.58683,-7.90302 31.982,7.05116 42.06322,1.87803 63.15667,-32.40854 3.26703,-5.31044 12.52138,-12.50952 22.46833,-17.47844 4.7458,-2.37072 8.20546,-3.12105 14.375,-3.11762 7.93682,0.005 13.4704,1.56342 35,9.86085 9.07856,3.49885 19.75105,5.14299 23.68224,3.64835 10.87417,-4.13435 14.30648,-20.17969 7.57535,-35.41314 -2.09994,-4.75244 -4.51654,-14.1593 -7.54637,-29.375 -1.42417,-7.15215 -1.14645,-26.73144 0.40113,-28.27901 1.32624,-1.32629 1.07097,-5.47104 -0.33695,-5.47104 -0.67352,0 -2.37162,2.24837 -3.77356,4.99639 -3.20361,6.2796 -14.75176,17.92287 -20.93547,21.1079 -2.58026,1.32901 -7.50387,3.86531 -10.94137,5.63622 -3.56207,1.8351 -10.28189,3.78309 -15.625,4.5295 -10.66141,1.48935 -29.39095,0.45344 -33.125,-1.83212 -3.41485,-2.09018 -16.52804,-4.45214 -21.875,-3.94015 -2.40625,0.2304 -6.625,1.03583 -9.375,1.78986 -13.65679,3.74452 -56.87741,4.04128 -65.80897,0.45183 -5.67352,-2.28009 -5.02427,-0.11888 1.95452,6.50616 12.02605,11.41646 17.96515,26.39276 15.78314,39.79951 -1.59278,9.78641 -4.14087,15.06183 -8.2979,17.1795 -1.99693,1.01728 -5.42715,3.16918 -7.6227,4.78201 -4.7412,3.48285 -15.41059,6.69214 -21.90424,6.58867 -7.00695,-0.11163 -15.04856,-3.65098 -32.90509,-14.4824 -13.32845,-8.08478 -17.32166,-9.9197 -22.53587,-10.35547 -4.86329,-0.40644 -6.8443,-0.0224 -8.51787,1.65114 -1.32205,1.32205 -2.63203,1.72944 -3.32685,1.03463 -1.83186,-1.83187 2.77053,-9.61993 6.82244,-11.5448 7.2051,-3.42282 11.66943,-2.42438 30.07,6.72508 16.40949,8.15943 17.95211,8.67667 25.625,8.59202 11.34429,-0.12518 19.30425,-3.82544 21.31126,-9.90674 0.81168,-2.45943 1.13954,-6.26403 0.72858,-8.45465 -1.07985,-5.75609 -13.75909,-22.89166 -25.62321,-34.62891 -9.9148,-9.80878 -10.60761,-10.24305 -21.74665,-13.63124 -6.32808,-1.92483 -14.88059,-5.03721 -19.00559,-6.91643 -9.43056,-4.29625 -18.68458,-4.58066 -24.85998,-0.76405 -4.18295,2.5852 -4.24028,2.74269 -4.47421,12.29015 -0.3227,13.17077 -0.22877,17.64736 0.67498,32.17139 0.73431,11.8009 0.59457,12.86301 -2.49865,18.9906 -1.80207,3.56984 -5.87235,8.70949 -9.04509,11.42146 -10.55351,9.02086 -32.86418,13.9252 -38.98429,8.56953 -1.13451,-0.99281 -3.84347,-2.70663 -6.0199,-3.80846 -2.17644,-1.10185 -7.52019,-5.13934 -11.875,-8.97222 -12.58535,-11.07691 -21.97927,-13.63968 -29.74013,-8.11346 -3.6395,2.59155 -4.19921,2.67679 -5.96721,0.90879 -1.768,-1.768 -1.63188,-2.33027 1.45124,-5.99434 4.42499,-5.25879 10.8087,-8.60816 18.03598,-9.46303 4.99257,-0.59052 7.34203,0.0351 16.83637,4.48392 6.06876,2.84362 12.53751,6.27975 14.375,7.63582 4.41063,3.25509 12.74788,3.516 18.21801,0.57015 5.7255,-3.08339 9.96537,-11.49105 8.9886,-17.82445 -1.69198,-10.97112 -2.6105,-24.30202 -2.53762,-36.83014 0.0769,-13.22047 0.14381,-13.51962 4.375,-19.55916 9.78955,-13.97346 23.37335,-21.14282 37.27891,-19.67534 7.72186,0.8149 18.94394,2.65347 24.0478,3.93984 3.27264,0.82484 3.28175,0.80585 4.17079,-8.68142 1.37014,-14.62137 8.87064,-26.75063 21.9244,-35.45452 10.56045,-7.04142 23.86201,-12.15656 26.01461,-10.00396 0.69716,0.69716 1.92808,0.85933 2.73539,0.36039 1.05699,-0.65325 1.08747,-1.28753 0.10887,-2.26609 -1.83847,-1.83847 -1.71963,-5.50502 0.20359,-6.28106 0.85938,-0.34676 0.28794,-0.67489 -1.26985,-0.72916 -2.35077,-0.0819 -2.78439,-0.72827 -2.55022,-3.80144 0.17646,-2.3158 -0.69469,-4.77393 -2.3257,-6.5625 -1.43432,-1.57286 -4.05903,-5.20029 -5.8327,-8.06094 -2.36208,-3.80967 -4.32634,-5.43429 -7.34194,-6.07246 -4.76981,-1.0094 -9.74205,-5.12784 -9.74205,-8.06924 0,-1.11766 -0.675,-2.70711 -1.5,-3.53211 -2.08961,-2.08961 -9.76225,-1.87639 -12.21059,0.33934 -1.24155,1.12357 -5.6462,2.07185 -11.31902,2.43685 -9.92047,0.6383 -12.47039,2.22586 -12.47039,7.76395 0,3.7579 -2.49624,5.11562 -4.46219,2.42702 -2.02247,-2.76591 -5.50399,-1.11337 -8.08729,3.83874 -1.00403,1.92471 -3.66903,5.1338 -5.92222,7.13131 -3.4097,3.02279 -4.03856,4.39115 -3.75,8.15981 0.33804,4.41478 0.24514,4.51817 -3.7158,4.13552 -3.01893,-0.29165 -4.0625,0.10975 -4.0625,1.5625 0,1.07522 0.5625,1.95496 1.25,1.95496 0.6875,0 1.25,0.84375 1.25,1.875 0,1.7679 -2.21245,2.47086 -6.08694,1.93399 -0.94156,-0.13047 -3.75406,1.38498 -6.25,3.36766 -2.49594,1.98269 -7.91306,5.73311 -12.03806,8.33427 -4.125,2.60118 -9.34203,6.03489 -11.59339,7.63048 -3.01162,2.13441 -6.64537,3.13202 -13.75,3.77492 -5.6329,0.50973 -10.53937,1.64939 -11.77517,2.73512 -1.49402,1.31256 -3.70503,1.65563 -7.5,1.16373 -12.67155,-1.64242 -19.23133,-2.82731 -20.69175,-3.73753 -0.86333,-0.53808 -2.68819,-0.18247 -4.08528,0.7961 -4.02758,2.82102 -13.15825,-0.66727 -15.68518,-5.99239 -1.48243,-3.12399 -3.71853,-4.82316 -9.673681,-7.35088 -4.26005,-1.80821 -9.30032,-3.28603 -11.20058,-3.28406 -4.28555,0.005 -11.60657,-4.65247 -13.36276,-8.50011 -1.22808,-2.69059 -8.03486,-6.20611 -10.56113,-5.45455 -0.6209,0.18472 -5.1209,0.58995 -10,0.9005 -7.31102,0.46534 -9.81857,1.22829 -14.25882,4.33846 -4.96413,3.4771 -7.73726,3.92377 -7.73726,1.24623 0,-0.59152 2.83968,-4.18256 6.31041,-7.98009 7.13077,-7.8022 13.58166,-10.4093 28.94283,-11.69712 8.15013,-0.68329 24.98426,1.39316 27.87176,3.43791 0.6875,0.48684 5.46875,2.1165 10.625001,3.62147 5.15625,1.50497 11.03923,3.64846 13.07329,4.76331 3.6826,2.01841 11.90723,4.36572 23.80171,6.79302 11.6335,2.37404 19.36919,0.1803 33.66255,-9.54626 11.663,-7.93662 20.13829,-16.3144 33.36142,-32.9776 14.03353,-17.68442 22.78125,-25.84416 33.60067,-31.3422 10.13155,-5.14847 16.03826,-6.48211 28.98695,-6.54472 11.90753,-0.0576 13.61085,0.47626 32.88841,10.30783 11.09335,5.65762 11.38489,5.92567 20.9375,19.25075 5.32812,7.43229 9.6875,14.27993 9.6875,15.21697 0,0.93702 0.51755,2.68043 1.15011,3.87423 0.63256,1.1938 2.35055,5.54554 3.81776,9.67054 4.47923,12.5931 6.82142,16.19895 10.83007,16.67311 1.96738,0.2327 4.13956,0.85827 4.82706,1.39014 0.6875,0.53186 2.72785,1.31924 4.53411,1.74971 1.80628,0.43048 4.20983,2.19548 5.34124,3.92224 2.33107,3.55765 17.59011,13.96826 25.12465,17.14151 8.42339,3.5476 19.58752,6.21597 22.71875,5.43008 1.63479,-0.4103 6.19185,-1.04055 10.1268,-1.40055 11.15922,-1.02093 16.15891,-2.78019 20.57384,-7.23938 2.24433,-2.26685 7.17436,-6.38683 10.95561,-9.15553 12.9562,-9.48675 16.61224,-13.97359 19.69999,-24.17659 1.55374,-5.13411 2.81934,-10.17849 2.81246,-11.20974 -0.007,-1.03125 -1.98126,-3.44585 -4.38749,-5.36579 -5.7044,-4.55155 -6.0909,-10.83136 -0.99405,-16.15132 3.29398,-3.43818 3.32697,-3.62024 1.28294,-7.08052 -1.15389,-1.95337 -1.75406,-3.89549 -1.33373,-4.31582 0.42033,-0.42034 -0.97911,-7.95239 -3.10986,-16.7379 -9.3973,-38.74684 -9.95892,-48.53756 -3.92781,-68.47365 1.45589,-4.8125 3.45025,-11.5625 4.43193,-15 3.11353,-10.90255 18.2212,-39.4323 26.03417,-49.16366 21.65755,-26.97534 51.09052,-40.23457 85.76652,-38.63694 22.6492,1.04353 41.811,8.29742 59.6256,22.57187 17.6203,14.11878 27.9706,30.63534 36.1765,57.72873 3.2306,10.66646 2.8352,45.60906 -0.7114,62.87267 -1.3703,6.67003 -2.8666,14.93983 -3.3252,18.37733 -0.8988,6.73828 -13.8886,35.16409 -18.6678,40.85129 -1.549,1.84321 -4.1028,6.00894 -5.6753,9.25717 -1.5724,3.24824 -6.351,9.61515 -10.619,14.14872 -5.1249,5.44367 -8.0722,9.72851 -8.6792,12.61782 -1.3037,6.20512 -5.1904,10 -10.2422,10 -2.6591,0 -5.1526,1.01346 -6.9199,2.8125 -1.5195,1.54687 -4.4726,3.42519 -6.5625,4.17403 -2.0898,0.74883 -3.7134,1.87383 -3.608,2.5 0.1054,0.62616 3.1992,2.33469 6.875,3.79674 4.8107,1.91346 7.7128,4.10244 10.3577,7.8125 2.0208,2.83483 4.5521,5.16242 5.625,5.17242 1.0728,0.01 4.2032,0.80342 6.9563,1.76315 2.7532,0.95972 8.4676,2.05298 12.6989,2.42946 4.2312,0.37649 9.067,1.02933 10.7461,1.45076 6.382,1.60179 23.3382,-4.57855 36.7039,-13.37817 9.5518,-6.28861 13.7943,-10.76764 15.0833,-15.92399 0.692,-2.7683 3.1287,-8.83639 7.8241,-19.4844 0.6063,-1.375 3.0955,-8.50105 5.5314,-15.83566 3.3593,-10.1149 6.4004,-16.26364 12.5916,-25.45904 8.8457,-13.13774 12.0541,-15.77539 30.065,-24.71645 8.4612,-4.20031 11.6351,-5.08222 20.625,-5.73089 22.81,-1.64583 40.8386,7.39708 60.7581,30.47549 22.8408,26.46307 37.9457,38.96895 54.0707,44.76715 7.6856,2.76359 18.7285,2.33106 25.1405,-0.98471 2.0111,-1.03999 4.7142,-1.89089 6.0068,-1.89089 1.2926,0 5.1174,-1.4039 8.4996,-3.11976 3.3821,-1.71588 6.6421,-3.12213 7.2443,-3.125 0.6023,-0.002 5.946,-1.88641 11.875,-4.18564 14.5204,-5.63089 22.2221,-7.32104 33.1653,-7.27811 8.9763,0.0352 18.86555,1.86417 19.89775,3.67997 0.2824,0.49695 0.9094,3.09419 1.3933,5.77165 l 0.8797,4.86813 -9.4326,-0.85476 c -10.84155,-0.98244 -15.77145,0.7207 -18.49075,6.38795 -1.8992,3.95827 -10.262,9.06653 -13.4696,8.22771 -1.2125,-0.31708 -5.6953,1.18561 -9.9617,3.33929 -5.8721,2.96425 -8.1781,4.92327 -9.4894,8.06177 -2.1727,5.20002 -11.4421,8.98929 -15.3294,6.26655 -1.468,-1.02824 -2.932,-1.19499 -4.0853,-0.46529 -0.9885,0.62549 -3.766,1.1658 -6.1723,1.20069 -2.4062,0.0349 -5.7812,0.86732 -7.5,1.84985 -4.1821,2.39071 -13.0159,2.39071 -15,0 -1.1223,-1.35234 -4.0917,-1.875 -10.6524,-1.875 -8.2416,0 -9.6795,-0.39241 -15.3018,-4.17598 -3.413,-2.29678 -7.2167,-4.56401 -8.4526,-5.03827 -1.2359,-0.47425 -6.0287,-3.37631 -10.6507,-6.44901 -5.3613,-3.56415 -9.7869,-5.58674 -12.2243,-5.58674 -4.5673,0 -6.409,-2.28776 -3.5341,-4.38994 3.2808,-2.39902 2.4311,-3.33752 -2.6216,-2.89531 -4.6828,0.40984 -4.6871,0.4057 -4.3408,-4.11773 0.2888,-3.77105 -0.3381,-5.13248 -3.75,-8.14405 -2.2532,-1.98883 -5.081,-5.13457 -6.2842,-6.99053 -2.8646,-4.41902 -6.979,-6.6709 -8.8217,-4.82824 -2.0757,2.07576 -3.3658,1.64105 -3.3658,-1.1342 0,-4.91038 -3.9677,-7.11357 -13.0906,-7.26904 -5.2863,-0.0901 -9.5654,-0.86473 -11.3936,-2.06261 -5.1412,-3.3686 -13.0158,-1.61906 -13.0158,2.89176 0,3.18258 -6.1625,8.52613 -11.0124,9.54892 -2.8038,0.59128 -4.5179,1.873 -5.3176,3.97633 -0.649,1.70709 -2.8653,5.5532 -4.925,8.54694 -4.2373,6.15872 -4.5482,8.22976 -1.8529,12.34326 1.6914,2.58144 1.6876,3.37669 -0.035,7.50039 -1.0864,2.60009 -3.2225,5.10519 -4.8957,5.74131 -4.3138,1.6401 -5.1881,3.78274 -1.5436,3.78274 1.6858,0 3.3888,0.84375 3.7846,1.875 0.3957,1.03125 2.0027,1.88109 3.5712,1.88853 1.5685,0.007 5.383,0.81623 8.4767,1.79731 28.4597,9.02499 43.614,24.42409 45.6744,46.41225 0.8891,9.48727 0.8982,9.50626 4.1708,8.68142 4.5718,-1.15227 15.8054,-3.03521 23.4991,-3.93881 13.8535,-1.62709 28.1842,5.62093 37.309,18.86974 l 4.8171,6.99412 0.077,13.39772 c 0.072,12.50377 -0.8476,25.83862 -2.5384,36.80203 -0.9768,6.3334 3.2631,14.74106 8.9886,17.82445 5.4701,2.94585 13.8074,2.68494 18.218,-0.57015 1.8375,-1.35607 8.3062,-4.7922 14.375,-7.63582 9.4943,-4.44873 11.8438,-5.07444 16.8364,-4.48391 7.2272,0.85486 13.6109,4.20423 18.0359,9.46302 3.0832,3.66408 3.2193,4.22634 1.4513,5.99434 -1.768,1.768 -2.3277,1.68276 -5.9672,-0.90879 -7.7609,-5.52622 -17.1548,-2.96345 -29.7402,8.11346 -4.3548,3.83288 -9.6985,7.87037 -11.875,8.97222 -2.1764,1.10183 -4.8854,2.81565 -6.0199,3.80846 -6.1201,5.35567 -28.4307,0.45134 -38.9843,-8.56953 -3.1727,-2.71197 -7.243,-7.85162 -9.045,-11.42146 -3.0933,-6.12759 -3.233,-7.1897 -2.4987,-18.9906 0.9038,-14.52402 0.9977,-19.00062 0.675,-32.17139 -0.2339,-9.54746 -0.2913,-9.70495 -4.4742,-12.29015 -6.1754,-3.81661 -15.4294,-3.5322 -24.86,0.76405 -4.125,1.87922 -12.6775,4.9916 -19.0056,6.91643 -11.139,3.38819 -11.8318,3.82246 -21.7466,13.63124 -11.8642,11.73725 -24.5434,28.87282 -25.6233,34.62891 -0.4109,2.19062 -0.083,5.99522 0.7286,8.45465 2.007,6.0813 9.967,9.78156 21.3113,9.90674 7.6729,0.0846 9.2155,-0.43259 25.625,-8.59202 18.4006,-9.14946 22.8649,-10.1479 30.07,-6.72508 4.0519,1.92487 8.6543,9.71293 6.8224,11.5448 -0.6948,0.69481 -2.0048,0.28742 -3.3268,-1.03463 -1.6736,-1.67356 -3.6546,-2.05757 -8.5179,-1.65114 -5.2142,0.43577 -9.2074,2.27069 -22.5359,10.35547 -17.8565,10.83142 -25.8981,14.37073 -32.9051,14.4824 -6.4936,0.1035 -17.163,-3.10582 -21.9042,-6.58867 -2.1955,-1.61284 -5.6258,-3.76473 -7.6227,-4.78201 -4.157,-2.11767 -6.7051,-7.39309 -8.2979,-17.1795 -2.182,-13.40675 3.7571,-28.38305 15.7831,-39.79951 3.6961,-3.50869 6.4205,-6.67905 6.0542,-7.04528 -0.3662,-0.36622 -3.2137,0.101 -6.3277,1.03813 -6.5929,1.98416 -37.7411,2.74082 -51.3934,1.24847 -10.4059,-1.13748 -10.7132,-0.75598 -6.6789,8.29215 5.9114,13.25827 6.9226,18.83762 5.196,28.67032 -3.0238,17.21958 -5.7544,23.00832 -15.5535,32.97265 -4.8956,4.97811 -10.1667,9.43255 -11.7136,9.89877 -1.5469,0.46621 -2.8125,1.32758 -2.8125,1.91411 0,0.58655 -1.8281,1.46504 -4.0625,1.95219 -13.0612,2.84771 -22.1782,10.27295 -22.1782,18.0629 0,6.24044 7.686,16.238 15.6157,20.31229 9.6288,4.94726 16.8357,6.22577 36.875,6.54166 23.3615,0.36826 29.2396,1.15871 40.625,5.46305 11.503,4.34878 18.4977,11.42041 25.7228,26.00548 4.7651,9.61912 5.4656,12.07642 5.4645,19.16806 0,15.30941 -8.8747,29.36231 -20.5166,32.49716 -5.3176,1.43186 -7.4269,3.49392 -11.1501,10.9 -3.3256,6.61535 -3.3791,12.84268 -0.1456,16.95339 1.375,1.74802 2.5,3.79264 2.5,4.54357 0,2.44022 -5.747,1.44073 -8.3211,-1.44716 z m 17.0711,-271.02024 c 9.2861,-3.37827 22.3687,-7.45924 26.5223,-8.27335 1.8685,-0.36622 3.9974,-1.38886 4.7307,-2.27254 1.9946,-2.40326 3.178,-14.37137 1.4211,-14.37137 -0.7832,0 -1.4241,-1.10543 -1.4241,-2.4565 0,-4.07662 -7.1879,-10.96443 -16.0894,-15.41766 -9.2503,-4.62775 -15.1089,-5.38936 -24.5282,-3.18863 -7.1009,1.65908 -14.6008,8.70604 -22.8232,21.44501 -2.5763,3.99148 -6.7935,9.79132 -9.3717,12.88853 -2.5781,3.09721 -4.6875,6.09071 -4.6875,6.65221 0,6.96836 31.4798,10.3677 46.25,4.9943 z m -377.60032,-6.80372 c 2.35106,-1.3813 4.48605,-3.14563 4.74441,-3.92071 0.25836,-0.7751 -1.66522,-3.97296 -4.27465,-7.10633 -2.60942,-3.13338 -6.8523,-8.9628 -9.4286,-12.95428 -8.22239,-12.73897 -15.72224,-19.78593 -22.82321,-21.44501 -9.41928,-2.20073 -15.27789,-1.43912 -24.52821,3.18863 -8.9015,4.45323 -16.08939,11.34104 -16.08939,15.41766 0,1.35107 -0.64085,2.4565 -1.42411,2.4565 -1.75689,0 -0.57343,11.96811 1.4211,14.37137 0.73339,0.88368 2.86221,1.90632 4.73072,2.27254 4.3678,0.85609 17.71304,5.05079 26.52229,8.33653 9.61696,3.58702 34.63265,3.212 41.14965,-0.6169 z m 293.64472,-3.74274 c 7.1582,-3.33238 8.2532,-6.56046 1.9716,-5.81195 -2.0026,0.23861 -4.2049,0.89511 -4.8942,1.45889 -1.6303,1.33342 -11.3526,-0.5319 -16.6328,-3.19115 -2.6124,-1.31573 -8.0851,-2.23619 -14.8569,-2.49885 -9.8376,-0.38159 -11.0418,-0.71596 -14.6141,-4.05789 -8.7217,-8.15946 -14.7104,-10.4084 -11.5366,-4.33235 1.6658,3.18909 13.0005,12.8125 15.0909,12.8125 0.5087,0 2.7401,0.86139 4.9588,1.9142 14.6998,6.97555 30.4048,8.4124 40.5133,3.7066 z m -222.9264,-5.69851 c 5.16773,-1.41775 10.93963,-3.38304 12.82646,-4.3673 1.88681,-0.98428 3.93178,-1.79305 4.54438,-1.79729 2.25018,-0.0156 13.53869,-9.48694 15.27982,-12.8202 3.17381,-6.07605 -2.81489,-3.82711 -11.53665,4.33235 -3.57223,3.34193 -4.77647,3.6763 -14.61402,4.05789 -6.77187,0.26266 -12.2445,1.18312 -14.85697,2.49885 -5.28015,2.65925 -15.00249,4.52457 -16.63275,3.19115 -2.16688,-1.77233 -8.49986,-1.99749 -9.06351,-0.32223 -0.83528,2.48263 11.89605,7.77818 18.73382,7.79228 3.25796,0.006 10.1517,-1.14777 15.31943,-2.5655 z"
     style="fill:none;fill-opacity:1;stroke:url(#linearGradient5662);stroke-width:10;stroke-miterlimit:4;stroke-dasharray:none;stroke-opacity:1" />
  <path
     style="fill:none;fill-opacity:1;stroke:url(#radialGradient5670);stroke-width:10;stroke-miterlimit:4;stroke-dasharray:none;stroke-opacity:1"
     d="m 725.56925,-1074.4569 c -7.5287,-8.4464 -9.9667,-16.7466 -7.8763,-26.8156 1.3183,-6.3506 2.374,-8.0285 9.1563,-14.5528 4.2164,-4.056 8.6468,-8.8527 9.8454,-10.6593 3.1074,-4.6837 2.9259,-15.5582 -0.348,-20.8555 -4.526,-7.3232 -20.3514,-10.8306 -55.5813,-12.3185 -17.1208,-0.723 -23.1239,-2.4419 -39.2792,-11.2471 -5.7911,-3.1563 -10.9006,-5.7387 -11.3545,-5.7387 -1.5158,0 -10.5882,-9.3261 -12.768,-13.125 -1.1834,-2.0625 -2.6651,-4.5937 -3.2926,-5.625 -3.7827,-6.2164 -4.5557,-9.907 -4.5557,-21.7517 0,-11.2206 0.39,-13.4563 3.5097,-20.1196 1.9304,-4.123 4.5388,-8.623 5.7965,-10 1.2577,-1.377 3.4866,-4.8943 4.9532,-7.8162 1.4665,-2.9219 3.1731,-5.3125 3.7923,-5.3125 1.8931,0 12.3635,-11.1126 13.2697,-14.0837 0.4683,-1.5352 1.9663,-5.2759 3.3289,-8.3126 3.3326,-7.427 2.2567,-13.8336 -3.4408,-20.4899 -2.384,-2.7851 -4.3345,-5.4597 -4.3345,-5.9436 0,-1.4708 -12.7389,-5.9144 -19.1425,-6.6773 -19.4466,-2.3171 -31.987,-7.909 -37.6022,-16.7675 -1.6038,-2.5302 -5.8524,-7.3393 -9.4413,-10.6868 -6.3166,-5.8918 -6.723,-6.0674 -12.7104,-5.4921 -11.2866,1.0845 -16.2359,8.8055 -16.5146,25.7632 -0.2525,15.3547 1.3561,28.6047 5.5152,45.4294 4.6516,18.8168 3.7627,23.4883 -6.98,36.6853 -4.4059,5.4125 -18.26035,13.0756 -23.63981,13.0756 -1.68754,0 -5.7775,1.6435 -9.0888,3.6522 -5.7282,3.4749 -6.40581,3.5964 -13.95389,2.5009 -4.36332,-0.6332 -8.3779,-0.8765 -8.92127,-0.5407 -1.67486,1.0351 -15.43703,-2.184 -19.2931,-4.5128 -2.26934,-1.3706 -4.94605,-1.9434 -7.08371,-1.5158 -2.55194,0.5104 -4.02558,-0.016 -5.72732,-2.0468 -3.50875,-4.1866 -8.45923,-6.287 -14.81791,-6.287 -5.4747,0 -6.18336,0.4239 -13.59414,8.1323 -4.30008,4.4727 -9.01645,10.5196 -10.48081,13.4375 -3.07406,6.1253 -9.83079,13.3958 -17.08982,18.3892 -5.21328,3.5862 -26.3113,10.041 -32.8196,10.041 -4.20934,0 -19.79384,-4.5779 -31.39299,-9.2216 -6.31324,-2.5275 -9.62025,-3.0886 -16.43158,-2.7879 -9.70296,0.4283 -11.53413,1.3559 -25.56073,12.947 -5.1997,4.2969 -9.89149,7.8125 -10.42618,7.8125 -0.5347,0 -3.04166,1.4063 -5.57102,3.125 -6.42797,4.3679 -16.9553,4.4132 -22.62739,0.097 -2.1885,-1.6652 -5.53129,-3.415 -7.42841,-3.8885 -4.21173,-1.051 -5.08943,-2.3111 -4.00024,-5.7428 0.75209,-2.3696 1.42479,-2.5452 6.64319,-1.7344 17.69032,2.7487 19.71997,1.6074 46.09453,-25.9201 13.17817,-13.7542 17.06039,-14.4128 46.58683,-7.903 31.982,7.0512 42.06322,1.878 63.15667,-32.4085 3.26703,-5.3105 12.52138,-12.5096 22.46833,-17.4785 4.7458,-2.3707 8.20546,-3.121 14.375,-3.1176 7.93682,0 13.4704,1.5634 35,9.8609 9.07856,3.4988 19.75105,5.1429 23.68224,3.6483 10.87417,-4.1343 14.30648,-20.1797 7.57535,-35.4131 -2.09994,-4.7525 -4.51654,-14.1593 -7.54637,-29.375 -1.42417,-7.1522 -1.14645,-26.7315 0.40113,-28.279 1.32624,-1.3263 1.07097,-5.4711 -0.33695,-5.4711 -0.67352,0 -2.37162,2.2484 -3.77356,4.9964 -3.20361,6.2796 -14.75176,17.9229 -20.93547,21.1079 -2.58026,1.329 -7.50387,3.8653 -10.94137,5.6362 -3.56207,1.8351 -10.28189,3.7831 -15.625,4.5295 -10.66141,1.4894 -29.39095,0.4535 -33.125,-1.8321 -3.41485,-2.0902 -16.52804,-4.4521 -21.875,-3.9401 -2.40625,0.2304 -6.625,1.0358 -9.375,1.7898 -13.65679,3.7445 -56.87741,4.0413 -65.80897,0.4518 -5.67352,-2.28 -5.02427,-0.1188 1.95452,6.5062 12.02605,11.4165 17.96515,26.3928 15.78314,39.7995 -1.59278,9.7864 -4.14087,15.0618 -8.2979,17.1795 -1.99693,1.0173 -5.42715,3.1692 -7.6227,4.782 -4.7412,3.4829 -15.41059,6.6922 -21.90424,6.5887 -7.00695,-0.1116 -15.04856,-3.651 -32.90509,-14.4824 -13.32845,-8.0848 -17.32166,-9.9197 -22.53587,-10.3555 -4.86329,-0.4064 -6.8443,-0.022 -8.51787,1.6512 -1.32205,1.322 -2.63203,1.7294 -3.32685,1.0346 -1.83186,-1.8319 2.77053,-9.6199 6.82244,-11.5448 7.2051,-3.4228 11.66943,-2.4244 30.07,6.7251 16.40949,8.1594 17.95211,8.6766 25.625,8.592 11.34429,-0.1252 19.30425,-3.8254 21.31126,-9.9067 0.81168,-2.4595 1.13954,-6.2641 0.72858,-8.4547 -1.07985,-5.7561 -13.75909,-22.8917 -25.62321,-34.6289 -9.9148,-9.8088 -10.60761,-10.2431 -21.74665,-13.6312 -6.32808,-1.9249 -14.88059,-5.0373 -19.00559,-6.9165 -9.43056,-4.2962 -18.68458,-4.5806 -24.85998,-0.764 -4.18295,2.5852 -4.24028,2.7427 -4.47421,12.2901 -0.3227,13.1708 -0.22877,17.6474 0.67498,32.1714 0.73431,11.8009 0.59457,12.863 -2.49865,18.9906 -1.80207,3.5699 -5.87235,8.7095 -9.04509,11.4215 -10.55351,9.0208 -32.86418,13.9252 -38.98429,8.5695 -1.13451,-0.9928 -3.84347,-2.7066 -6.0199,-3.8085 -2.17644,-1.1018 -7.52019,-5.1393 -11.875,-8.9722 -12.58535,-11.0769 -21.97927,-13.6397 -29.74013,-8.1134 -3.6395,2.5915 -4.19921,2.6768 -5.96721,0.9088 -1.768,-1.768 -1.63188,-2.3303 1.45124,-5.9944 4.42499,-5.2588 10.8087,-8.6081 18.03598,-9.463 4.99257,-0.5905 7.34203,0.035 16.83637,4.4839 6.06876,2.8436 12.53751,6.2798 14.375,7.6358 4.41063,3.2551 12.74788,3.516 18.21801,0.5702 5.7255,-3.0834 9.96537,-11.4911 8.9886,-17.8245 -1.69198,-10.9711 -2.6105,-24.302 -2.53762,-36.8301 0.0769,-13.2205 0.14381,-13.5196 4.375,-19.5592 9.78955,-13.9734 23.37335,-21.1428 37.27891,-19.6753 7.72186,0.8149 18.94394,2.6535 24.0478,3.9398 3.27264,0.8249 3.28175,0.8059 4.17079,-8.6814 1.37014,-14.6214 8.87064,-26.7506 21.9244,-35.4545 10.56045,-7.0414 23.86201,-12.1566 26.01461,-10.004 0.69716,0.6972 1.92808,0.8594 2.73539,0.3604 1.05699,-0.6532 1.08747,-1.2875 0.10887,-2.2661 -1.83847,-1.8384 -1.71963,-5.505 0.20359,-6.281 0.85938,-0.3468 0.28794,-0.6749 -1.26985,-0.7292 -2.35077,-0.082 -2.78439,-0.7283 -2.55022,-3.8014 0.17646,-2.3158 -0.69469,-4.774 -2.3257,-6.5625 -1.43432,-1.5729 -4.05903,-5.2003 -5.8327,-8.061 -2.36208,-3.8096 -4.32634,-5.4343 -7.34194,-6.0724 -4.76981,-1.0094 -9.74205,-5.1279 -9.74205,-8.0693 0,-1.1176 -0.675,-2.7071 -1.5,-3.5321 -2.08961,-2.0896 -9.76225,-1.8764 -12.21059,0.3394 -1.24155,1.1235 -5.6462,2.0718 -11.31902,2.4368 -9.92047,0.6383 -12.47039,2.2259 -12.47039,7.764 0,3.7579 -2.49624,5.1156 -4.46219,2.427 -2.02247,-2.7659 -5.50399,-1.1134 -8.08729,3.8387 -1.00403,1.9247 -3.66903,5.1338 -5.92222,7.1313 -3.4097,3.0228 -4.03856,4.3912 -3.75,8.1598 0.33804,4.4148 0.24514,4.5182 -3.7158,4.1356 -3.01893,-0.2917 -4.0625,0.1097 -4.0625,1.5625 0,1.0752 0.5625,1.9549 1.25,1.9549 0.6875,0 1.25,0.8438 1.25,1.875 0,1.7679 -2.21245,2.4709 -6.08694,1.934 -0.94156,-0.1305 -3.75406,1.385 -6.25,3.3677 -2.49594,1.9827 -7.91306,5.7331 -12.03806,8.3342 -4.125,2.6012 -9.34203,6.0349 -11.59339,7.6305 -3.01162,2.1344 -6.64537,3.132 -13.75,3.7749 -5.6329,0.5098 -10.53937,1.6494 -11.77517,2.7352 -1.49402,1.3125 -3.70503,1.6556 -7.5,1.1637 -12.67155,-1.6424 -19.23133,-2.8273 -20.69175,-3.7375 -0.86333,-0.5381 -2.68819,-0.1825 -4.08528,0.7961 -4.02758,2.821 -13.15825,-0.6673 -15.68518,-5.9924 -1.48243,-3.124 -3.71853,-4.8232 -9.673681,-7.3509 -4.26005,-1.8082 -9.30032,-3.286 -11.20058,-3.2841 -4.28555,0 -11.60657,-4.6524 -13.36276,-8.5001 -1.22808,-2.6906 -8.03486,-6.2061 -10.56113,-5.4545 -0.6209,0.1847 -5.1209,0.5899 -10,0.9005 -7.31102,0.4653 -9.81857,1.2283 -14.25882,4.3384 -4.96413,3.4771 -7.73726,3.9238 -7.73726,1.2463 0,-0.5916 2.83968,-4.1826 6.31041,-7.9801 7.13077,-7.8022 13.58166,-10.4093 28.94283,-11.6972 8.15013,-0.6832 24.98426,1.3932 27.87176,3.438 0.6875,0.4868 5.46875,2.1165 10.625001,3.6214 5.15625,1.505 11.03923,3.6485 13.07329,4.7633 3.6826,2.0184 11.90723,4.3658 23.80171,6.7931 11.6335,2.374 19.36919,0.1803 33.66255,-9.5463 11.663,-7.9366 20.13829,-16.3144 33.36142,-32.9776 14.03353,-17.6844 22.78125,-25.8442 33.60067,-31.3422 10.13155,-5.1485 16.03826,-6.4821 28.98695,-6.5447 11.90753,-0.058 13.61085,0.4762 32.88841,10.3078 11.09335,5.6576 11.38489,5.9257 20.9375,19.2508 5.32812,7.4322 9.6875,14.2799 9.6875,15.2169 0,0.937 0.51755,2.6805 1.15011,3.8743 0.63256,1.1938 2.35055,5.5455 3.81776,9.6705 4.47923,12.5931 6.82142,16.1989 10.83007,16.6731 1.96738,0.2327 4.13956,0.8583 4.82706,1.3901 0.6875,0.5319 2.72785,1.3193 4.53411,1.7498 1.80628,0.4304 4.20983,2.1954 5.34124,3.9222 2.33107,3.5576 17.59011,13.9683 25.12465,17.1415 8.42339,3.5476 19.58752,6.216 22.71875,5.4301 1.63479,-0.4103 6.19185,-1.0406 10.1268,-1.4006 11.15922,-1.0209 16.15891,-2.7802 20.57384,-7.2393 2.24433,-2.2669 7.17436,-6.3869 10.95561,-9.1556 12.9562,-9.4867 16.61224,-13.9736 19.69999,-24.1766 1.55374,-5.1341 2.81934,-10.1785 2.81246,-11.2097 -0.007,-1.0313 -1.98126,-3.4459 -4.38749,-5.3658 -5.7044,-4.5515 -6.0909,-10.8314 -0.99405,-16.1513 3.29398,-3.4382 3.32697,-3.6203 1.28294,-7.0805 -1.15389,-1.9534 -1.75406,-3.8955 -1.33373,-4.3159 0.42033,-0.4203 -0.97911,-7.9523 -3.10986,-16.7379 -9.3973,-38.7468 -9.95892,-48.5375 -3.92781,-68.4736 1.45589,-4.8125 3.45025,-11.5625 4.43193,-15 3.11353,-10.9026 18.2212,-39.4323 26.03417,-49.1637 21.65755,-26.9753 51.09052,-40.2345 85.76652,-38.6369 22.6492,1.0435 41.811,8.2974 59.6256,22.5719 17.6203,14.1187 27.9706,30.6353 36.1765,57.7287 3.2306,10.6665 2.8352,45.6091 -0.7114,62.8727 -1.3703,6.67 -2.8666,14.9398 -3.3252,18.3773 -0.8988,6.7383 -13.8886,35.1641 -18.6678,40.8513 -1.549,1.8432 -4.1028,6.0089 -5.6753,9.2572 -1.5724,3.2482 -6.351,9.6151 -10.619,14.1487 -5.1249,5.4436 -8.0722,9.7285 -8.6792,12.6178 -1.3037,6.2051 -5.1904,10 -10.2422,10 -2.6591,0 -5.1526,1.0135 -6.9199,2.8125 -1.5195,1.5469 -4.4726,3.4252 -6.5625,4.174 -2.0898,0.7489 -3.7134,1.8739 -3.608,2.5 0.1054,0.6262 3.1992,2.3347 6.875,3.7968 4.8107,1.9134 7.7128,4.1024 10.3577,7.8125 2.0208,2.8348 4.5521,5.1624 5.625,5.1724 1.0728,0.01 4.2032,0.8034 6.9563,1.7631 2.7532,0.9598 8.4676,2.053 12.6989,2.4295 4.2312,0.3765 9.067,1.0293 10.7461,1.4508 6.382,1.6017 23.3382,-4.5786 36.7039,-13.3782 9.5518,-6.2886 13.7943,-10.7677 15.0833,-15.924 0.692,-2.7683 3.1287,-8.8364 7.8241,-19.4844 0.6063,-1.375 3.0955,-8.5011 5.5314,-15.8357 3.3593,-10.1149 6.4004,-16.2636 12.5916,-25.459 8.8457,-13.1377 12.0541,-15.7754 30.065,-24.7165 8.4612,-4.2003 11.6351,-5.0822 20.625,-5.7308 22.81,-1.6459 40.8386,7.397 60.7581,30.4754 22.8408,26.4631 37.9457,38.969 54.0707,44.7672 7.6856,2.7636 18.7285,2.3311 25.1405,-0.9847 2.0111,-1.04 4.7142,-1.8909 6.0068,-1.8909 1.2926,0 5.1174,-1.4039 8.4996,-3.1198 3.3821,-1.7158 6.6421,-3.1221 7.2443,-3.125 0.6023,0 5.946,-1.8864 11.875,-4.1856 14.5204,-5.6309 22.2221,-7.321 33.1653,-7.2781 8.9763,0.035 18.86555,1.8642 19.89775,3.68 0.2824,0.4969 0.9094,3.0941 1.3933,5.7716 l 0.8797,4.8681 -9.4326,-0.8547 c -10.84155,-0.9825 -15.77145,0.7207 -18.49075,6.3879 -1.8992,3.9583 -10.262,9.0666 -13.4696,8.2277 -1.2125,-0.317 -5.6953,1.1856 -9.9617,3.3393 -5.8721,2.9643 -8.1781,4.9233 -9.4894,8.0618 -2.1727,5.2 -11.4421,8.9893 -15.3294,6.2665 -1.468,-1.0282 -2.932,-1.1949 -4.0853,-0.4652 -0.9885,0.6254 -3.766,1.1658 -6.1723,1.2006 -2.4062,0.035 -5.7812,0.8674 -7.5,1.8499 -4.1821,2.3907 -13.0159,2.3907 -15,0 -1.1223,-1.3523 -4.0917,-1.875 -10.6524,-1.875 -8.2416,0 -9.6795,-0.3924 -15.3018,-4.176 -3.413,-2.2968 -7.2167,-4.564 -8.4526,-5.0383 -1.2359,-0.4742 -6.0287,-3.3763 -10.6507,-6.449 -5.3613,-3.5641 -9.7869,-5.5867 -12.2243,-5.5867 -4.5673,0 -6.409,-2.2878 -3.5341,-4.3899 3.2808,-2.3991 2.4311,-3.3376 -2.6216,-2.8954 -4.6828,0.4099 -4.6871,0.4057 -4.3408,-4.1177 0.2888,-3.771 -0.3381,-5.1325 -3.75,-8.144 -2.2532,-1.9889 -5.081,-5.1346 -6.2842,-6.9906 -2.8646,-4.419 -6.979,-6.6709 -8.8217,-4.8282 -2.0757,2.0758 -3.3658,1.641 -3.3658,-1.1342 0,-4.9104 -3.9677,-7.1136 -13.0906,-7.269 -5.2863,-0.09 -9.5654,-0.8648 -11.3936,-2.0627 -5.1412,-3.3686 -13.0158,-1.619 -13.0158,2.8918 0,3.1826 -6.1625,8.5261 -11.0124,9.5489 -2.8038,0.5913 -4.5179,1.873 -5.3176,3.9764 -0.649,1.707 -2.8653,5.5532 -4.925,8.5469 -4.2373,6.1587 -4.5482,8.2298 -1.8529,12.3433 1.6914,2.5814 1.6876,3.3766 -0.035,7.5003 -1.0864,2.6001 -3.2225,5.1052 -4.8957,5.7414 -4.3138,1.6401 -5.1881,3.7827 -1.5436,3.7827 1.6858,0 3.3888,0.8437 3.7846,1.875 0.3957,1.0312 2.0027,1.8811 3.5712,1.8885 1.5685,0.01 5.383,0.8163 8.4767,1.7973 28.4597,9.025 43.614,24.4241 45.6744,46.4123 0.8891,9.4873 0.8982,9.5062 4.1708,8.6814 4.5718,-1.1523 15.8054,-3.0352 23.4991,-3.9388 13.8535,-1.6271 28.1842,5.6209 37.309,18.8697 l 4.8171,6.9942 0.077,13.3977 c 0.072,12.5037 -0.8476,25.8386 -2.5384,36.802 -0.9768,6.3334 3.2631,14.7411 8.9886,17.8245 5.4701,2.9458 13.8074,2.6849 18.218,-0.5702 1.8375,-1.3561 8.3062,-4.7922 14.375,-7.6358 9.4943,-4.4487 11.8438,-5.0745 16.8364,-4.4839 7.2272,0.8548 13.6109,4.2042 18.0359,9.463 3.0832,3.6641 3.2193,4.2263 1.4513,5.9943 -1.768,1.768 -2.3277,1.6828 -5.9672,-0.9088 -7.7609,-5.5262 -17.1548,-2.9634 -29.7402,8.1135 -4.3548,3.8329 -9.6985,7.8704 -11.875,8.9722 -2.1764,1.1019 -4.8854,2.8157 -6.0199,3.8085 -6.1201,5.3557 -28.4307,0.4513 -38.9843,-8.5695 -3.1727,-2.712 -7.243,-7.8517 -9.045,-11.4215 -3.0933,-6.1276 -3.233,-7.1897 -2.4987,-18.9906 0.9038,-14.524 0.9977,-19.0006 0.675,-32.1714 -0.2339,-9.5475 -0.2913,-9.7049 -4.4742,-12.2901 -6.1754,-3.8167 -15.4294,-3.5322 -24.86,0.764 -4.125,1.8792 -12.6775,4.9916 -19.0056,6.9164 -11.139,3.3882 -11.8318,3.8225 -21.7466,13.6313 -11.8642,11.7372 -24.5434,28.8728 -25.6233,34.6289 -0.4109,2.1906 -0.083,5.9952 0.7286,8.4546 2.007,6.0813 9.967,9.7816 21.3113,9.9068 7.6729,0.085 9.2155,-0.4326 25.625,-8.592 18.4006,-9.1495 22.8649,-10.1479 30.07,-6.7251 4.0519,1.9248 8.6543,9.7129 6.8224,11.5448 -0.6948,0.6948 -2.0048,0.2874 -3.3268,-1.0347 -1.6736,-1.6735 -3.6546,-2.0575 -8.5179,-1.6511 -5.2142,0.4358 -9.2074,2.2707 -22.5359,10.3555 -17.8565,10.8314 -25.8981,14.3707 -32.9051,14.4824 -6.4936,0.1035 -17.163,-3.1058 -21.9042,-6.5887 -2.1955,-1.6128 -5.6258,-3.7647 -7.6227,-4.782 -4.157,-2.1177 -6.7051,-7.3931 -8.2979,-17.1795 -2.182,-13.4068 3.7571,-28.3831 15.7831,-39.7995 3.6961,-3.5087 6.4205,-6.6791 6.0542,-7.0453 -0.3662,-0.3662 -3.2137,0.101 -6.3277,1.0381 -6.5929,1.9842 -37.7411,2.7409 -51.3934,1.2485 -10.4059,-1.1375 -10.7132,-0.756 -6.6789,8.2922 5.9114,13.2582 6.9226,18.8376 5.196,28.6703 -3.0238,17.2196 -5.7544,23.0083 -15.5535,32.9726 -4.8956,4.9781 -10.1667,9.4326 -11.7136,9.8988 -1.5469,0.4662 -2.8125,1.3276 -2.8125,1.9141 0,0.5866 -1.8281,1.465 -4.0625,1.9522 -13.0612,2.8477 -22.1782,10.2729 -22.1782,18.0629 0,6.2404 7.686,16.238 15.6157,20.3123 9.6288,4.9473 16.8357,6.2258 36.875,6.5417 23.3615,0.3682 29.2396,1.1587 40.625,5.463 11.503,4.3488 18.4977,11.4204 25.7228,26.0055 4.7651,9.6191 5.4656,12.0764 5.4645,19.168 0,15.3095 -8.8747,29.3624 -20.5166,32.4972 -5.3176,1.4319 -7.4269,3.4939 -11.1501,10.9 -3.3256,6.6154 -3.3791,12.8427 -0.1456,16.9534 1.375,1.748 2.5,3.7926 2.5,4.5436 0,2.4402 -5.747,1.4407 -8.3211,-1.4472 z m 17.0711,-271.0202 c 9.2861,-3.3783 22.3687,-7.4593 26.5223,-8.2734 1.8685,-0.3662 3.9974,-1.3889 4.7307,-2.2725 1.9946,-2.4033 3.178,-14.3714 1.4211,-14.3714 -0.7832,0 -1.4241,-1.1054 -1.4241,-2.4565 0,-4.0766 -7.1879,-10.9644 -16.0894,-15.4177 -9.2503,-4.6277 -15.1089,-5.3893 -24.5282,-3.1886 -7.1009,1.6591 -14.6008,8.706 -22.8232,21.445 -2.5763,3.9915 -6.7935,9.7913 -9.3717,12.8885 -2.5781,3.0973 -4.6875,6.0908 -4.6875,6.6523 0,6.9683 31.4798,10.3677 46.25,4.9943 z m -377.60032,-6.8038 c 2.35106,-1.3813 4.48605,-3.1456 4.74441,-3.9207 0.25836,-0.7751 -1.66522,-3.9729 -4.27465,-7.1063 -2.60942,-3.1334 -6.8523,-8.9628 -9.4286,-12.9543 -8.22239,-12.739 -15.72224,-19.7859 -22.82321,-21.445 -9.41928,-2.2007 -15.27789,-1.4391 -24.52821,3.1886 -8.9015,4.4533 -16.08939,11.3411 -16.08939,15.4177 0,1.3511 -0.64085,2.4565 -1.42411,2.4565 -1.75689,0 -0.57343,11.9681 1.4211,14.3714 0.73339,0.8836 2.86221,1.9063 4.73072,2.2725 4.3678,0.8561 17.71304,5.0508 26.52229,8.3365 9.61696,3.5871 34.63265,3.212 41.14965,-0.6169 z m 293.64472,-3.7427 c 7.1582,-3.3324 8.2532,-6.5605 1.9716,-5.812 -2.0026,0.2387 -4.2049,0.8952 -4.8942,1.4589 -1.6303,1.3335 -11.3526,-0.5319 -16.6328,-3.1911 -2.6124,-1.3157 -8.0851,-2.2362 -14.8569,-2.4989 -9.8376,-0.3816 -11.0418,-0.7159 -14.6141,-4.0579 -8.7217,-8.1594 -14.7104,-10.4084 -11.5366,-4.3323 1.6658,3.1891 13.0005,12.8125 15.0909,12.8125 0.5087,0 2.7401,0.8614 4.9588,1.9142 14.6998,6.9755 30.4048,8.4124 40.5133,3.7066 z m -222.9264,-5.6985 c 5.16773,-1.4178 10.93963,-3.3831 12.82646,-4.3673 1.88681,-0.9843 3.93178,-1.7931 4.54438,-1.7973 2.25018,-0.016 13.53869,-9.4869 15.27982,-12.8202 3.17381,-6.0761 -2.81489,-3.8271 -11.53665,4.3323 -3.57223,3.342 -4.77647,3.6763 -14.61402,4.0579 -6.77187,0.2627 -12.2445,1.1832 -14.85697,2.4989 -5.28015,2.6592 -15.00249,4.5246 -16.63275,3.1911 -2.16688,-1.7723 -8.49986,-1.9975 -9.06351,-0.3222 -0.83528,2.4826 11.89605,7.7782 18.73382,7.7923 3.25796,0.01 10.1517,-1.1478 15.31943,-2.5655 z"
     id="path5666"
     inkscape:connector-curvature="0" />
  <path
     style="color:#000000;clip-rule:nonzero;display:inline;overflow:visible;visibility:visible;opacity:1;color-interpolation:sRGB;color-interpolation-filters:linearRGB;fill:#729fcf;fill-opacity:1;fill-rule:nonzero;stroke:#000000;stroke-width:2;stroke-linecap:round;stroke-linejoin:round;stroke-miterlimit:4;stroke-dasharray:2, 12;stroke-dashoffset:0;stroke-opacity:1;marker:none;enable-background:accumulate"
     d="m 389.44519,-913.22861 0,660.83556"
     id="path5688"
     inkscape:connector-curvature="0"
     sodipodi:nodetypes="cc" />
  <path
     sodipodi:nodetypes="cc"
     inkscape:connector-curvature="0"
     id="path5690"
     d="m 630.98262,-915.94251 0,660.83556"
     style="color:#000000;clip-rule:nonzero;display:inline;overflow:visible;visibility:visible;opacity:1;color-interpolation:sRGB;color-interpolation-filters:linearRGB;fill:#729fcf;fill-opacity:1;fill-rule:nonzero;stroke:#000000;stroke-width:2;stroke-linecap:round;stroke-linejoin:round;stroke-miterlimit:4;stroke-dasharray:2, 12;stroke-dashoffset:0;stroke-opacity:1;marker:none;enable-background:accumulate" />
  <ellipse
     ry="97.048782"
     rx="158.7901"
     cy="-1367.1289"
     cx="529.21124"
     id="ellipse5694"
     style="color:#000000;clip-rule:nonzero;display:inline;overflow:visible;visibility:visible;opacity:1;color-interpolation:sRGB;color-interpolation-filters:linearRGB;fill:none;fill-opacity:1;fill-rule:nonzero;stroke:#000000;stroke-width:1.94656551;stroke-linecap:round;stroke-linejoin:round;stroke-miterlimit:4;stroke-dasharray:1.94656539, 11.67939234;stroke-dashoffset:0;stroke-opacity:1;marker:none;enable-background:accumulate" />
  <ellipse
     style="color:#000000;clip-rule:nonzero;display:inline;overflow:visible;visibility:visible;opacity:1;color-interpolation:sRGB;color-interpolation-filters:linearRGB;fill:none;fill-opacity:1;fill-rule:nonzero;stroke:#000000;stroke-width:2;stroke-linecap:round;stroke-linejoin:round;stroke-miterlimit:4;stroke-dasharray:2,12;stroke-dashoffset:0;stroke-opacity:1;marker:none;enable-background:accumulate"
     id="path5692"
     cx="525.14038"
     cy="-1369.8428"
     rx="327.32706"
     ry="209.9507" />
  <ellipse
     ry="331.49759"
     rx="516.72156"
     cy="-1369.8428"
     cx="525.14038"
     id="ellipse5696"
     style="color:#000000;clip-rule:nonzero;display:inline;overflow:visible;visibility:visible;opacity:1;color-interpolation:sRGB;color-interpolation-filters:linearRGB;fill:none;fill-opacity:1;fill-rule:nonzero;stroke:#000000;stroke-width:2;stroke-linecap:round;stroke-linejoin:round;stroke-miterlimit:4;stroke-dasharray:2,12;stroke-dashoffset:0;stroke-opacity:1;marker:none;enable-background:accumulate" />
  <path
     inkscape:connector-curvature="0"
     id="path5700"
     d="m 482.15814,-2474.7198 -207.61364,118.0548 321.5976,157.4064 332.4532,-146.5508 -322.69611,-151.3945 -19.25576,10.2715"
     style="color:#000000;clip-rule:nonzero;display:inline;overflow:visible;visibility:visible;opacity:1;color-interpolation:sRGB;color-interpolation-filters:linearRGB;fill:none;fill-opacity:1;fill-rule:nonzero;stroke:#000000;stroke-width:10;stroke-linecap:round;stroke-linejoin:round;stroke-miterlimit:4;stroke-dasharray:none;stroke-dashoffset:0;stroke-opacity:1;marker:none;enable-background:accumulate"
     sodipodi:nodetypes="cccccc" />
  <path
     inkscape:connector-curvature="0"
     id="path5702"
     d="m 479.42973,-2507.9156 -207.61364,118.0548 321.5976,157.4064 332.4532,-146.5508 -320.66246,-149.3787 -21.28941,8.2557"
     style="color:#000000;clip-rule:nonzero;display:inline;overflow:visible;visibility:visible;opacity:1;color-interpolation:sRGB;color-interpolation-filters:linearRGB;fill:none;fill-opacity:1;fill-rule:nonzero;stroke:#000000;stroke-width:10;stroke-linecap:butt;stroke-linejoin:miter;stroke-miterlimit:4;stroke-dasharray:none;stroke-dashoffset:0;stroke-opacity:1;marker:none;enable-background:accumulate"
     sodipodi:nodetypes="cccccc" />
  <path
     style="color:#000000;clip-rule:nonzero;display:inline;overflow:visible;visibility:visible;opacity:1;color-interpolation:sRGB;color-interpolation-filters:linearRGB;fill:none;fill-opacity:1;fill-rule:nonzero;stroke:#000000;stroke-width:10;stroke-linecap:square;stroke-linejoin:bevel;stroke-miterlimit:4;stroke-dasharray:none;stroke-dashoffset:0;stroke-opacity:1;marker:none;enable-background:accumulate"
     d="m 478.97499,-2543.385 -207.61364,118.0548 321.5976,157.4064 332.4532,-146.5508 -326.22109,-148.6772 -15.73078,7.5542"
     id="path5698"
     inkscape:connector-curvature="0"
     sodipodi:nodetypes="cccccc" />
  <path
     style="fill:none;fill-rule:evenodd;stroke:#000000;stroke-width:1px;stroke-linecap:butt;stroke-linejoin:miter;stroke-opacity:1;marker-mid:url(#Arrow1Mend)"
     d="m 601.50865,-2636.3499 c -1.85846,8.8671 -12.53047,11.9843 -20.13112,8.7963 -10.14398,-4.2547 -13.76497,-16.7714 -9.13878,-26.3582 5.47707,-11.3501 19.79399,-15.3528 30.78309,-9.7156 12.41077,6.3665 16.7443,22.2252 10.29945,34.3651 -7.08974,13.3546 -24.29699,17.9844 -37.43226,10.8562 -14.20772,-7.7102 -19.10754,-26.1224 -11.38106,-40.1442 8.25944,-14.989 27.7663,-20.1378 42.5929,-11.8755 15.71208,8.7558 21.09253,29.2696 12.34247,44.8367 -9.21083,16.3869 -30.66011,21.9846 -46.91555,12.7851 -17.02099,-9.6327 -22.82352,-31.9577 -13.20608,-48.8581 10.02708,-17.6202 33.17722,-23.6169 50.68561,-13.6078 18.1891,10.3983 24.3707,34.3299 13.99229,52.4146 -10.74956,18.7314 -35.42448,25.0896 -54.05778,14.3612 -19.25018,-11.0835 -25.77765,-36.4682 -14.71625,-55.6256 11.40229,-19.7479 37.46689,-26.438 57.12676,-15.0585 20.22659,11.7075 27.0734,38.4252 15.38909,58.568 -12.00068,20.6881 -39.34733,27.6862 -59.95532,15.709 -21.13405,-12.2829 -28.27842,-40.2365 -16.01917,-61.2937 12.55526,-21.5657 41.09579,-28.8518 62.58755,-16.3202 21.98404,12.8185 29.40768,41.9276 16.61286,63.8404 -13.07359,22.3903 -42.73419,29.9476 -65.05574,16.8977 -22.78523,-13.321 -30.47255,-43.5175 -17.17516,-66.2362 13.56133,-23.1697 44.27909,-30.9837 67.38437,-17.4458 23.54435,13.7951 31.48185,45.0206 17.71004,68.5024 -14.02282,23.9099 -45.74334,31.968 -69.59247,17.9683 -24.26677,-14.2448 -32.44263,-46.4485 -18.22077,-70.6562 14.4615,-24.6156 47.13718,-32.9067 71.69524,-18.4679 24.95681,14.6731 33.36056,47.8103 18.70998,72.711 -14.88011,25.2908 -48.46888,33.805 -73.70495,18.9472 -25.61803,-15.0826 -34.24033,-49.1136 -19.1799,-74.6781 15.2809,-25.9388 49.74524,-34.6672 75.63172,-19.4082 26.2534,15.4752 35.08588,50.3645 19.63241,76.5667 -1.31282,2.2259 -2.77929,4.3611 -4.38547,6.3856"
     id="path16123" />
  <text
     xml:space="preserve"
     style="color:#000000;font-style:normal;font-variant:normal;font-weight:normal;font-stretch:normal;font-size:41.24875259px;line-height:139.99999762%;-inkscape-font-specification:&quot;Lobster 1.4, Normal&quot;;text-indent:0;text-align:start;text-decoration:none;text-decoration-line:none;text-decoration-color:currentColor;letter-spacing:normal;word-spacing:normal;text-transform:none;direction:ltr;block-progression:tb;writing-mode:lr-tb;baseline-shift:baseline;text-anchor:start;clip-rule:nonzero;display:inline;overflow:visible;visibility:visible;opacity:1;color-interpolation:sRGB;color-interpolation-filters:linearRGB;fill:none;fill-opacity:1;fill-rule:nonzero;stroke:#000000;stroke-width:10;stroke-linecap:square;stroke-linejoin:bevel;stroke-miterlimit:4;stroke-dasharray:none;stroke-dashoffset:0;stroke-opacity:1;marker:none;enable-background:accumulate"
     x="510.7132"
     y="-2821.7698"
     id="text16388"
     sodipodi:linespacing="140%"><tspan
       sodipodi:role="line"
       id="tspan16390"
       x="510.7132"
       y="-2821.7698">J</tspan></text>
</svg>
