{
  "kind": "collectionType",
  "collectionName": "tags",
  "info": {
    "name": "Tag"
  },
  "options": {
    "increments": true,
    "timestamps": true,
    "draftAndPublish": true
  },
  "attributes": {
    "name": {
      "type": "string",
      "required": true
    },
    "slug": {
      "type": "string",
      "required": true,
      "unique": true
    },
    "questions": {
      "via": "tags",
      "collection": "question"
    }
  }
}
