-------------------------------------------------------------------------------
Test set: com.bh10.project.shorttermjobs.service.EmployerProfileServiceTest
-------------------------------------------------------------------------------
Tests run: 5, Failures: 0, Errors: 0, Skipped: 0, Time elapsed: 0.059 sec
