C:\Users\belak\Documents\NetBeansProjects\NewProjects\ShortTermJobs\src\main\java\com\bh10\project\shorttermjobs\dto\GroupDto.java
C:\Users\belak\Documents\NetBeansProjects\NewProjects\ShortTermJobs\src\main\java\com\bh10\project\shorttermjobs\servlet\ApplyServlet.java
C:\Users\belak\Documents\NetBeansProjects\NewProjects\ShortTermJobs\src\main\java\com\bh10\project\shorttermjobs\dao\SoftSkillDAO.java
C:\Users\belak\Documents\NetBeansProjects\NewProjects\ShortTermJobs\src\main\java\com\bh10\project\shorttermjobs\dto\HardSkillDto.java
C:\Users\belak\Documents\NetBeansProjects\NewProjects\ShortTermJobs\src\main\java\com\bh10\project\shorttermjobs\dto\LanguageDto.java
C:\Users\belak\Documents\NetBeansProjects\NewProjects\ShortTermJobs\src\main\java\com\bh10\project\shorttermjobs\entity\ApplicationEntity.java
C:\Users\belak\Documents\NetBeansProjects\NewProjects\ShortTermJobs\src\main\java\com\bh10\project\shorttermjobs\entity\LanguageEntity.java
C:\Users\belak\Documents\NetBeansProjects\NewProjects\ShortTermJobs\src\main\java\com\bh10\project\shorttermjobs\service\ReportService.java
C:\Users\belak\Documents\NetBeansProjects\NewProjects\ShortTermJobs\src\main\java\com\bh10\project\shorttermjobs\dao\StjUserDAO.java
C:\Users\belak\Documents\NetBeansProjects\NewProjects\ShortTermJobs\src\main\java\com\bh10\project\shorttermjobs\service\ApplicationService.java
C:\Users\belak\Documents\NetBeansProjects\NewProjects\ShortTermJobs\src\main\java\com\bh10\project\shorttermjobs\servlet\CreateAdminServlet.java
C:\Users\belak\Documents\NetBeansProjects\NewProjects\ShortTermJobs\src\main\java\com\bh10\project\shorttermjobs\entity\EducationEntity.java
C:\Users\belak\Documents\NetBeansProjects\NewProjects\ShortTermJobs\src\main\java\com\bh10\project\shorttermjobs\service\EmployerProfileService.java
C:\Users\belak\Documents\NetBeansProjects\NewProjects\ShortTermJobs\src\main\java\com\bh10\project\shorttermjobs\mapper\LanguageMapper.java
C:\Users\belak\Documents\NetBeansProjects\NewProjects\ShortTermJobs\src\main\java\com\bh10\project\shorttermjobs\service\StjUserService.java
C:\Users\belak\Documents\NetBeansProjects\NewProjects\ShortTermJobs\src\main\java\com\bh10\project\shorttermjobs\exception\EmailIsUsedException.java
C:\Users\belak\Documents\NetBeansProjects\NewProjects\ShortTermJobs\src\main\java\com\bh10\project\shorttermjobs\dao\GroupDAO.java
C:\Users\belak\Documents\NetBeansProjects\NewProjects\ShortTermJobs\src\main\java\com\bh10\project\shorttermjobs\servlet\CreateAdvertisementServlet.java
C:\Users\belak\Documents\NetBeansProjects\NewProjects\ShortTermJobs\src\main\java\com\bh10\project\shorttermjobs\mapper\AdvertisementMapper.java
C:\Users\belak\Documents\NetBeansProjects\NewProjects\ShortTermJobs\src\main\java\com\bh10\project\shorttermjobs\servlet\RegistrationServlet.java
C:\Users\belak\Documents\NetBeansProjects\NewProjects\ShortTermJobs\src\main\java\com\bh10\project\shorttermjobs\dao\LanguageDAO.java
C:\Users\belak\Documents\NetBeansProjects\NewProjects\ShortTermJobs\src\main\java\com\bh10\project\shorttermjobs\service\ImageUploadService.java
C:\Users\belak\Documents\NetBeansProjects\NewProjects\ShortTermJobs\src\main\java\com\bh10\project\shorttermjobs\mapper\StjUserMapper.java
C:\Users\belak\Documents\NetBeansProjects\NewProjects\ShortTermJobs\src\main\java\com\bh10\project\shorttermjobs\mapper\ReportMapper.java
C:\Users\belak\Documents\NetBeansProjects\NewProjects\ShortTermJobs\src\main\java\com\bh10\project\shorttermjobs\dto\UserTypeDto.java
C:\Users\belak\Documents\NetBeansProjects\NewProjects\ShortTermJobs\src\main\java\com\bh10\project\shorttermjobs\dto\ReportDto.java
C:\Users\belak\Documents\NetBeansProjects\NewProjects\ShortTermJobs\src\main\java\com\bh10\project\shorttermjobs\mapper\EducationMapper.java
C:\Users\belak\Documents\NetBeansProjects\NewProjects\ShortTermJobs\src\main\java\com\bh10\project\shorttermjobs\servlet\EditProfileServlet.java
C:\Users\belak\Documents\NetBeansProjects\NewProjects\ShortTermJobs\src\main\java\com\bh10\project\shorttermjobs\dao\ReportDAO.java
C:\Users\belak\Documents\NetBeansProjects\NewProjects\ShortTermJobs\src\main\java\com\bh10\project\shorttermjobs\servlet\ReportServlet.java
C:\Users\belak\Documents\NetBeansProjects\NewProjects\ShortTermJobs\src\main\java\com\bh10\project\shorttermjobs\entity\ReviewEntity.java
C:\Users\belak\Documents\NetBeansProjects\NewProjects\ShortTermJobs\src\main\java\com\bh10\project\shorttermjobs\dto\EmployerDataDto.java
C:\Users\belak\Documents\NetBeansProjects\NewProjects\ShortTermJobs\src\main\java\com\bh10\project\shorttermjobs\servlet\ReportAdvertisementServlet.java
C:\Users\belak\Documents\NetBeansProjects\NewProjects\ShortTermJobs\src\main\java\com\bh10\project\shorttermjobs\servlet\FileUploadHandlerServlet.java
C:\Users\belak\Documents\NetBeansProjects\NewProjects\ShortTermJobs\src\main\java\com\bh10\project\shorttermjobs\entity\GroupEntity.java
C:\Users\belak\Documents\NetBeansProjects\NewProjects\ShortTermJobs\src\main\java\com\bh10\project\shorttermjobs\dao\JobApplicantDataDAO.java
C:\Users\belak\Documents\NetBeansProjects\NewProjects\ShortTermJobs\src\main\java\com\bh10\project\shorttermjobs\service\GroupService.java
C:\Users\belak\Documents\NetBeansProjects\NewProjects\ShortTermJobs\src\main\java\com\bh10\project\shorttermjobs\mapper\SoftSkillMapper.java
C:\Users\belak\Documents\NetBeansProjects\NewProjects\ShortTermJobs\src\main\java\com\bh10\project\shorttermjobs\entity\AdvertisementEntity.java
C:\Users\belak\Documents\NetBeansProjects\NewProjects\ShortTermJobs\src\main\java\com\bh10\project\shorttermjobs\entity\SoftSkillEntity.java
C:\Users\belak\Documents\NetBeansProjects\NewProjects\ShortTermJobs\src\main\java\com\bh10\project\shorttermjobs\servlet\AdvertisementServlet.java
C:\Users\belak\Documents\NetBeansProjects\NewProjects\ShortTermJobs\src\main\java\com\bh10\project\shorttermjobs\servlet\LogoutServlet.java
C:\Users\belak\Documents\NetBeansProjects\NewProjects\ShortTermJobs\src\main\java\com\bh10\project\shorttermjobs\dto\StjUserDto.java
C:\Users\belak\Documents\NetBeansProjects\NewProjects\ShortTermJobs\src\main\java\com\bh10\project\shorttermjobs\dto\EducationDto.java
C:\Users\belak\Documents\NetBeansProjects\NewProjects\ShortTermJobs\src\main\java\com\bh10\project\shorttermjobs\dao\UserTypeDAO.java
C:\Users\belak\Documents\NetBeansProjects\NewProjects\ShortTermJobs\src\main\java\com\bh10\project\shorttermjobs\dao\ApplicationDAO.java
C:\Users\belak\Documents\NetBeansProjects\NewProjects\ShortTermJobs\src\main\java\com\bh10\project\shorttermjobs\entity\ExperienceEntity.java
C:\Users\belak\Documents\NetBeansProjects\NewProjects\ShortTermJobs\src\main\java\com\bh10\project\shorttermjobs\servlet\CheckMyApplicationsServlet.java
C:\Users\belak\Documents\NetBeansProjects\NewProjects\ShortTermJobs\src\main\java\com\bh10\project\shorttermjobs\dto\TestDto.java
C:\Users\belak\Documents\NetBeansProjects\NewProjects\ShortTermJobs\src\main\java\com\bh10\project\shorttermjobs\dao\ExperienceDAO.java
C:\Users\belak\Documents\NetBeansProjects\NewProjects\ShortTermJobs\src\main\java\com\bh10\project\shorttermjobs\dao\EducationDAO.java
C:\Users\belak\Documents\NetBeansProjects\NewProjects\ShortTermJobs\src\main\java\com\bh10\project\shorttermjobs\exception\UserAlreadyAppliedException.java
C:\Users\belak\Documents\NetBeansProjects\NewProjects\ShortTermJobs\src\main\java\com\bh10\project\shorttermjobs\dao\HardSkillDAO.java
C:\Users\belak\Documents\NetBeansProjects\NewProjects\ShortTermJobs\src\main\java\com\bh10\project\shorttermjobs\mapper\JobApplicantDataMapper.java
C:\Users\belak\Documents\NetBeansProjects\NewProjects\ShortTermJobs\src\main\java\com\bh10\project\shorttermjobs\dto\ExperienceDto.java
C:\Users\belak\Documents\NetBeansProjects\NewProjects\ShortTermJobs\src\main\java\com\bh10\project\shorttermjobs\exception\UserHasNoApplicationException.java
C:\Users\belak\Documents\NetBeansProjects\NewProjects\ShortTermJobs\src\main\java\com\bh10\project\shorttermjobs\dto\JobApplicantDataDto.java
C:\Users\belak\Documents\NetBeansProjects\NewProjects\ShortTermJobs\src\main\java\com\bh10\project\shorttermjobs\dao\EmployerDataDAO.java
C:\Users\belak\Documents\NetBeansProjects\NewProjects\ShortTermJobs\src\main\java\com\bh10\project\shorttermjobs\service\UserTypeService.java
C:\Users\belak\Documents\NetBeansProjects\NewProjects\ShortTermJobs\src\main\java\com\bh10\project\shorttermjobs\mapper\EmployerDataMapper.java
C:\Users\belak\Documents\NetBeansProjects\NewProjects\ShortTermJobs\src\main\java\com\bh10\project\shorttermjobs\entity\StjUserEntity.java
C:\Users\belak\Documents\NetBeansProjects\NewProjects\ShortTermJobs\src\main\java\com\bh10\project\shorttermjobs\servlet\EditCompanyProfileServlet.java
C:\Users\belak\Documents\NetBeansProjects\NewProjects\ShortTermJobs\src\main\java\com\bh10\project\shorttermjobs\dto\ApplicationDto.java
C:\Users\belak\Documents\NetBeansProjects\NewProjects\ShortTermJobs\src\main\java\com\bh10\project\shorttermjobs\dto\ReviewDto.java
C:\Users\belak\Documents\NetBeansProjects\NewProjects\ShortTermJobs\src\main\java\com\bh10\project\shorttermjobs\service\AdvertisementService.java
C:\Users\belak\Documents\NetBeansProjects\NewProjects\ShortTermJobs\src\main\java\com\bh10\project\shorttermjobs\servlet\ProfileServlet.java
C:\Users\belak\Documents\NetBeansProjects\NewProjects\ShortTermJobs\src\main\java\com\bh10\project\shorttermjobs\mapper\HardSkillMapper.java
C:\Users\belak\Documents\NetBeansProjects\NewProjects\ShortTermJobs\src\main\java\com\bh10\project\shorttermjobs\exception\UserAlreadyReportedThisException.java
C:\Users\belak\Documents\NetBeansProjects\NewProjects\ShortTermJobs\src\main\java\com\bh10\project\shorttermjobs\entity\TestEntity.java
C:\Users\belak\Documents\NetBeansProjects\NewProjects\ShortTermJobs\src\main\java\com\bh10\project\shorttermjobs\dao\AdvertisementDAO.java
C:\Users\belak\Documents\NetBeansProjects\NewProjects\ShortTermJobs\src\main\java\com\bh10\project\shorttermjobs\entity\ReportEntity.java
C:\Users\belak\Documents\NetBeansProjects\NewProjects\ShortTermJobs\src\main\java\com\bh10\project\shorttermjobs\entity\HardSkillEntity.java
C:\Users\belak\Documents\NetBeansProjects\NewProjects\ShortTermJobs\src\main\java\com\bh10\project\shorttermjobs\entity\UserTypeEntity.java
C:\Users\belak\Documents\NetBeansProjects\NewProjects\ShortTermJobs\src\main\java\com\bh10\project\shorttermjobs\entity\JobApplicantDataEntity.java
C:\Users\belak\Documents\NetBeansProjects\NewProjects\ShortTermJobs\src\main\java\com\bh10\project\shorttermjobs\mapper\ExperienceMapper.java
C:\Users\belak\Documents\NetBeansProjects\NewProjects\ShortTermJobs\src\main\java\com\bh10\project\shorttermjobs\servlet\DisplayImageServlet.java
C:\Users\belak\Documents\NetBeansProjects\NewProjects\ShortTermJobs\src\main\java\com\bh10\project\shorttermjobs\entity\EmployerDataEntity.java
C:\Users\belak\Documents\NetBeansProjects\NewProjects\ShortTermJobs\src\main\java\com\bh10\project\shorttermjobs\mapper\ApplicationMapper.java
C:\Users\belak\Documents\NetBeansProjects\NewProjects\ShortTermJobs\src\main\java\com\bh10\project\shorttermjobs\dto\AdvertisementDto.java
C:\Users\belak\Documents\NetBeansProjects\NewProjects\ShortTermJobs\src\main\java\com\bh10\project\shorttermjobs\service\ProfileService.java
C:\Users\belak\Documents\NetBeansProjects\NewProjects\ShortTermJobs\src\main\java\com\bh10\project\shorttermjobs\dto\SoftSkillDto.java
C:\Users\belak\Documents\NetBeansProjects\NewProjects\ShortTermJobs\src\main\java\com\bh10\project\shorttermjobs\servlet\MyAdvertisementsServlet.java
