{
  "properties": [
    {
      "name": "app.endpoint.cmc.url",
      "type": "java.lang.String",
      "description": "Description for app.endpoint.cmc.url."
    },
    {
      "name": "app.endpoint.cmc.auth-header",
      "type": "java.lang.String",
      "description": "Description for app.endpoint.cmc.auth-header."
    },
    {
      "name": "app.endpoint.cmc.auth-header-value",
      "type": "java.lang.String",
      "description": "Description for app.endpoint.cmc.auth-header-value."
    },
    {
      "name": "app.endpoint.cmc.quotes-path",
      "type": "java.lang.String",
      "description": "Description for app.endpoint.cmc.quotes-path."
    }
  ] }