<svg xmlns="http://www.w3.org/2000/svg" viewBox="0 0 65 65">
  <path d="M56.997 21.9c-2.9 0-5.3 2.4-5.3 5.3v7.1c-1.2-.1-2.4.3-3.3 1.1l-2 2-8.5-14.9c-.2-.3-.5-.5-.9-.5s-.7.2-.9.5l-3.3 5.8V24v-6.7l2.6-2.6c7.1-.3 12.8-6.1 12.8-13.2 0-.6-.4-1-1-1-7.1 0-12.9 5.7-13.2 12.7l-1.2 1.2v-.9c0-.6-.4-1-1-1s-1 .4-1 1v7.9l-1.1-1.1c-.1-3.4-1.5-6.5-3.8-8.9-2.5-2.5-5.8-3.9-9.3-3.9-.6 0-1 .4-1 1 0 7.1 5.7 12.9 12.7 13.2l2.6 2.6v4.9l-2.4-3c-.2-.2-.5-.4-.8-.4-.3 0-.6.2-.8.4l-8.2 11.3-2-2c-.9-.9-2.1-1.3-3.3-1.1v-7.1c0-2.9-2.4-5.3-5.3-5.3-1.4 0-2.6 1.2-2.6 2.6v21c0 1.1.3 2.2 1 3.1 2.4 3.7 3.5 4.4 3.5 6.2v1.3h-.5c-1.1 0-2 .9-2 2v4.3c0 1.1.9 2 2 2h18.6c1.1 0 2-.9 2-2V58c0-1.1-.9-2-2-2h-.4c-.3-2.9 1.3-8.3-3.3-12.9l-4.3-4.3 7.6-10.5 3.4 4.2c.2.3.5.4.9.4.3 0 .6-.2.8-.5l4.3-7.5 7.9 13.9c-2.6 3.2-7.6 5.6-7.6 12.3V56h-.4c-1.1 0-2 .9-2 2v4.5c0 1.1.9 2 2 2h18.5c1.1 0 2-.9 2-2V58c0-1.1-.9-2-2-2h-.4c.1-.8-.2-2 .6-3.3l2.8-4.2c.6-.9 1-2 1-3.1V24.5c.1-1.4-1.1-2.6-2.5-2.6zm-17.7-16.1c1.9-1.9 4.3-3 6.9-3.2-.4 4.7-3.9 8.6-8.4 9.8l4-4c.4-.4.4-1 0-1.4-.4-.4-1-.4-1.4 0l-4 4c.4-2 1.4-3.8 2.9-5.2zm-21.7 3.7c4.7.4 8.6 3.9 9.8 8.4l-4-4c-.4-.4-1-.4-1.4 0-.4.4-.4 1 0 1.4l4 4c-4.5-1.1-8-5-8.4-9.8zm10.5 53v1zm-.1 0h-18.5v-4.4h18.6v4.4zm-2.3-6.4h-13.9v-1.3c0-2.7-1.7-3.8-3.8-7.3-.4-.6-.6-1.3-.6-2v-21c0-.3.3-.6.6-.6 1.8 0 3.3 1.5 3.3 3.3v7.9c-1.9 1.5-2.1 4.3-.4 5.9l2.9 2.9c.4.4 1 .4 1.4 0 .4-.4.4-1 0-1.4-2.4-2.6-3.5-2.9-3.5-4.3 0-1.8 2.1-2.6 3.4-1.4l7.7 7.8c4 3.9 2.6 8.3 2.9 11.5zm29.8 6.4v1zm0 0h-18.6v-4.4h18.6zm2.1-17c0 .7-.2 1.4-.6 2l-2.8 4.2c-1.3 1.9-.9 3.6-1 4.4h-13.9v-4.9c0-6 4.7-7.9 10.5-14.3 1.8-1.8 4.6.9 2.8 2.8l-2.9 2.8c-.4.4-.4 1 0 1.4.4.4 1 .4 1.4 0l2.9-2.9c1.7-1.7 1.5-4.5-.4-5.9v-7.9c0-1.8 1.5-3.3 3.3-3.3.3 0 .6.3.6.6v21z"/>
  <path d="M37.497 38.4c.2.3.5.5.8.5.2 0 .4-.1.5-.2.5-.3.6-.9.3-1.4l-1.9-2.9c-.3-.5-.9-.6-1.4-.3-.5.3-.6.9-.3 1.4zM27.097 36.5l-1.9 2.9c-.3.5-.2 1.1.3 1.4.2.1.4.2.5.2.3 0 .7-.2.8-.5l1.9-2.9c.3-.5.2-1.1-.3-1.4-.4-.3-1-.1-1.3.3zM41.597 59.3h-1c-.6 0-1 .4-1 1s.4 1 1 1h1c.6 0 1-.4 1-1s-.4-1-1-1zM24.397 59.3h-1c-.6 0-1 .4-1 1s.4 1 1 1h1c.6 0 1-.4 1-1s-.5-1-1-1z"/>
</svg>