<svg xmlns="http://www.w3.org/2000/svg" viewBox="0 0 65 65">
  <g data-name="13 Prototyping">
    <path d="M61.098 16.3l.268-.463a1 1 0 000-1.008 6.163 6.163 0 00-1.468-1.681v-1.3a6.163 6.163 0 001.462-1.685 1 1 0 000-1.007l-1.34-2.32a1.034 1.034 0 00-.883-.5 6.234 6.234 0 00-2.183.423l-1.123-.65a6.352 6.352 0 00-.723-2.1 1 1 0 00-.87-.509h-2.68a1 1 0 00-.873.513 6.321 6.321 0 00-.724 2.1l-1.123.65a6.234 6.234 0 00-2.183-.423 1.063 1.063 0 00-.883.5l-1.34 2.32a1 1 0 00.011 1.02 6.313 6.313 0 001.455 1.668v1.3a6.313 6.313 0 00-1.455 1.668.991.991 0 00-.124.68h-3.663c-.009-.111-.013-.228-.027-.333a1 1 0 00-.493-.734l-2.28-1.31a1 1 0 00-.863-.064 6.387 6.387 0 00-1.879 1.153l-1.474-.4a6.47 6.47 0 00-1.03-1.927 1 1 0 00-.792-.381h-2.64a1 1 0 00-.792.389 6.47 6.47 0 00-1.03 1.927l-1.474.4a6.387 6.387 0 00-1.879-1.153 1 1 0 00-.863.064l-2.28 1.31a1 1 0 00-.493.734c-.014.105-.018.222-.027.333h-8.842V11.5a2 2 0 00-2-2h-2a4 4 0 00-4 4v44a.189.189 0 000 .023v.033a4.283 4.283 0 004.17 3.944h51.83a2 2 0 002-2v-42a1.98 1.98 0 00-.4-1.2zm-13.942-6.014a2.76 2.76 0 01-.676-.674l.709-1.227a3.162 3.162 0 01.887.216 1 1 0 001.243.195l2.16-1.25a.952.952 0 00.463-1.124 2.764 2.764 0 01.246-.922h1.421a3.056 3.056 0 01.255.879 1 1 0 00.453 1.167l2.16 1.25a.946.946 0 001.209-.163 2.8 2.8 0 01.922-.247l.71 1.23a3.083 3.083 0 01-.633.657 1 1 0 00-.787.977v2.5a.948.948 0 00.743.964 2.755 2.755 0 01.676.67l-.384.664-.325.563a3.117 3.117 0 01-.886-.215 1 1 0 00-1.243-.195l-2.16 1.25a.951.951 0 00-.463 1.124 2.733 2.733 0 01-.248.925h-1.421a3.094 3.094 0 01-.255-.88 1 1 0 00-.453-1.166l-2.16-1.25a.949.949 0 00-1.21.164 2.756 2.756 0 01-.92.246L46.834 16l-.354-.612a3.123 3.123 0 01.631-.66 1 1 0 00.787-.977v-2.5a.948.948 0 00-.742-.965zM23.69 15.113a3.417 3.417 0 01.876.6 1 1 0 001.191.6l2.76-.74a.957.957 0 00.732-1.073 3.1 3.1 0 01.453-1h1.596a3.444 3.444 0 01.455.954 1 1 0 00.729 1.122l2.76.74a.955.955 0 001.174-.566 3.041 3.041 0 01.893-.636l1.38.792a5.127 5.127 0 01-.005.525 2.631 2.631 0 01-.084.547 1 1 0 00.083 1.319l2.02 2.02a.957.957 0 001.3.1 3.059 3.059 0 011.094-.1l.793 1.38a3.417 3.417 0 01-.6.876 1 1 0 00-.6 1.191l.74 2.76a.96.96 0 001.068.727 3.1 3.1 0 011 .453V29.3a3.444 3.444 0 01-.954.455 1 1 0 00-1.122.729l-.541 2.016h-5.459a8.246 8.246 0 001.076-4 8 8 0 00-16 0 8.256 8.256 0 001.076 4h-5.459l-.541-2.019a.958.958 0 00-1.076-.732 3.1 3.1 0 01-1-.453V27.7a3.444 3.444 0 01.954-.455 1 1 0 001.122-.729l.74-2.76a.96.96 0 00-.566-1.174 3.041 3.041 0 01-.636-.893l.792-1.38a3.439 3.439 0 011.059.079 1 1 0 001.332-.074l2.02-2.02a.963.963 0 00.1-1.293 1.718 1.718 0 01-.1-.573 5.129 5.129 0 010-.525zM26.041 32.5a6 6 0 118.914 0zm-20.543-19a2 2 0 012-2h2v42h-2a4.108 4.108 0 00-2 .537zm54 46H7.668a2.254 2.254 0 01-2.17-2 2 2 0 012-2h2a2 2 0 002-2v-36h8.786l-.936.936a6.531 6.531 0 00-2.183-.067 1 1 0 00-.734.493l-1.31 2.28a1 1 0 00-.064.863 6.387 6.387 0 001.153 1.879l-.4 1.474a6.47 6.47 0 00-1.927 1.03 1 1 0 00-.385.792v2.64a1 1 0 00.389.792 6.47 6.47 0 001.927 1.03l.231.858h-1.547a1 1 0 000 2h42a1 1 0 000-2H44.951l.231-.858a6.47 6.47 0 001.927-1.03 1 1 0 00.389-.792v-2.64a1 1 0 00-.389-.792 6.47 6.47 0 00-1.927-1.03l-.4-1.474a6.387 6.387 0 001.153-1.879 1 1 0 00-.064-.863l-1.31-2.28a1 1 0 00-.734-.493 6.5 6.5 0 00-2.183.067l-.932-.936h4.679l.381.66a1.023 1.023 0 00.883.5 6.234 6.234 0 002.183-.423l1.123.65a6.321 6.321 0 00.724 2.1 1 1 0 00.873.513h2.68a1 1 0 00.874-.513 6.352 6.352 0 00.723-2.1l1.123-.65a6.234 6.234 0 002.183.423.978.978 0 00.323-.054c.011 0 .023 0 .034-.005z"/>
    <path d="M53.003 49.633a.989.989 0 01.495-.133h3a1 1 0 00.944-1.329 7.584 7.584 0 00-6.944-4.671 6.95 6.95 0 00-5 2.1 2.948 2.948 0 01-2.133.9H15.498v-1a1 1 0 00-2 0v10a1 1 0 002 0v-1h27.87a3 3 0 012.137.9 6.947 6.947 0 004.993 2.1 7.588 7.588 0 006.944-4.671 1 1 0 00-.944-1.329h-2.89a1.228 1.228 0 01-.608-.165.966.966 0 01-.486-.664.982.982 0 01.489-1.038zm-2.461 1.374A2.962 2.962 0 0052 53.067a3.227 3.227 0 001.608.433h1.179a5.657 5.657 0 01-2.614 1.724 5.148 5.148 0 01-1.675.276 4.963 4.963 0 01-3.563-1.5 5.006 5.006 0 00-3.567-1.5h-27.87v-4h27.87a4.933 4.933 0 003.564-1.5 5.086 5.086 0 015.266-1.218 5.632 5.632 0 012.59 1.718h-1.29a3 3 0 00-2.956 3.507zM33.498 39.5h6a1 1 0 000-2h-6a1 1 0 000 2zM18.498 43.5h5a1 1 0 000-2h-5a1 1 0 000 2zM39.498 41.5h-12a1 1 0 000 2h12a1 1 0 000-2zM18.498 39.5h11a1 1 0 000-2h-11a1 1 0 000 2z"/>
  </g>
</svg>