<svg xmlns="http://www.w3.org/2000/svg" data-name="Layer 1" viewBox="0 0 50 50">
  <path d="M48.734 28.024a3.128 3.128 0 00-3.965-1.465 4.947 4.947 0 00-3.073-2 5.087 5.087 0 00-3.01.263 4.583 4.583 0 00-.45-.61 5.568 5.568 0 00-3.1-1.767 18.658 18.658 0 00-1.468-8.032 3.034 3.034 0 00.418-2.173 5.809 5.809 0 00-2.917-3.97c-4.126-2.709-9.712-.688-9.948-.6a.75.75 0 00-.011 1.4 7.358 7.358 0 012.689 1.923 10.508 10.508 0 01.637.967 8.253 8.253 0 003.2 3.41 6.149 6.149 0 002.646.642 4.787 4.787 0 001.8-.343 3.21 3.21 0 00.32-.164 17.539 17.539 0 011.13 6.856 4.825 4.825 0 00-4.22 2.437 3.744 3.744 0 00-3.152.372c-1.845-1-3.642-1.937-4.657-2.36a5.4 5.4 0 00-3.827.038L8.049 27.13l-.688-1.56a.749.749 0 00-.988-.385l-4.926 2.17a.75.75 0 00-.385.988L7.379 42.69a.748.748 0 00.988.384l4.926-2.17a.749.749 0 00.385-.989l-.84-1.907 4.055-1.785 10.779 3.811a3.318 3.318 0 002.359-.049c1.7-.684 5.415-2.243 11.253-5a69.147 69.147 0 006.27-3.42 2.668 2.668 0 001.18-3.54zM28.38 14.014a6.976 6.976 0 01-2.57-2.839 11.228 11.228 0 00-.742-1.118 7.331 7.331 0 00-1.581-1.439c1.8-.348 4.64-.55 6.859.905a4.337 4.337 0 012.262 2.995 1.575 1.575 0 01-.99 1.76 3.943 3.943 0 01-3.238-.265zm1.042 12.452a.75.75 0 001.167-.5c.118-.732 1-2.12 3.475-2.134h.025a3.943 3.943 0 013.452 1.952.75.75 0 001.175.72 3.416 3.416 0 012.672-.482 3.543 3.543 0 011.91 1.067c-.943.348-1.98.711-4.438 1.442-1.721.512-4.064 1.088-5.137 1.346a3.1 3.1 0 00-1.256-1.233c-.17-.095-2.17-1.242-4.47-2.522a2.169 2.169 0 011.425.344zM8.449 41.402L2.737 28.425 6.29 26.86l4.872 11.065.836 1.91zm38.3-11.1a68.906 68.906 0 01-6.107 3.332c-5.8 2.735-9.493 4.282-11.174 4.961a1.85 1.85 0 01-1.3.025l-11.06-3.91a.754.754 0 00-.551.02l-4.327 1.905-3.577-8.133 9.727-4.283a3.928 3.928 0 012.645-.027c2.544 1.06 10.608 5.7 10.719 5.766a1.648 1.648 0 01.654 2.318 1.659 1.659 0 01-2.047.67l-5.418-2.262a.75.75 0 10-.58 1.383l5.419 2.263a3.105 3.105 0 001.2.24 3.122 3.122 0 003.15-3.25c1.11-.267 3.436-.84 5.16-1.354 2.89-.859 3.857-1.22 4.976-1.637l.843-.312c.67-.246 1.876-.3 2.25.586a1.205 1.205 0 01-.6 1.7z"/>
  <path d="M36.553 18.33a3.778 3.778 0 001.464.29 4.81 4.81 0 002.024-.478 6.342 6.342 0 002.516-2.6 7.6 7.6 0 01.47-.7 5.333 5.333 0 011.957-1.36.751.751 0 00.005-1.4c-.18-.07-4.44-1.666-7.637.378a4.528 4.528 0 00-2.3 3.071 2.51 2.51 0 001.5 2.8zm-.036-2.5a3.083 3.083 0 011.642-2.107 5.675 5.675 0 013.076-.8 9.459 9.459 0 011.51.13 5.3 5.3 0 00-.877.841 8.618 8.618 0 00-.581.851 5.094 5.094 0 01-1.873 2.036 2.779 2.779 0 01-2.281.167.994.994 0 01-.616-1.12zM29.799 10.512a11.459 11.459 0 00-2.56-1.333l-.213-.086a.75.75 0 00-.562 1.391l.22.088a10 10 0 012.253 1.17 7.584 7.584 0 011.463 1.36.752.752 0 001.2-.908 9.243 9.243 0 00-1.801-1.682z"/>
</svg>