<svg xmlns="http://www.w3.org/2000/svg" viewBox="0 0 1000 1000">
  <defs/>
  <path d="M213.147 608.158a76.113 76.113 0 01-.427 7.24c.523-4.965.054-.658-.117.323-.222 1.27-.505 2.525-.787 3.781-.578 2.572-1.333 5.103-2.138 7.611-.41 1.277-.874 2.536-1.338 3.795-.317.842-.647 1.68-.988 2.513.893-2.097.941-2.245.145-.446-2.23 4.951-4.974 9.661-8.02 14.151-.418.614-3.143 4.255-.439.765-.81 1.045-1.669 2.05-2.53 3.052-1.964 2.29-4.12 4.403-6.36 6.42-.646.58-4.045 3.222-.356.423-.98.744-2.009 1.421-3.038 2.096-1.013.664-2.07 1.253-3.129 1.84-.853.474-4.637 2.165-.122.262-2.158.91-4.42 1.533-6.702 2.038-4.012.888 4.142-.348.04.005-1.56.135-3.127.081-4.687 0-4.112-.212 4.076.753.04-.005-1.146-.215-2.267-.539-3.386-.86-1.127-.326-2.223-.753-3.316-1.178 4.508 1.75.788.212-.12-.262-2.166-1.129-4.193-2.506-6.167-3.936 3.724 2.697.321.162-.356-.424-1.294-1.117-2.508-2.325-3.71-3.539-1.848-1.867-3.539-3.884-5.18-5.932 2.752 3.435-.005-.146-.438-.765-.776-1.105-1.5-2.246-2.224-3.386-1.459-2.294-2.764-4.683-4.018-7.094-.628-1.207-1.204-2.439-1.78-3.672-.796-1.799-.749-1.65.144.446a98.41 98.41 0 01-.988-2.513c-1.892-4.916-3.273-10.019-4.263-15.188-.184-.959-.73-5.304-.118-.324-.15-1.216-.235-2.438-.319-3.66-.209-3.05-.097-6.106.165-9.148-.394 4.572.012.117.176-.763.247-1.328.59-2.637.932-3.943.34-1.295.772-2.563 1.204-3.83 1.455-4.268-1.6 3.356.245-.733 1.084-2.402 2.42-4.682 3.828-6.903.42-.663 3.052-4.245.32-.71 1.066-1.38 2.242-2.67 3.43-3.943 1.784-1.913 3.762-3.633 5.791-5.278-3.447 2.795.035.131.71-.319 1.093-.729 2.236-1.382 3.377-2.032 1.146-.653 2.337-1.225 3.526-1.796 4.047-1.942-3.498 1.312.733-.245 2.953-1.086 6.024-1.81 9.111-2.384 1.99-.314 1.797-.29-.576.072.92-.09 1.843-.158 2.767-.204 1.866-.114 3.738-.068 5.605 0 .924.046 1.846.114 2.767.204-2.373-.363-2.565-.387-.575-.072 1.782.286 3.536.723 5.281 1.181 1.725.452 3.41 1.048 5.081 1.663-4.346-1.599.99.518 1.85.956 1.563.796 3.057 1.72 4.536 2.657.733.476 1.454.97 2.164 1.48-3.6-2.526-.085-.039.56.51 2.657 2.258 5.015 4.846 7.207 7.55-2.905-3.583.532 1.046 1.023 1.82.94 1.482 1.756 3.04 2.553 4.603.391.79.763 1.59 1.116 2.397-.902-2.145-1.002-2.302-.3-.473.618 1.678 1.092 3.404 1.545 5.133.46 1.753.77 3.54 1.055 5.327-.76-4.744-.029 2.477-.015 3.646.117 9.538 7.872 17.5 17.5 17.5 9.451 0 17.617-7.96 17.5-17.5-.33-26.906-14.978-52.033-38.779-64.872-23.768-12.82-54.256-11.42-76.44 4.137-21.793 15.284-34.465 41.285-31.653 67.975 2.616 24.834 14.11 49.871 32.826 66.714 11.043 9.938 24.296 16.204 39.222 16.976 15.264.79 29.245-6.727 40.615-16.148 21.023-17.419 33.934-47.766 34.21-74.78.096-9.54-8.035-17.5-17.5-17.5-9.614-.002-17.404 7.96-17.5 17.498zm56.4 171.098v44.904l17.5-17.5H61.948l17.5 17.5v-44.649c0-1.018.03-2.03.066-3.048.044-.92.11-1.84.198-2.759.387-4.638-.667 3.79.15-.75.318-1.767.781-3.503 1.263-5.229.3-1.07 2.871-7.589.992-3.285.876-2.008 1.935-3.93 3.034-5.823.542-.935 4.572-6.559 1.72-2.896 2.403-3.085 5.212-5.832 8.18-8.366 1.496-1.212 1.344-1.1-.457.333 1.05-.779 2.148-1.487 3.247-2.193 1.84-1.184 3.783-2.196 5.744-3.162 1.774-.807 1.591-.746-.55.18a56.655 56.655 0 012.488-.92c2.104-.75 4.272-1.3 6.447-1.799.883-.19 1.77-.362 2.66-.512-4.572.824-.1.05.79-.024 1.501-.126 3.014-.149 4.52-.149h13.127l-12.375-5.126 41.601 46.782c6.057 6.812 18.7 6.86 24.75 0l41.253-46.782-12.375 5.126h13.383c1.887 0 3.762.106 5.641.264 2.017.224 1.821.193-.584-.09 1.336.208 2.656.511 3.974.813 2.171.498 4.29 1.197 6.385 1.944 4.235 1.51-3.372-1.59.688.294 1.192.554 2.344 1.188 3.495 1.821 1.91 1.052 3.72 2.274 5.497 3.534-3.743-2.654 1.63 1.498 2.456 2.27 1.586 1.482 3.035 3.104 4.443 4.754 2.874 3.364-2.14-3.006.422.607.756 1.067 1.44 2.184 2.121 3.3 1.143 1.868 2.113 3.837 3.034 5.822-1.963-4.229.66 2.192.992 3.285.655 2.15 1.105 4.355 1.503 6.564-.824-4.572-.049-.1.025.79.12 1.387.135 2.782.151 4.175.114 9.538 7.875 17.5 17.5 17.5 9.454 0 17.614-7.96 17.5-17.5-.313-26.252-13.725-49.834-35.728-63.984-10.9-7.01-23.812-10.334-36.63-11.099-6.473-.386-14.634-1.17-20.917.56-6.13 1.686-9.51 6.527-13.443 10.987l-14.248 16.157-21.285 24.138h24.75l-22.79-25.628-14.4-16.193c-4.897-5.508-8.988-10.087-17.532-10.087-8.638 0-17.075-.122-25.65 1.215-13.31 2.073-24.862 8.281-35.36 16.46-17.879 13.93-26.865 37.011-26.865 59.193v43.186c0 9.54 7.96 17.5 17.5 17.5h225.1c9.54 0 17.5-7.96 17.5-17.5v-44.904c0-9.54-7.96-17.5-17.5-17.5s-17.502 7.96-17.502 17.5zm594.601-171.098a76.113 76.113 0 01-.427 7.24c.523-4.965.055-.658-.117.323-.222 1.27-.505 2.525-.787 3.781-.578 2.572-1.333 5.103-2.138 7.611-.41 1.277-.875 2.536-1.339 3.795a94.81 94.81 0 01-.987 2.513c.893-2.097.94-2.245.145-.446-2.23 4.951-4.975 9.661-8.022 14.151-.416.614-3.142 4.255-.438.765-.81 1.045-1.67 2.05-2.53 3.052-1.964 2.29-4.12 4.403-6.36 6.42-.645.58-4.045 3.222-.355.423-.98.744-2.01 1.421-3.038 2.096-1.012.664-2.07 1.253-3.128 1.84-.854.474-4.637 2.165-.122.262-2.157.91-4.42 1.533-6.7 2.038-4.013.888 4.141-.348.04.005-1.56.135-3.128.081-4.689 0-4.11-.212 4.076.753.041-.005-1.146-.215-2.268-.539-3.386-.86-1.128-.326-2.224-.753-3.316-1.178 4.508 1.75.788.212-.12-.262-2.166-1.129-4.193-2.506-6.167-3.936 3.724 2.697.321.162-.356-.424-1.294-1.117-2.508-2.325-3.71-3.539-1.848-1.867-3.539-3.884-5.18-5.932 2.752 3.435-.005-.146-.438-.765-.775-1.105-1.5-2.246-2.224-3.386-1.459-2.294-2.764-4.683-4.018-7.094-.628-1.207-1.204-2.439-1.78-3.672-.797-1.799-.748-1.65.145.446a91.514 91.514 0 01-.988-2.513c-1.892-4.916-3.272-10.019-4.264-15.188-.184-.959-.73-5.304-.117-.324-.15-1.216-.235-2.438-.319-3.66-.209-3.05-.097-6.106.165-9.148-.394 4.572.013.117.176-.763.247-1.328.59-2.637.933-3.943.34-1.295.771-2.563 1.204-3.83 1.454-4.268-1.602 3.356.245-.733 1.083-2.402 2.418-4.682 3.827-6.903.421-.663 3.053-4.245.32-.71 1.066-1.38 2.242-2.67 3.431-3.943 1.783-1.913 3.761-3.633 5.79-5.278-3.447 2.795.035.131.711-.319 1.093-.729 2.235-1.382 3.377-2.032 1.146-.653 2.337-1.225 3.525-1.796 4.048-1.942-3.498 1.312.733-.245 2.952-1.086 6.023-1.81 9.111-2.384 1.99-.314 1.798-.29-.576.072.921-.09 1.843-.158 2.767-.204 1.867-.114 3.738-.068 5.605 0 .924.046 1.846.114 2.767.204-2.373-.363-2.565-.387-.575-.072 1.782.286 3.536.723 5.28 1.181 1.726.452 3.41 1.048 5.081 1.663-4.346-1.599.99.518 1.85.956 1.563.796 3.057 1.72 4.536 2.657.732.476 1.454.97 2.163 1.48-3.6-2.526-.085-.039.56.51 2.657 2.258 5.017 4.846 7.21 7.55-2.906-3.583.531 1.046 1.021 1.82.94 1.482 1.757 3.04 2.553 4.603.392.79.764 1.59 1.116 2.397-.9-2.145-1-2.302-.299-.473.617 1.678 1.092 3.404 1.545 5.133.46 1.753.77 3.54 1.056 5.327-.766-4.744-.034 2.477-.019 3.646.117 9.538 7.872 17.5 17.5 17.5 9.451 0 17.617-7.96 17.5-17.5-.33-26.906-14.979-52.033-38.779-64.872-23.768-12.82-54.256-11.42-76.439 4.137-21.793 15.284-34.465 41.285-31.653 67.975 2.616 24.834 14.11 49.871 32.826 66.714 11.043 9.938 24.296 16.204 39.222 16.976 15.264.79 29.244-6.727 40.615-16.148 21.023-17.419 33.934-47.766 34.21-74.78.096-9.54-8.035-17.5-17.5-17.5-9.616-.002-17.406 7.96-17.502 17.498zm56.4 171.098v44.904l17.5-17.5H712.95l17.5 17.5v-44.649c0-1.018.03-2.03.066-3.048.044-.92.11-1.84.197-2.759.388-4.638-.667 3.79.15-.75.318-1.767.781-3.503 1.264-5.229.3-1.07 2.871-7.589.992-3.285.876-2.008 1.935-3.93 3.034-5.823.542-.935 4.572-6.559 1.72-2.896 2.402-3.085 5.212-5.832 8.18-8.366 1.496-1.212 1.344-1.1-.457.333 1.05-.779 2.148-1.487 3.247-2.193 1.84-1.184 3.783-2.196 5.744-3.162 1.774-.807 1.591-.746-.55.18a56.655 56.655 0 012.488-.92c2.104-.75 4.272-1.3 6.447-1.799.883-.19 1.77-.362 2.66-.512-4.572.823-.1.05.79-.024 1.501-.126 3.014-.149 4.521-.149h13.127l-12.374-5.126c13.866 15.595 27.733 31.188 41.601 46.782 6.057 6.812 18.7 6.86 24.748 0l41.254-46.782-12.374 5.126h13.382c1.887 0 3.762.106 5.642.264 2.016.224 1.821.193-.585-.09 1.337.208 2.656.511 3.974.813 2.171.498 4.29 1.197 6.386 1.944 4.234 1.51-3.373-1.59.688.294 1.191.554 2.344 1.188 3.494 1.821 1.91 1.052 3.721 2.274 5.497 3.534-3.743-2.654 1.63 1.498 2.456 2.27 1.586 1.482 3.035 3.104 4.443 4.754 2.874 3.364-2.14-3.006.422.607.757 1.067 1.44 2.184 2.121 3.3 1.144 1.868 2.113 3.837 3.035 5.822-1.964-4.229.658 2.192.991 3.285.655 2.15 1.106 4.355 1.504 6.564-.823-4.572-.05-.1.024.79.117 1.387.133 2.782.15 4.175.113 9.538 7.874 17.5 17.5 17.5 9.454 0 17.613-7.96 17.5-17.5-.313-26.252-13.726-49.834-35.729-63.984-10.9-7.01-23.812-10.334-36.63-11.099-6.473-.386-14.634-1.17-20.917.56-6.13 1.686-9.51 6.527-13.443 10.987l-14.247 16.157-21.285 24.138h24.748l-22.789-25.628-14.399-16.193c-4.897-5.508-8.988-10.087-17.532-10.087-8.639 0-17.075-.122-25.65 1.215-13.31 2.073-24.862 8.281-35.36 16.46-17.879 13.93-26.864 37.011-26.864 59.193v43.186c0 9.54 7.96 17.5 17.5 17.5h225.1c9.54 0 17.5-7.96 17.5-17.5v-44.904c0-9.54-7.96-17.5-17.5-17.5s-17.503 7.96-17.503 17.5zm-381.9-647.098a76.154 76.154 0 01-.427 7.24c.523-4.964.055-.658-.117.324-.222 1.268-.505 2.525-.787 3.781-.578 2.573-1.333 5.102-2.138 7.611-.41 1.277-.875 2.536-1.339 3.794-.317.842-.646 1.68-.987 2.514.893-2.097.94-2.246.145-.447-2.23 4.952-4.975 9.662-8.022 14.152-.416.614-3.142 4.255-.438.765-.81 1.044-1.67 2.05-2.53 3.051-1.964 2.29-4.12 4.404-6.36 6.42-.645.58-4.045 3.222-.355.422-.98.744-2.01 1.421-3.038 2.095-1.012.664-2.07 1.253-3.128 1.84-.854.473-4.637 2.165-.122.262-2.157.91-4.42 1.533-6.7 2.038-4.013.887 4.141-.348.04.005-1.56.134-3.128.081-4.689 0-4.11-.213 4.076.752.041-.005-1.146-.215-2.267-.54-3.386-.862-1.127-.325-2.223-.752-3.316-1.176 4.508 1.75.788.212-.12-.262-2.166-1.128-4.193-2.506-6.168-3.936 3.724 2.697.322.162-.356-.423-1.294-1.118-2.508-2.326-3.71-3.54-1.848-1.867-3.539-3.883-5.18-5.93 2.751 3.434-.005-.148-.438-.766-.776-1.105-1.5-2.246-2.224-3.385-1.458-2.294-2.764-4.683-4.018-7.094-.627-1.208-1.204-2.44-1.78-3.673-.796-1.799-.749-1.649.144.447a97.041 97.041 0 01-.988-2.514c-1.892-4.916-3.273-10.018-4.263-15.187-.184-.959-.73-5.304-.118-.324-.15-1.216-.235-2.438-.319-3.66-.209-3.05-.097-6.107.165-9.149-.394 4.572.012.118.176-.762.247-1.329.59-2.637.932-3.943.34-1.295.772-2.564 1.204-3.83 1.455-4.268-1.6 3.356.245-.734 1.084-2.4 2.42-4.68 3.828-6.903.42-.664 3.052-4.245.32-.71 1.066-1.38 2.242-2.67 3.43-3.944 1.784-1.912 3.762-3.633 5.791-5.277-3.447 2.794.035.13.71-.32 1.094-.729 2.236-1.38 3.377-2.032 1.146-.653 2.337-1.225 3.525-1.795 4.048-1.943-3.498 1.311.733-.245 2.953-1.086 6.024-1.81 9.112-2.384 1.99-.315 1.797-.29-.576.073a55.674 55.674 0 012.767-.204c1.867-.115 3.738-.069 5.605 0 .924.045 1.846.113 2.767.204-2.373-.363-2.565-.388-.575-.073 1.782.286 3.536.723 5.28 1.18 1.726.453 3.41 1.05 5.081 1.664-4.346-1.599.99.518 1.85.956 1.563.796 3.057 1.72 4.536 2.657.732.477 1.454.97 2.163 1.48-3.6-2.525-.085-.038.56.51 2.657 2.26 5.017 4.846 7.21 7.55-2.906-3.583.531 1.046 1.021 1.82.94 1.482 1.757 3.04 2.553 4.603.392.79.764 1.59 1.116 2.397-.9-2.144-1-2.302-.299-.473.617 1.68 1.092 3.405 1.545 5.133.46 1.752.77 3.54 1.056 5.327-.764-4.744-.032 2.478-.017 3.647.117 9.538 7.872 17.5 17.5 17.5 9.451 0 17.617-7.959 17.5-17.5-.33-26.907-14.979-52.034-38.779-64.872-23.768-12.82-54.256-11.42-76.439 4.137-21.793 15.284-34.466 41.285-31.654 67.975 2.616 24.833 14.11 49.871 32.826 66.713 11.043 9.938 24.296 16.204 39.222 16.976 15.264.79 29.244-6.727 40.615-16.148 21.023-17.419 33.934-47.767 34.21-74.78.096-9.54-8.035-17.5-17.5-17.5-9.615 0-17.405 7.961-17.5 17.5zm56.4 171.098v44.904l17.5-17.5H387.45l17.5 17.5v-44.65c0-1.017.03-2.03.066-3.047.044-.92.11-1.84.198-2.759.387-4.638-.667 3.79.15-.75.318-1.766.781-3.502 1.263-5.229.3-1.072 2.871-7.589.992-3.286.876-2.008 1.935-3.93 3.034-5.823.542-.934 4.572-6.559 1.72-2.897 2.403-3.085 5.212-5.83 8.18-8.366 1.496-1.212 1.344-1.1-.457.333 1.05-.78 2.148-1.487 3.247-2.193 1.84-1.184 3.783-2.197 5.744-3.162 1.774-.806 1.591-.747-.55.18a57.967 57.967 0 012.488-.92c2.104-.75 4.272-1.3 6.447-1.799.883-.19 1.77-.362 2.66-.512-4.572.824-.1.05.79-.025 1.501-.125 3.014-.149 4.52-.149h13.127l-12.375-5.125 41.601 46.782c6.057 6.811 18.701 6.86 24.75 0l41.253-46.782-12.374 5.125h13.382c1.887 0 3.762.107 5.642.264 2.016.223 1.821.193-.585-.09 1.337.208 2.656.511 3.974.813 2.171.498 4.29 1.197 6.386 1.943 4.234 1.51-3.373-1.59.688.294 1.191.553 2.344 1.188 3.494 1.821 1.91 1.052 3.721 2.274 5.497 3.534-3.743-2.654 1.63 1.498 2.456 2.27 1.586 1.483 3.035 3.104 4.443 4.753 2.874 3.365-2.14-3.005.422.608.757 1.067 1.44 2.184 2.121 3.3 1.144 1.868 2.113 3.837 3.035 5.822-1.964-4.229.658 2.193.991 3.286.655 2.15 1.106 4.355 1.504 6.564-.823-4.572-.05-.1.024.79.118 1.39.134 2.785.151 4.178.113 9.538 7.874 17.5 17.5 17.5 9.454 0 17.613-7.959 17.5-17.5-.313-26.252-13.726-49.834-35.729-63.984-10.9-7.01-23.812-10.334-36.63-11.099-6.473-.386-14.634-1.169-20.917.56-6.13 1.686-9.51 6.527-13.443 10.988l-14.247 16.157-21.286 24.137h24.75l-22.79-25.627-14.4-16.193c-4.897-5.507-8.988-10.087-17.532-10.087-8.638 0-17.075-.122-25.65 1.214-13.31 2.074-24.862 8.282-35.36 16.46-17.879 13.928-26.865 37.011-26.865 59.193v43.186c0 9.54 7.96 17.5 17.5 17.5h225.1c9.54 0 17.5-7.96 17.5-17.5v-44.904c0-9.54-7.96-17.5-17.5-17.5s-17.5 7.96-17.5 17.5zM167.872 496.421a368.78 368.78 0 019.961-36.73c1.88-5.738 3.941-11.414 6.11-17.047a353.85 353.85 0 013.367-8.37c-1.556 3.751.385-.86.594-1.342a361.987 361.987 0 012.448-5.473c10.275-22.59 23.057-44.013 37.785-63.976.88-1.192 1.774-2.374 2.668-3.556 2.982-3.939-2.158 2.745.888-1.145a359.144 359.144 0 015.58-6.913c4.077-4.948 8.317-9.76 12.654-14.483 8.34-9.079 17.198-17.673 26.423-25.846 4.432-3.926 8.984-7.713 13.604-11.415 1.156-.926 2.323-1.837 3.49-2.749-3.158 2.467.754-.552 1.166-.863a358.094 358.094 0 018.384-6.112c10.098-7.172 20.61-13.753 31.395-19.836a359.793 359.793 0 016.538-3.58c8.396-4.506 10.965-15.942 6.278-23.943-4.947-8.445-15.537-10.79-23.943-6.278-90.716 48.691-158.689 134.52-185.229 233.998-1.445 5.417-2.727 10.875-3.913 16.354-2.017 9.314 2.652 18.895 12.223 21.527 8.807 2.423 19.51-2.897 21.53-12.222zM661.476 865.57a389.087 389.087 0 01-18.165 9.218 360.102 360.102 0 01-9.303 4.228c-.13.057-5.292 2.241-2.099.91a354.08 354.08 0 01-6.34 2.556c-13.346 5.27-27.04 9.626-40.922 13.238-6.738 1.753-13.54 3.258-20.37 4.612-3.438.681-6.89 1.286-10.346 1.865-1.734.291-3.473.556-5.21.821-1.163.174-2.325.343-3.489.505 1.738-.229 1.538-.205-.6.07-14.799 1.884-29.72 2.727-44.635 2.764-14.884.037-29.762-.95-44.533-2.75-5.75-.702 3.393.498-2.33-.314-1.739-.247-3.473-.52-5.208-.793a351.28 351.28 0 01-10.34-1.808c-7.4-1.388-14.744-3.065-22.04-4.92-13.873-3.53-27.498-8-40.838-13.18-1.59-.617-3.17-1.258-4.752-1.898-.139-.056-5.298-2.234-2.103-.868a355.343 355.343 0 01-9.309-4.166c-6.666-3.079-13.21-6.41-19.672-9.896a361.292 361.292 0 01-7.378-4.116c-8.289-4.729-19.088-2.01-23.943 6.277-4.782 8.163-1.995 19.225 6.278 23.943 51.967 29.646 110.235 46.312 169.967 49.128 60.47 2.852 120.83-9.88 175.637-35.265 6.678-3.092 13.234-6.439 19.707-9.94 8.38-4.532 10.977-15.92 6.277-23.943-4.934-8.426-15.549-10.818-23.94-6.278zM650.3 262.46a371.058 371.058 0 0132.353 18.31c5.008 3.174 9.915 6.504 14.76 9.923a356.238 356.238 0 017.18 5.228c1.187.883 2.362 1.781 3.54 2.68-3.219-2.457 1.734 1.39 2.28 1.822 19.264 15.345 36.831 32.783 52.548 51.733a358.132 358.132 0 015.564 6.91c3.056 3.874-2.113-2.785.88 1.141a369.011 369.011 0 012.66 3.553c3.827 5.153 7.483 10.432 11.027 15.784 6.841 10.328 13.076 21.05 18.805 32.031 2.763 5.296 5.357 10.677 7.85 16.105a362.009 362.009 0 013.628 8.22c-1.604-3.74.343.87.542 1.357a358.14 358.14 0 012.215 5.586c4.571 11.741 8.438 23.75 11.732 35.91 1.063 3.923 2.032 7.872 2.96 11.83 2.176 9.287 12.604 14.677 21.527 12.223 9.455-2.6 14.396-12.248 12.223-21.527-23.49-100.256-89.13-187.768-178.23-239.19-6.022-3.475-12.164-6.734-18.377-9.85-8.527-4.277-18.897-2.337-23.943 6.277-4.587 7.83-2.245 19.67 6.276 23.944zm-50.184 282.094H540.07c-2.654 0-1.044-.24.577.11-1.87-.606-1.702-.506.508.302-1.627-1.036-1.5-.883.381.46-3.123-2.657 1.666 2.98-.458-.537 2.367 3.92-.125-2.146.47 2.491-.078-.61-.059-1.28-.059-1.91v-59.543l-29.874 12.375 76.127 76.127c6.742 6.742 18.006 6.742 24.748 0 6.742-6.742 6.742-18.006 0-24.748l-76.127-76.128c-10.798-10.798-29.874-2.89-29.874 12.375v34.475c0 13.821-2.399 30.952 5.042 43.27 6.404 10.602 18.105 15.883 30.164 15.883h58.421c9.54 0 17.5-7.96 17.5-17.5s-7.96-17.502-17.5-17.502z"/>
  <path d="M582.615 562.053v155.871c0 .795-.019 1.574-.045 2.372.138-4.238-.04-.602-.4.607 1.166-3.917.15-.54-.486.521 2.067-3.447.316-.453-.56.423-1.448 1.263-1.285 1.146.49-.353-.73.47-1.487.892-2.27 1.267 3.758-1.947.277-.356-.823-.104 1.902-.438 2.99-.23.573-.23h-158.2c-4.539 0 3.59.921-.72-.068-1.86-.615-1.702-.48.48.402a20.99 20.99 0 01-2.27-1.267c3.446 2.067.453.316-.424-.56-2.986-2.986 1.86 3.004-.315-.624-2.189-3.65 1.032 3.446-.197-.677-1.246-4.182.077 3.748-.068-.72-.01-.344 0-.689 0-1.034V507.093c0-.515.027-1.002.045-1.537-.137 4.238.041.602.401-.608-1.167 3.917-.15.54.486-.52-2.067 3.446-.316.452.56-.424 2.986-2.986-3.004 1.86.624-.315 3.651-2.189-3.446 1.032.677-.196 4.112-1.225-3.698-.068.732-.068h103.081l-12.374-5.125 76.127 76.127c6.742 6.742 18.006 6.742 24.748 0 6.742-6.742 6.742-18.006 0-24.748l-51.21-51.21-23.726-23.726c-7.63-7.63-17.189-6.317-26.96-6.317h-84.993c-5.006 0-9.749.174-14.73 1.318-16.864 3.874-26.863 19.578-28.444 35.813-.477 4.897-.045 10.022-.045 14.93v196.25c0 22.23 15.902 39.96 38.512 40.69 20.062.65 40.251 0 60.32 0h87.078c11.216 0 22.204.321 32.054-6.443 10.715-7.358 17.27-19.278 17.27-32.367V562.055c0-9.54-7.96-17.5-17.5-17.5s-17.498 7.958-17.498 17.498z"/>
  <path d="M460.025 635.586h79.946c9.54 0 17.5-7.96 17.5-17.5s-7.96-17.5-17.5-17.5h-79.946c-9.54 0-17.5 7.96-17.5 17.5s7.961 17.5 17.5 17.5zm0 59.205h43.013c9.54 0 17.5-7.96 17.5-17.5s-7.96-17.5-17.5-17.5h-43.013c-9.54 0-17.5 7.96-17.5 17.5s7.961 17.5 17.5 17.5z"/>
</svg>