<svg xmlns="http://www.w3.org/2000/svg" viewBox="0 0 95 95">
  <defs/>
  <path stroke="#215B83" stroke-width=".8" d="M19.478 15.709l.166.543 2.322.575-.285 2.368.448.347a7.618 7.618 0 002.95 1.413l.554.129 1.664-1.727 1.92 1.439.525-.217a7.633 7.633 0 002.687-1.868l.387-.414-.661-2.291 2.201-.94.076-.563c.074-.552.09-1.104.047-1.642a7.577 7.577 0 00-.311-1.615l-.165-.542-2.322-.575.285-2.368-.448-.346a7.622 7.622 0 00-2.949-1.413l-.554-.13-1.664 1.729-1.919-1.438-.525.216a7.63 7.63 0 00-2.688 1.866l-.388.414.661 2.292-2.199.938-.077.562a7.702 7.702 0 00-.048 1.646c.045.542.149 1.084.31 1.612zm3.803-3.349l.158-.363c.022-.052.05-.102.096-.19l.184-.354-.644-2.229a5.639 5.639 0 011.091-.761l1.541 1.154.408.229.914-.069 1.614-1.676a5.66 5.66 0 011.197.576l-.229 1.908-.004.453.533.77 2.251.558a5.411 5.411 0 01.106 1.319l-2.128.909-.159.359c-.025.058-.055.112-.099.197l-.184.354.644 2.229c-.336.298-.7.552-1.091.761l-1.854-1.39-1.017.084-1.606 1.666a5.61 5.61 0 01-1.197-.576l.23-1.907.027-.423-.237-.32c-.039-.052-.078-.104-.113-.158l-.216-.324-2.241-.556a5.482 5.482 0 01-.107-1.32zm2.438 4.121a3.287 3.287 0 002.527-.167h.001a3.316 3.316 0 001.501-4.435 3.312 3.312 0 00-6.103.404 3.29 3.29 0 00.168 2.528 3.28 3.28 0 001.906 1.67zm-.179-3.554c.112-.331.347-.599.661-.754a1.303 1.303 0 011.754.592 1.314 1.314 0 01-.595 1.756 1.297 1.297 0 01-1 .065 1.296 1.296 0 01-.754-.66 1.299 1.299 0 01-.066-.999zM4.327 33.372l.207.632a10.06 10.06 0 001.052 2.236l.353.565 3.343-.553-.239 3.368.594.3c.77.389 1.551.676 2.323.852l.648.148 1.977-2.758 2.223 2.559.632-.207a10.066 10.066 0 002.238-1.054l.562-.354-.553-3.341 3.378.237.3-.592a10.12 10.12 0 00.84-2.326l.148-.648-2.756-1.975 2.559-2.223-.207-.631a10.044 10.044 0 00-1.053-2.239l-.354-.562-3.344.555.238-3.38-.593-.3a10.123 10.123 0 00-2.328-.839l-.647-.146-1.974 2.755-2.222-2.559-.631.207c-.784.257-1.538.611-2.239 1.054l-.562.354.552 3.341-3.379-.237-.3.593a10.15 10.15 0 00-.839 2.325l-.146.647 2.755 1.975zm2.07-5.031c.068-.217.146-.43.231-.641l3.513.248.327-.383c.063-.073.126-.144.192-.212l.349-.361-.573-3.474c.201-.105.407-.202.617-.29l2.309 2.658.673-.055.099.001.521-.009 2.049-2.859c.217.067.432.145.642.231l-.248 3.513.383.327c.073.063.145.127.213.193l.361.349 3.474-.574c.105.201.202.407.29.617l-2.66 2.311.057.672-.001.097.009.524 2.859 2.049a8.452 8.452 0 01-.231.642l-3.513-.248-.327.383a4.907 4.907 0 01-.193.212l-.349.361.574 3.473a8.475 8.475 0 01-.617.291l-2.311-2.659-.642.056-.113-.003-.535.009-2.052 2.861a8.23 8.23 0 01-.642-.238l.249-3.508-.469-.404c-.044-.037-.088-.073-.13-.113l-.361-.349-3.472.572a7.913 7.913 0 01-.287-.618l2.66-2.312-.06-.681.001-.091-.009-.521zm5.638 5.474a3.936 3.936 0 002.361.785 3.952 3.952 0 002.372-7.12 3.934 3.934 0 00-2.934-.746 3.932 3.932 0 00-2.602 1.547 3.962 3.962 0 00.803 5.534zm.801-4.337a1.955 1.955 0 013.131 2.339 1.96 1.96 0 01-2.735.396 1.956 1.956 0 01-.396-2.735zm21.005-1.99a1 1 0 001 1h2.126c-.033.342-.056.69-.056 1.047 0 5.873 4.777 10.65 10.649 10.65 5.873 0 10.65-4.777 10.65-10.65 0-.357-.023-.705-.056-1.047h1.834a1 1 0 100-2h-.536a12.054 12.054 0 00-8.12-9.555v-1.305c0-.432-.356-.88-.781-.976a13.986 13.986 0 00-5.824-.039c-.428.088-.799.538-.799.979v1.294a12.016 12.016 0 00-8.261 9.602h-.827a.999.999 0 00-.999 1zm22.37 2.047c0 4.77-3.881 8.65-8.65 8.65s-8.649-3.881-8.649-8.65c0-.361.026-.709.067-1.047h17.166c.04.338.066.685.066 1.047zm1.205-3.047h-6.083v-7.426a10.052 10.052 0 016.083 7.426zm-8.083-10.015v10.015h-3.404V16.451a11.976 11.976 0 013.404.022zm-5.404 2.534v7.481h-6.225a10.01 10.01 0 016.225-7.481zm45.767 46.781a6.508 6.508 0 00-3.743-1.175 1 1 0 00-1 1v3.632h-7.809l2.689-1.288a3.167 3.167 0 001.715-2.117 3.16 3.16 0 00-.558-2.667L68.177 46.306A7.037 7.037 0 0065.111 44l-10.643-4.106-.439.317c-1.757 1.271-4.515 1.841-6.468 1.841-1.777 0-4.519-.482-6.396-1.841l-.439-.317-.49.189h-.002l-.002.001-10.15 3.915a7.03 7.03 0 00-3.066 2.307L14.202 63.172a3.163 3.163 0 00-.559 2.667c.225.932.85 1.704 1.715 2.117l2.69 1.289h-7.999v-4.789a1 1 0 00-1-1 6.49 6.49 0 00-3.93 1.31A6.498 6.498 0 002.5 70.004v12.528l.002.011-.002.037a6.556 6.556 0 006.549 6.548h76.903A6.556 6.556 0 0092.5 82.58V71.162a6.555 6.555 0 00-2.804-5.374zM47.561 44.053c1.454 0 3.457-.28 5.303-.988l-5.021 14.764-5.431-14.723c1.778.675 3.68.947 5.149.947zM15.588 65.369a1.167 1.167 0 01.206-.987l12.813-16.865a5.036 5.036 0 012.195-1.651l9.189-3.544 7.928 21.493 7.307-21.485 9.164 3.535a5.04 5.04 0 012.195 1.65l12.813 16.867a1.174 1.174 0 01-.429 1.771l-19.581 9.382a3.019 3.019 0 01-4.006-1.397 2.987 2.987 0 01-.123-2.343 2.984 2.984 0 011.597-1.72l13.436-6.029-8.682-10.751a1.185 1.185 0 00-1.211-.615 1.19 1.19 0 00-1.048 1.192v12.892l-3.313 1.487c-.546.245-1.02.59-1.435.994H40.741c-.044 0-.082.02-.124.025a4.992 4.992 0 00-1.463-1.019l-3.313-1.487V53.872a1.19 1.19 0 00-1.049-1.192 1.193 1.193 0 00-1.211.615L24.9 64.046l13.436 6.029a2.99 2.99 0 011.597 1.721c.28.771.236 1.604-.124 2.342a3.02 3.02 0 01-4.006 1.397l-19.581-9.383a1.164 1.164 0 01-.634-.783zm45.764.497v-9.708l5.755 7.126zm-27.511-9.709v9.709l-5.755-2.582zM4.501 70.004a4.512 4.512 0 013.549-4.425v10.528a6.488 6.488 0 00-3.549 1.762v-7.865zm81.452 17.124H9.05a4.554 4.554 0 01-4.549-4.548c0-1.444.663-2.771 1.82-3.64a4.51 4.51 0 012.729-.908h1v-6.787h12.173l12.717 6.094a4.966 4.966 0 002.15.489 5.027 5.027 0 004.518-2.814 4.951 4.951 0 00.238-3.769h11.5a4.954 4.954 0 00.238 3.768 5.025 5.025 0 004.518 2.815c.724 0 1.458-.157 2.15-.49l12.719-6.094.003.001h11.979v6.787h1c.937 0 1.835.281 2.599.814a4.555 4.555 0 011.949 3.733 4.553 4.553 0 01-4.548 4.549zm3.743-9.922a6.514 6.514 0 00-2.743-1.099v-9.371a4.508 4.508 0 011.599.692 4.555 4.555 0 011.949 3.733v6.721a6.56 6.56 0 00-.805-.676zM46.729 46.637a1.061 1.061 0 112.122 0 1.061 1.061 0 01-2.122 0zm2.123 3.763a1.061 1.061 0 11-2.122 0 1.061 1.061 0 012.122 0zm33.502-7.292v5.701h7.199v-7.2h-5.865l-9.713-7.299v-1.101h8.379v2.601h7.199v-7.2h-7.199v2.6h-8.379v-1.1l9.713-7.299h5.865v-7.2h-7.199v5.701l-9.713 7.299h-5.865v7.2h5.865zm2-12.5h3.199v3.2h-3.199zm0 13h3.199v3.2h-3.199zm0-26h3.199v3.2h-3.199zM71.975 33.809h-3.199v-3.2h3.199z"/>
  <path stroke="#215B83" stroke-width=".8" d="M41.852 81.744H31.775v-3.367h-7.384v2h5.384v3.367h14.077v-3.367h5.941v3.367H67.04v-4.077h9.235v-2H65.04v4.077H51.793v-3.367h-9.941z"/>
</svg>