<svg xmlns="http://www.w3.org/2000/svg" viewBox="0 0 52.1 52.1">
  <g fill-rule="evenodd" clip-rule="evenodd">
    <path d="M26.64 9.84c.332.549.263 1.498 1.2 1.44 4.116-.718 3.241-5.243 0-6.24-.712.001-1.051.359-1.44 1.2-1.533.12-7.106-.469-6 2.88 2.268 1.538 3.241.621 6.24.72zM44.161 31.921c1.879-.135 2.833-2.733 2.88-4.32-.676-.639-1.372-.008-1.92-.48-.368-2.457.226-4.524-.48-5.76-3.044.145-2.757 2.97-2.64 5.04-.448.191-.879.401-1.44.48-.852 2.269 1.585 5.183 3.6 5.04zM26.88 42.721c.488-.633-.406-.736-.96-.48-1.444-3.771-5.15.062-5.76 2.16 1.024.96 1.947 3.845 4.56 3.12.27-.926.567-1.109.24-2.16 2.007-.309 6.083 1.269 6-1.68-1.858-.569-2.718-1.327-4.08-.96zM11.28 25.681c1.157-1.853-1.421-5.241-3.6-5.04-1.596.147-3.002 2.57-2.64 4.56.807.324 1.27-.13 1.68.24.309 1.771.066 4.094.48 5.76h1.68c.899-1.279.468-2.025 1.2-2.399 0-.358-.221-1.504 0-2.88.557.075.922-.04 1.2-.241zM14.88 1.681C12.275.771 10.546.514 8.16.961c-.741-.24.521-.396.48-.72-.628-.281-1.033.74-.96-.24H7.2c-.032 1.553-.974-.444-1.2.72-.365-.852-1.024.081-1.44-.72h-.48c-.118.877-2.042-.373-2.16.96C1.542.94 1.732.349 1.2.481c-.41.39-.851.75-1.2 1.2v3.84c1.031 3.756-.753 7.644 1.2 10.32 4.083.28 8.34-.411 13.44-.72 1.126-3.899-.012-9.459.24-13.44zm-1.92 11.52c-3.186-.273-4.17-.017-5.52-1.2-1.613.539-2.136.138-3.6.24-.002-4.423-.219-4.066-.24-8.16 2.63-.46 6.292-.732 9.36-.72-.27 2.647.178 6.499 0 9.84zM14.88 37.681c-2.605-.91-4.334-1.166-6.72-.72-.564-.004.087-.655.48-.48-.151-.874-1.213.647-.96-.479-.787.985-1.137-.014-1.68.72-1.208-1.399-3.494.281-4.8-.24-.41.391-.851.75-1.2 1.2v3.84c1.255 3.836-1.332 8.591 1.92 10.56h2.4c3.689-.779 6.23-.4 10.32-.96 1.126-3.9-.012-9.46.24-13.441zM12.96 49.2c-3.186-.272-4.17-.017-5.52-1.199-1.613.538-2.136.138-3.6.239-.002-4.423-.219-4.065-.24-8.16 2.63-.459 6.292-.732 9.36-.72-.27 2.648.178 6.5 0 9.84zM50.88 37.681c-2.604-.91-4.335-1.166-6.72-.72-.564-.004.088-.655.479-.48-.15-.874-1.212.647-.96-.479-.787.985-1.137-.014-1.68.72-1.208-1.399-3.494.281-4.8-.24-.41.391-.851.75-1.2 1.2 1.129 4.795-1.415 11.478 1.92 14.399h2.4c3.688-.779 6.229-.4 10.319-.96 1.003-.357.03-2.689.721-3.359v-.24c-.941-3.267-.034-6.926-.479-9.841zM48.96 49.2c-3.186-.272-4.17-.017-5.52-1.199-1.613.538-2.137.138-3.601.239-.002-4.423-.219-4.065-.24-8.16 2.631-.459 6.292-.732 9.36-.72-.268 2.648.179 6.5.001 9.84zM50.88 1.92C48.635.535 46.461.632 44.16.96c-.564-.003.088-.655.479-.48-.15-.875-1.212.647-.96-.48H43.2c-.032 1.553-.974-.444-1.2.72-.365-.852-1.024.081-1.44-.72h-.479c-.707.197-2.241 1.023-2.88.48-.41.39-.851.75-1.2 1.2.799 4.759-.692 10.444 1.2 14.16 1.345-.35 12.175.354 13.439-.72.927-.787.112-2.613.721-3.36v-.24c-.946-3.131-.032-6.877-.481-9.6zm-1.92 11.281c-3.186-.273-4.17-.017-5.52-1.2-1.613.539-2.137.138-3.601.24-.002-4.423-.219-4.066-.24-8.16 2.631-.46 6.292-.732 9.36-.72-.268 2.647.179 6.499.001 9.84z"/>
  </g>
</svg>