<svg xmlns="http://www.w3.org/2000/svg" viewBox="0 0 64 64">
  <path d="M53.743 36.563c.035-.149.025-.343.047-.504-.019.165-.029.338-.047.504zM18.99 38.699c.207-.103.412-.206.471-.457-.199.125-.372.267-.471.457zM19.461 38.242c.009-.005.017-.012.026-.018-.007-.001-.01-.003-.017-.005-.001.01-.007.015-.009.023z"/>
  <path d="M53.07 54.779c.418-6.377.114-12.826.673-18.216-.025.11-.073.199-.193.216-.493-1.781.863-6.449 0-4.8.477-1.421-.827-2.852 0-3.12.116.284.256.544.48.72-.148-2.538.074-4.125-.142-6.35-.13-.187-.066-.566-.099-.851.042.297.072.576.099.851.034.049.073.094.142.109-.158-1.317.245-3.701-.721-5.04-.095-.575 1.094.133.721-.72-.605-4.598 1.421-7.931-1.44-11.52h-1.2c-3.025 2.238-.202 7.621-.96 9.12-.084-1.705-.521.593-.72.96-6.354-.046-13.599-.073-19.92.24-1.04-5.227-10.242-5.215-11.28 0-1.55-.253-3.335-.029-4.8 0-.737-3.192.952-7.62-.96-9.84-2.882-.516-2.373 1.997-2.4 3.36-.281 14.299.011 30.432.48 44.641-1.955.228-3.599-.452-3.84 1.68 1.168 1.551 5.106.333 6.96 1.2h.24c1.075-.617 1.789-.119 2.88-.721.406-2.405-2.127-1.872-4.08-1.92.11-2.906.023-7.541 0-11.52 2.321.036 3.874-.408 6 0 .857 5.078 9.371 4.705 10.32 0 5.879-.333 14.977-.447 21.6 0-.154 3.846.312 8.312-.24 11.76h-3.36c-.076.563-.379.901-.239 1.68 2.738.397 7.102.397 9.84 0v-1.439c-.78-.66-3.076.195-3.841-.48zM25.23 15.66c-.562.86.613 1.688.96 2.4-.417 2.235-1.881 2.449-4.32 1.92-2.082-2.381.938-6.423 3.36-4.32zm-12.24 3.6c1.547-.532 4.06-.101 6-.24.562 5.076 7.914 5.124 10.08 2.16-.213.106-.429.21-.48.48-.523-1.715 2.133-1.635 3.12-2.16.374 1.5 3.778-.224 5.521.72.45-.544 1.251-.419 2.159-.96-.127.193-.25.39-.239.72 4.696-.073 6.666-.229 11.04-.24.341 2.924-.028 5.404.239 8.4-2.617.781-6.033-.043-8.64.24-1.698-4.7-9.849-4.805-10.8.48-6.178.25-11.283-.314-17.76.24-.549-2.811-.088-6.632-.24-9.84zM38.91 30.3c-.933 1.023-1.699.724-2.641 1.68-2.853.293-2.801-2.304-2.159-4.32 1.353-.77 5.319-.557 4.8 2.64zM24.27 44.939c-2.024-.081-1.069-1.743-2.4-2.88.288-2.688 3.084-3.102 4.32-1.92 1.672 1.599.319 4.89-1.92 4.8zm26.64-4.32c-6.642.78-14.54.213-21.84.48-.676-3.408-4.243-5.095-7.68-4.32.001.84-1.164.998-1.903 1.445.891.222-.807.88-.017.955-.156.407-.552.15-.48-.24-.673.235.348.641-.24.96-1.174.226-1.674-.279-2.16.72-.403-1.342-2.007-.183-2.64-.72.154-1.309-.002-1.959-.72-3.359.315.084.377.422.72.479-.17-1.43.186-3.354-.24-5.04 6.018-.535 11.468-.305 17.04-.24 1.467 5.256 9.408 4.895 10.56-.24 3.253-.54 6.358-.314 9.601-.24l-.001 9.36z"/>
</svg>