<svg xmlns="http://www.w3.org/2000/svg" viewBox="0 0 60.726 54.032">
  <g fill-rule="evenodd" clip-rule="evenodd">
    <path d="M11.582 9.84c.472-.102.787-.923 1.92-.48.906-1.336 2.206-3.936.96-6.48C13.655 1.233 11.639.524 9.902 0h-.72c-6.04.894-5.428 11.455 2.4 9.84zm-4.08-6.239c2.138-1.819 3.406.011 3.6 2.4-.233.007-.186.294-.24.48-.687.66-2.673.66-3.36 0-.49-.918-.05-1.836 0-2.88zm43.68 5.759c3.727-3.047.95-8.798-3.12-9.36h-.96c-2.728.873-4.408 2.792-4.08 6.72.716 3.145 6.23 3.479 8.16 2.64zm-3.84-6.719c.922.152 1.82 2.583 1.68 3.12-.44 1.693-3.036 1.572-3.84.24-.103-2.126 1.118-3.533 2.16-3.36zM6.182 15.334a3.582 3.582 0 0 0-.36.266.576.576 0 0 0 .36-.266z"/>
    <path d="M16.862 14.88c-.521-.499.029-.775.24-1.2-1.655-.36-2.337-2.846-4.56-2.4.793-.745-.5.128-.24-.72C5.614 9.397-.471 14.421 1.742 20.4c4.74-.273 12.105.451 15.84-.721.127-2.548-.282-5.738-.72-4.799zm-13.2 3.361c.023-1.817 1.565-2.115 2.4-3.12.148.037.166.124.122.214 2.464-1.65 8.117-1.423 8.519 2.666-2.811.035-6.183.253-11.041.24zm40.56-6.721c.017-.002-.014-.441 0-.48-.557.278-.995 1.676-2.16.72-.36.518-.281.967-.721 1.44.067-.073-.3-.375-.48-.24-1.404 1.052-2.913 5.884-1.68 7.68 4.619.373 12.25.564 16.32-.72.656-7.717-6.183-8.961-11.28-8.4zm-2.4 6.721c-.64-1.664 1.5-2.153 1.92-2.4.566-.333-.153-.216.96-.479.717-.171 2.082-1.138 2.64-1.2 2.357-.262 4.576 1.085 5.28 3.84-2.75.074-6.014.239-10.8.239zm-19.92-.96c.869-1.474-.094.38-.96-.24.257 1.12-1.515 1.005-.72 1.92-.324-.075-.458-.342-.96-.24-.103 1.046-1.781 1.624-1.68 4.08-1.201-.369-1.117 3.123-1.2 5.28.557.163.827.613 1.2.96 7.169-.204 12.84-.038 21.6-.72 2.69-9.136-10.21-15.248-17.28-11.04zm-2.64 8.88c.455-2.811 2.438-4.973 3.6-4.561-.102-.461.165-.866.24-.479 3.878-4.17 13.46-1.892 13.68 4.8-5.011.427-11.271.114-17.52.24zm6.24-13.681c2.515 1.17 6.24.259 7.68-.24.673-1.06.652-1.389 1.68-2.16 1.298-4.951-.556-9.031-6-10.08h-.96c-6.273.77-7.85 9.945-2.4 12.48zm5.04-8.399c-.06.261-.477.163-.48.48 3.373 1.926-.29 7.852-4.56 5.04-3.45-3.02 1.647-9.46 5.04-5.52zM54.766 41.156c-.938-1.614.102.416 1.037-.262-.278 1.226 1.636 1.1.777 2.102.35-.082.495-.375 1.037-.263.11 1.145 1.923 1.778 1.814 4.467 1.297-.404 1.206 3.42 1.295 5.78-.6.18-.892.672-1.295 1.052-7.741-.223-13.865-.042-23.323-.788-2.905-10.003 11.024-16.695 18.658-12.088zm2.85 9.723c-.49-3.078-2.632-5.445-3.886-4.994.11-.505-.179-.948-.26-.524-4.187-4.566-14.533-2.072-14.771 5.255 5.41.467 12.17.125 18.918.263zm-6.737-14.98c-2.716 1.282-6.738.284-8.293-.262-.726-1.16-.704-1.52-1.814-2.365-1.401-5.42.6-9.887 6.479-11.036h1.036c6.774.843 8.477 10.888 2.592 13.664zm-5.442-9.195c.065.286.515.179.518.526-3.642 2.108.313 8.597 4.924 5.518 3.725-3.307-1.778-10.358-5.442-6.044zM4.366 36.075c.687-1.272-.074.329-.76-.207.204.967-1.198.868-.569 1.658-.256-.065-.362-.296-.76-.207C2.198 38.22.87 38.72.95 40.84 0 40.522.066 43.536 0 45.398c.44.14.654.53.95.829 5.67-.176 10.155-.033 17.083-.622 2.128-7.886-8.075-13.162-13.667-9.53zm-2.088 7.666c.36-2.427 1.928-4.293 2.847-3.937-.08-.398.13-.748.19-.414 3.067-3.6 10.45-2.518 10.623 3.258-3.963.369-8.718.984-13.66 1.093zm4.935-10.437c1.99 1.01 4.936.224 6.075-.207.532-.915.515-1.2 1.329-1.865 1.026-4.273.445-7.008-3.86-7.914H9.012c-4.961.665-6.11 7.798-1.8 9.986zm3.987-7.25c1.133 1.603 2.377 1.518.8 1.693 2.669 1.663-1.41 5.5-4.787 3.072-2.728-2.607 1.303-8.166 3.987-4.765zM28.603 40.734c.472-.102.787-.923 1.92-.48.906-1.336 2.206-3.936.96-6.48-.807-1.647-2.823-2.356-4.56-2.88h-.72c-6.04.894-5.428 11.455 2.4 9.84zm-4.08-6.239c2.138-1.819 3.406.011 3.6 2.4-.233.007-.186.294-.24.48-.687.66-2.673.66-3.36 0-.49-.918-.05-1.836 0-2.88zm-1.319 11.733c-.126.081-.246.17-.36.266a.576.576 0 0 0 .36-.266z"/>
    <path d="M23.703 42.388c.017-.002 1.167-.244 0-.48-.557.278-.405 2.07-1.57 1.113-.36.518-.87.574-1.31 1.047.066-.073-.3-.375-.48-.24-1.405 1.052-2.914 5.884-1.68 7.68 4.618.373 12.25.564 16.32-.72.655-7.717-6.183-8.961-11.28-8.4zm-2.4 6.72c-.64-1.663 1.12-2.367 1.54-2.614.566-.333.326-.985 1.439-1.248.717-.171 1.983-.154 2.541-.216 2.357-.262 4.576 1.085 5.28 3.84-2.75.074-5.915 1.813-10.8.239z"/>
  </g>
</svg>