{
  "routes": [
    {
      "method": "GET",
      "path": "/geofoci",
      "handler": "geofocus.find",
      "config": {
        "policies": []
      }
    },
    {
      "method": "GET",
      "path": "/geofoci/count",
      "handler": "geofocus.count",
      "config": {
        "policies": []
      }
    },
    {
      "method": "GET",
      "path": "/geofoci/:id",
      "handler": "geofocus.findOne",
      "config": {
        "policies": []
      }
    },
    {
      "method": "POST",
      "path": "/geofoci",
      "handler": "geofocus.create",
      "config": {
        "policies": []
      }
    },
    {
      "method": "PUT",
      "path": "/geofoci/:id",
      "handler": "geofocus.update",
      "config": {
        "policies": []
      }
    },
    {
      "method": "DELETE",
      "path": "/geofoci/:id",
      "handler": "geofocus.delete",
      "config": {
        "policies": []
      }
    }
  ]
}
