{
  "collectionName": "attachments",
  "info": {
    "name": "attachment",
    "icon": "paperclip",
    "description": ""
  },
  "options": {},
  "attributes": {
    "url": {
      "type": "string",
      "required": true
    }
  }
}
