<svg width="501" height="429" viewBox="0 0 501 429" fill="none" xmlns="http://www.w3.org/2000/svg">
<path opacity="0.4" d="M108.37 356.22L107.48 354.68L250.36 272.19L252.14 273.21L108.37 356.22Z" fill="#E5E7EB"/>
<path opacity="0.4" d="M196.032 187.985L195.142 189.526L413.64 315.676L414.53 314.135L196.032 187.985Z" fill="#E5E7EB"/>
<path opacity="0.4" d="M417.09 225.6L340.67 181.48L417.09 137.36L493.51 181.48L417.09 225.6Z" fill="#E5E7EB"/>
<path d="M491.09 171.73L424.44 133.25L357.8 171.73L348.02 166.09V177.37L424.44 221.49L500.86 177.37V166.09L491.09 171.73Z" fill="#9FA6B2"/>
<path d="M424.44 210.21L348.02 166.09L424.44 121.97L500.86 166.09L424.44 210.21Z" fill="#F6F5FF"/>
<path d="M424.44 73.25L361.01 36.62L424.44 0L487.88 36.62L424.44 73.25Z" fill="#F6F5FF"/>
<path d="M361.01 36.62V167.2L424.44 203.83V73.25L361.01 36.62Z" fill="#E5E7EB"/>
<path d="M424.44 203.83L487.88 167.2V36.62L424.44 73.25V203.83Z" fill="#D2D6DC"/>
<path d="M445.99 89.23L435.01 95.57V82.89L445.99 76.55V89.23Z" fill="#252F3F"/>
<path d="M480.8 69.13L449.34 87.29V74.61L480.8 56.45V69.13Z" fill="#252F3F"/>
<path d="M445.99 107.71L435.01 114.05V101.37L445.99 95.03V107.71Z" fill="#252F3F"/>
<path d="M480.8 87.61L449.34 105.78V93.09L480.8 74.94V87.61Z" fill="#252F3F"/>
<path d="M445.99 126.19L435.01 132.53V119.85L445.99 113.51V126.19Z" fill="#252F3F"/>
<path d="M480.8 106.1L449.34 124.26V111.58L480.8 93.42V106.1Z" fill="#252F3F"/>
<path d="M445.99 144.67L435.01 151.01V138.33L445.99 131.99V144.67Z" fill="#252F3F"/>
<path d="M480.8 124.58L449.34 142.74V130.06L480.8 111.9V124.58Z" fill="#252F3F"/>
<path d="M445.99 163.15L435.01 169.5V156.81L445.99 150.47V163.15Z" fill="#252F3F"/>
<path d="M480.8 143.06L449.34 161.22V148.54L480.8 130.38V143.06Z" fill="#252F3F"/>
<path d="M379.85 76.91L368.94 70.61V58.01L379.85 64.31V76.91Z" fill="#252F3F"/>
<path d="M414.43 96.87L383.18 78.83V66.23L414.43 84.28V96.87Z" fill="#252F3F"/>
<path d="M379.85 95.27L368.94 88.97V76.38L379.85 82.67V95.27Z" fill="#252F3F"/>
<path d="M414.43 115.24L383.18 97.19V84.6L414.43 102.64V115.24Z" fill="#252F3F"/>
<path d="M379.85 113.63L368.94 107.33V94.74L379.85 101.04V113.63Z" fill="#252F3F"/>
<path d="M414.43 133.6L383.18 115.56V102.96L414.43 121V133.6Z" fill="#252F3F"/>
<path d="M379.85 132L368.94 125.7V113.1L379.85 119.4V132Z" fill="#252F3F"/>
<path d="M414.43 151.96L383.18 133.92V121.32L414.43 139.36V151.96Z" fill="#252F3F"/>
<path d="M379.85 150.36L368.94 144.06V131.46L379.85 137.76V150.36Z" fill="#252F3F"/>
<path d="M414.43 170.32L383.18 152.28V139.68L414.43 157.72V170.32Z" fill="#252F3F"/>
<path d="M361.01 159.88L424.44 195.84L487.88 158.59V167.2L424.44 203.83L361.01 167.2V159.88Z" fill="#C27803"/>
<path d="M425.8 37.48C424.431 37.7952 423.009 37.7952 421.64 37.48L418.49 39.3C421.885 40.4703 425.575 40.4703 428.97 39.3L425.8 37.48Z" fill="#252F3F"/>
<path d="M428.83 35.74L432 37.57C432.47 37.2179 432.851 36.7613 433.114 36.2362C433.377 35.7111 433.513 35.1321 433.513 34.545C433.513 33.9579 433.377 33.3789 433.114 32.8538C432.851 32.3287 432.47 31.8721 432 31.52L428.84 33.34C429.098 33.6873 429.237 34.1089 429.235 34.5417C429.233 34.9744 429.091 35.3949 428.83 35.74V35.74Z" fill="#252F3F"/>
<path d="M421.65 31.6C423.019 31.29 424.441 31.29 425.81 31.6L429 29.77C425.605 28.5997 421.915 28.5997 418.52 29.77L421.65 31.6Z" fill="#252F3F"/>
<path d="M418.63 33.34L415.47 31.52C414.998 31.8708 414.615 32.3271 414.351 32.8523C414.087 33.3775 413.95 33.9572 413.95 34.545C413.95 35.1328 414.087 35.7125 414.351 36.2377C414.615 36.763 414.998 37.2192 415.47 37.57L418.63 35.75C418.368 35.4029 418.226 34.9799 418.226 34.545C418.226 34.1101 418.368 33.6871 418.63 33.34V33.34Z" fill="#252F3F"/>
<path d="M434.3 38.9L437.3 40.66C442.14 37.07 442.14 32.01 437.3 28.42L434.3 30.19C437.51 32.78 437.51 36.3 434.3 38.9Z" fill="#252F3F"/>
<path d="M431.28 40.64C426.418 42.4999 421.042 42.4999 416.18 40.64L413.13 42.4C419.916 45.1997 427.534 45.1997 434.32 42.4L431.28 40.64Z" fill="#252F3F"/>
<path d="M416.18 28.44C421.039 26.5846 426.411 26.5846 431.27 28.44L434.32 26.68C427.532 23.8901 419.918 23.8901 413.13 26.68L416.18 28.44Z" fill="#252F3F"/>
<path d="M413.16 30.18L410.11 28.42C405.27 32.01 405.27 37.07 410.11 40.66L413.16 38.9C410 36.3 409.94 32.78 413.16 30.18Z" fill="#252F3F"/>
<path d="M439.63 42L442.63 43.75C450.35 38.46 450.35 30.67 442.63 25.37L439.63 27.12C445.71 31.42 445.7 37.66 439.63 42Z" fill="#252F3F"/>
<path d="M436.61 43.72C429.13 47.23 418.32 47.23 410.84 43.72L407.84 45.47C417.01 49.92 430.5 49.92 439.67 45.47L436.61 43.72Z" fill="#252F3F"/>
<path d="M410.84 25.36C418.33 21.85 429.13 21.85 436.61 25.36L439.61 23.61C430.44 19.15 416.95 19.15 407.78 23.61L410.84 25.36Z" fill="#252F3F"/>
<path d="M407.82 27.1L404.82 25.35C397.1 30.65 397.1 38.44 404.82 43.73L407.82 41.98C401.75 37.66 401.75 31.42 407.82 27.1Z" fill="#252F3F"/>
<path opacity="0.4" d="M177.61 230.93L101.19 186.81L177.61 142.69L254.03 186.81L177.61 230.93Z" fill="#E5E7EB"/>
<path d="M251.6 177.06L184.96 138.59L118.32 177.06L108.54 171.42V182.71L184.96 226.82L261.38 182.71V171.42L251.6 177.06Z" fill="#9FA6B2"/>
<path d="M184.96 215.54L108.54 171.42L184.96 127.3L261.38 171.42L184.96 215.54Z" fill="#F6F5FF"/>
<path d="M184.96 78.58L121.53 41.95L184.96 5.33L248.4 41.95L184.96 78.58Z" fill="#F6F5FF"/>
<path d="M121.53 41.95V172.53L184.96 209.16V78.58L121.53 41.95Z" fill="#E5E7EB"/>
<path d="M184.96 209.16L248.4 172.53V41.95L184.96 78.58V209.16Z" fill="#D2D6DC"/>
<path d="M206.51 94.56L195.53 100.9V88.22L206.51 81.88V94.56Z" fill="#252F3F"/>
<path d="M241.31 74.47L209.86 92.63V79.94L241.31 61.78V74.47Z" fill="#252F3F"/>
<path d="M206.51 113.04L195.53 119.38V106.7L206.51 100.36V113.04Z" fill="#252F3F"/>
<path d="M241.31 92.95L209.86 111.11V98.43L241.31 80.27V92.95Z" fill="#252F3F"/>
<path d="M206.51 131.52L195.53 137.86V125.18L206.51 118.84V131.52Z" fill="#252F3F"/>
<path d="M241.31 111.43L209.86 129.59V116.91L241.31 98.75V111.43Z" fill="#252F3F"/>
<path d="M206.51 150L195.53 156.34V143.66L206.51 137.32V150Z" fill="#252F3F"/>
<path d="M241.31 129.91L209.86 148.07V135.39L241.31 117.23V129.91Z" fill="#252F3F"/>
<path d="M206.51 168.49L195.53 174.83V162.15L206.51 155.81V168.49Z" fill="#252F3F"/>
<path d="M241.31 148.39L209.86 166.55V153.87L241.31 135.71V148.39Z" fill="#252F3F"/>
<path d="M140.37 82.24L129.46 75.94V63.34L140.37 69.64V82.24Z" fill="#252F3F"/>
<path d="M174.94 102.2L143.69 84.16V71.56L174.94 89.61V102.2Z" fill="#252F3F"/>
<path d="M140.37 100.6L129.46 94.3V81.71L140.37 88.01V100.6Z" fill="#252F3F"/>
<path d="M174.94 120.57L143.69 102.53V89.93L174.94 107.97V120.57Z" fill="#252F3F"/>
<path d="M140.37 118.97L129.46 112.67V100.07L140.37 106.37V118.97Z" fill="#252F3F"/>
<path d="M174.94 138.93L143.69 120.89V108.29L174.94 126.33V138.93Z" fill="#252F3F"/>
<path d="M140.37 137.33L129.46 131.03V118.43L140.37 124.73V137.33Z" fill="#252F3F"/>
<path d="M174.94 157.29L143.69 139.25V126.65L174.94 144.69V157.29Z" fill="#252F3F"/>
<path d="M140.37 155.69L129.46 149.39V136.79L140.37 143.09V155.69Z" fill="#252F3F"/>
<path d="M174.94 175.65L143.69 157.61V145.01L174.94 163.06V175.65Z" fill="#252F3F"/>
<path d="M121.53 165.21L184.96 201.18L248.4 163.92V172.53L184.96 209.16L121.53 172.53V165.21Z" fill="#C27803"/>
<path d="M186.32 42.82C184.951 43.13 183.529 43.13 182.16 42.82L179 44.64C182.399 45.8103 186.091 45.8103 189.49 44.64L186.32 42.82Z" fill="#252F3F"/>
<path d="M189.34 41.07L192.51 42.9C192.97 42.5471 193.343 42.0929 193.6 41.5727C193.857 41.0524 193.99 40.4801 193.99 39.9C193.99 39.3199 193.857 38.7475 193.6 38.2273C193.343 37.7071 192.97 37.2529 192.51 36.9L189.35 38.72C189.597 39.0626 189.728 39.4745 189.727 39.8966C189.725 40.3187 189.589 40.7295 189.34 41.07V41.07Z" fill="#252F3F"/>
<path d="M182.17 36.93C183.539 36.62 184.961 36.62 186.33 36.93L189.49 35.11C186.09 33.945 182.4 33.945 179 35.11L182.17 36.93Z" fill="#252F3F"/>
<path d="M179.15 38.67L176 36.85C175.54 37.2029 175.167 37.6571 174.91 38.1773C174.653 38.6976 174.52 39.2699 174.52 39.85C174.52 40.4301 174.653 41.0025 174.91 41.5227C175.167 42.0429 175.54 42.4971 176 42.85L179.16 41.03C178.908 40.6885 178.772 40.2759 178.77 39.8516C178.768 39.4274 178.901 39.0136 179.15 38.67V38.67Z" fill="#252F3F"/>
<path d="M194.82 44.23L197.82 45.99C202.66 42.4 202.66 37.34 197.82 33.75L194.77 35.52C198 38.12 198 41.63 194.82 44.23Z" fill="#252F3F"/>
<path d="M191.79 46C186.931 47.8554 181.559 47.8554 176.7 46L173.7 47.76C180.486 50.5597 188.104 50.5597 194.89 47.76L191.79 46Z" fill="#252F3F"/>
<path d="M176.7 33.77C181.559 31.9146 186.931 31.9146 191.79 33.77L194.84 32C188.052 29.2101 180.438 29.2101 173.65 32L176.7 33.77Z" fill="#252F3F"/>
<path d="M173.68 35.51L170.63 33.76C165.79 37.34 165.79 42.4 170.63 45.99L173.68 44.23C170.47 41.63 170.46 38.11 173.68 35.51Z" fill="#252F3F"/>
<path d="M200.15 47.31L203.15 49.06C210.87 43.77 210.87 35.98 203.15 30.68L200.15 32.43C206.22 36.75 206.22 43 200.15 47.31Z" fill="#252F3F"/>
<path d="M197.13 49.05C189.64 52.56 178.84 52.56 171.36 49.05L168.36 50.8C177.53 55.25 191.02 55.25 200.19 50.8L197.13 49.05Z" fill="#252F3F"/>
<path d="M171.36 30.69C178.85 27.19 189.65 27.18 197.13 30.69L200.13 28.94C190.96 24.48 177.47 24.48 168.3 28.94L171.36 30.69Z" fill="#252F3F"/>
<path d="M168.34 32.43L165.34 30.68C157.62 35.98 157.62 43.77 165.34 49.06L168.34 47.31C162.27 43 162.27 36.76 168.34 32.43Z" fill="#252F3F"/>
<path opacity="0.4" d="M293.1 296.86L216.68 252.74L293.1 208.62L369.52 252.74L293.1 296.86Z" fill="#E5E7EB"/>
<path d="M367.09 242.99L300.45 204.51L233.81 242.99L224.03 237.35V248.63L300.45 292.75L376.87 248.64V237.35L367.09 242.99Z" fill="#9FA6B2"/>
<path d="M300.45 281.47L224.03 237.35L300.45 193.23L376.87 237.35L300.45 281.47Z" fill="#F6F5FF"/>
<path d="M300.45 144.51L237.02 107.88L300.45 71.26L363.88 107.89L300.45 144.51Z" fill="#F6F5FF"/>
<path d="M237.02 107.88V238.46L300.45 275.09V144.51L237.02 107.88Z" fill="#E5E7EB"/>
<path d="M300.45 275.09L363.88 238.47V107.89L300.45 144.51V275.09Z" fill="#D2D6DC"/>
<path d="M322 160.49L311.02 166.83V154.15L322 147.81V160.49Z" fill="#252F3F"/>
<path d="M356.8 140.4L325.35 158.56V145.88L356.8 127.72V140.4Z" fill="#252F3F"/>
<path d="M322 178.97L311.02 185.31V172.63L322 166.29V178.97Z" fill="#252F3F"/>
<path d="M356.8 158.88L325.35 177.04V164.36L356.8 146.2V158.88Z" fill="#252F3F"/>
<path d="M322 197.45L311.02 203.79V191.11L322 184.77V197.45Z" fill="#252F3F"/>
<path d="M356.8 177.36L325.35 195.52V182.84L356.8 164.68V177.36Z" fill="#252F3F"/>
<path d="M322 215.93L311.02 222.27V209.59L322 203.25V215.93Z" fill="#252F3F"/>
<path d="M356.8 195.84L325.35 214V201.32L356.8 183.16V195.84Z" fill="#252F3F"/>
<path d="M322 234.42L311.02 240.76V228.08L322 221.74V234.42Z" fill="#252F3F"/>
<path d="M356.8 214.32L325.35 232.48V219.8L356.8 201.64V214.32Z" fill="#252F3F"/>
<path d="M255.85 148.17L244.94 141.87V129.28L255.85 135.57V148.17Z" fill="#252F3F"/>
<path d="M290.43 168.13L259.18 150.09V137.5L290.43 155.54V168.13Z" fill="#252F3F"/>
<path d="M255.85 166.53L244.94 160.23V147.64L255.85 153.94V166.53Z" fill="#252F3F"/>
<path d="M290.43 186.5L259.18 168.46V155.86L290.43 173.9V186.5Z" fill="#252F3F"/>
<path d="M255.85 184.9L244.94 178.6V166L255.85 172.3V184.9Z" fill="#252F3F"/>
<path d="M290.43 204.86L259.18 186.82V174.22L290.43 192.26V204.86Z" fill="#252F3F"/>
<path d="M255.85 203.26L244.94 196.96V184.36L255.85 190.66V203.26Z" fill="#252F3F"/>
<path d="M290.43 223.22L259.18 205.18V192.58L290.43 210.62V223.22Z" fill="#252F3F"/>
<path d="M255.85 221.62L244.94 215.32V202.72L255.85 209.02V221.62Z" fill="#252F3F"/>
<path d="M290.43 241.58L259.18 223.54V210.94L290.43 228.99V241.58Z" fill="#252F3F"/>
<path d="M237.02 231.14L300.45 267.11L363.88 229.85V238.47L300.45 275.09L237.02 238.46V231.14Z" fill="#C27803"/>
<path d="M301.81 108.75C300.441 109.06 299.019 109.06 297.65 108.75L294.49 110.57C297.889 111.74 301.581 111.74 304.98 110.57L301.81 108.75Z" fill="#252F3F"/>
<path d="M304.83 107L308 108.83C308.46 108.477 308.833 108.023 309.09 107.503C309.347 106.982 309.48 106.41 309.48 105.83C309.48 105.25 309.347 104.678 309.09 104.157C308.833 103.637 308.46 103.183 308 102.83L304.84 104.65C305.087 104.993 305.218 105.405 305.217 105.827C305.215 106.249 305.079 106.659 304.83 107Z" fill="#252F3F"/>
<path d="M297.66 102.86C299.029 102.55 300.451 102.55 301.82 102.86L305 101C301.6 99.835 297.91 99.835 294.51 101L297.66 102.86Z" fill="#252F3F"/>
<path d="M294.64 104.6L291.47 102.78C291.01 103.133 290.637 103.587 290.38 104.107C290.123 104.628 289.99 105.2 289.99 105.78C289.99 106.36 290.123 106.932 290.38 107.453C290.637 107.973 291.01 108.427 291.47 108.78L294.63 106.96C294.381 106.616 294.248 106.203 294.25 105.778C294.252 105.354 294.388 104.941 294.64 104.6V104.6Z" fill="#252F3F"/>
<path d="M310.31 110.16L313.31 111.92C318.15 108.33 318.15 103.27 313.31 99.68L310.26 101.45C313.51 104.05 313.52 107.56 310.31 110.16Z" fill="#252F3F"/>
<path d="M307.28 111.91C302.421 113.765 297.049 113.765 292.19 111.91L289.14 113.67C295.926 116.47 303.544 116.47 310.33 113.67L307.28 111.91Z" fill="#252F3F"/>
<path d="M292.19 99.7C297.049 97.8446 302.421 97.8446 307.28 99.7L310.33 97.94C303.542 95.1501 295.928 95.1501 289.14 97.94L292.19 99.7Z" fill="#252F3F"/>
<path d="M289.16 101.44L286.16 99.69C281.32 103.27 281.32 108.33 286.16 111.92L289.21 110.16C286 107.56 286 104 289.16 101.44Z" fill="#252F3F"/>
<path d="M315.64 113.24L318.64 114.99C326.36 109.7 326.36 101.91 318.64 96.61L315.64 98.36C321.71 102.68 321.71 108.92 315.64 113.24Z" fill="#252F3F"/>
<path d="M312.62 115C305.13 118.51 294.33 118.51 286.85 115L283.85 116.75C293.02 121.2 306.51 121.2 315.68 116.75L312.62 115Z" fill="#252F3F"/>
<path d="M286.85 96.62C294.34 93.12 305.14 93.11 312.62 96.62L315.62 94.87C306.45 90.41 292.96 90.41 283.79 94.87L286.85 96.62Z" fill="#252F3F"/>
<path d="M283.83 98.36L280.83 96.61C273.11 101.91 273.11 109.7 280.83 114.99L283.83 113.24C277.76 108.92 277.76 102.69 283.83 98.36Z" fill="#252F3F"/>
<path opacity="0.4" d="M417.23 368.59L340.81 324.47L417.23 280.35L493.65 324.47L417.23 368.59Z" fill="#E5E7EB"/>
<path d="M491.23 314.72L424.58 276.25L357.94 314.72L348.16 309.08V320.37L424.58 364.49L501 320.37V309.08L491.23 314.72Z" fill="#9FA6B2"/>
<path d="M424.58 353.2L348.16 309.08L424.58 264.96L501 309.08L424.58 353.2Z" fill="#F6F5FF"/>
<path d="M424.58 216.24L361.15 179.62L424.58 142.99L488.01 179.62L424.58 216.24Z" fill="#F6F5FF"/>
<path d="M361.15 179.62V310.19L424.58 346.82V216.24L361.15 179.62Z" fill="#E5E7EB"/>
<path d="M424.58 346.82L488.01 310.2V179.62L424.58 216.24V346.82Z" fill="#D2D6DC"/>
<path d="M446.13 232.22L435.15 238.56V225.88L446.13 219.54V232.22Z" fill="#252F3F"/>
<path d="M480.93 212.13L449.48 230.29V217.61L480.93 199.45V212.13Z" fill="#252F3F"/>
<path d="M446.13 250.7L435.15 257.04V244.36L446.13 238.02V250.7Z" fill="#252F3F"/>
<path d="M480.93 230.61L449.48 248.77V236.09L480.93 217.93V230.61Z" fill="#252F3F"/>
<path d="M446.13 269.18L435.15 275.52V262.84L446.13 256.5V269.18Z" fill="#252F3F"/>
<path d="M480.93 249.09L449.48 267.25V254.57L480.93 236.41V249.09Z" fill="#252F3F"/>
<path d="M446.13 287.67L435.15 294.01V281.33L446.13 274.99V287.67Z" fill="#252F3F"/>
<path d="M480.93 267.57L449.48 285.73V273.05L480.93 254.89V267.57Z" fill="#252F3F"/>
<path d="M446.13 306.15L435.15 312.49V299.81L446.13 293.47V306.15Z" fill="#252F3F"/>
<path d="M480.93 286.05L449.48 304.21V291.53L480.93 273.37V286.05Z" fill="#252F3F"/>
<path d="M379.99 219.9L369.08 213.6V201.01L379.99 207.31V219.9Z" fill="#252F3F"/>
<path d="M414.56 239.87L383.31 221.82V209.23L414.56 227.27V239.87Z" fill="#252F3F"/>
<path d="M379.99 238.26L369.08 231.97V219.37L379.99 225.67V238.26Z" fill="#252F3F"/>
<path d="M414.56 258.23L383.31 240.19V227.59L414.56 245.63V258.23Z" fill="#252F3F"/>
<path d="M379.99 256.63L369.08 250.33V237.73L379.99 244.03V256.63Z" fill="#252F3F"/>
<path d="M414.56 276.59L383.31 258.55V245.95L414.56 263.99V276.59Z" fill="#252F3F"/>
<path d="M379.99 274.99L369.08 268.69V256.09L379.99 262.39V274.99Z" fill="#252F3F"/>
<path d="M414.56 294.95L383.31 276.91V264.31L414.56 282.36V294.95Z" fill="#252F3F"/>
<path d="M379.99 293.35L369.08 287.05V274.45L379.99 280.75V293.35Z" fill="#252F3F"/>
<path d="M414.56 313.31L383.31 295.27V282.67L414.56 300.72V313.31Z" fill="#252F3F"/>
<path d="M361.15 302.88L424.58 338.84L488.01 301.58V310.2L424.58 346.82L361.15 310.19V302.88Z" fill="#C27803"/>
<path d="M425.94 180.48C424.571 180.795 423.149 180.795 421.78 180.48L418.62 182.3C422.019 183.47 425.711 183.47 429.11 182.3L425.94 180.48Z" fill="#252F3F"/>
<path d="M429 178.73L432.17 180.56C432.64 180.208 433.021 179.751 433.284 179.226C433.547 178.701 433.683 178.122 433.683 177.535C433.683 176.948 433.547 176.369 433.284 175.844C433.021 175.319 432.64 174.862 432.17 174.51L429 176.33C429.26 176.676 429.4 177.097 429.4 177.53C429.4 177.963 429.26 178.384 429 178.73Z" fill="#252F3F"/>
<path d="M421.79 174.59C423.159 174.275 424.581 174.275 425.95 174.59L429.11 172.76C425.713 171.6 422.027 171.6 418.63 172.76L421.79 174.59Z" fill="#252F3F"/>
<path d="M418.77 176.33L415.6 174.51C415.13 174.862 414.749 175.319 414.486 175.844C414.223 176.369 414.087 176.948 414.087 177.535C414.087 178.122 414.223 178.701 414.486 179.226C414.749 179.751 415.13 180.208 415.6 180.56L418.76 178.74C418.499 178.392 418.359 177.968 418.361 177.533C418.363 177.098 418.507 176.676 418.77 176.33V176.33Z" fill="#252F3F"/>
<path d="M434.44 181.89L437.44 183.65C442.28 180.07 442.28 175 437.44 171.42L434.39 173.18C437.65 175.78 437.65 179.3 434.44 181.89Z" fill="#252F3F"/>
<path d="M431.42 183.64C426.558 185.495 421.182 185.495 416.32 183.64L413.27 185.41C420.058 188.2 427.672 188.2 434.46 185.41L431.42 183.64Z" fill="#252F3F"/>
<path d="M416.32 171.43C421.18 169.58 426.55 169.58 431.41 171.43L434.41 169.67C427.622 166.88 420.008 166.88 413.22 169.67L416.32 171.43Z" fill="#252F3F"/>
<path d="M413.3 173.18L410.25 171.42C405.41 175 405.41 180.07 410.25 183.65L413.3 181.89C410.09 179.29 410.08 175.77 413.3 173.18Z" fill="#252F3F"/>
<path d="M439.77 185L442.77 186.75C450.49 181.46 450.49 173.67 442.77 168.37L439.77 170.12C445.84 174.42 445.84 180.65 439.77 185Z" fill="#252F3F"/>
<path d="M436.75 186.72C429.26 190.22 418.46 190.22 410.98 186.72L407.98 188.47C417.15 192.92 430.64 192.92 439.81 188.47L436.75 186.72Z" fill="#252F3F"/>
<path d="M411 168.35C418.49 164.85 429.29 164.84 436.77 168.35L439.77 166.6C430.6 162.14 417.11 162.15 407.94 166.6L411 168.35Z" fill="#252F3F"/>
<path d="M408 170.1L405 168.35C397.28 173.64 397.28 181.43 405 186.72L408 184.97C401.89 180.65 401.89 174.42 408 170.1Z" fill="#252F3F"/>
<path opacity="0.4" d="M50.31 426.28L4.50997 399.83C-0.690029 396.83 -0.0400295 391.6 5.95997 388.14L29.21 374.71C35.21 371.25 44.28 370.87 49.47 373.87L95.27 400.32C100.47 403.32 99.81 408.55 93.82 412.01L70.57 425.44C64.57 428.9 55.5 429.28 50.31 426.28Z" fill="#CDDBFE"/>
<path d="M119.1 393.28V329.34L21.35 318.34V382.68C21.28 384.68 22.41 386.52 24.83 387.92L70.63 414.36C75.82 417.36 84.9 416.98 90.89 413.52L114.14 400.1C117.52 398.1 119.2 395.64 119.14 393.28H119.1Z" fill="#CDDBFE"/>
<path d="M119.08 336.32V329.32H111.56L69.8 305.22C64.61 302.22 55.54 302.6 49.54 306.06L26.29 319.48C25.8768 319.719 25.4762 319.979 25.09 320.26L21.35 318.34C21.35 318.34 21.35 325.71 21.35 325.96C21.3 327.96 22.43 329.79 24.84 331.18L70.64 357.62C75.83 360.62 84.91 360.25 90.9 356.78L114.15 343.36C117.63 341.36 119.3 338.75 119.08 336.36V336.32Z" fill="#F0F5FF"/>
<path d="M70.6299 350L24.8299 323.56C19.6399 320.56 20.2899 315.33 26.2899 311.86L49.5399 298.44C55.5399 294.98 64.6099 294.6 69.7999 297.6L115.6 324.04C120.79 327.04 120.14 332.28 114.14 335.74L90.8899 349.18C84.8999 352.65 75.8199 353 70.6299 350Z" fill="#E5EDFF"/>
<path d="M94.16 326C94.1657 326.407 94.0608 326.808 93.8565 327.16C93.6523 327.513 93.3562 327.803 93 328L71.9 340.18C71.5576 340.376 71.1698 340.48 70.775 340.48C70.3802 340.48 69.9924 340.376 69.65 340.18L40.13 323.07C39.7861 322.874 39.5004 322.59 39.3019 322.247C39.1034 321.905 38.9992 321.516 39 321.12V321L94.16 326Z" fill="#F4F5F7"/>
<path d="M93 328L71.9 340.18C71.5595 340.377 71.1732 340.48 70.78 340.48V326H94.16C94.1657 326.407 94.0609 326.808 93.8566 327.16C93.6523 327.513 93.3563 327.803 93 328V328Z" fill="#F4F5F7"/>
<path d="M71.61 339C71.3659 339.143 71.088 339.219 70.805 339.219C70.522 339.219 70.2441 339.143 70 339L39.3 321.29C39.2129 321.262 39.1368 321.208 39.0828 321.134C39.0288 321.06 38.9996 320.971 38.9996 320.88C38.9996 320.789 39.0288 320.7 39.0828 320.626C39.1368 320.552 39.2129 320.498 39.3 320.47L61.93 307.4L94.16 326L71.61 339Z" fill="#F9FAFB"/>
<path d="M51.92 326.01L52.08 326.1L61.93 331.79L67.33 328.67L67.48 328.58L57.48 322.8L51.92 326.01Z" fill="#D2D6DC"/>
<path d="M52.0801 326.1L61.9301 331.79L67.3301 328.67L57.4801 322.98L52.0801 326.1Z" fill="#F4F5F7"/>
<path d="M85.6101 327.13L87.0001 328C87.0693 328.037 87.1466 328.056 87.2251 328.056C87.3035 328.056 87.3808 328.037 87.45 328L88.8001 327.22C88.9401 327.14 88.9501 327.03 88.8001 326.96L87.38 326.14C87.3108 326.103 87.2335 326.084 87.1551 326.084C87.0766 326.084 86.9993 326.103 86.9301 326.14L85.5801 326.92C85.5101 327 85.5001 327.06 85.6101 327.13Z" fill="#252F3F"/>
<path d="M83.6 326L85.02 326.82C85.0911 326.857 85.17 326.876 85.25 326.876C85.3301 326.876 85.4089 326.857 85.48 326.82L86.83 326.04C86.97 325.96 86.98 325.84 86.83 325.78L85.41 324.96C85.3407 324.923 85.2635 324.904 85.185 324.904C85.1066 324.904 85.0293 324.923 84.96 324.96L83.61 325.74C83.5 325.79 83.49 325.9 83.6 326Z" fill="#252F3F"/>
<path d="M81.59 324.81L83.01 325.63C83.0811 325.667 83.16 325.686 83.24 325.686C83.32 325.686 83.3989 325.667 83.47 325.63L84.82 324.85C84.95 324.77 84.97 324.65 84.82 324.59L83.4 323.77C83.3307 323.733 83.2535 323.714 83.175 323.714C83.0966 323.714 83.0193 323.733 82.95 323.77L81.6 324.55C81.49 324.63 81.48 324.74 81.59 324.81Z" fill="#252F3F"/>
<path d="M79.58 323.65L81 324.47C81.0711 324.507 81.1499 324.526 81.23 324.526C81.31 324.526 81.3889 324.507 81.46 324.47L82.81 323.69C82.94 323.61 82.96 323.49 82.81 323.43L81.39 322.61C81.3207 322.573 81.2434 322.554 81.165 322.554C81.0865 322.554 81.0093 322.573 80.94 322.61L79.59 323.39C79.48 323.46 79.47 323.58 79.58 323.65Z" fill="#252F3F"/>
<path d="M77.57 322.49L78.99 323.31C79.06 323.344 79.137 323.362 79.215 323.362C79.293 323.362 79.37 323.344 79.44 323.31L80.8 322.53C80.93 322.45 80.95 322.33 80.8 322.27L79.38 321.45C79.31 321.416 79.233 321.398 79.155 321.398C79.077 321.398 79 321.416 78.93 321.45L77.57 322.24C77.47 322.3 77.46 322.42 77.57 322.49Z" fill="#252F3F"/>
<path d="M75.56 321.33L76.98 322.15C77.05 322.184 77.127 322.202 77.205 322.202C77.283 322.202 77.36 322.184 77.43 322.15L78.79 321.37C78.92 321.29 78.94 321.17 78.79 321.1L77.37 320.28C77.2992 320.248 77.2225 320.232 77.145 320.232C77.0674 320.232 76.9908 320.248 76.92 320.28L75.56 321.07C75.46 321.14 75.45 321.26 75.56 321.33Z" fill="#252F3F"/>
<path d="M73.55 320.17L75 321C75.0708 321.032 75.1475 321.048 75.225 321.048C75.3026 321.048 75.3792 321.032 75.45 321L76.81 320.21C76.94 320.14 76.96 320.02 76.81 319.95L75.39 319.13C75.3192 319.098 75.2426 319.082 75.165 319.082C75.0875 319.082 75.0108 319.098 74.94 319.13L73.58 319.91C73.45 320 73.43 320.1 73.55 320.17Z" fill="#252F3F"/>
<path d="M71.5401 319L72.9601 319.82C73.0308 319.852 73.1075 319.868 73.1851 319.868C73.2626 319.868 73.3393 319.852 73.4101 319.82L74.7701 319.03C74.9001 318.96 74.9201 318.84 74.7701 318.77L73.3501 317.95C73.2801 317.916 73.2031 317.898 73.1251 317.898C73.0471 317.898 72.9701 317.916 72.9001 317.95L71.5401 318.73C71.4401 318.82 71.4201 318.94 71.5401 319Z" fill="#252F3F"/>
<path d="M69.5301 317.84L70.9501 318.66C71.0201 318.694 71.097 318.712 71.1751 318.712C71.2531 318.712 71.33 318.694 71.4001 318.66L72.7601 317.87C72.8901 317.8 72.9101 317.68 72.7601 317.61L71.3401 316.79C71.27 316.756 71.1931 316.738 71.1151 316.738C71.037 316.738 70.9601 316.756 70.8901 316.79L69.5301 317.57C69.4301 317.66 69.4101 317.78 69.5301 317.84Z" fill="#252F3F"/>
<path d="M67.52 316.68L68.9401 317.5C69.0094 317.537 69.0866 317.556 69.1651 317.556C69.2435 317.556 69.3208 317.537 69.3901 317.5L70.7501 316.72C70.8801 316.64 70.8901 316.53 70.7501 316.46L69.3301 315.64C69.2608 315.603 69.1835 315.584 69.1051 315.584C69.0266 315.584 68.9493 315.603 68.88 315.64L67.52 316.42C67.42 316.5 67.4 316.62 67.52 316.68Z" fill="#252F3F"/>
<path d="M65.51 315.52L66.93 316.34C66.9993 316.377 67.0766 316.396 67.155 316.396C67.2335 316.396 67.3107 316.377 67.38 316.34L68.74 315.56C68.87 315.48 68.88 315.37 68.74 315.3L67.32 314.48C67.2507 314.443 67.1735 314.424 67.095 314.424C67.0166 314.424 66.9393 314.443 66.87 314.48L65.51 315.26C65.41 315.34 65.39 315.46 65.51 315.52Z" fill="#252F3F"/>
<path d="M63.5001 314.36L64.9201 315.18C64.9893 315.217 65.0666 315.236 65.1451 315.236C65.2235 315.236 65.3008 315.217 65.3701 315.18L66.7201 314.4C66.8601 314.32 66.8701 314.21 66.7201 314.14L65.3001 313.32C65.229 313.283 65.1501 313.264 65.0701 313.264C64.99 313.264 64.9111 313.283 64.8401 313.32L63.4901 314.1C63.4001 314.18 63.3801 314.29 63.5001 314.36Z" fill="#252F3F"/>
<path d="M61.49 313.2L62.91 314.02C62.9793 314.057 63.0566 314.076 63.135 314.076C63.2135 314.076 63.2907 314.057 63.36 314.02L64.71 313.24C64.85 313.16 64.86 313.05 64.71 312.98L63.29 312.16C63.219 312.123 63.1401 312.104 63.06 312.104C62.98 312.104 62.9011 312.123 62.83 312.16L61.48 312.94C61.39 313 61.37 313.13 61.49 313.2Z" fill="#252F3F"/>
<path d="M58.5101 311.48L60.9001 312.86C60.9694 312.897 61.0466 312.916 61.1251 312.916C61.2035 312.916 61.2808 312.897 61.3501 312.86L62.7001 312.08C62.8401 312 62.8501 311.88 62.7001 311.82L60.3101 310.44C60.2408 310.403 60.1635 310.384 60.0851 310.384C60.0066 310.384 59.9294 310.403 59.8601 310.44L58.5001 311.22C58.4101 311.3 58.3901 311.41 58.5101 311.48Z" fill="#252F3F"/>
<path d="M80.68 326.53L82.1 327.35C82.1717 327.385 82.2503 327.402 82.33 327.402C82.4096 327.402 82.4882 327.385 82.56 327.35L83.91 326.56C84.04 326.49 84.06 326.37 83.91 326.3L82.49 325.48C82.42 325.446 82.343 325.428 82.265 325.428C82.1869 325.428 82.11 325.446 82.04 325.48L80.69 326.26C80.58 326.35 80.57 326.47 80.68 326.53Z" fill="#252F3F"/>
<path d="M78.6701 325.37L80.0901 326.19C80.1594 326.227 80.2366 326.246 80.3151 326.246C80.3935 326.246 80.4708 326.227 80.5401 326.19L81.9001 325.41C82.0301 325.33 82.0501 325.22 81.9001 325.15L80.4801 324.33C80.4108 324.293 80.3335 324.274 80.2551 324.274C80.1766 324.274 80.0994 324.293 80.0301 324.33L78.6701 325.11C78.5701 325.19 78.5501 325.3 78.6701 325.37Z" fill="#252F3F"/>
<path d="M76.65 324.21L78.08 325.03C78.1493 325.067 78.2265 325.086 78.305 325.086C78.3834 325.086 78.4607 325.067 78.53 325.03L79.88 324.25C80.02 324.17 80.03 324.05 79.88 323.99L78.45 323.17C78.3807 323.133 78.3034 323.114 78.225 323.114C78.1465 323.114 78.0693 323.133 78 323.17L76.65 323.95C76.55 324 76.54 324.14 76.65 324.21Z" fill="#252F3F"/>
<path d="M74.64 323.05L76.06 323.87C76.1308 323.902 76.2074 323.918 76.285 323.918C76.3625 323.918 76.4392 323.902 76.51 323.87L77.87 323.08C78 323.01 78.02 322.89 77.87 322.82L76.48 322C76.41 321.966 76.333 321.948 76.255 321.948C76.177 321.948 76.1 321.966 76.03 322L74.67 322.78C74.54 322.86 74.52 323 74.64 323.05Z" fill="#252F3F"/>
<path d="M72.64 321.89L74.06 322.71C74.1311 322.747 74.21 322.766 74.29 322.766C74.3701 322.766 74.449 322.747 74.52 322.71L75.8701 321.93C76.0001 321.85 76.0201 321.74 75.8701 321.67L74.45 320.85C74.3807 320.813 74.3035 320.794 74.225 320.794C74.1466 320.794 74.0693 320.813 74 320.85L72.65 321.63C72.54 321.71 72.53 321.83 72.64 321.89Z" fill="#252F3F"/>
<path d="M70.63 320.73L72.05 321.55C72.1193 321.587 72.1966 321.606 72.275 321.606C72.3535 321.606 72.4307 321.587 72.5 321.55L73.86 320.77C73.99 320.69 74 320.57 73.86 320.51L72.44 319.69C72.3707 319.653 72.2935 319.634 72.215 319.634C72.1366 319.634 72.0593 319.653 71.99 319.69L70.63 320.47C70.53 320.55 70.51 320.66 70.63 320.73Z" fill="#252F3F"/>
<path d="M68.61 319.57L70.03 320.39C70.1025 320.422 70.1808 320.438 70.26 320.438C70.3392 320.438 70.4175 320.422 70.49 320.39L71.84 319.61C71.98 319.53 71.99 319.41 71.84 319.34L70.42 318.52C70.3492 318.488 70.2726 318.472 70.195 318.472C70.1175 318.472 70.0408 318.488 69.97 318.52L68.62 319.31C68.51 319.38 68.5 319.5 68.61 319.57Z" fill="#252F3F"/>
<path d="M66.6 318.4L68.02 319.22C68.0893 319.257 68.1666 319.276 68.245 319.276C68.3235 319.276 68.4007 319.257 68.47 319.22L69.83 318.44C69.96 318.37 69.98 318.25 69.83 318.18L68.41 317.36C68.3407 317.323 68.2635 317.304 68.185 317.304C68.1066 317.304 68.0293 317.323 67.96 317.36L66.6 318.14C66.5 318.22 66.48 318.34 66.6 318.4Z" fill="#252F3F"/>
<path d="M64.5901 317.24L66.0101 318.06C66.0794 318.097 66.1566 318.116 66.2351 318.116C66.3135 318.116 66.3908 318.097 66.4601 318.06L67.8101 317.28C67.9501 317.2 67.9601 317.09 67.8101 317.02L66.3901 316.2C66.319 316.163 66.2401 316.144 66.1601 316.144C66.08 316.144 66.0011 316.163 65.9301 316.2L64.5801 316.98C64.4801 317.06 64.4701 317.17 64.5901 317.24Z" fill="#252F3F"/>
<path d="M62.57 316.08L63.99 316.9C64.06 316.934 64.137 316.952 64.215 316.952C64.293 316.952 64.37 316.934 64.44 316.9L65.8 316.12C65.93 316.04 65.95 315.92 65.8 315.86L64.41 315C64.34 314.966 64.263 314.948 64.185 314.948C64.107 314.948 64.03 314.966 63.96 315L62.6 315.79C62.47 315.89 62.46 316 62.57 316.08Z" fill="#252F3F"/>
<path d="M60.56 314.91L61.98 315.73C62.05 315.764 62.127 315.782 62.205 315.782C62.283 315.782 62.36 315.764 62.43 315.73L63.79 314.94C63.92 314.87 63.93 314.75 63.79 314.68L62.37 313.86C62.3 313.826 62.223 313.808 62.145 313.808C62.0669 313.808 61.99 313.826 61.92 313.86L60.56 314.64C60.46 314.73 60.44 314.85 60.56 314.91Z" fill="#252F3F"/>
<path d="M58.5401 313.75L59.9601 314.57C60.0311 314.607 60.11 314.626 60.1901 314.626C60.2701 314.626 60.349 314.607 60.4201 314.57L61.7701 313.79C61.9101 313.71 61.9201 313.6 61.7701 313.53L60.3501 312.71C60.2808 312.673 60.2035 312.654 60.1251 312.654C60.0466 312.654 59.9694 312.673 59.9001 312.71L58.5501 313.49C58.4401 313.57 58.4301 313.69 58.5401 313.75Z" fill="#252F3F"/>
<path d="M82.7 327.7L85.09 329.08C85.1608 329.112 85.2375 329.128 85.315 329.128C85.3926 329.128 85.4692 329.112 85.54 329.08L86.89 328.3C87.03 328.22 87.04 328.1 86.89 328.03L84.5 326.65C84.4292 326.618 84.3526 326.602 84.275 326.602C84.1975 326.602 84.1208 326.618 84.05 326.65L82.69 327.44C82.6 327.51 82.58 327.63 82.7 327.7Z" fill="#252F3F"/>
<path d="M58.38 311.54L59.8 312.36C59.91 312.42 59.91 312.53 59.8 312.6L58.36 313.43C58.2946 313.462 58.2228 313.478 58.15 313.478C58.0773 313.478 58.0055 313.462 57.94 313.43L57.83 313.36C57.7692 313.331 57.7025 313.316 57.635 313.316C57.5675 313.316 57.5009 313.331 57.44 313.36L55.93 314.24C55.8653 314.274 55.7932 314.292 55.72 314.292C55.6468 314.292 55.5748 314.274 55.51 314.24L54.6 313.72C54.5769 313.708 54.5574 313.69 54.5438 313.668C54.5303 313.646 54.5231 313.621 54.5231 313.595C54.5231 313.569 54.5303 313.544 54.5438 313.522C54.5574 313.5 54.5769 313.482 54.6 313.47L56.02 312.66L56.31 312.49L56.52 312.36L56.74 312.24L57.96 311.54C58.0248 311.506 58.0968 311.488 58.17 311.488C58.2432 311.488 58.3153 311.506 58.38 311.54Z" fill="#252F3F"/>
<path d="M77.81 331.63L79.23 332.45C79.3 332.484 79.377 332.502 79.455 332.502C79.533 332.502 79.61 332.484 79.68 332.45L81.04 331.67C81.17 331.59 81.19 331.47 81.04 331.4L79.62 330.58C79.5492 330.548 79.4725 330.532 79.395 330.532C79.3174 330.532 79.2408 330.548 79.17 330.58L77.81 331.37C77.71 331.44 77.7 331.56 77.81 331.63Z" fill="#252F3F"/>
<path d="M75.81 330.47L77.23 331.29C77.2993 331.327 77.3766 331.346 77.455 331.346C77.5335 331.346 77.6107 331.327 77.68 331.29L79.03 330.51C79.17 330.43 79.18 330.31 79.03 330.25L77.61 329.43C77.539 329.393 77.4601 329.374 77.38 329.374C77.3 329.374 77.2211 329.393 77.15 329.43L75.8 330.21C75.7 330.29 75.69 330.4 75.81 330.47Z" fill="#252F3F"/>
<path d="M73.8 329.31L75.22 330.13C75.2893 330.167 75.3665 330.186 75.445 330.186C75.5234 330.186 75.6007 330.167 75.67 330.13L77.03 329.35C77.16 329.27 77.18 329.16 77.03 329.09L75.61 328.27C75.5407 328.233 75.4634 328.214 75.385 328.214C75.3065 328.214 75.2293 328.233 75.16 328.27L73.8 329.05C73.7 329.13 73.69 329.25 73.8 329.31Z" fill="#252F3F"/>
<path d="M56.73 319.45L58.15 320.27C58.22 320.304 58.297 320.322 58.375 320.322C58.453 320.322 58.53 320.304 58.6 320.27L59.95 319.48C60.09 319.41 60.1 319.29 59.95 319.22L58.53 318.4C58.459 318.363 58.3801 318.344 58.3 318.344C58.22 318.344 58.1411 318.363 58.07 318.4L56.72 319.18C56.63 319.27 56.61 319.39 56.73 319.45Z" fill="#252F3F"/>
<path d="M54.72 318.3L56.14 319.12C56.21 319.154 56.287 319.172 56.365 319.172C56.443 319.172 56.52 319.154 56.59 319.12L57.95 318.34C58.08 318.26 58.1 318.14 57.95 318.07L56.53 317.25C56.4593 317.218 56.3826 317.202 56.305 317.202C56.2275 317.202 56.1508 317.218 56.08 317.25L54.72 318.04C54.62 318.11 54.61 318.23 54.72 318.3Z" fill="#252F3F"/>
<path d="M52.72 317.14L54.14 317.96C54.2093 317.997 54.2866 318.016 54.365 318.016C54.4435 318.016 54.5207 317.997 54.59 317.96L55.94 317.18C56.08 317.1 56.09 316.98 55.94 316.92L54.52 316.1C54.4489 316.063 54.3701 316.044 54.29 316.044C54.21 316.044 54.1311 316.063 54.06 316.1L52.71 316.88C52.62 317 52.6 317.07 52.72 317.14Z" fill="#252F3F"/>
<path d="M50.71 316L52.13 316.82C52.1993 316.857 52.2766 316.876 52.355 316.876C52.4335 316.876 52.5107 316.857 52.58 316.82L53.94 316.04C54.07 315.96 54.09 315.85 53.94 315.78L52.52 314.96C52.4507 314.923 52.3735 314.904 52.295 314.904C52.2166 314.904 52.1393 314.923 52.07 314.96L50.71 315.74C50.61 315.8 50.6 315.91 50.71 316Z" fill="#252F3F"/>
<path d="M71.28 327.86L73.22 329C73.29 329.034 73.3669 329.052 73.445 329.052C73.523 329.052 73.6 329.034 73.67 329L75.02 328.21C75.16 328.14 75.17 328.02 75.02 327.95L73.08 326.83C73.0092 326.798 72.9325 326.782 72.855 326.782C72.7774 326.782 72.7007 326.798 72.63 326.83L71.27 327.62C71.18 327.67 71.16 327.79 71.28 327.86Z" fill="#252F3F"/>
<path d="M58.73 320.61L60.67 321.73C60.7393 321.767 60.8166 321.786 60.895 321.786C60.9735 321.786 61.0507 321.767 61.12 321.73L62.48 320.95C62.61 320.87 62.62 320.75 62.48 320.69L60.54 319.57C60.4707 319.533 60.3935 319.514 60.315 319.514C60.2366 319.514 60.1593 319.533 60.09 319.57L58.73 320.35C58.63 320.43 58.62 320.54 58.73 320.61Z" fill="#252F3F"/>
<path d="M61.25 322.07L70.7 327.52C70.7693 327.557 70.8465 327.576 70.925 327.576C71.0034 327.576 71.0807 327.557 71.15 327.52L72.5 326.74C72.64 326.66 72.65 326.54 72.5 326.48L63.09 321C63.02 320.966 62.943 320.948 62.865 320.948C62.787 320.948 62.71 320.966 62.64 321L61.29 321.79C61.15 321.88 61.14 322 61.25 322.07Z" fill="#252F3F"/>
<path d="M78.19 327.34L79.61 328.16C79.6793 328.197 79.7565 328.216 79.835 328.216C79.9134 328.216 79.9907 328.197 80.06 328.16L81.42 327.38C81.55 327.31 81.56 327.19 81.42 327.12L80 326.28C79.9307 326.243 79.8534 326.224 79.775 326.224C79.6965 326.224 79.6193 326.243 79.55 326.28L78.19 327.06C78.09 327.16 78.07 327.28 78.19 327.34Z" fill="#252F3F"/>
<path d="M76.18 326.18L77.6 327C77.67 327.034 77.747 327.052 77.825 327.052C77.903 327.052 77.98 327.034 78.05 327L79.41 326.21C79.54 326.14 79.56 326.02 79.41 325.95L78 325.12C77.9307 325.083 77.8535 325.064 77.775 325.064C77.6966 325.064 77.6193 325.083 77.55 325.12L76.19 325.9C76.08 326 76.06 326.12 76.18 326.18Z" fill="#252F3F"/>
<path d="M74.17 325L75.59 325.82C75.66 325.854 75.737 325.872 75.815 325.872C75.893 325.872 75.97 325.854 76.04 325.82L77.4 325C77.53 324.93 77.55 324.81 77.4 324.74L76 324C75.93 323.966 75.853 323.948 75.775 323.948C75.697 323.948 75.62 323.966 75.55 324L74.19 324.78C74.07 324.84 74.05 325 74.17 325Z" fill="#252F3F"/>
<path d="M72.16 323.86L73.58 324.68C73.65 324.714 73.727 324.732 73.805 324.732C73.883 324.732 73.96 324.714 74.03 324.68L75.39 323.89C75.52 323.82 75.54 323.7 75.39 323.63L74 322.8C73.93 322.766 73.853 322.748 73.775 322.748C73.697 322.748 73.62 322.766 73.55 322.8L72.19 323.58C72.06 323.68 72.05 323.8 72.16 323.86Z" fill="#252F3F"/>
<path d="M70.15 322.71L71.57 323.53C71.6425 323.562 71.7208 323.578 71.8 323.578C71.8792 323.578 71.9575 323.562 72.03 323.53L73.38 322.74C73.52 322.67 73.53 322.55 73.38 322.48L72 321.64C71.93 321.606 71.853 321.588 71.775 321.588C71.697 321.588 71.62 321.606 71.55 321.64L70.2 322.42C70.05 322.52 70 322.64 70.15 322.71Z" fill="#252F3F"/>
<path d="M68.1501 321.55L69.5701 322.37C69.6408 322.402 69.7175 322.418 69.7951 322.418C69.8726 322.418 69.9493 322.402 70.0201 322.37L71.3701 321.58C71.5101 321.51 71.5201 321.39 71.3701 321.32L70.0001 320.48C69.9276 320.448 69.8493 320.432 69.7701 320.432C69.6909 320.432 69.6125 320.448 69.5401 320.48L68.1901 321.26C68.0001 321.36 68.0001 321.48 68.1501 321.55Z" fill="#252F3F"/>
<path d="M66.14 320.39L67.56 321.21C67.6308 321.242 67.7074 321.258 67.785 321.258C67.8625 321.258 67.9392 321.242 68.01 321.21L69.36 320.43C69.5 320.35 69.51 320.23 69.36 320.16L68 319.32C67.9275 319.288 67.8492 319.272 67.77 319.272C67.6908 319.272 67.6125 319.288 67.54 319.32L66.19 320.11C66 320.2 66 320.32 66.14 320.39Z" fill="#252F3F"/>
<path d="M64.13 319.23L65.55 320.05C65.62 320.084 65.697 320.102 65.775 320.102C65.853 320.102 65.93 320.084 66 320.05L67.36 319.27C67.49 319.19 67.5 319.07 67.36 319L66 318.16C65.9292 318.128 65.8526 318.112 65.775 318.112C65.6974 318.112 65.6208 318.128 65.55 318.16L64.19 318.95C64 319 64 319.16 64.13 319.23Z" fill="#252F3F"/>
<path d="M62.12 318.07L63.54 318.89C63.61 318.924 63.687 318.942 63.765 318.942C63.843 318.942 63.92 318.924 63.99 318.89L65.35 318.11C65.48 318.03 65.5 317.91 65.35 317.84L64 317C63.9292 316.968 63.8525 316.952 63.775 316.952C63.6974 316.952 63.6207 316.968 63.55 317L62.19 317.79C62 317.88 62 318 62.12 318.07Z" fill="#252F3F"/>
<path d="M60.11 316.91L61.53 317.73C61.6001 317.764 61.677 317.782 61.755 317.782C61.8331 317.782 61.91 317.764 61.98 317.73L63.34 316.95C63.47 316.87 63.49 316.75 63.34 316.69L62 315.85C61.93 315.816 61.8531 315.798 61.775 315.798C61.697 315.798 61.6201 315.816 61.55 315.85L60.19 316.64C60 316.72 60 316.84 60.11 316.91Z" fill="#252F3F"/>
<path d="M58.1 315.75L59.52 316.57C59.5918 316.605 59.6704 316.622 59.75 316.622C59.8297 316.622 59.9083 316.605 59.98 316.57L61.33 315.79C61.46 315.71 61.48 315.59 61.33 315.53L59.91 314.71C59.84 314.676 59.7631 314.658 59.685 314.658C59.607 314.658 59.5301 314.676 59.46 314.71L58.11 315.5C58 315.56 58 315.68 58.1 315.75Z" fill="#252F3F"/>
<path d="M56.09 314.59L57.51 315.41C57.5811 315.447 57.6599 315.466 57.74 315.466C57.82 315.466 57.8989 315.447 57.97 315.41L59.32 314.63C59.46 314.55 59.47 314.43 59.32 314.37L57.9 313.55C57.83 313.516 57.753 313.498 57.675 313.498C57.597 313.498 57.52 313.516 57.45 313.55L56.1 314.34C56 314.4 56 314.52 56.09 314.59Z" fill="#252F3F"/>
<path d="M80.2 328.5L83.13 330.2C83.2011 330.237 83.28 330.256 83.36 330.256C83.4401 330.256 83.519 330.237 83.59 330.2L84.9401 329.42C85.0701 329.34 85.0901 329.22 84.9401 329.16L82 327.44C81.929 327.403 81.8501 327.384 81.77 327.384C81.69 327.384 81.6111 327.403 81.5401 327.44L80.1901 328.22C80.0901 328.32 80.08 328.44 80.2 328.5Z" fill="#252F3F"/>
<path d="M77.2401 329L78.6601 329.82C78.7301 329.854 78.807 329.872 78.8851 329.872C78.9631 329.872 79.0401 329.854 79.1101 329.82L80.4601 329.03C80.6001 328.96 80.6101 328.84 80.4601 328.77L79.0801 328C79.0083 327.965 78.9297 327.947 78.8501 327.947C78.7704 327.947 78.6918 327.965 78.6201 328L77.2701 328.78C77.1301 328.86 77.1201 329 77.2401 329Z" fill="#252F3F"/>
<path d="M75.23 327.89L76.65 328.71C76.7208 328.742 76.7975 328.758 76.875 328.758C76.9526 328.758 77.0292 328.742 77.1 328.71L78.46 327.92C78.59 327.85 78.6 327.73 78.46 327.66L77.04 326.84C76.97 326.806 76.893 326.788 76.815 326.788C76.737 326.788 76.66 326.806 76.59 326.84L75.23 327.62C75.13 327.7 75.11 327.82 75.23 327.89Z" fill="#252F3F"/>
<path d="M73.22 326.73L74.64 327.55C74.7108 327.582 74.7874 327.598 74.865 327.598C74.9425 327.598 75.0192 327.582 75.09 327.55L76.45 326.76C76.58 326.69 76.6 326.57 76.45 326.5L75.03 325.68C74.96 325.646 74.883 325.628 74.805 325.628C74.727 325.628 74.65 325.646 74.58 325.68L73.22 326.46C73.12 326.54 73.1 326.66 73.22 326.73Z" fill="#252F3F"/>
<path d="M71.21 325.57L72.63 326.39C72.7008 326.422 72.7775 326.438 72.855 326.438C72.9326 326.438 73.0093 326.422 73.08 326.39L74.44 325.61C74.57 325.53 74.59 325.41 74.44 325.34L73.02 324.52C72.9492 324.488 72.8726 324.472 72.795 324.472C72.7175 324.472 72.6408 324.488 72.57 324.52L71.21 325.31C71.11 325.38 71.1 325.5 71.21 325.57Z" fill="#252F3F"/>
<path d="M69.2 324.41L70.62 325.23C70.6918 325.265 70.7704 325.283 70.85 325.283C70.9296 325.283 71.0083 325.265 71.08 325.23L72.43 324.45C72.56 324.37 72.58 324.25 72.43 324.18L71 323.34C70.9292 323.308 70.8526 323.292 70.775 323.292C70.6975 323.292 70.6208 323.308 70.55 323.34L69.2 324.13C69.1 324.22 69.09 324.34 69.2 324.41Z" fill="#252F3F"/>
<path d="M67.19 323.25L68.62 324.07C68.69 324.104 68.767 324.122 68.845 324.122C68.923 324.122 69 324.104 69.07 324.07L70.42 323.29C70.56 323.21 70.57 323.09 70.42 323.03L69 322.19C68.93 322.156 68.853 322.138 68.775 322.138C68.697 322.138 68.62 322.156 68.55 322.19L67.2 322.98C67.09 323.06 67.08 323.18 67.19 323.25Z" fill="#252F3F"/>
<path d="M65.19 322.09L66.61 322.91C66.6793 322.947 66.7565 322.966 66.835 322.966C66.9134 322.966 66.9907 322.947 67.06 322.91L68.41 322.13C68.55 322.05 68.56 321.93 68.41 321.87L67 321C66.9282 320.965 66.8496 320.947 66.77 320.947C66.6903 320.947 66.6117 320.965 66.54 321L65.19 321.79C65.09 321.9 65.07 322 65.19 322.09Z" fill="#252F3F"/>
<path d="M63.18 320.93L64.6 321.75C64.6693 321.787 64.7466 321.806 64.825 321.806C64.9035 321.806 64.9807 321.787 65.05 321.75L66.41 320.97C66.54 320.89 66.55 320.77 66.41 320.71L65 319.87C64.9307 319.833 64.8535 319.814 64.775 319.814C64.6966 319.814 64.6193 319.833 64.55 319.87L63.19 320.65C63.08 320.75 63.06 320.86 63.18 320.93Z" fill="#252F3F"/>
<path d="M61.17 319.77L62.59 320.59C62.6593 320.627 62.7365 320.646 62.815 320.646C62.8934 320.646 62.9707 320.627 63.04 320.59L64.4 319.81C64.53 319.73 64.55 319.61 64.4 319.55L63 318.71C62.9307 318.673 62.8534 318.654 62.775 318.654C62.6965 318.654 62.6193 318.673 62.55 318.71L61.19 319.49C61.07 319.59 61.05 319.7 61.17 319.77Z" fill="#252F3F"/>
<path d="M59.16 318.61L60.58 319.43C60.6493 319.467 60.7266 319.486 60.805 319.486C60.8835 319.486 60.9607 319.467 61.03 319.43L62.39 318.65C62.52 318.57 62.54 318.45 62.39 318.39L61 317.55C60.9307 317.513 60.8535 317.494 60.775 317.494C60.6966 317.494 60.6193 317.513 60.55 317.55L59.2 318.33C59.06 318.43 59.05 318.54 59.16 318.61Z" fill="#252F3F"/>
<path d="M57.15 317.45L58.57 318.27C58.6411 318.307 58.72 318.326 58.8 318.326C58.8801 318.326 58.9589 318.307 59.03 318.27L60.38 317.49C60.52 317.41 60.53 317.3 60.38 317.23L59 316.39C58.9307 316.353 58.8535 316.334 58.775 316.334C58.6966 316.334 58.6193 316.353 58.55 316.39L57.2 317.17C57.05 317.27 57 317.38 57.15 317.45Z" fill="#252F3F"/>
<path d="M52.66 314.86L56.57 317.11C56.6393 317.147 56.7165 317.166 56.795 317.166C56.8734 317.166 56.9507 317.147 57.02 317.11L58.37 316.33C58.51 316.25 58.52 316.14 58.37 316.07L54.46 313.81C54.3892 313.778 54.3125 313.762 54.235 313.762C54.1574 313.762 54.0807 313.778 54.01 313.81L52.65 314.6C52.56 314.67 52.54 314.79 52.66 314.86Z" fill="#252F3F"/>
<path d="M79.24 330.2L81.18 331.32C81.2493 331.357 81.3266 331.376 81.405 331.376C81.4835 331.376 81.5607 331.357 81.63 331.32L82.99 330.54C83.12 330.46 83.14 330.35 82.99 330.28L81.05 329.16C80.9807 329.123 80.9035 329.104 80.825 329.104C80.7466 329.104 80.6693 329.123 80.6 329.16L79.25 329.94C79.14 330 79.13 330.14 79.24 330.2Z" fill="#252F3F"/>
<path d="M94.1601 326L61.9301 307.4V282.05L62.1801 281.49L62.4401 281.35C62.7803 281.158 63.1644 281.057 63.5551 281.057C63.9457 281.057 64.3298 281.158 64.6701 281.35L94.1601 298.35C94.4986 298.545 94.7796 298.827 94.9745 299.166C95.1694 299.505 95.2714 299.889 95.2701 300.28V324.06C95.0701 325.32 94.8501 325.61 94.1601 326Z" fill="#F4F5F7"/>
<path d="M91.2001 301.45L61.9301 282.9V282.05L62.1801 281.49L62.4401 281.35C62.7803 281.158 63.1644 281.057 63.5551 281.057C63.9457 281.057 64.3298 281.158 64.6701 281.35L94.1601 298.35C94.5192 298.559 94.8134 298.864 95.0101 299.23L91.2001 301.45Z" fill="#F4F5F7"/>
<path d="M62.67 281.48L93.67 299.35C93.8349 299.445 93.9717 299.582 94.0665 299.747C94.1613 299.912 94.2108 300.1 94.21 300.29V326L61.93 307.4V281.91C61.9285 281.823 61.9503 281.737 61.9931 281.661C62.036 281.585 62.0983 281.522 62.1737 281.478C62.2492 281.434 62.3349 281.411 62.4222 281.411C62.5094 281.412 62.595 281.435 62.67 281.48V281.48Z" fill="#EBF5FF"/>
<path d="M62.67 281.48L93.67 299.35C93.8349 299.445 93.9717 299.582 94.0665 299.747C94.1613 299.912 94.2108 300.1 94.21 300.29V326L61.93 307.4V281.91C61.9285 281.823 61.9503 281.737 61.9931 281.661C62.036 281.585 62.0983 281.522 62.1737 281.478C62.2492 281.434 62.3349 281.411 62.4222 281.411C62.5094 281.412 62.595 281.435 62.67 281.48V281.48Z" fill="#F9FAFB"/>
<path d="M94.1601 326.01V325.09L61.9301 306.48V307.4L94.1601 326.01Z" fill="#E5E7EB"/>
<path d="M63.16 283.04V305.86L93.12 323.11V300.34L63.16 283.04Z" fill="#161E2E"/>
<path d="M9.65999 303.64C9.38999 306.04 6.52999 316.36 7.14999 319.89C7.76999 323.42 17.51 329.34 17.51 329.34L18.86 323.34L13.46 318L14.92 308L9.65999 303.64Z" fill="#FBD5D5"/>
<path d="M17.21 293.47C16.261 293.031 15.1841 292.956 14.1833 293.258C13.1825 293.56 12.3274 294.219 11.78 295.11C10.34 297.49 8.84997 305.64 8.71997 307C8.71997 307 10.72 309.78 13.72 309.32L17.21 293.47Z" fill="#FDF6B2"/>
<path d="M28.34 408.56C30.4627 409.144 32.7301 408.868 34.65 407.79C36.17 407.79 44.43 404.31 45.55 407.27C46.55 409.87 42.96 412.27 41.05 412.74C36.88 413.74 33.8 415.83 32.12 416.18C30.87 416.44 29.26 416.61 28.27 415.63C27.07 414.46 27.18 410.11 28.34 408.56Z" fill="#475569"/>
<path d="M32.12 415.46C33.8 415.11 36.88 413.03 41.05 412.02C42.65 411.63 45.4 409.88 45.68 407.79C46.05 410.19 42.83 412.31 41.05 412.74C36.88 413.74 33.8 415.83 32.12 416.18C30.87 416.44 29.26 416.61 28.27 415.63C28.0069 415.347 27.818 415.004 27.72 414.63C28.3384 415.101 29.0581 415.421 29.8219 415.565C30.5857 415.709 31.3725 415.673 32.12 415.46V415.46Z" fill="#014451"/>
<path d="M14.9999 402.55C17.1228 403.132 19.3894 402.855 21.3099 401.78C22.8299 401.83 31.0799 398.3 32.1999 401.26C33.1999 403.86 29.6099 406.26 27.6999 406.73C23.5399 407.73 20.4499 409.82 18.7799 410.17C17.5299 410.43 15.9199 410.6 14.9199 409.62C13.6899 408.45 13.7899 404.1 14.9999 402.55Z" fill="#475569"/>
<path d="M18.74 409.45C20.41 409.1 23.5 407.02 27.66 406.01C29.26 405.62 32.02 403.87 32.3 401.78C32.67 404.18 29.45 406.3 27.66 406.78C23.5 407.78 20.41 409.87 18.74 410.22C17.49 410.48 15.88 410.65 14.88 409.67C14.6202 409.386 14.4347 409.043 14.34 408.67C14.9626 409.132 15.6843 409.444 16.448 409.579C17.2116 409.714 17.9963 409.67 18.74 409.45V409.45Z" fill="#014451"/>
<path d="M14.8 380.13C15.1517 377.077 15.7878 374.064 16.7 371.13C16.7 371.13 16.13 363.33 15.85 355.93C15.52 347.54 12.61 340.16 14.91 333.46L40.8 339.22C40.8 339.22 39.24 372.67 38.89 376.72C38.6976 379.874 38.3101 383.014 37.73 386.12C36.55 392.61 34.63 408.06 34.63 408.06C31.89 409.65 28.29 408.77 28.29 408.77C28.29 408.77 28.49 389.23 28.67 384.55C28.88 378.84 29.06 379.28 29.06 379.28L28.2 365L27.64 357.92C27.64 357.92 26.92 363.12 26.46 367.76C26.05 371.81 25.07 375.47 23.98 383C23.04 389.54 21.5 402.67 21.5 402.67C18.76 404.26 15.04 402.94 15.04 402.94C15.04 402.94 14.06 385.8 14.8 380.13Z" fill="#771D1D"/>
<path d="M18.58 293.61C20.58 293.71 22.02 294.22 22.26 293.61C22.4765 292.594 22.6268 291.565 22.71 290.53C22.49 289.96 22.29 289.35 22.29 289.35C19.81 287.82 19.03 285.15 18.71 282.03C18.15 276.7 21.03 272.03 26.36 271.48C31.36 270.96 35.05 274.48 36.03 279.31C36.56 281.7 37.61 286.21 36.19 290.13C35.39 292.33 34.37 294.07 33.34 294.41C32.3359 294.38 31.3343 294.294 30.34 294.15C30.34 294.15 30.07 295.63 29.89 296.58C29.71 297.53 29.78 298.03 31.67 299.19C33.56 300.35 28.81 302.75 25.67 302.52C22.53 302.29 19.07 300.41 18.12 298.4C17.13 296.18 17.22 293.55 18.58 293.61Z" fill="#FBD5D5"/>
<path d="M21.43 293.9C20.88 295.27 22.27 296.9 25.98 298.1C29.69 299.3 29.98 297.76 29.98 297.76C32.4456 298.865 34.8491 300.104 37.18 301.47C39.4 303.03 40.39 307.47 40.69 315.11C41.03 323.9 41.06 336.93 40.77 339.18C40.77 339.18 36.62 343.32 31.3 342.88C25.98 342.44 17.04 337.74 14.87 334.11C14.93 326.41 15.87 325.11 14.59 320.71C11.73 310.56 10.23 306.4 11.59 299.65C12.73 294.08 14.33 293.39 16.53 293.45C18.1703 293.511 19.806 293.661 21.43 293.9V293.9Z" fill="#FDFDEA"/>
<path d="M49.07 322.38C44.71 323.48 43.69 320.72 43.07 318.45C41.69 312.93 40.94 307.95 39.9 304.82C38.69 301.13 37.41 300.54 35.61 299.82C33.51 298.98 31.7 300.76 32.4 305.46C33.2666 310.899 34.605 316.253 36.4 321.46C36.95 323.18 38.17 326.23 39.99 327.71C42.24 329.53 45.63 329.45 50.76 328.17C52.94 327.63 55.34 326.32 59.48 324.39C60.59 323.87 61.48 323.53 63.59 322.54C65.7292 321.576 67.6052 320.111 69.06 318.27C70.17 316.65 70.32 315.89 70.06 315.52C69.8 315.15 69.27 315.16 68.68 315.84C67.8143 316.989 66.7511 317.974 65.54 318.75C65.54 318.75 66.91 317.32 67.66 316.4C68.3268 315.577 68.8816 314.669 69.31 313.7C69.7 312.76 68.89 311.48 68.31 312.15C67.73 312.82 67.39 313.51 66.31 314.86C65.7233 315.581 65.0518 316.229 64.31 316.79C65.0126 315.842 65.6379 314.838 66.18 313.79C66.6596 312.97 66.8955 312.03 66.86 311.08C66.86 310.59 66.13 310 65.47 310.94C64.8384 312.224 64.0526 313.426 63.13 314.52C62.13 315.52 61.29 316.15 61.26 315.86C61.23 315.57 61.87 315 62.26 313.8C62.65 312.6 62.26 311.32 61.6 311.19C60.94 311.06 61.06 311.08 60.52 312.19C59.7839 313.35 59.1161 314.552 58.52 315.79C58.1838 316.95 57.5693 318.011 56.73 318.88C55.59 320.07 53.22 321.33 49.07 322.38Z" fill="#FBD5D5"/>
<path d="M34 299.07C36.91 298.64 39 299.95 40.26 304.36C41.52 308.77 42.44 312.36 42.44 312.36C41.2893 314.026 39.5421 315.186 37.56 315.6C34.08 316.45 32.82 314.78 32.82 314.78C32.82 314.78 31.82 310.16 31.25 307.01C30.68 303.86 30.44 299.6 34 299.07Z" fill="#FDF6B2"/>
<path d="M35.86 278.63C35.86 278.63 40.46 271.63 30.49 270.2C23.3 269.2 18.68 273.8 18.14 278.81C17.63 283.6 20.58 288.58 22.71 290.55C23.71 290.92 25.99 291.14 28.93 289.8C29.0491 288.497 29.0958 287.188 29.07 285.88C29.07 285.88 25.56 278.5 35.86 278.63Z" fill="#633112"/>
<path d="M129.276 196.436L57.5745 155.036C55.6355 153.917 53.8633 153.736 52.5151 154.341C52.3286 154.425 52.1496 154.525 51.9799 154.64L44.488 158.789L49.9367 166.434V220.566C49.9367 225.43 53.356 231.352 57.5815 233.77L85.6726 249.984L89.0919 258.803L85.4919 274.42L93.4216 270.013L101.191 258.942L125.516 272.995L126.371 280.285L134.224 275.907C135.857 275.212 136.9 273.44 136.9 270.757V209.654C136.92 204.789 133.501 198.868 129.276 196.436Z" fill="#D2D6DC"/>
<path d="M121.353 200.842L49.6448 159.442C45.4332 157.01 42 158.983 42 163.848V225.006C42 229.871 45.4193 235.793 49.6448 238.211L77.7359 254.425L85.4919 274.42L93.2548 263.369L121.346 279.59C125.564 282.023 128.991 280.049 128.991 275.184V214.061C128.984 209.196 125.571 203.274 121.353 200.842Z" fill="#F4F5F7"/>
<path d="M85.8948 189.097C95.0338 194.379 102.421 207.166 102.387 217.668C102.352 228.169 94.9296 232.408 85.7906 227.126C76.6516 221.844 69.264 209.057 69.2987 198.563C69.3335 188.068 76.7628 183.822 85.8948 189.097ZM94.9296 219.885L89.2794 210.099L94.9713 206.854L91.552 200.932L85.8601 204.178L80.2099 194.386L76.7698 196.346L82.4199 206.124L76.7281 209.369L80.1404 215.284L85.8323 212.038L91.4825 221.83L94.9226 219.871" fill="#F98080"/>
<path d="M91.5454 200.932L94.9647 206.853L89.2728 210.099L94.923 219.884L91.4828 221.844L85.8326 212.052L80.1407 215.29L76.7284 209.383L82.4203 206.138L76.7631 196.345L80.2033 194.385L85.8535 204.178L91.5454 200.932Z" fill="white"/>
<path d="M105.097 252.361L105.083 257.747L63.864 233.944L63.8779 228.565L105.097 252.361Z" fill="#9FA6B2"/>
<path d="M107.363 244.23L107.349 249.616L61.6471 223.234L61.661 217.848L107.363 244.23Z" fill="#9FA6B2"/>
</svg>
