<svg xmlns="http://www.w3.org/2000/svg" fill="none" viewBox="0 0 503 422">
  <defs/>
  <path fill="#FCD9BD" d="M75.622 264.567l-75.404 43.5 194.814 113.15 307.504-177.55L291.447 107.9"/>
  <path fill="url(#paint0_linear)" d="M331.583 258.083L217.46 330.617l-30.799-23.15 106.136-59.084" opacity=".32"/>
  <path fill="url(#paint1_linear)" d="M271.47 342.633l-105.92 60.85-52.326-29.1 93.48-52.033" opacity=".32"/>
  <path fill="url(#paint2_linear)" d="M439.287 253.417l-95.131 53.917-25.162-13.984 93.496-52.033" opacity=".32"/>
  <path fill="#76A9FA" d="M67.185 127.417L285.494 1.833a6.67 6.67 0 0110.005 5.25l14.007 174a6.67 6.67 0 01-3.335 6.334L92.497 308.333a6.674 6.674 0 01-8.76-1.966 6.663 6.663 0 01-1.161-3.034L63.9 133.917a6.664 6.664 0 013.285-6.5z"/>
  <path fill="#E3A008" d="M136.769 325l114.458-66.767a3.956 3.956 0 013.933-.04 3.946 3.946 0 012.02 3.373V299.6a3.95 3.95 0 01-2.001 3.433L140.671 368.4a3.957 3.957 0 01-3.908.016 3.94 3.94 0 01-2.011-3.35l-.601-35.466a5.269 5.269 0 012.618-4.6z"/>
  <path fill="#fff" d="M164.152 344.562c4.112-5.49 3.567-12.842-1.218-16.423-4.785-3.58-11.997-2.032-16.108 3.458-4.112 5.489-3.567 12.842 1.218 16.422s11.997 2.032 16.108-3.457z"/>
  <path fill="#E5E7EB" d="M177.24 321.3l46.69-26.9a1.885 1.885 0 00-1.901-3.234l-46.69 26.901a1.88 1.88 0 00.543 3.326c.449.139.933.106 1.358-.093zM179.174 332.233l64.365-37.067a1.88 1.88 0 00-.543-3.326 1.886 1.886 0 00-1.358.093L177.273 329a1.883 1.883 0 001.901 3.233z"/>
  <path fill="#FF8A4C" d="M158.58 337.017l114.458-66.767a3.956 3.956 0 013.933-.04 3.946 3.946 0 012.02 3.374v38.083a3.95 3.95 0 01-2.001 3.433l-114.508 65.4a3.957 3.957 0 01-3.908.017 3.956 3.956 0 01-2.011-3.35l-.601-35.5a5.261 5.261 0 012.618-4.65z"/>
  <path fill="#fff" d="M185.964 356.578c4.112-5.489 3.567-12.842-1.218-16.422s-11.997-2.032-16.108 3.457c-4.112 5.49-3.567 12.843 1.218 16.423 4.785 3.58 11.997 2.032 16.108-3.458z"/>
  <path fill="#E5E7EB" d="M199.034 333.333l46.69-26.9a1.885 1.885 0 00-1.901-3.233L197.15 330a1.879 1.879 0 00-.523 2.482 1.884 1.884 0 002.423.751l-.016.1zM200.968 344.25l64.365-37.067a1.88 1.88 0 00-.543-3.326 1.887 1.887 0 00-1.358.093l-64.365 37.067a1.883 1.883 0 001.901 3.233z"/>
  <path fill="#76A9FA" d="M178.907 349.75l114.457-66.767a3.956 3.956 0 015.393 1.378c.354.592.547 1.266.56 1.955v38.034a3.948 3.948 0 01-2.001 3.433l-114.507 65.45a3.957 3.957 0 01-3.909.017 3.953 3.953 0 01-2.011-3.35l-.6-35.467a5.267 5.267 0 012.618-4.683z"/>
  <path fill="#161E2E" d="M178.907 349.75l114.457-66.767a3.956 3.956 0 015.393 1.378c.354.592.547 1.266.56 1.955v38.034a3.948 3.948 0 01-2.001 3.433l-114.507 65.45a3.957 3.957 0 01-3.909.017 3.953 3.953 0 01-2.011-3.35l-.6-35.467a5.267 5.267 0 012.618-4.683z" opacity=".15"/>
  <path fill="#fff" d="M206.297 369.302c4.112-5.489 3.566-12.842-1.218-16.422-4.785-3.58-11.997-2.032-16.109 3.458-4.112 5.489-3.566 12.842 1.218 16.422 4.785 3.58 11.997 2.032 16.109-3.458z"/>
  <path fill="#E5E7EB" d="M219.377 346.05l46.69-26.9a1.882 1.882 0 00-.543-3.327 1.891 1.891 0 00-1.358.093l-46.69 26.901a1.885 1.885 0 001.901 3.233zM221.311 356.983l64.366-37.067a1.88 1.88 0 00-.544-3.326 1.884 1.884 0 00-1.357.093l-64.365 37.067a1.879 1.879 0 00-.523 2.482 1.886 1.886 0 002.423.751z"/>
  <path fill="#FACA15" d="M286.561 39.133l-67.584 40.15 7.887 97.384 67.918-38.217-8.221-99.317z"/>
  <path fill="#FCD9BD" d="M207.171 85.283l-67.6 40.167 7.887 97.367 67.934-38.2-8.221-99.334zM125.647 132.983c0 .5 3.685 40 3.685 40s-44.672 25.4-44.438 25c.233-.4-4.536-39.216-4.536-39.216l45.289-25.784z"/>
  <path fill="#FF8A4C" d="M132.317 184.733c0 .5 3.685 40 3.685 40s-44.672 25.4-44.439 25c.234-.4-4.535-39.216-4.535-39.216l45.289-25.784z"/>
  <path fill="#76A9FA" d="M412.39 219.617s-5.386 36.799 17.793 36.916c22.261.117 16.525-37.366 16.525-37.366s-16.192-14.067-34.318.45z"/>
  <path fill="#161E2E" d="M412.39 219.617s-5.386 36.799 17.793 36.916c22.261.117 16.525-37.366 16.525-37.366s-16.192-14.067-34.318.45z" opacity=".15"/>
  <path fill="#76A9FA" d="M429.482 226.683c9.458 0 17.125-3.164 17.125-7.067 0-3.902-7.667-7.066-17.125-7.066s-17.125 3.164-17.125 7.066c0 3.903 7.667 7.067 17.125 7.067z"/>
  <path fill="#000" d="M429.482 226.683c9.458 0 17.125-3.164 17.125-7.067 0-3.902-7.667-7.066-17.125-7.066s-17.125 3.164-17.125 7.066c0 3.903 7.667 7.067 17.125 7.067z" opacity=".7"/>
  <path fill="#046C4E" d="M402.519 165.884s-11.939-2.867-7.354-12.801c0 .017 8.204 1.634 7.354 12.801zM409.772 175.9s-1.667-8.483 5.003-11.917c-.017.017 5.319 8.9-5.003 11.917zM417.226 188.917s-1.984-10.15 5.953-14.25c0 0 6.37 10.633-5.953 14.25zM422.996 203.083s-1.984-10.15 5.953-14.25c0 0 6.37 10.65-5.953 14.25zM409.055 176.133s-4.218-7.55-11.489-5.883c0 0 1.668 10.217 11.489 5.883zM416.592 189.233s-5.386-8.833-14.007-6.5c0-.016 2.468 12.15 14.007 6.5zM422.329 203.217s-6.337-8.184-14.641-5c0 .116 3.785 11.883 14.641 5z"/>
  <path fill="#633112" d="M426.798 226.784h.166a8.327 8.327 0 011.668.133.777.777 0 000-.167 122.338 122.338 0 00-25.746-62.116c-.751-.934-2.051.383-1.318 1.316a120.082 120.082 0 0125.213 60.717l.017.117z"/>
  <path fill="#046C4E" d="M455.062 182.1s10.238-2.45 6.303-10.983c0 0-7.054 1.4-6.303 10.983zM448.825 190.683s1.418-7.283-4.269-10.216c0 0-4.618 7.633 4.269 10.216zM442.439 201.85s1.667-8.717-5.103-12.217c0 0-5.469 9.117 5.103 12.217zM437.486 214.016s1.668-8.716-5.102-12.216c0-.017-5.47 9.116 5.102 12.216zM449.442 190.883s3.619-6.483 9.855-5c0-.05-1.417 8.717-9.855 5zM442.972 202.117s4.619-7.567 12.023-5.583c-.05 0-2.118 10.433-12.023 5.583zM438.053 214.117s5.436-7.017 12.556-4.217c.017 0-3.234 10.1-12.556 4.217z"/>
  <path fill="#633112" d="M454.728 181.017a104.968 104.968 0 00-20.91 45.65c.533-.084 1.1-.167 1.667-.217a103.012 103.012 0 0120.394-44.283c.617-.817-.517-1.95-1.151-1.15z"/>
  <path fill="#FBD5D5" d="M293.197 109.75s.684-4.683 0-6.5a39.295 39.295 0 01-1.1-6.834 1.904 1.904 0 00-2.201 1.184c-.65 1.583.7 5.45.7 5.45s-3.885 8.067 0 11.75 2.601-5.05 2.601-5.05z"/>
  <path fill="#B43403" d="M319.06 135l-25.863-25.25s-5.852 12.7 0 18.517l23.696 23.566"/>
  <path fill="#FF5A1F" d="M323.879 239.15s3.569 5 3.335 7.833c-.233 2.834-4.835 7.767-5.869 9.834-1.034 2.066-1.301 2.966 0 4.483 1.3 1.517 12.423-8.183 12.673-9.733.25-1.55-1.551-7.5-1.551-7.5l5.003 6.233 3.601-2.117-7.62-12.833"/>
  <path fill="#233876" d="M322.479 261.433c.3-.3 9.104-3.333 9.104-3.333s4.136-4.3 4.019-5.95c-.117-1.65-1.668-8.15-3.185-8.084-1.517.067-1.667 8.7-1.667 8.7l-8.271 8.667z"/>
  <path fill="#FF5A1F" d="M312.007 247.333l-1.134 13.167s-2.851 2.083-3.552 1.9c-.7-.183-2.784-.717-2.818-1.05-.033-.333 1.001-9.317.717-9.533-.283-.217-4.652 6.85-6.019 7-1.368.15-11.823-5.917-10.806-8.234 1.017-2.316 6.053-1.1 8.538-1.116a8.74 8.74 0 007.804-5.717"/>
  <path fill="#046C4E" d="M305.387 211.667l-6.37 33.766s3.685 4.817 16.859 4.2l9.804-23.95"/>
  <path fill="#046C4E" d="M302.569 158.684s-9.822 14.333-6.804 37.55c2.685 20.583 23.245 44.816 23.245 44.816s6.153 2.717 18.943-9.4l-14.124-22.45s13.774-31.883-2.484-52.133"/>
  <path fill="#6B7280" d="M265.484 141.667c-5.003-.417-8.338-7.184-7.721-15.384.617-8.2 5.17-14.283 10.189-13.866 5.019.416 8.337 7.183 7.72 15.383s-5.169 14.267-10.188 13.867zm2.251-26.517c-3.335-.283-6.67 5-7.237 11.367-.567 6.366 1.851 12.133 5.236 12.416 3.385.284 6.67-5 7.237-11.366.567-6.367-1.868-12.15-5.236-12.434v.017z" opacity=".55"/>
  <path fill="#FBD5D5" d="M274.855 131.167a1.434 1.434 0 00-2.868 0v2.9l-.317-.633a41.38 41.38 0 01-2.501-8.334c-.35-1.85-3.002-1.016-2.768.767.188 1.391.478 2.767.867 4.117l-.284-.117a1.859 1.859 0 00-.759-.08 1.875 1.875 0 00-1.309.726 1.9 1.9 0 00-.333.687 2.662 2.662 0 000 1.35h-.217a2.088 2.088 0 00-1.481 1.321 2.079 2.079 0 00.298 1.963 1.892 1.892 0 00-.684 1.116 2.767 2.767 0 001.234 2.634c.984.816 2.068 1.883 2.968 2.766a60.344 60.344 0 003.635 3.217c1.117.917 2.935-2.133 2.952-3.15a1.323 1.323 0 001.174-.241 1.306 1.306 0 00.493-1.092c-.144-3.3-.178-6.606-.1-9.917z"/>
  <path fill="#8E4B10" d="M269.119 134.233a61.21 61.21 0 01-1.868-4.3c-.117-.3-.617-.166-.5.134a62.429 62.429 0 001.934 4.416c.134.3.584.05.434-.25z"/>
  <path fill="#D03801" d="M304.053 127.017a47.153 47.153 0 00-6.67 7.333c-1.851 3-9.288 11.2-12.356 8.733-3.068-2.466-8.505-7.183-8.505-7.183s-7.737 5.333-6.936 10.867c0 0 6.87 14.05 17.592 10.95 10.722-3.1 13.34-7.15 13.34-7.15l1.667 9.133s13.34 4.167 19.46-2.017c0 0 4.052-26.233 1.067-30.15"/>
  <path fill="#FBD5D5" d="M302.585 111.133c-.1.3-.333 9.817 2.902 10.733 3.235.917 8.738-1.35 10.172-4.366 1.434-3.017-.617-12.634-5.72-13.184-5.102-.55-6.453 4.017-7.354 6.817z"/>
  <path fill="#FF8A4C" d="M306.537 112.9c2.135 1.45.784 4.183-.116 5.95a9.133 9.133 0 00-.951 4.35 5.697 5.697 0 01-1.384 3.833c-.729.915-1.35 1.91-1.851 2.967 4.725.861 9.562.923 14.307.183 3.916-.315 7.813-.838 11.673-1.566a7.037 7.037 0 00-.55-2.4c-.918-2.1-2.418-3.217-2.068-5.7a11.53 11.53 0 00.1-5.667c-.684-1.95-2.335-2.85-3.902-4a10.03 10.03 0 01-1.284-1.117l-.333-.566a27.849 27.849 0 00-2.869-4.884 8.455 8.455 0 00-4.619-2.366 13.734 13.734 0 00-10.538 2.4s-2.785 2.666-1.901 5.533c.884 2.867 4.335 1.817 6.286 3.05z"/>
  <path fill="#014737" d="M304.07 218.617s11.255 19.466 15.007 22.433l-3.135 8.567s-13.14-18.334-11.872-31zM323.596 208.2a61.302 61.302 0 01-5.869-24.217c0-.666-1.068-.666-1.034 0a62.636 62.636 0 006.019 24.734c.267.6 1.168.083.884-.517z"/>
  <defs>
    <linearGradient id="paint0_linear" x1="208.939" x2="227.377" y1="314.2" y2="304.326" gradientUnits="userSpaceOnUse">
      <stop stop-color="#fff" stop-opacity="0"/>
      <stop offset=".99" stop-color="#DC841E"/>
    </linearGradient>
    <linearGradient id="paint1_linear" x1="23416.5" x2="24441.2" y1="20722.5" y2="19265" gradientUnits="userSpaceOnUse">
      <stop stop-color="#fff" stop-opacity="0"/>
      <stop offset=".99" stop-color="#DC841E"/>
    </linearGradient>
    <linearGradient id="paint2_linear" x1="32545.6" x2="34600.5" y1="13200.4" y2="10068.1" gradientUnits="userSpaceOnUse">
      <stop stop-color="#fff" stop-opacity="0"/>
      <stop offset=".99" stop-color="#DC841E"/>
    </linearGradient>
  </defs>
</svg>
