{
  "kind": "collectionType",
  "collectionName": "types",
  "info": {
    "name": "type",
    "description": ""
  },
  "options": {
    "increments": true,
    "timestamps": true,
    "draftAndPublish": false
  },
  "attributes": {
    "code": {
      "type": "string",
      "unique": true,
      "required": true
    },
    "name": {
      "type": "string",
      "required": true,
      "unique": true
    },
    "color": {
      "type": "string",
      "regex": "#[0-9a-fA-F]{6}",
      "default": "#ffffff",
      "required": true,
      "unique": true
    }
  }
}
