<svg xmlns="http://www.w3.org/2000/svg" viewBox="0 0 88 88">
  <path stroke="currentColor" stroke-width="4" d="M76.413 30.073c0-.126-.016-.25-.045-.366C74.94 13.032 60.767.007 43.99.007c-16.854 0-31.086 13.155-32.398 29.948-.031.403.115.78.365 1.076 0 .005 19.165 22.215 19.165 22.215h-2.995a1.5 1.5 0 00-1.5 1.5v31.748a1.5 1.5 0 001.5 1.5h31.747a1.5 1.5 0 001.5-1.5V54.747a1.5 1.5 0 00-1.5-1.5h-2.998l19.08-22.1c.28-.272.457-.652.457-1.074zm-61.224.127a12.772 12.772 0 018.087-2.866c3.41 0 6.603 1.33 9.037 3.737L38.8 53.246h-3.714zm20.142.504c2.39-2.171 5.428-3.37 8.659-3.37 3.237 0 6.28 1.204 8.673 3.385l-6.588 22.528h-4.15zm23.043 25.543v28.747H29.627V56.248zm-5.461-3H49.2l6.49-22.202c2.438-2.39 5.62-3.713 9.017-3.713 2.982 0 5.81 1.015 8.097 2.874zm11.795-28.914a15.735 15.735 0 00-10.355 3.853 15.77 15.77 0 00-10.362-3.853c-3.843 0-7.47 1.358-10.363 3.853a15.718 15.718 0 00-10.351-3.853c-2.931 0-5.74.791-8.188 2.271 2.765-13.488 14.824-23.597 28.9-23.597 14.082 0 26.143 10.108 28.904 23.596a15.752 15.752 0 00-8.185-2.27zm-28.026 47.78H42.5v5.825c0 .83.67 1.5 1.5 1.5.829 0 1.5-.67 1.5-1.5v-5.825h5.817a1.5 1.5 0 000-3H45.5V63.3a1.5 1.5 0 10-3 0v5.814h-5.818a1.5 1.5 0 100 3z"/>
</svg>
