{
  "development": {
    "storage": "./database/jogos_development",
    "dialect": "sqlite"
  },
  "test": {
    "storage": "./database/jogos_test",
    "dialect": "sqlite"
  },
  "production": {
    "storage": "./database/jogos_production",
    "dialect": "sqlite"
  }
}
