[32m
OK Test MyLib #001 : #01-01: call Get() - EdgeCases - Init - BWWS
OK Test MyLib #001 : #01-02: call Get() - EdgeCases - Init - WWS
OK Test MyLib #001 : #01-03: call Get() - EdgeCases - Init - NS
OK Test MyLib #001 : #02-01: call Set() - EdgeCases - Null, Max_Name_Length
OK Test MyLib #001 : #02-02: call Set() - EdgeCases - NS'Last + 1 : exeption ADA.STRINGS.LENGTH_ERROR generated
OK Test MyLib #001 : #03: call Set() - ASCII, Latin_1, Unicode Devanagari, Unicode Emoji
OK Test MyLib #001 : #04: call Get() - ASCII, Latin_1, Unicode Devanagari, Unicode Emoji
OK Test MyLib #001 : #04: call Get() - EdgeCases - Null_String
OK Test MyLib #001 : #00: call Get() - Ada with Emoji
[0m[35m[0m[31m[0m
Total Tests Run:   9
Successful Tests:  9
Failed Assertions: 0
Unexpected Errors: 0
