{
    "tw.alerts.autosaving": "Creazione del punto di ripristino...",
    "tw.alerts.savedToDisk": "Salvato sul computer.",
    "tw.backpack.rename": "Nuovo nome:",
    "tw.blocks.buttonIsDown": "pulsante [MOUSE_BUTTON] del mouse premuto",
    "tw.blocks.lastKeyPressed": "ultimo tasto premuto",
    "tw.blocks.mouseButton.middle": "(1) centrale",
    "tw.blocks.mouseButton.primary": "(0) primario",
    "tw.blocks.mouseButton.secondary": "(2) secondario",
    "tw.blocks.openDocs": "Documentazione Open",
    "tw.browserModal.audio": "Questo browser non supporta le funzionalità richieste da questa app. Se stai usando un browser che ha restrizioni della privacy, prova ad usare un normale browser.",
    "tw.browserModal.desc": "Assicurati di usare una versione recente di Google Chrome, Mozilla Firefox, Microsoft Edge o Apple Safari.",
    "tw.browserModal.eval": "Un'estensione del browser sta interferendo con il compilatore di TurboWarp. Prova a disattivare il tuo adblocker e ad aggiornare la pagina. Questo sito non contiene pubblicità.",
    "tw.changeUsername.cannotChangeWhileRunning": "Non è possibile cambiare lo username mentre il progetto è in esecuzione.",
    "tw.cloudVariableBadge": "Questo progetto usa le variabili cloud. TurboWarp usa un proprio server di variabili cloud indipendente da Scratch. Nota che gli utenti potrebbero non essere chi detto dal loro username.",
    "tw.code": "Codice Sorgente",
    "tw.customExtension.description": "Carica le estensioni personalizzate usando Il loro URL. Per sviluppatori. Sperimentale.",
    "tw.customExtension.name": "Estensioni Personalizzate",
    "tw.featuredProjectsStudio": "Vai alla galleria sul sito di Scratch.",
    "tw.feedback": "Feedback & Bug",
    "tw.feedbackButton": "Feedback per adacraft",
    "tw.footer.credits": "Crediti",
    "tw.footer.disclaimer": "TurboWarp non è affiliato a Scratch, allo Scratch Team o alla Scratch Foundation.",
    "tw.footer.embed": "Inclusione",
    "tw.footer.fosshost": "Hosting fornito da Fosshost",
    "tw.footer.parameters": "Parametri URL",
    "tw.footer.translate": "Aiuta a Tradurre TurboWarp",
    "tw.framerateIndicatorInterpolated": "{framerate} FPS usando l'interpolazione",
    "tw.gui.crashMessage.description": "Ci dispiace, sembra che adacraft abbia smesso di funzionare. Aggiorna la pagina per riprovare.",
    "tw.gui.defaultProjectTitle": "Progetto",
    "tw.home.credit": "Note e Crediti",
    "tw.home.description": "TurboWarp è una Modifica di Scratch che compila i progetti in JavaScript per renderli molto più veloci. Provalo, inserisci qui sopra un ID di un progetto o una URL o scegli uno dei progetti in primo piano che trovi qui sotto.",
    "tw.home.instructions": "Istruzioni",
    "tw.input.tooltip": "Copia e incolla il link di un progetto Scratch qui!",
    "tw.invalidParameters.clones": "Il parametro URL \"clone\" non è valido",
    "tw.invalidParameters.fps": "Il parametro URL \"fps\" non è valido",
    "tw.loader.assets.known": "Scaricamento risorse in corso ({complete}/{total}) ...",
    "tw.loader.assets.unknown": "Scaricamento risorse in corso ...",
    "tw.loader.data": "Scaricamento dati del progetto in corso...",
    "tw.loader.generic": "Caricamento del progetto in corso …",
    "tw.menuBar.60off": "Disabilita modalità 60 FPS",
    "tw.menuBar.60on": "Abilita modalità 60 FPS",
    "tw.menuBar.addons": "Addon",
    "tw.menuBar.advanced": "Impostazioni Avanzate",
    "tw.menuBar.changeUsername": "Cambia Username",
    "tw.menuBar.cloudOff": "Disabilita Variabili Cloud",
    "tw.menuBar.cloudOn": "Abilita Variabili Cloud",
    "tw.menuBar.cloudUnavailable": "Le Variabili Cloud non sono Disponibili",
    "tw.menuBar.cloudUnavailableAlert": "Impossibile usare le variabili cloud, probabilmente perché è stato aperto l'editor.",
    "tw.menuBar.loadRestorePoint": "Carica il punto di ripristino",
    "tw.menuBar.moreSettings": "Impostazioni Avanzate",
    "tw.menuBar.newFramerate": "Nuovo framerate:",
    "tw.menuBar.reportError1": "Non è stato possibile compilare tutti gli script.",
    "tw.menuBar.reportError2": "Si è verificato un problema. Ti invitiamo a segnalarlo.",
    "tw.menuBar.saveAs": "Salva come {file}",
    "tw.menuBar.seeInside": "Guarda dentro",
    "tw.paint.alpha": "Opacità",
    "tw.privacy": "Politica della Privacy",
    "tw.regardingUnshared": "A proposito dei progetti non condivisi",
    "tw.restorePoint.confirm": "adacraft memorizza un punto di ripristino automatico in caso qualcosa non vada per il verso giusto e tu abbia dimenticato di salvare. Non dovresti fare affidamento su questa funzionalità e non possiamo garantirti che funzioni sempre Vuoi provare a caricarla?",
    "tw.restorePoint.createFail": "Impossibile ripristinare il progetto; i punti di ripristino sono stati disabilitati. I regolari salvataggi non verranno influenzati.\n\nDebug: {error}",
    "tw.restorePoint.loadFail": "Impossibile caricare il punto di ripristino.\n\nDebug: {error}",
    "tw.settingsModal.confirmReload": "Per cambiare la dimensione dello stage è necessario ricaricare l'editor. Sei sicuro di volerlo ricaricare?",
    "tw.settingsModal.customStageSize": "Dimensioni Stage Personalizzate:",
    "tw.settingsModal.customStageSizeHelp": "Cambia la dimensione dello stage di Scratch da 480x360 a un altro valore. Prova 640x360 per rendere lo stage widescreen. Pochi progetti potranno gestire questa proprietà.",
    "tw.settingsModal.dangerZone": "Zona Pericolosa",
    "tw.settingsModal.disableCompiler": "Disabilita Compilatore",
    "tw.settingsModal.disableCompilerHelp": "Disabilita il compilatore di TurboWarp. E' un'opzione utile soltanto quando si modificano i progetti, in modo che gli script si aggiornino immediatamente. Si sconsiglia di usare questa opzione in altri casi.",
    "tw.settingsModal.featured": "In Evidenza",
    "tw.settingsModal.fps": "60 FPS (FPS personalizzato)",
    "tw.settingsModal.fpsHelp": "Esegue gli script 60 volte al secondo invece di 30. Alcuni progetti potrebbero non funzionare correttamente con questa impostazione abilitata. In questo caso puoi provare ad abilitare l'interpolazione senza abilitare la modalità 60 FPS. {customFramerate}.",
    "tw.settingsModal.fpsHelp.customFramerate": "Clicca qui per usare un framerate diverso da 30 o 60",
    "tw.settingsModal.help": "Clicca per aiuto",
    "tw.settingsModal.highQualityPen": "Penna Alta Qualità",
    "tw.settingsModal.highQualityPenHelp": "Penna ad Alta Qualità permette ai progetti che fanno uso della penna di essere visualizzati ad una risoluzione maggiore e disabilita l'arrotondamento fatto dall'editor. Non tutti i progetti si giovano di questa impostazione che può avere impatto sulla performance del progetto. {comparison}",
    "tw.settingsModal.highQualityPenHelp.comparison": "Guarda il confronto",
    "tw.settingsModal.infiniteClones": "Cloni Infiniti",
    "tw.settingsModal.infiniteClonesHelp": "Disabilita il limite di Scratch di 300 cloni.",
    "tw.settingsModal.interp60Warning": "L'uso combinato della modalità 60 FPS e dell'interpolazione può causare comportamenti inattesi. E' preferibile abilitare solo la modalità 60 FPS o solo l'interpolazione, non entrambe. Se non hai le idee chiare su quale usare, ti suggeriamo di provare prima l'interpolazione.",
    "tw.settingsModal.interpolation": "Interpolazione",
    "tw.settingsModal.interpolationHelp": "L'interpolazione fa apparire i progetti più fluidi interpolando il movimento degli sprite. L'interpolazione non dovrebbe essere usata nei progetti 3D, nei raytracer, nei progetti basati sull'uso della penna e nei progetti che laggano in quanto l'interpolazione li farebbe eseguire più lentamente senza farli apparire più fluidi.",
    "tw.settingsModal.largeStageWarning": "L'uso di uno stage personalizzato così grande non è raccomandato! Ti suggeriamo di usare una dimensione inferiore con le stesse proporzioni e usare poi il fullscreen per portarlo alle dimensioni dello schermo dell'utente.",
    "tw.settingsModal.removeFencing": "Rimozione Recinto",
    "tw.settingsModal.removeFencingHelp": "Permette agli sprite di muoversi completamente fuori dallo Stage e di diventare grandi o piccoli quando si desidera.",
    "tw.settingsModal.removeLimits": "Rimozione Limiti",
    "tw.settingsModal.removeMiscLimits": "Rimozione Limiti Vari",
    "tw.settingsModal.removeMiscLimitsHelp": "Rimuove i limiti degli effetti sonori, della dimensione della penna e altri limiti futuri.",
    "tw.settingsModal.storeProjectOptions": "Memorizza le impostazioni nel progetto",
    "tw.settingsModal.storeProjectOptionsHelp": "Memorizza nel progetto le impostazioni selezionate in modo che siano applicate automaticamente quando il progetto viene caricato in adacraft. La dimensione personalizzata dello stage e il warp timer non verranno memorizzati.",
    "tw.settingsModal.title": "Impostazioni Avanzate",
    "tw.settingsModal.warpTimerHelp": "Il Timer Warp permette ai progetti di verificare se sono bloccati in un loop molto lungo o infinito e di essere quindi eseguiti ad un framerate più basso invece di risultare bloccati fino a che il loop non termina. Questa opzione risolve molte cause di blocco ma ha un impatto significativo sulla performance, quindi è abilitata come impostazione predeterminata solo all'interno dell'editor.",
    "tw.spriteSelectorItem.rename": "rinomina",
    "tw.studioview.authorAttribution": "di {author}",
    "tw.studioview.error": "Si è verificato un errore nel caricamento della pagina di progetti successiva.",
    "tw.studioview.hoverText": "{title} di {author}",
    "tw.twExtension.description": "Nuovi blocchi strani. Non compatibile con Scratch.",
    "tw.twExtension.name": "Blocchi TurboWarp",
    "tw.usernameModal.help": "Questo valore verrà archiviato nello spazio di archiviazione del tuo browser. Potrebbe essere loggato quando interagisci con progetti che usano le variabili cloud.",
    "tw.usernameModal.help2": "Raccomandiamo di lasciare questo valore come è o di cambiarlo nel tuo username di Scratch, in quanto altri valori potrebbero impedire alle variabili cloud di funzionare correttamente.",
    "tw.usernameModal.mustChange": "Il server delle variabili cloud pensa che il tuo username possa non essere sicuro. Ti preghiamo di cambiarlo con qualcos'altro o di {resetIt}",
    "tw.usernameModal.mustChange.resetIt": "resettarlo (raccomandato)",
    "tw.usernameModal.reset": "Resetta",
    "tw.usernameModal.title": "Cambia Username",
    "tw.viewFeaturedProjects": "Clicca per vedere i progetti in primo piano.",
    "tw.viewOnScratch": "Mostra il progetto nel sito di Scratch",
    "tw.webglModal.description": "Sembra che il tuo browser o il tuo computer non siano compatibili con {webGlLink}. Questa tecnologia è necessaria per poter usare questo sito. Prova ad aggiornare il tuo browser e i tuoi driver video o a riavviare il tuo computer."
}