{
    "tw.alerts.autosaving": "Criando ponto de restauração...",
    "tw.alerts.savedToDisk": "Salvo no seu computador.",
    "tw.backpack.rename": "Novo nome:",
    "tw.blocks.buttonIsDown": "botão [MOUSE_BUTTON] do mouse pressionado?",
    "tw.blocks.lastKeyPressed": "última tecla pressionada",
    "tw.blocks.mouseButton.middle": "(1) do meio",
    "tw.blocks.mouseButton.primary": "(0) primário",
    "tw.blocks.mouseButton.secondary": "(2) secundário",
    "tw.blocks.openDocs": "Abrir Documentação",
    "tw.browserModal.audio": "Esse navegador não suporta funções que este app precisa. Se você está usando um navegador de \"privacidade\", tente trocar para um navegador normal.",
    "tw.browserModal.desc": "Veja se você está usando uma versão recente do Google Chrome, Mozilla Firefox, Microsoft Edge ou Apple Safari.",
    "tw.browserModal.eval": "Uma extensão de navegador está interferindo com a habilidade do TurboWarp de compilar scripts. Tente desligar seu bloqueador de propaganda e recarregar. Este site não contém anúncios.",
    "tw.changeUsername.cannotChangeWhileRunning": "Nome de usuário não pode ser mudado enquanto o projeto roda.",
    "tw.cloudVariableBadge": "Esse projeto usa variáveis na nuvem. O TurboWarp tem seu próprio servidor para variáveis na nuvem independente do Scratch. Usuários podem não ser realmente quem o nome de usuário diz que eles são.",
    "tw.code": "Código fonte",
    "tw.confirmIncompatibleExtension": "Essa extensão não é compatível com o Scratch. Projetos feitos com ela não funcionarão se você tentar fazer upload no site do Scratch. Tem certeza que quer ativá-la?",
    "tw.customExtension.description": "Carregue extensões customizadas por URLs. Para desenvolvedores. Experimental.",
    "tw.customExtension.name": "Extensão Customizada",
    "tw.featuredProjectsStudio": "Ver estúdio no Scratch.",
    "tw.feedback": "Feedback e bugs",
    "tw.feedbackButton": "Feedback do adacraft",
    "tw.footer.credits": "Créditos",
    "tw.footer.disclaimer": "O TurboWarp não tem afiliação com o Scratch, a Equipe do Scratch ou a Fundação Scratch.",
    "tw.footer.embed": "Incorporação",
    "tw.footer.fosshost": "Hospedagem por Fosshost",
    "tw.footer.parameters": "Parâmetros de URL",
    "tw.footer.translate": "Ajude a traduzir o TurboWarp",
    "tw.framerateIndicatorInterpolated": "{framerate} FPS com interpolação",
    "tw.gui.crashMessage.description": "Desculpe, parece que o adacraft deixou de funcionar. Por favor, atualize a página para tentar de novo.",
    "tw.gui.defaultProjectTitle": "Projeto",
    "tw.home.credit": "Notas e Créditos",
    "tw.home.description": "TurboWarp é um mod do Scratch que compila projetos para JavaScript para os executar bem rápido. Experimente colocando um ID ou URL de projeto acima ou escolhendo um dos projetos em destaque abaixo.",
    "tw.home.instructions": "Instruções",
    "tw.input.tooltip": "Copie e cole um link de um projeto do Scratch aqui!",
    "tw.invalidParameters.clones": "parâmetro de URL \"clone\" é inválido",
    "tw.invalidParameters.fps": "parâmetro de URL \"fps\" é inválido",
    "tw.loader.assets.known": "Baixando recursos ({complete}/{total}) ...",
    "tw.loader.assets.unknown": "Baixando recursos ...",
    "tw.loader.data": "Baixando dados do projeto ...",
    "tw.loader.generic": "Carregando projeto …",
    "tw.menuBar.60off": "Desligar modo 60 FPS",
    "tw.menuBar.60on": "Ligar modo 60 FPS",
    "tw.menuBar.advanced": "Avançado",
    "tw.menuBar.changeUsername": "Mudar nome de usuário",
    "tw.menuBar.cloudOff": "Desligar variáveis de nuvem",
    "tw.menuBar.cloudOn": "Ligar variáveis de nuvem",
    "tw.menuBar.cloudUnavailable": "Variáveis de nuvem não estão disponíveis",
    "tw.menuBar.cloudUnavailableAlert": "Não pode usar variáveis na nuvem, provavelmente porque você abriu o editor.",
    "tw.menuBar.legacyDownloadToComputer": "{saveToYourComputer} (antigo)",
    "tw.menuBar.loadRestorePoint": "Carregar ponto de restauração",
    "tw.menuBar.moreSettings": "Configurações Avançadas",
    "tw.menuBar.newFramerate": "Novo FPS:",
    "tw.menuBar.reportError1": "Alguns scripts não puderam ser compilados",
    "tw.menuBar.reportError2": "Isso é um bug. Por favor reporte-o.",
    "tw.menuBar.saveAs": "Salvar como {file}",
    "tw.menuBar.seeInside": "Ver por dentro",
    "tw.paint.alpha": "Opacidade",
    "tw.privacy": "Política de Privacidade",
    "tw.regardingUnshared": "Sobre projetos não-compartilhados",
    "tw.restorePoint.confirm": "O adacraft grava um ponto de restauração automaticamente caso algo dê errado e você esqueça de salvar. Use essa função apenas em caso de emergência pois não podemos garantir que seu projeto será recuperado. Quer tentar carregá-lo?",
    "tw.restorePoint.createFail": "Não foi possível restaurar; pontos de restauração foram desativados. Você ainda pode salvar projetos.\n\nDebug: {error}",
    "tw.restorePoint.loadFail": "Erro ao carregar ponto de restauração.\n\nDebug: {error}",
    "tw.settingsModal.confirmReload": "Você precisa recarregar para mudar o tamanho do palco, quer reiniciar agora?",
    "tw.settingsModal.customStageSize": "Tamanho Customizado do Palco:",
    "tw.settingsModal.customStageSizeHelp": "Muda o tamanho do palco do Scratch de 480x360 para outro valor. Tente 640x360 para deixar o palco em widescreen. Muito poucos projetos vão funcionar direito com essa opção.",
    "tw.settingsModal.dangerZone": "Zona do Perigo",
    "tw.settingsModal.disableCompiler": "Desligar compilador",
    "tw.settingsModal.disableCompilerHelp": "Desabilita o compilador do TurboWarp. Você pode ligar isso enquanto está editando para que os scripts atualizem imediatamente. Em qualquer outra hipótese, deixe esta opção desativada.",
    "tw.settingsModal.featured": "Em destaque",
    "tw.settingsModal.fps": "60 FPS (FPS customizado)",
    "tw.settingsModal.fpsHelp": "Roda scripts 60 vezes por segundo ao invés de 30. A maioria dos projetos não vão funcionar direito com isso ativado. Se esse for o caso você pode tentar usar Interpolação e desligar o modo 60 FPS. {customFramerate}.",
    "tw.settingsModal.fpsHelp.customFramerate": "Clique para escolher um FPS diferente",
    "tw.settingsModal.help": "Ajuda",
    "tw.settingsModal.highQualityPen": "Caneta de Alta Qualidade",
    "tw.settingsModal.highQualityPenHelp": "A Caneta de Alta Qualidade deixa projetos que usam a caneta renderizarem em uma qualidade melhor e reduz arredondamento de coordenadas no editor. Nem todo projeto se beneficia dessa opção, e ela pode piorar a performance. {comparison}.",
    "tw.settingsModal.highQualityPenHelp.comparison": "Ver comparação",
    "tw.settingsModal.infiniteClones": "Clones Infinitos",
    "tw.settingsModal.infiniteClonesHelp": "Desabilita o limite de 300 clones do Scratch.",
    "tw.settingsModal.interp60Warning": "Usar 60 FPS e interpolação juntos pode causar resultados inesperados. Você provavelmente quer ativar só o modo 60 FPS ou só interpolação, não os dois. Se você não sabe qual usar, tente a interpolação primeiro.",
    "tw.settingsModal.interpolation": "Interpolação",
    "tw.settingsModal.interpolationHelp": "Interpolação faz projetos parecerem rodar em framerates mais altas interpolando o movimento de atores. Interpolação não deve ser usada em projetos 3D, raytracers, projetos que usam caneta e projetos lagados porque a interpolação só vai fazer eles rodarem mais devagar sem deixá-los mais suaves.",
    "tw.settingsModal.largeStageWarning": "Não é recomendado usar um tamanho de palco tão grande! Ao invés disso, use um tamanho menor com a mesma proporção e o modo tela cheia irá aumentar o palco para preencher a tela do usuário.",
    "tw.settingsModal.removeFencing": "Remover Borda",
    "tw.settingsModal.removeFencingHelp": "Deixa atores andarem para fora da tela e ficarem grandes ou pequenos sem limitação.",
    "tw.settingsModal.removeLimits": "Remover Limites",
    "tw.settingsModal.removeMiscLimits": "Remover Outros Limites",
    "tw.settingsModal.removeMiscLimitsHelp": "Remove os limites de efeitos de som, tamanho da caneta, e talvez outros no futuro.",
    "tw.settingsModal.storeProjectOptions": "Salvar configurações no projeto",
    "tw.settingsModal.storeProjectOptionsHelp": "Salva suas configurações no projeto e automaticamente aplica quando você abrir o projeto no adacraft. Tamanho customizado do palco e warp timer não serão salvos.",
    "tw.settingsModal.title": "Opções Avançadas",
    "tw.settingsModal.warpTimerHelp": "O Warp Timer faz scripts detectarem se estão presos em um loop longo ou infinito e roda a uma framerate baixa ao invés de travar até o loop terminar. Isso conserta a maioria dos crashes mas impacta muito a performance, então não está ativado por padrão fora do editor.",
    "tw.spriteSelectorItem.rename": "renomear",
    "tw.studioview.authorAttribution": "por {author}",
    "tw.studioview.error": "Erro ao carregar a próxima página de projetos.",
    "tw.studioview.hoverText": "{title} por {author}",
    "tw.twExtension.description": "Uns blocos novos esquisitos. Não compatíveis com o Scratch.",
    "tw.twExtension.name": "Blocos do TurboWarp",
    "tw.usernameModal.help": "Esse valor será guardado no armazenamento do seu navegador. Projetos que contenham variáveis cloud podem querer registrá-lo.",
    "tw.usernameModal.help2": "É recomendado que você deixe esse valor assim como está ou mude-o para o seu nome de usuário do Scratch, já que outros valores podem ser inutilizáveis com variáveis cloud.",
    "tw.usernameModal.mustChange": "Desculpa, o servidor de variáveis na nuvem acha o seu nome de usuário inapropriado. Por favor mude para outra coisa ou {resetIt}.",
    "tw.usernameModal.mustChange.resetIt": "resete-o (recomendado)",
    "tw.usernameModal.reset": "Resetar",
    "tw.usernameModal.title": "Mudar nome de usuário",
    "tw.viewFeaturedProjects": "Clique para ver projetos em destaque.",
    "tw.viewOnScratch": "Ver projeto no Scratch",
    "tw.webglModal.description": "Infelizmente parece que o seu navegador ou computador {webGlLink}. Essa tecnologia é necessária para o site funcionar. Tente atualizar o seu navegador e drivers gráficos ou reiniciar o seu computador."
}