[
    "better-backpack",
    "cat-blocks",
    "editor-devtools",
    "editor-searchable-dropdowns",
    "data-category-tweaks-v2",
    "block-palette-icons",
    "hide-flyout",
    "mediarecorder",
    "drag-drop",
    "color-picker",
    "remove-sprite-confirm",
    "tw-project-info",
    "onion-skinning",
    "bitmap-copy",
    "2d-color-picker",
    "better-img-uploads",
    "pause",
    "mute-project",
    "clones",
    "mouse-pos",
    "custom-block-shape",
    "editor-theme3",
    "editor-colored-context-menus",
    "editor-stage-left",
    "variable-manager",
    "gamepad",
    "editor-sounds",
    "folders",
    "block-switching",
    "load-extensions",
    "custom-zoom",
    "initialise-sprite-position",
    "blocks2image",
    "remove-curved-stage-border",
    "transparent-orphans",
    "debugger",
    "tw-interface-customization",
    "editor-extra-keys",
    "rename-broadcasts"
]