<?xml version="1.0" encoding="utf-8"?>
<!-- Generator: Adobe Illustrator 25.2.3, SVG Export Plug-In . SVG Version: 6.00 Build 0)  -->
<svg version="1.1"
	 id="Layer_1" xmlns:cc="http://creativecommons.org/ns#" xmlns:dc="http://purl.org/dc/elements/1.1/" xmlns:rdf="http://www.w3.org/1999/02/22-rdf-syntax-ns#"
	 xmlns="http://www.w3.org/2000/svg" xmlns:xlink="http://www.w3.org/1999/xlink" x="0px" y="0px" viewBox="0 0 600 372"
	 style="enable-background:new 0 0 600 372;" xml:space="preserve">
<style type="text/css">
	.st0{fill:#0E9A6C;}
	.st1{fill:#FFFFFF;}
	.st2{fill:none;stroke:#FFFFFF;stroke-width:12;stroke-linecap:round;stroke-linejoin:round;stroke-miterlimit:10;}
</style>
<rect x="0" y="0" class="st0" width="600" height="372"/>
<g>
	<g>
		<path class="st1" d="M171.4,240c-3.4,0-6.1,1.3-8,3.9c-1.9,2.6-2.8,6.2-2.8,10.8c0,9.6,3.6,14.4,10.8,14.4c3,0,6.7-0.8,11-2.3v7.6
			c-3.5,1.5-7.5,2.2-11.8,2.2c-6.2,0-11-1.9-14.3-5.7s-5-9.2-5-16.3c0-4.5,0.8-8.4,2.4-11.7c1.6-3.4,4-5.9,7-7.7s6.6-2.7,10.7-2.7
			c4.2,0,8.4,1,12.6,3l-2.9,7.4c-1.6-0.8-3.2-1.4-4.8-2C174.6,240.3,173.1,240,171.4,240z"/>
		<path class="st1" d="M199.9,276h-9v-45.7h9V276z"/>
		<path class="st1" d="M239.1,259.5c0,5.3-1.4,9.5-4.2,12.5s-6.7,4.5-11.8,4.5c-3.2,0-5.9-0.7-8.3-2.1c-2.4-1.4-4.3-3.4-5.6-6
			s-1.9-5.6-1.9-9c0-5.4,1.4-9.5,4.2-12.5c2.8-3,6.7-4.5,11.8-4.5c3.2,0,5.9,0.7,8.3,2.1s4.3,3.3,5.6,5.9
			C238.4,253,239.1,256,239.1,259.5z M216.4,259.5c0,3.3,0.5,5.7,1.6,7.4c1.1,1.7,2.8,2.5,5.2,2.5s4.1-0.8,5.2-2.5
			c1-1.7,1.6-4.1,1.6-7.4s-0.5-5.7-1.6-7.3s-2.8-2.4-5.2-2.4s-4.1,0.8-5.2,2.4S216.4,256.2,216.4,259.5z"/>
		<path class="st1" d="M269.8,276l-1.2-4.2H268c-1,1.5-2.3,2.7-4.1,3.5c-1.8,0.8-3.8,1.2-6,1.2c-3.9,0-6.8-1-8.7-3.1
			c-2-2.1-2.9-5-2.9-8.9v-21.4h9v19.2c0,2.4,0.4,4.1,1.3,5.3c0.8,1.2,2.2,1.8,4,1.8c2.5,0,4.3-0.8,5.4-2.5c1.1-1.7,1.7-4.5,1.7-8.3
			v-15.5h9v32.8h-7V276z"/>
		<path class="st1" d="M296.4,276.6c-3.9,0-6.9-1.5-9.1-4.5c-2.2-3-3.3-7.1-3.3-12.5s1.1-9.6,3.4-12.6c2.2-3,5.3-4.5,9.3-4.5
			c4.1,0,7.3,1.6,9.5,4.8h0.3c-0.5-2.4-0.7-4.6-0.7-6.6v-10.4h9V276h-6.9l-1.7-4.3h-0.4C303.8,274.9,300.6,276.6,296.4,276.6z
			 M299.5,269.4c2.3,0,4-0.7,5-2s1.7-3.6,1.7-6.8v-1c0-3.5-0.5-6.1-1.6-7.6s-2.9-2.3-5.3-2.3c-2,0-3.6,0.8-4.7,2.5
			c-1.1,1.7-1.7,4.2-1.7,7.4s0.6,5.7,1.7,7.3C295.9,268.6,297.5,269.4,299.5,269.4z"/>
		<path class="st1" d="M324.9,276v-43h9.1v35.4h17.4v7.5h-26.5V276z"/>
		<path class="st1" d="M357.8,234.6c0-2.9,1.6-4.4,4.9-4.4s4.9,1.5,4.9,4.4c0,1.4-0.4,2.5-1.2,3.2c-0.8,0.8-2,1.2-3.7,1.2
			C359.3,239,357.8,237.6,357.8,234.6z M367,276h-9v-32.8h9V276z"/>
		<path class="st1" d="M406.8,276h-9v-19.2c0-2.4-0.4-4.1-1.3-5.3c-0.8-1.2-2.2-1.8-4-1.8c-2.5,0-4.3,0.8-5.4,2.5s-1.7,4.5-1.7,8.3
			V276h-9v-32.8h6.8l1.2,4.2h0.5c1-1.6,2.4-2.8,4.1-3.6c1.8-0.8,3.7-1.2,6-1.2c3.8,0,6.7,1,8.7,3.1s3,5,3,8.9L406.8,276L406.8,276z"
			/>
		<path class="st1" d="M424.6,258.1l3.9-5l9.2-10h10.1l-13,14.2l13.8,18.6h-10.3l-9.5-13.3l-3.8,3.1v10.2h-9v-45.6h9v20.4l-0.5,7.5
			h0.1V258.1z"/>
	</g>
	<g>
		<path class="st2" d="M267.4,142.6c19.1-18.3,46.6-18.3,65.7,0"/>
		<path class="st2" d="M250.7,123.2c28.2-28.8,70.4-28.8,98.6,0"/>
		<path class="st2" d="M283.9,161.7c9.7-8.2,22.8-8.2,32.5,0"/>
		<path class="st2" d="M300,182.7L300,182.7"/>
	</g>
</g>
</svg>
