{
    "name": "Better Backpack",
    "description": "Add multiple rows in backpack",
    "credits": [
      {
        "name": "Oeildelynx"
      },
      {
        "name": "pumpkinhasapatch"
      }
    ],
    "userstyles": [
      {
        "url": "lines-backpack.css",
        "matches": ["https://www.adacraft.org/studio/*"]
      }
    ],
    "versionAdded": "1.0.0",
    "tags": ["new", "editor", "beta", "recommended"],
    "enabledByDefault": true
  }
  