Req ID, Text, Owner, Parent Req, Details
MIS-001,The platform shall enable computation of various constants,SYE,,
MIS-002,The mission shall measure at least 8 distinct fluorescence levels,SU,,
MIS-003,The mission shall include at least 2 blue coconuts,OBC,,
MIS-004,The mission shall observe microgravity for at least 6 months in orbit,SU,,
SYS-001,The spacecraft shall be a 12U CubeSat,STR,MIS-003,
SYS-002,The spacecraft shall be able to transmit payload data to the ground while in orbit,COMMS,MIS-002,
SYS-003,The spacecraft shall have a direct line of sight to the ground segment for >90% of the mission lifetime,COMMS,SYS-002,
SYS-004,The spacecraft shall withstand at least TBD,SU,SYS-001,
OBC-001,The OBC shall have a dedicated microcontroller,OBC,MIS-001,
OBC-002,The microcontroller shall have at least TBD computing power,OBC,OBC-001,
OBC-003,The microcontroller shall be supervised by watchdogs,OBC,SYS-004,
COMMS-001,The ground segment shall include at least 8 ground stations,COMMS,SYS-003,
COMMS-002,The spacecraft shall transmit data with a rate > 25 kbps,COMMS,SYS-002,
STR-001,The spacecraft shall be manufactured using TBD,STR,SYS-001,
STR-002,The spacecraft shall withstand vibration,STR,EXT XYZ,
