# -------------------------------------------------------------------------------
#		C:/Users/ASAT 02/Documents/OMERE 5.4/CDR CLOSE-OUT/SSO 500 - 1.5 years/LET/Vessel/Integral LET spectrum .txt
# -------------------------------------------------------------------------------
# ID: 1 2 1

# Graph: Integral LET spectrum  
# min: 0.000160896 1e-06 max: 1.09391e+09 1.61213e+08
# X-axis L: LET (MeV.cm^2.g^{-1})
# Y-axis L: Flux (cm^{-2}.s^{-1})
# -------------------------------------------------------------------------------
# Curve 0: LET spectrum with Flares 
# Params: 0 5 #14bf4c 2 1
#	LET (MeV.cm^2.g^{-1})		Flux (cm^{-2}.s^{-1})
# -------------------------------------------------------------------------------
        1.608960e+00	        1.612132e+04
        1.626982e+00	        1.612132e+04
        1.645205e+00	        1.612132e+04
        1.663632e+00	        1.612132e+04
        1.682265e+00	        1.612121e+04
        1.701107e+00	        1.612107e+04
        1.720161e+00	        1.612098e+04
        1.739427e+00	        1.612092e+04
        1.758910e+00	        1.612087e+04
        1.778610e+00	        1.612082e+04
        1.798532e+00	        1.612079e+04
        1.818676e+00	        1.612048e+04
        1.839046e+00	        1.611995e+04
        1.859644e+00	        1.611932e+04
        1.880473e+00	        1.611829e+04
        1.901536e+00	        1.611725e+04
        1.922834e+00	        1.611609e+04
        1.944370e+00	        1.611484e+04
        1.966148e+00	        1.611359e+04
        1.988170e+00	        1.611221e+04
        2.010439e+00	        1.611079e+04
        2.032956e+00	        1.610935e+04
        2.055727e+00	        1.610779e+04
        2.078752e+00	        1.610601e+04
        2.102035e+00	        1.610420e+04
        2.125579e+00	        1.610238e+04
        2.149386e+00	        1.610030e+04
        2.173460e+00	        1.609803e+04
        2.197804e+00	        1.609574e+04
        2.222421e+00	        1.609342e+04
        2.247313e+00	        1.609096e+04
        2.272484e+00	        1.608836e+04
        2.297937e+00	        1.608573e+04
        2.323675e+00	        1.608307e+04
        2.349701e+00	        1.608038e+04
        2.376019e+00	        1.607691e+04
        2.402632e+00	        1.607297e+04
        2.429542e+00	        1.606899e+04
        2.456754e+00	        1.606496e+04
        2.484271e+00	        1.606092e+04
        2.512096e+00	        1.605705e+04
        2.540233e+00	        1.605314e+04
        2.568685e+00	        1.604918e+04
        2.597455e+00	        1.604518e+04
        2.626548e+00	        1.604113e+04
        2.655967e+00	        1.603704e+04
        2.685715e+00	        1.603084e+04
        2.715796e+00	        1.602451e+04
        2.746214e+00	        1.601812e+04
        2.776973e+00	        1.601165e+04
        2.808077e+00	        1.600511e+04
        2.839529e+00	        1.599781e+04
        2.871333e+00	        1.599017e+04
        2.903493e+00	        1.598245e+04
        2.936014e+00	        1.597465e+04
        2.968899e+00	        1.596676e+04
        3.002152e+00	        1.595878e+04
        3.035777e+00	        1.594908e+04
        3.069779e+00	        1.593903e+04
        3.104162e+00	        1.592886e+04
        3.138931e+00	        1.591858e+04
        3.174088e+00	        1.590818e+04
        3.209640e+00	        1.589766e+04
        3.245589e+00	        1.588715e+04
        3.281941e+00	        1.587654e+04
        3.318701e+00	        1.586581e+04
        3.355872e+00	        1.585496e+04
        3.393459e+00	        1.584399e+04
        3.431468e+00	        1.583290e+04
        3.469902e+00	        1.582169e+04
        3.508766e+00	        1.580955e+04
        3.548066e+00	        1.579704e+04
        3.587806e+00	        1.578440e+04
        3.627992e+00	        1.577160e+04
        3.668627e+00	        1.575867e+04
        3.709717e+00	        1.574559e+04
        3.751268e+00	        1.573241e+04
        3.793284e+00	        1.572072e+04
        3.835771e+00	        1.570891e+04
        3.878733e+00	        1.569696e+04
        3.922177e+00	        1.568488e+04
        3.966107e+00	        1.567266e+04
        4.010530e+00	        1.566030e+04
        4.055449e+00	        1.564781e+04
        4.100872e+00	        1.563427e+04
        4.146804e+00	        1.561843e+04
        4.193250e+00	        1.560242e+04
        4.240217e+00	        1.558622e+04
        4.287709e+00	        1.556985e+04
        4.335734e+00	        1.555329e+04
        4.384296e+00	        1.553654e+04
        4.433403e+00	        1.552275e+04
        4.483059e+00	        1.550889e+04
        4.533271e+00	        1.549488e+04
        4.584046e+00	        1.548071e+04
        4.635390e+00	        1.546638e+04
        4.687308e+00	        1.545190e+04
        4.739809e+00	        1.543725e+04
        4.792897e+00	        1.542243e+04
        4.846580e+00	        1.540477e+04
        4.900864e+00	        1.538651e+04
        4.955756e+00	        1.536804e+04
        5.011263e+00	        1.534936e+04
        5.067391e+00	        1.533048e+04
        5.124149e+00	        1.531138e+04
        5.181542e+00	        1.529207e+04
        5.239577e+00	        1.527352e+04
        5.298263e+00	        1.525505e+04
        5.357606e+00	        1.523637e+04
        5.417614e+00	        1.521748e+04
        5.478294e+00	        1.519838e+04
        5.539654e+00	        1.517906e+04
        5.601701e+00	        1.515953e+04
        5.664442e+00	        1.513978e+04
        5.727887e+00	        1.511878e+04
        5.792042e+00	        1.509702e+04
        5.856916e+00	        1.507501e+04
        5.922516e+00	        1.505276e+04
        5.988851e+00	        1.503025e+04
        6.055929e+00	        1.500750e+04
        6.123759e+00	        1.498449e+04
        6.192348e+00	        1.496122e+04
        6.261705e+00	        1.493574e+04
        6.331839e+00	        1.490644e+04
        6.402759e+00	        1.487682e+04
        6.474473e+00	        1.484687e+04
        6.546991e+00	        1.481658e+04
        6.620320e+00	        1.478596e+04
        6.694471e+00	        1.475499e+04
        6.769452e+00	        1.472365e+04
        6.845274e+00	        1.469043e+04
        6.921944e+00	        1.465585e+04
        6.999473e+00	        1.462089e+04
        7.077871e+00	        1.458554e+04
        7.157146e+00	        1.454979e+04
        7.237310e+00	        1.451364e+04
        7.318371e+00	        1.447709e+04
        7.400341e+00	        1.444013e+04
        7.483228e+00	        1.440106e+04
        7.567044e+00	        1.435964e+04
        7.651799e+00	        1.431776e+04
        7.737503e+00	        1.427541e+04
        7.824166e+00	        1.423258e+04
        7.911801e+00	        1.418928e+04
        8.000417e+00	        1.414549e+04
        8.090026e+00	        1.410120e+04
        8.180638e+00	        1.405635e+04
        8.272265e+00	        1.400379e+04
        8.364918e+00	        1.395063e+04
        8.458610e+00	        1.389689e+04
        8.553350e+00	        1.384253e+04
        8.649152e+00	        1.378757e+04
        8.746027e+00	        1.373200e+04
        8.843987e+00	        1.367580e+04
        8.943044e+00	        1.361897e+04
        9.043210e+00	        1.355516e+04
        9.144499e+00	        1.348544e+04
        9.246921e+00	        1.341495e+04
        9.350492e+00	        1.334367e+04
        9.455222e+00	        1.327159e+04
        9.561125e+00	        1.319870e+04
        9.668214e+00	        1.312500e+04
        9.776503e+00	        1.305047e+04
        9.886005e+00	        1.297559e+04
        9.996733e+00	        1.290056e+04
        1.010870e+01	        1.282468e+04
        1.022192e+01	        1.274796e+04
        1.033641e+01	        1.267037e+04
        1.045219e+01	        1.259192e+04
        1.056926e+01	        1.251259e+04
        1.068764e+01	        1.243237e+04
        1.080734e+01	        1.235125e+04
        1.092839e+01	        1.226487e+04
        1.105080e+01	        1.216333e+04
        1.117457e+01	        1.206066e+04
        1.129973e+01	        1.195684e+04
        1.142629e+01	        1.185185e+04
        1.155427e+01	        1.174569e+04
        1.168369e+01	        1.163834e+04
        1.181455e+01	        1.152979e+04
        1.194688e+01	        1.142599e+04
        1.208069e+01	        1.133686e+04
        1.221600e+01	        1.124672e+04
        1.235282e+01	        1.115557e+04
        1.249118e+01	        1.106340e+04
        1.263109e+01	        1.097020e+04
        1.277256e+01	        1.087596e+04
        1.291562e+01	        1.078066e+04
        1.306028e+01	        1.068429e+04
        1.320657e+01	        1.058685e+04
        1.335449e+01	        1.047789e+04
        1.350406e+01	        1.036009e+04
        1.365531e+01	        1.024097e+04
        1.380826e+01	        1.012051e+04
        1.396292e+01	        9.998709e+03
        1.411931e+01	        9.875540e+03
        1.427746e+01	        9.750992e+03
        1.443737e+01	        9.625049e+03
        1.459908e+01	        9.512321e+03
        1.476259e+01	        9.402212e+03
        1.492794e+01	        9.290870e+03
        1.509514e+01	        9.178281e+03
        1.526421e+01	        9.064431e+03
        1.543518e+01	        8.949306e+03
        1.560806e+01	        8.832891e+03
        1.578288e+01	        8.715173e+03
        1.595966e+01	        8.597353e+03
        1.613841e+01	        8.485241e+03
        1.631917e+01	        8.371873e+03
        1.650195e+01	        8.257235e+03
        1.668678e+01	        8.141312e+03
        1.687368e+01	        8.024092e+03
        1.706268e+01	        7.905558e+03
        1.725379e+01	        7.785697e+03
        1.744704e+01	        7.664494e+03
        1.764245e+01	        7.556293e+03
        1.784006e+01	        7.452160e+03
        1.803988e+01	        7.346862e+03
        1.824193e+01	        7.240383e+03
        1.844625e+01	        7.132713e+03
        1.865286e+01	        7.023836e+03
        1.886178e+01	        6.913740e+03
        1.907304e+01	        6.802411e+03
        1.928667e+01	        6.689834e+03
        1.950269e+01	        6.590111e+03
        1.972113e+01	        6.489493e+03
        1.994201e+01	        6.387747e+03
        2.016537e+01	        6.284862e+03
        2.039124e+01	        6.180824e+03
        2.061963e+01	        6.075621e+03
        2.085058e+01	        5.969240e+03
        2.108411e+01	        5.861667e+03
        2.132027e+01	        5.760566e+03
        2.155906e+01	        5.670445e+03
        2.180054e+01	        5.579315e+03
        2.204471e+01	        5.487165e+03
        2.229162e+01	        5.393982e+03
        2.254130e+01	        5.299756e+03
        2.279378e+01	        5.204474e+03
        2.304908e+01	        5.108125e+03
        2.330724e+01	        5.010696e+03
        2.356829e+01	        4.912246e+03
        2.383227e+01	        4.812752e+03
        2.409920e+01	        4.712143e+03
        2.436912e+01	        4.610408e+03
        2.464207e+01	        4.507533e+03
        2.491807e+01	        4.403506e+03
        2.519717e+01	        4.298314e+03
        2.547939e+01	        4.198688e+03
        2.576477e+01	        4.128612e+03
        2.605335e+01	        4.057751e+03
        2.634516e+01	        3.986096e+03
        2.664024e+01	        3.913638e+03
        2.693862e+01	        3.840369e+03
        2.724035e+01	        3.766280e+03
        2.754545e+01	        3.691360e+03
        2.785397e+01	        3.615601e+03
        2.816595e+01	        3.538994e+03
        2.848142e+01	        3.468758e+03
        2.880043e+01	        3.397896e+03
        2.912301e+01	        3.326240e+03
        2.944920e+01	        3.253781e+03
        2.977905e+01	        3.180511e+03
        3.011259e+01	        3.106421e+03
        3.044986e+01	        3.031500e+03
        3.079092e+01	        2.955740e+03
        3.113579e+01	        2.897075e+03
        3.148453e+01	        2.840087e+03
        3.183717e+01	        2.782461e+03
        3.219376e+01	        2.724190e+03
        3.255435e+01	        2.665266e+03
        3.291897e+01	        2.605682e+03
        3.328768e+01	        2.545430e+03
        3.366052e+01	        2.484504e+03
        3.403753e+01	        2.427489e+03
        3.441877e+01	        2.382115e+03
        3.480428e+01	        2.336232e+03
        3.519410e+01	        2.289836e+03
        3.558829e+01	        2.242920e+03
        3.598690e+01	        2.195478e+03
        3.638997e+01	        2.147505e+03
        3.679756e+01	        2.098994e+03
        3.720971e+01	        2.049940e+03
        3.762647e+01	        2.001903e+03
        3.804791e+01	        1.958464e+03
        3.847406e+01	        1.914538e+03
        3.890499e+01	        1.870120e+03
        3.934075e+01	        1.825205e+03
        3.978138e+01	        1.779787e+03
        4.022696e+01	        1.733861e+03
        4.067752e+01	        1.687420e+03
        4.113313e+01	        1.644221e+03
        4.159384e+01	        1.610406e+03
        4.205971e+01	        1.576213e+03
        4.253080e+01	        1.541637e+03
        4.300716e+01	        1.506673e+03
        4.348887e+01	        1.471318e+03
        4.397596e+01	        1.435566e+03
        4.446851e+01	        1.399414e+03
        4.496658e+01	        1.362857e+03
        4.547023e+01	        1.333281e+03
        4.597952e+01	        1.305574e+03
        4.649451e+01	        1.277557e+03
        4.701528e+01	        1.249227e+03
        4.754187e+01	        1.220579e+03
        4.807436e+01	        1.191612e+03
        4.861282e+01	        1.162320e+03
        4.915731e+01	        1.132701e+03
        4.970789e+01	        1.103972e+03
        5.026464e+01	        1.081117e+03
        5.082763e+01	        1.058006e+03
        5.139693e+01	        1.034636e+03
        5.197260e+01	        1.011005e+03
        5.255472e+01	        9.871084e+02
        5.314336e+01	        9.629445e+02
        5.373859e+01	        9.385091e+02
        5.434049e+01	        9.138001e+02
        5.494913e+01	        8.920042e+02
        5.556458e+01	        8.715915e+02
        5.618694e+01	        8.509502e+02
        5.681626e+01	        8.300777e+02
        5.745263e+01	        8.089714e+02
        5.809612e+01	        7.876290e+02
        5.874683e+01	        7.660486e+02
        5.940482e+01	        7.442263e+02
        6.007019e+01	        7.268569e+02
        6.074300e+01	        7.106060e+02
        6.142335e+01	        6.941728e+02
        6.211133e+01	        6.775557e+02
        6.280700e+01	        6.607526e+02
        6.351047e+01	        6.437613e+02
        6.422182e+01	        6.265802e+02
        6.494114e+01	        6.092069e+02
        6.566851e+01	        5.938856e+02
        6.640403e+01	        5.795194e+02
        6.714779e+01	        5.649922e+02
        6.789988e+01	        5.503023e+02
        6.866039e+01	        5.354479e+02
        6.942942e+01	        5.204272e+02
        7.020706e+01	        5.052386e+02
        7.099342e+01	        4.906557e+02
        7.178858e+01	        4.809569e+02
        7.259264e+01	        4.711495e+02
        7.340572e+01	        4.612322e+02
        7.422790e+01	        4.512038e+02
        7.505929e+01	        4.410632e+02
        7.589999e+01	        4.308089e+02
        7.675011e+01	        4.204398e+02
        7.760974e+01	        4.099552e+02
        7.847901e+01	        3.995241e+02
        7.935802e+01	        3.897177e+02
        8.024686e+01	        3.798015e+02
        8.114567e+01	        3.697742e+02
        8.205454e+01	        3.596347e+02
        8.297359e+01	        3.493814e+02
        8.390294e+01	        3.390134e+02
        8.484269e+01	        3.285299e+02
        8.579297e+01	        3.212508e+02
        8.675389e+01	        3.140606e+02
        8.772558e+01	        3.067898e+02
        8.870815e+01	        2.994376e+02
        8.970173e+01	        2.920031e+02
        9.070643e+01	        2.844853e+02
        9.172239e+01	        2.768834e+02
        9.274972e+01	        2.691962e+02
        9.378856e+01	        2.629153e+02
        9.483904e+01	        2.567916e+02
        9.590129e+01	        2.505993e+02
        9.697543e+01	        2.443377e+02
        9.806160e+01	        2.380060e+02
        9.915994e+01	        2.316033e+02
        1.002706e+02	        2.251294e+02
        1.013937e+02	        2.187832e+02
        1.025293e+02	        2.137488e+02
        1.036777e+02	        2.086579e+02
        1.048389e+02	        2.035100e+02
        1.060132e+02	        1.983044e+02
        1.072006e+02	        1.930406e+02
        1.084013e+02	        1.877174e+02
        1.096154e+02	        1.823346e+02
        1.108432e+02	        1.776377e+02
        1.120847e+02	        1.735651e+02
        1.133401e+02	        1.694469e+02
        1.146095e+02	        1.652826e+02
        1.158932e+02	        1.610717e+02
        1.171913e+02	        1.568136e+02
        1.185039e+02	        1.525079e+02
        1.198312e+02	        1.481539e+02
        1.211734e+02	        1.445700e+02
        1.225306e+02	        1.410835e+02
        1.239030e+02	        1.375579e+02
        1.252907e+02	        1.339929e+02
        1.266941e+02	        1.303880e+02
        1.281131e+02	        1.267427e+02
        1.295480e+02	        1.230566e+02
        1.309990e+02	        1.196195e+02
        1.324663e+02	        1.164046e+02
        1.339500e+02	        1.131545e+02
        1.354503e+02	        1.098679e+02
        1.369674e+02	        1.065446e+02
        1.385015e+02	        1.031840e+02
        1.400528e+02	        9.981927e+01
        1.416214e+02	        9.746382e+01
        1.432077e+02	        9.508198e+01
        1.448117e+02	        9.267348e+01
        1.464336e+02	        9.023799e+01
        1.480737e+02	        8.777554e+01
        1.497322e+02	        8.528550e+01
        1.514093e+02	        8.276757e+01
        1.531052e+02	        8.057386e+01
        1.548200e+02	        7.842772e+01
        1.565541e+02	        7.625755e+01
        1.583076e+02	        7.406306e+01
        1.600807e+02	        7.184402e+01
        1.618737e+02	        6.960073e+01
        1.636867e+02	        6.746657e+01
        1.655201e+02	        6.568154e+01
        1.673740e+02	        6.387652e+01
        1.692487e+02	        6.205123e+01
        1.711444e+02	        6.020549e+01
        1.730613e+02	        5.833910e+01
        1.749996e+02	        5.645181e+01
        1.769597e+02	        5.498050e+01
        1.789418e+02	        5.358840e+01
        1.809460e+02	        5.218071e+01
        1.829727e+02	        5.075726e+01
        1.850221e+02	        4.931786e+01
        1.870944e+02	        4.786234e+01
        1.891900e+02	        4.639223e+01
        1.913090e+02	        4.506834e+01
        1.934517e+02	        4.372962e+01
        1.956185e+02	        4.237618e+01
        1.978095e+02	        4.100765e+01
        2.000251e+02	        3.962379e+01
        2.022655e+02	        3.827182e+01
        2.045309e+02	        3.722049e+01
        2.068218e+02	        3.615739e+01
        2.091383e+02	        3.508238e+01
        2.114807e+02	        3.399534e+01
        2.138494e+02	        3.289616e+01
        2.162446e+02	        3.178584e+01
        2.186667e+02	        3.091899e+01
        2.211159e+02	        3.004244e+01
        2.235925e+02	        2.915607e+01
        2.260968e+02	        2.825977e+01
        2.286292e+02	        2.735343e+01
        2.311900e+02	        2.643694e+01
        2.337794e+02	        2.567793e+01
        2.363979e+02	        2.493696e+01
        2.390456e+02	        2.418769e+01
        2.417231e+02	        2.343003e+01
        2.444305e+02	        2.266378e+01
        2.471682e+02	        2.188898e+01
        2.499366e+02	        2.121999e+01
        2.527360e+02	        2.056424e+01
        2.555668e+02	        1.990115e+01
        2.584293e+02	        1.923076e+01
        2.613238e+02	        1.855289e+01
        2.642508e+02	        1.789745e+01
        2.672105e+02	        1.737844e+01
        2.702034e+02	        1.685363e+01
        2.732298e+02	        1.632294e+01
        2.762901e+02	        1.578630e+01
        2.793847e+02	        1.524369e+01
        2.825139e+02	        1.471885e+01
        2.856782e+02	        1.426310e+01
        2.888780e+02	        1.380223e+01
        2.921136e+02	        1.333622e+01
        2.953854e+02	        1.286498e+01
        2.986938e+02	        1.238847e+01
        3.020393e+02	        1.197388e+01
        3.054223e+02	        1.160449e+01
        3.088432e+02	        1.123096e+01
        3.123024e+02	        1.085328e+01
        3.158004e+02	        1.047137e+01
        3.193375e+02	        1.008519e+01
        3.229142e+02	        9.708152e+00
        3.265310e+02	        9.332796e+00
        3.301883e+02	        8.953237e+00
        3.338866e+02	        8.569388e+00
        3.376263e+02	        8.181317e+00
        3.414079e+02	        7.888558e+00
        3.452318e+02	        7.618320e+00
        3.490986e+02	        7.345058e+00
        3.530086e+02	        7.068741e+00
        3.569625e+02	        6.789338e+00
        3.609607e+02	        6.509588e+00
        3.650036e+02	        6.270515e+00
        3.690918e+02	        6.028792e+00
        3.732258e+02	        5.784412e+00
        3.774062e+02	        5.537296e+00
        3.816333e+02	        5.287414e+00
        3.859078e+02	        5.057964e+00
        3.902301e+02	        4.841155e+00
        3.946009e+02	        4.621920e+00
        3.990206e+02	        4.400230e+00
        4.034898e+02	        4.176087e+00
        4.080091e+02	        3.968693e+00
        4.125790e+02	        3.781291e+00
        4.172001e+02	        3.591790e+00
        4.218730e+02	        3.400166e+00
        4.265982e+02	        3.206397e+00
        4.313763e+02	        3.018990e+00
        4.362079e+02	        2.841574e+00
        4.410936e+02	        2.662213e+00
        4.460341e+02	        2.480867e+00
        4.510299e+02	        2.297494e+00
        4.560817e+02	        2.121176e+00
        4.611900e+02	        1.944349e+00
        4.663556e+02	        1.765544e+00
        4.715790e+02	        1.584736e+00
        4.768609e+02	        1.415404e+00
        4.822020e+02	        1.245270e+00
        4.876029e+02	        1.073238e+00
        4.930643e+02	        8.960362e-01
        4.985868e+02	        7.122607e-01
        5.041712e+02	        5.264280e-01
        5.098182e+02	        3.312288e-01
        5.155284e+02	        1.295307e-01
        5.213026e+02	        1.424834e-02
        5.271414e+02	        1.401611e-02
        5.330457e+02	        1.378273e-02
        5.390161e+02	        1.354693e-02
        5.450533e+02	        1.330856e-02
        5.511582e+02	        1.306586e-02
        5.573314e+02	        1.281559e-02
        5.635738e+02	        1.260057e-02
        5.698861e+02	        1.239887e-02
        5.762691e+02	        1.219775e-02
        5.827236e+02	        1.199882e-02
        5.892504e+02	        1.180027e-02
        5.958503e+02	        1.159947e-02
        6.025241e+02	        1.139664e-02
        6.092727e+02	        1.119959e-02
        6.160968e+02	        1.100871e-02
        6.229974e+02	        1.081597e-02
        6.299753e+02	        1.062378e-02
        6.370313e+02	        1.044557e-02
        6.441664e+02	        1.026631e-02
        6.513814e+02	        1.008564e-02
        6.586772e+02	        9.920693e-03
        6.660547e+02	        9.759687e-03
        6.735148e+02	        9.596924e-03
        6.810585e+02	        9.428057e-03
        6.886867e+02	        9.252841e-03
        6.964003e+02	        9.082024e-03
        7.042004e+02	        8.918440e-03
        7.120878e+02	        8.772445e-03
        7.200635e+02	        8.626120e-03
        7.281286e+02	        8.478929e-03
        7.362840e+02	        8.330507e-03
        7.445307e+02	        8.180608e-03
        7.528698e+02	        8.027875e-03
        7.613023e+02	        7.878242e-03
        7.698293e+02	        7.748256e-03
        7.784518e+02	        7.619279e-03
        7.871708e+02	        7.490073e-03
        7.959875e+02	        7.359851e-03
        8.049030e+02	        7.228490e-03
        8.139183e+02	        7.106108e-03
        8.230346e+02	        6.988103e-03
        8.322529e+02	        6.863172e-03
        8.415746e+02	        6.738337e-03
        8.510006e+02	        6.614203e-03
        8.605323e+02	        6.490704e-03
        8.701706e+02	        6.373524e-03
        8.799170e+02	        6.259158e-03
        8.897725e+02	        6.143808e-03
        8.997384e+02	        6.027385e-03
        9.098159e+02	        5.906683e-03
        9.200063e+02	        5.790815e-03
        9.303108e+02	        5.688579e-03
        9.407307e+02	        5.590700e-03
        9.512674e+02	        5.491997e-03
        9.619221e+02	        5.392466e-03
        9.726961e+02	        5.292058e-03
        9.835907e+02	        5.192662e-03
        9.946074e+02	        5.089895e-03
        1.005748e+03	        4.989861e-03
        1.017012e+03	        4.893296e-03
        1.028403e+03	        4.800799e-03
        1.039922e+03	        4.709899e-03
        1.051570e+03	        4.624760e-03
        1.063348e+03	        4.538884e-03
        1.075258e+03	        4.447974e-03
        1.087301e+03	        4.357589e-03
        1.099480e+03	        4.267598e-03
        1.111794e+03	        4.184207e-03
        1.124247e+03	        4.107002e-03
        1.136839e+03	        4.029551e-03
        1.149572e+03	        3.951834e-03
        1.162448e+03	        3.831765e-03
        1.175468e+03	        3.720870e-03
        1.188634e+03	        3.619670e-03
        1.201947e+03	        3.526711e-03
        1.215409e+03	        3.435614e-03
        1.229023e+03	        3.352583e-03
        1.242788e+03	        3.273467e-03
        1.256708e+03	        3.194953e-03
        1.270784e+03	        3.116492e-03
        1.285017e+03	        3.042705e-03
        1.299410e+03	        2.970006e-03
        1.313964e+03	        2.897796e-03
        1.328681e+03	        2.825993e-03
        1.343563e+03	        2.756655e-03
        1.358612e+03	        2.691810e-03
        1.373829e+03	        2.629008e-03
        1.389216e+03	        2.566750e-03
        1.404776e+03	        2.504861e-03
        1.420510e+03	        2.443115e-03
        1.436421e+03	        2.382299e-03
        1.452509e+03	        2.321377e-03
        1.468778e+03	        2.262230e-03
        1.485229e+03	        2.203415e-03
        1.501865e+03	        2.145258e-03
        1.518686e+03	        2.085934e-03
        1.535696e+03	        2.023507e-03
        1.552897e+03	        1.952421e-03
        1.570290e+03	        1.841870e-03
        1.587878e+03	        1.803828e-03
        1.605663e+03	        1.767148e-03
        1.623647e+03	        1.736574e-03
        1.641833e+03	        1.706047e-03
        1.660222e+03	        1.675532e-03
        1.678818e+03	        1.644757e-03
        1.697621e+03	        1.613666e-03
        1.716635e+03	        1.582876e-03
        1.735863e+03	        1.553489e-03
        1.755305e+03	        1.525523e-03
        1.774965e+03	        1.497569e-03
        1.794846e+03	        1.470908e-03
        1.814949e+03	        1.444181e-03
        1.835277e+03	        1.417197e-03
        1.855833e+03	        1.389941e-03
        1.876620e+03	        1.362401e-03
        1.897639e+03	        1.334636e-03
        1.918893e+03	        1.308137e-03
        1.940386e+03	        1.282259e-03
        1.962119e+03	        1.258967e-03
        1.984096e+03	        1.235664e-03
        2.006319e+03	        1.212124e-03
        2.028790e+03	        1.188393e-03
        2.051514e+03	        1.164449e-03
        2.074492e+03	        1.140996e-03
        2.097727e+03	        1.118707e-03
        2.121223e+03	        1.096878e-03
        2.144981e+03	        1.076988e-03
        2.169006e+03	        1.057218e-03
        2.193300e+03	        1.037249e-03
        2.217866e+03	        1.017268e-03
        2.242707e+03	        9.973631e-04
        2.267827e+03	        9.773238e-04
        2.293228e+03	        9.581389e-04
        2.318913e+03	        9.393828e-04
        2.344886e+03	        9.211467e-04
        2.371150e+03	        9.032018e-04
        2.397708e+03	        8.852709e-04
        2.424563e+03	        8.675882e-04
        2.451720e+03	        8.497391e-04
        2.479180e+03	        8.317218e-04
        2.506948e+03	        8.148809e-04
        2.535027e+03	        7.986874e-04
        2.563421e+03	        7.838578e-04
        2.592132e+03	        7.689659e-04
        2.621165e+03	        7.539943e-04
        2.650524e+03	        7.388712e-04
        2.680211e+03	        7.235872e-04
        2.710231e+03	        7.081493e-04
        2.740587e+03	        6.939938e-04
        2.771282e+03	        6.810145e-04
        2.802322e+03	        6.685769e-04
        2.833710e+03	        6.559741e-04
        2.865449e+03	        6.432304e-04
        2.897543e+03	        6.303525e-04
        2.929997e+03	        6.173770e-04
        2.962814e+03	        6.043566e-04
        2.995999e+03	        5.919238e-04
        3.029556e+03	        5.812036e-04
        3.063488e+03	        5.703652e-04
        3.097801e+03	        5.594057e-04
        3.132498e+03	        5.483264e-04
        3.167583e+03	        5.372956e-04
        3.203062e+03	        5.263290e-04
        3.238938e+03	        5.152542e-04
        3.275216e+03	        5.046674e-04
        3.311900e+03	        4.947449e-04
        3.348994e+03	        4.847501e-04
        3.386505e+03	        4.747852e-04
        3.424435e+03	        4.647313e-04
        3.462791e+03	        4.545757e-04
        3.501576e+03	        4.446198e-04
        3.540795e+03	        4.351212e-04
        3.580454e+03	        4.262838e-04
        3.620557e+03	        4.178837e-04
        3.661109e+03	        4.095379e-04
        3.702115e+03	        4.010986e-04
        3.743580e+03	        3.925793e-04
        3.785510e+03	        3.843330e-04
        3.827910e+03	        3.760919e-04
        3.870784e+03	        3.678443e-04
        3.914139e+03	        3.598169e-04
        3.957979e+03	        3.522135e-04
        4.002311e+03	        3.446246e-04
        4.047138e+03	        3.375423e-04
        4.092468e+03	        3.304869e-04
        4.138306e+03	        3.234344e-04
        4.184657e+03	        3.163375e-04
        4.231527e+03	        3.092921e-04
        4.278923e+03	        3.025077e-04
        4.326849e+03	        2.958075e-04
        4.375311e+03	        2.891791e-04
        4.424317e+03	        2.824979e-04
        4.473872e+03	        2.757635e-04
        4.523981e+03	        2.689760e-04
        4.574652e+03	        2.624088e-04
        4.625890e+03	        2.562787e-04
        4.677703e+03	        2.505105e-04
        4.730095e+03	        2.448829e-04
        4.783075e+03	        2.391926e-04
        4.836647e+03	        2.334020e-04
        4.890820e+03	        2.277072e-04
        4.945600e+03	        2.220559e-04
        5.000993e+03	        2.164240e-04
        5.057007e+03	        2.106790e-04
        5.113648e+03	        2.043999e-04
        5.170923e+03	        1.986224e-04
        5.228840e+03	        1.940403e-04
        5.287405e+03	        1.894905e-04
        5.346627e+03	        1.849013e-04
        5.406512e+03	        1.803234e-04
        5.467067e+03	        1.761224e-04
        5.528301e+03	        1.720002e-04
        5.590221e+03	        1.679629e-04
        5.652834e+03	        1.639206e-04
        5.716149e+03	        1.598757e-04
        5.780172e+03	        1.558192e-04
        5.844913e+03	        1.517420e-04
        5.910379e+03	        1.477806e-04
        5.976578e+03	        1.439616e-04
        6.043519e+03	        1.402812e-04
        6.111209e+03	        1.365213e-04
        6.179658e+03	        1.326802e-04
        6.248873e+03	        1.285389e-04
        6.318863e+03	        1.250897e-04
        6.389638e+03	        1.217126e-04
        6.461205e+03	        1.185085e-04
        6.533574e+03	        1.153451e-04
        6.606753e+03	        1.121441e-04
        6.680752e+03	        1.089651e-04
        6.755579e+03	        1.057808e-04
        6.831245e+03	        1.025939e-04
        6.907759e+03	        9.935055e-05
        6.985129e+03	        9.615710e-05
        7.063366e+03	        9.293186e-05
        7.142479e+03	        8.952647e-05
        7.222478e+03	        8.592923e-05
        7.303374e+03	        8.151242e-05
        7.385175e+03	        7.635169e-05
        7.467893e+03	        7.437363e-05
        7.551537e+03	        7.256393e-05
        7.636118e+03	        7.089718e-05
        7.721646e+03	        6.925388e-05
        7.808132e+03	        6.762183e-05
        7.895587e+03	        6.597383e-05
        7.984022e+03	        6.430777e-05
        8.073446e+03	        6.271724e-05
        8.163873e+03	        6.118257e-05
        8.255312e+03	        5.964056e-05
        8.347776e+03	        5.809027e-05
        8.441275e+03	        5.652462e-05
        8.535822e+03	        5.494342e-05
        8.631427e+03	        5.338656e-05
        8.728103e+03	        5.183231e-05
        8.825862e+03	        5.027570e-05
        8.924716e+03	        4.881469e-05
        9.024678e+03	        4.745076e-05
        9.125758e+03	        4.611955e-05
        9.227971e+03	        4.479058e-05
        9.331329e+03	        4.342597e-05
        9.435845e+03	        4.202726e-05
        9.541531e+03	        4.058713e-05
        9.648401e+03	        3.878987e-05
        9.756468e+03	        3.775795e-05
        9.865745e+03	        3.673517e-05
        9.976246e+03	        3.570759e-05
        1.008798e+04	        3.467065e-05
        1.020098e+04	        3.365476e-05
        1.031523e+04	        3.266595e-05
        1.043077e+04	        3.169165e-05
        1.054760e+04	        3.079752e-05
        1.066573e+04	        2.990251e-05
        1.078520e+04	        2.900079e-05
        1.090600e+04	        2.809469e-05
        1.102815e+04	        2.719785e-05
        1.115167e+04	        2.629369e-05
        1.127657e+04	        2.540527e-05
        1.140288e+04	        2.457317e-05
        1.153059e+04	        2.372371e-05
        1.165974e+04	        2.285351e-05
        1.179034e+04	        2.194909e-05
        1.192240e+04	        2.093934e-05
        1.205593e+04	        1.966518e-05
        1.219096e+04	        1.905055e-05
        1.232751e+04	        1.850943e-05
        1.246558e+04	        1.796816e-05
        1.260520e+04	        1.741976e-05
        1.274639e+04	        1.686551e-05
        1.288915e+04	        1.630448e-05
        1.303352e+04	        1.574305e-05
        1.317950e+04	        1.516309e-05
        1.332712e+04	        1.460081e-05
        1.347639e+04	        1.405498e-05
        1.362733e+04	        1.349049e-05
        1.377996e+04	        1.289029e-05
        1.393431e+04	        1.225318e-05
        1.409038e+04	        1.152415e-05
        1.424820e+04	        1.084039e-05
        1.440778e+04	        1.056677e-05
        1.456916e+04	        1.029150e-05
        1.473234e+04	        1.001344e-05
        1.489735e+04	        9.733348e-06
        1.506421e+04	        9.451406e-06
        1.523293e+04	        9.180435e-06
        1.540355e+04	        8.916411e-06
        1.557608e+04	        8.651691e-06
        1.575054e+04	        8.383585e-06
        1.592695e+04	        8.111179e-06
        1.610534e+04	        7.838106e-06
        1.628573e+04	        7.593809e-06
        1.646814e+04	        7.347185e-06
        1.665259e+04	        7.070793e-06
        1.683910e+04	        6.861462e-06
        1.702771e+04	        6.650463e-06
        1.721843e+04	        6.440900e-06
        1.741128e+04	        6.260337e-06
        1.760630e+04	        6.078437e-06
        1.780350e+04	        5.894152e-06
        1.800291e+04	        5.708003e-06
        1.820455e+04	        5.520624e-06
        1.840845e+04	        5.341084e-06
        1.861463e+04	        5.165436e-06
        1.882312e+04	        4.985346e-06
        1.903395e+04	        4.791605e-06
        1.924714e+04	        4.609873e-06
        1.946272e+04	        4.458214e-06
        1.968071e+04	        4.315256e-06
        1.990114e+04	        4.170460e-06
        2.012405e+04	        4.024048e-06
        2.034945e+04	        3.875003e-06
        2.057737e+04	        3.740599e-06
        2.080785e+04	        3.607162e-06
        2.104091e+04	        3.471400e-06
        2.127657e+04	        3.331418e-06
        2.151488e+04	        3.189354e-06
        2.175586e+04	        3.059083e-06
        2.199954e+04	        2.942384e-06
        2.224594e+04	        2.824480e-06
        2.249511e+04	        2.708118e-06
        2.274706e+04	        2.597152e-06
        2.300184e+04	        2.484801e-06
        2.325947e+04	        2.371472e-06
        2.351999e+04	        2.262173e-06
        2.378343e+04	        2.157883e-06
        2.404981e+04	        2.052772e-06
        2.431918e+04	        1.947089e-06
        2.459157e+04	        1.842464e-06
        2.486701e+04	        1.736637e-06
        2.514553e+04	        1.630959e-06
        2.542717e+04	        1.530365e-06
        2.571197e+04	        1.427718e-06
        2.599996e+04	        1.319743e-06
        2.629117e+04	        1.218525e-06
        2.658564e+04	        1.113601e-06
        2.688341e+04	        1.004167e-06
        2.718452e+04	        8.858023e-07
        2.748900e+04	        7.608191e-07
        2.779689e+04	        6.281972e-07
        2.810823e+04	        4.624594e-07
        2.842306e+04	        1.665225e-07
        2.874141e+04	        5.444008e-08
        2.906333e+04	        4.947089e-08
        2.938885e+04	        4.403411e-08
        2.971802e+04	        3.792664e-08
        3.005088e+04	        3.224424e-08
        3.038746e+04	        2.585588e-08
        3.072782e+04	        1.719361e-08
        3.107198e+04	        2.761996e-09
        3.142000e+04	        2.534601e-09
        3.177192e+04	        2.288907e-09
        3.212779e+04	        1.998302e-09
        3.248763e+04	        1.717604e-09
        3.285151e+04	        1.499118e-09
        3.321946e+04	        1.233715e-09
        3.359154e+04	        7.790230e-10
        3.396778e+04	        7.204985e-10
        3.434823e+04	        6.766265e-10
        3.473295e+04	        6.293445e-10
        3.512198e+04	        5.529981e-10
        3.551536e+04	        5.273026e-10
        3.591315e+04	        5.006700e-10
        3.631540e+04	        4.727952e-10
        3.672215e+04	        4.455280e-10
        3.713345e+04	        4.168357e-10
        3.754937e+04	        3.793588e-10
        3.796994e+04	        3.509170e-10
        3.839522e+04	        3.332716e-10
        3.882526e+04	        3.134166e-10
        3.926013e+04	        2.954285e-10
        3.969986e+04	        2.774754e-10
        4.014452e+04	        2.513277e-10
        4.059416e+04	        2.394592e-10
        4.104883e+04	        2.282709e-10
        4.150860e+04	        2.159109e-10
        4.197351e+04	        2.058635e-10
        4.244364e+04	        1.938616e-10
        4.291903e+04	        1.814629e-10
        4.339974e+04	        1.742699e-10
        4.388584e+04	        1.665795e-10
        4.437738e+04	        1.596251e-10
        4.487443e+04	        1.525495e-10
        4.537705e+04	        1.446471e-10
        4.588529e+04	        1.394868e-10
        4.639923e+04	        1.342443e-10
        4.691893e+04	        1.291934e-10
        4.744444e+04	        1.240856e-10
        4.797584e+04	        1.188108e-10
        4.851319e+04	        1.144510e-10
        4.905657e+04	        1.100852e-10
        4.960602e+04	        1.056725e-10
        5.016164e+04	        1.010042e-10
        5.072347e+04	        9.675622e-11
        5.129160e+04	        9.246088e-11
        5.186609e+04	        8.870696e-11
        5.244702e+04	        8.486459e-11
        5.303445e+04	        8.108234e-11
        5.362846e+04	        7.716204e-11
        5.422913e+04	        7.340737e-11
        5.483652e+04	        6.979230e-11
        5.545071e+04	        6.611407e-11
        5.607179e+04	        6.199782e-11
        5.669982e+04	        5.829714e-11
        5.733489e+04	        5.504862e-11
        5.797707e+04	        5.166662e-11
        5.862644e+04	        4.751977e-11
        5.928308e+04	        4.451838e-11
        5.994708e+04	        4.177827e-11
        6.061852e+04	        3.925149e-11
        6.129748e+04	        3.600576e-11
        6.198404e+04	        3.420612e-11
        6.267829e+04	        3.226242e-11
        6.338032e+04	        3.006139e-11
        6.409021e+04	        2.804265e-11
        6.480805e+04	        2.675048e-11
        6.553393e+04	        2.552322e-11
        6.626795e+04	        2.418619e-11
        6.701018e+04	        2.315048e-11
        6.776073e+04	        2.208358e-11
        6.851968e+04	        2.093052e-11
        6.928713e+04	        1.998715e-11
        7.006318e+04	        1.906493e-11
        7.084793e+04	        1.811624e-11
        7.164146e+04	        1.718381e-11
        7.244388e+04	        1.630717e-11
        7.325529e+04	        1.542608e-11
        7.407578e+04	        1.454860e-11
        7.490547e+04	        1.373314e-11
        7.574444e+04	        1.290512e-11
        7.659282e+04	        1.208350e-11
        7.745070e+04	        1.131524e-11
        7.831818e+04	        1.056034e-11
        7.919539e+04	        9.832593e-12
        8.008241e+04	        9.114019e-12
        8.097938e+04	        8.333880e-12
        8.188638e+04	        7.602333e-12
        8.280355e+04	        6.832750e-12
        8.373099e+04	        6.029430e-12
        8.466882e+04	        5.295013e-12
        8.561715e+04	        4.403253e-12
        8.657611e+04	        3.698882e-12
        8.754580e+04	        2.940959e-12
        8.852636e+04	        2.279768e-12
        8.951790e+04	        1.867791e-12
        9.052054e+04	        1.445391e-12
        9.153442e+04	        1.004460e-12
        9.255965e+04	        4.657293e-13
        9.359636e+04	        1.232773e-13
        9.464469e+04	        9.190943e-14
        9.570475e+04	        8.418115e-14
        9.677669e+04	        7.636244e-14
        9.786064e+04	        6.806118e-14
        9.895673e+04	        5.946545e-14
        1.000651e+05	        4.965548e-14
        1.011859e+05	        3.751946e-14
        1.023192e+05	        1.901185e-14
        1.034652e+05	        1.069408e-14
        1.046241e+05	        3.180172e-15
        1.057959e+05	        0.000000e+00
        1.069809e+05	        0.000000e+00
        1.081791e+05	        0.000000e+00
        1.093908e+05	        0.000000e+00

# -------------------------------------------------------------------------------
# Curve 1: LET spectrum without Flares
# Params: 0 5 #e086ff 2 1
#	LET (MeV.cm^2.g^{-1})		Flux (cm^{-2}.s^{-1})
# -------------------------------------------------------------------------------
        1.608960e+00	        7.085013e+01
        1.626982e+00	        7.085013e+01
        1.645205e+00	        7.085013e+01
        1.663632e+00	        7.085013e+01
        1.682265e+00	        7.074037e+01
        1.701107e+00	        7.060316e+01
        1.720161e+00	        7.051470e+01
        1.739427e+00	        7.045339e+01
        1.758910e+00	        7.039934e+01
        1.778610e+00	        7.035568e+01
        1.798532e+00	        7.031868e+01
        1.818676e+00	        7.028596e+01
        1.839046e+00	        7.025605e+01
        1.859644e+00	        7.022771e+01
        1.880473e+00	        7.020227e+01
        1.901536e+00	        7.017835e+01
        1.922834e+00	        7.015712e+01
        1.944370e+00	        7.014099e+01
        1.966148e+00	        7.012940e+01
        1.988170e+00	        7.012176e+01
        2.010439e+00	        7.011472e+01
        2.032956e+00	        7.010761e+01
        2.055727e+00	        7.010096e+01
        2.078752e+00	        7.009530e+01
        2.102035e+00	        7.008958e+01
        2.125579e+00	        7.008380e+01
        2.149386e+00	        7.007877e+01
        2.173460e+00	        7.007422e+01
        2.197804e+00	        7.006961e+01
        2.222421e+00	        7.006496e+01
        2.247313e+00	        7.006102e+01
        2.272484e+00	        7.005773e+01
        2.297937e+00	        7.005440e+01
        2.323675e+00	        7.005103e+01
        2.349701e+00	        7.004763e+01
        2.376019e+00	        7.004441e+01
        2.402632e+00	        7.004129e+01
        2.429542e+00	        7.003814e+01
        2.456754e+00	        7.003494e+01
        2.484271e+00	        7.003192e+01
        2.512096e+00	        7.003000e+01
        2.540233e+00	        7.002807e+01
        2.568685e+00	        7.002611e+01
        2.597455e+00	        7.002414e+01
        2.626548e+00	        7.002214e+01
        2.655967e+00	        7.002012e+01
        2.685715e+00	        7.001819e+01
        2.715796e+00	        7.001625e+01
        2.746214e+00	        7.001429e+01
        2.776973e+00	        7.001231e+01
        2.808077e+00	        7.001030e+01
        2.839529e+00	        7.000871e+01
        2.871333e+00	        7.000726e+01
        2.903493e+00	        7.000580e+01
        2.936014e+00	        7.000432e+01
        2.968899e+00	        7.000282e+01
        3.002152e+00	        7.000130e+01
        3.035777e+00	        6.994659e+01
        3.069779e+00	        6.988289e+01
        3.104162e+00	        6.981848e+01
        3.138931e+00	        6.975334e+01
        3.174088e+00	        6.968747e+01
        3.209640e+00	        6.962087e+01
        3.245589e+00	        6.951588e+01
        3.281941e+00	        6.940189e+01
        3.318701e+00	        6.928663e+01
        3.355872e+00	        6.917007e+01
        3.393459e+00	        6.905221e+01
        3.431468e+00	        6.893303e+01
        3.469902e+00	        6.881251e+01
        3.508766e+00	        6.867216e+01
        3.548066e+00	        6.852462e+01
        3.587806e+00	        6.837543e+01
        3.627992e+00	        6.822456e+01
        3.668627e+00	        6.807200e+01
        3.709717e+00	        6.791774e+01
        3.751268e+00	        6.776188e+01
        3.793284e+00	        6.760930e+01
        3.835771e+00	        6.745502e+01
        3.878733e+00	        6.729900e+01
        3.922177e+00	        6.714124e+01
        3.966107e+00	        6.698171e+01
        4.010530e+00	        6.682040e+01
        4.055449e+00	        6.665728e+01
        4.100872e+00	        6.647593e+01
        4.146804e+00	        6.625351e+01
        4.193250e+00	        6.602860e+01
        4.240217e+00	        6.580117e+01
        4.287709e+00	        6.557120e+01
        4.335734e+00	        6.533865e+01
        4.384296e+00	        6.510349e+01
        4.433403e+00	        6.490437e+01
        4.483059e+00	        6.470419e+01
        4.533271e+00	        6.450176e+01
        4.584046e+00	        6.429707e+01
        4.635390e+00	        6.409008e+01
        4.687308e+00	        6.388078e+01
        4.739809e+00	        6.366913e+01
        4.792897e+00	        6.345511e+01
        4.846580e+00	        6.320300e+01
        4.900864e+00	        6.294262e+01
        4.955756e+00	        6.267933e+01
        5.011263e+00	        6.241308e+01
        5.067391e+00	        6.214386e+01
        5.124149e+00	        6.187162e+01
        5.181542e+00	        6.159633e+01
        5.239577e+00	        6.133984e+01
        5.298263e+00	        6.108659e+01
        5.357606e+00	        6.083051e+01
        5.417614e+00	        6.057155e+01
        5.478294e+00	        6.030970e+01
        5.539654e+00	        6.004491e+01
        5.601701e+00	        5.977715e+01
        5.664442e+00	        5.950640e+01
        5.727887e+00	        5.923502e+01
        5.792042e+00	        5.896186e+01
        5.856916e+00	        5.868563e+01
        5.922516e+00	        5.840631e+01
        5.988851e+00	        5.812386e+01
        6.055929e+00	        5.783825e+01
        6.123759e+00	        5.754944e+01
        6.192348e+00	        5.725740e+01
        6.261705e+00	        5.695351e+01
        6.331839e+00	        5.663076e+01
        6.402759e+00	        5.630440e+01
        6.474473e+00	        5.597438e+01
        6.546991e+00	        5.564066e+01
        6.620320e+00	        5.530321e+01
        6.694471e+00	        5.496198e+01
        6.769452e+00	        5.459783e+01
        6.845274e+00	        5.424891e+01
        6.921944e+00	        5.390644e+01
        6.999473e+00	        5.356156e+01
        7.077871e+00	        5.321342e+01
        7.157146e+00	        5.286297e+01
        7.237310e+00	        5.250894e+01
        7.318371e+00	        5.215136e+01
        7.400341e+00	        5.178980e+01
        7.483228e+00	        5.143609e+01
        7.567044e+00	        5.109165e+01
        7.651799e+00	        5.074361e+01
        7.737503e+00	        5.039211e+01
        7.824166e+00	        5.003714e+01
        7.911801e+00	        4.967865e+01
        8.000417e+00	        4.931639e+01
        8.090026e+00	        4.895009e+01
        8.180638e+00	        4.857982e+01
        8.272265e+00	        4.822010e+01
        8.364918e+00	        4.785639e+01
        8.458610e+00	        4.748861e+01
        8.553350e+00	        4.711672e+01
        8.649152e+00	        4.674085e+01
        8.746027e+00	        4.636077e+01
        8.843987e+00	        4.597643e+01
        8.943044e+00	        4.558779e+01
        9.043210e+00	        4.519595e+01
        9.144499e+00	        4.480050e+01
        9.246921e+00	        4.440063e+01
        9.350492e+00	        4.399627e+01
        9.455222e+00	        4.358738e+01
        9.561125e+00	        4.317396e+01
        9.668214e+00	        4.275590e+01
        9.776503e+00	        4.233316e+01
        9.886005e+00	        4.193581e+01
        9.996733e+00	        4.157723e+01
        1.010870e+01	        4.121473e+01
        1.022192e+01	        4.084817e+01
        1.033641e+01	        4.047750e+01
        1.045219e+01	        4.010268e+01
        1.056926e+01	        3.972366e+01
        1.068764e+01	        3.934040e+01
        1.080734e+01	        3.895286e+01
        1.092839e+01	        3.855478e+01
        1.105080e+01	        3.813211e+01
        1.117457e+01	        3.770470e+01
        1.129973e+01	        3.727252e+01
        1.142629e+01	        3.683560e+01
        1.155427e+01	        3.639378e+01
        1.168369e+01	        3.594702e+01
        1.181455e+01	        3.549525e+01
        1.194688e+01	        3.507184e+01
        1.208069e+01	        3.473214e+01
        1.221600e+01	        3.438868e+01
        1.235282e+01	        3.404137e+01
        1.249118e+01	        3.369017e+01
        1.263109e+01	        3.333504e+01
        1.277256e+01	        3.297593e+01
        1.291562e+01	        3.261283e+01
        1.306028e+01	        3.224572e+01
        1.320657e+01	        3.187450e+01
        1.335449e+01	        3.147532e+01
        1.350406e+01	        3.105424e+01
        1.365531e+01	        3.062844e+01
        1.380826e+01	        3.019788e+01
        1.396292e+01	        2.976250e+01
        1.411931e+01	        2.932228e+01
        1.427746e+01	        2.887712e+01
        1.443737e+01	        2.842697e+01
        1.459908e+01	        2.804256e+01
        1.476259e+01	        2.767262e+01
        1.492794e+01	        2.729854e+01
        1.509514e+01	        2.692030e+01
        1.526421e+01	        2.653777e+01
        1.543518e+01	        2.615100e+01
        1.560806e+01	        2.575990e+01
        1.578288e+01	        2.536444e+01
        1.595966e+01	        2.497154e+01
        1.613841e+01	        2.461464e+01
        1.631917e+01	        2.425373e+01
        1.650195e+01	        2.388879e+01
        1.668678e+01	        2.351975e+01
        1.687368e+01	        2.314659e+01
        1.706268e+01	        2.276925e+01
        1.725379e+01	        2.238768e+01
        1.744704e+01	        2.200184e+01
        1.764245e+01	        2.166556e+01
        1.784006e+01	        2.134534e+01
        1.803988e+01	        2.102153e+01
        1.824193e+01	        2.069410e+01
        1.844625e+01	        2.036300e+01
        1.865286e+01	        2.002820e+01
        1.886178e+01	        1.968964e+01
        1.907304e+01	        1.934729e+01
        1.928667e+01	        1.900110e+01
        1.950269e+01	        1.870369e+01
        1.972113e+01	        1.840377e+01
        1.994201e+01	        1.810049e+01
        2.016537e+01	        1.779382e+01
        2.039124e+01	        1.748371e+01
        2.061963e+01	        1.717013e+01
        2.085058e+01	        1.685304e+01
        2.108411e+01	        1.653240e+01
        2.132027e+01	        1.623382e+01
        2.155906e+01	        1.597237e+01
        2.180054e+01	        1.570799e+01
        2.204471e+01	        1.544065e+01
        2.229162e+01	        1.517031e+01
        2.254130e+01	        1.489695e+01
        2.279378e+01	        1.462052e+01
        2.304908e+01	        1.434098e+01
        2.330724e+01	        1.405831e+01
        2.356829e+01	        1.377465e+01
        2.383227e+01	        1.348969e+01
        2.409920e+01	        1.320154e+01
        2.436912e+01	        1.291016e+01
        2.464207e+01	        1.261552e+01
        2.491807e+01	        1.231757e+01
        2.519717e+01	        1.201623e+01
        2.547939e+01	        1.173151e+01
        2.576477e+01	        1.153454e+01
        2.605335e+01	        1.133537e+01
        2.634516e+01	        1.113396e+01
        2.664024e+01	        1.093030e+01
        2.693862e+01	        1.072435e+01
        2.724035e+01	        1.051605e+01
        2.754545e+01	        1.030538e+01
        2.785397e+01	        1.009236e+01
        2.816595e+01	        9.876954e+00
        2.848142e+01	        9.683787e+00
        2.880043e+01	        9.489007e+00
        2.912301e+01	        9.292046e+00
        2.944920e+01	        9.092881e+00
        2.977905e+01	        8.891485e+00
        3.011259e+01	        8.687764e+00
        3.044986e+01	        8.481759e+00
        3.079092e+01	        8.273448e+00
        3.113579e+01	        8.112583e+00
        3.148453e+01	        7.956395e+00
        3.183717e+01	        7.798459e+00
        3.219376e+01	        7.638754e+00
        3.255435e+01	        7.477260e+00
        3.291897e+01	        7.313904e+00
        3.328768e+01	        7.148665e+00
        3.366052e+01	        6.981575e+00
        3.403753e+01	        6.825057e+00
        3.441877e+01	        6.700044e+00
        3.480428e+01	        6.573632e+00
        3.519410e+01	        6.445803e+00
        3.558829e+01	        6.316543e+00
        3.598690e+01	        6.185828e+00
        3.638997e+01	        6.053497e+00
        3.679756e+01	        5.919685e+00
        3.720971e+01	        5.784373e+00
        3.762647e+01	        5.651999e+00
        3.804791e+01	        5.532748e+00
        3.847406e+01	        5.412161e+00
        3.890499e+01	        5.290223e+00
        3.934075e+01	        5.166919e+00
        3.978138e+01	        5.042229e+00
        4.022696e+01	        4.916142e+00
        4.067752e+01	        4.788642e+00
        4.113313e+01	        4.670111e+00
        4.159384e+01	        4.577527e+00
        4.205971e+01	        4.483906e+00
        4.253080e+01	        4.389063e+00
        4.300716e+01	        4.293246e+00
        4.348887e+01	        4.196387e+00
        4.397596e+01	        4.098259e+00
        4.446851e+01	        3.998956e+00
        4.496658e+01	        3.898551e+00
        4.547023e+01	        3.817033e+00
        4.597952e+01	        3.740567e+00
        4.649451e+01	        3.663246e+00
        4.701528e+01	        3.585064e+00
        4.754187e+01	        3.506008e+00
        4.807436e+01	        3.426213e+00
        4.861282e+01	        3.345586e+00
        4.915731e+01	        3.264058e+00
        4.970789e+01	        3.184939e+00
        5.026464e+01	        3.121757e+00
        5.082763e+01	        3.057866e+00
        5.139693e+01	        2.993260e+00
        5.197260e+01	        2.927933e+00
        5.255472e+01	        2.861874e+00
        5.314336e+01	        2.795061e+00
        5.373859e+01	        2.727160e+00
        5.434049e+01	        2.658501e+00
        5.494913e+01	        2.597802e+00
        5.556458e+01	        2.540877e+00
        5.618694e+01	        2.483315e+00
        5.681626e+01	        2.425110e+00
        5.745263e+01	        2.366253e+00
        5.809612e+01	        2.306782e+00
        5.874683e+01	        2.246771e+00
        5.940482e+01	        2.186088e+00
        6.007019e+01	        2.137548e+00
        6.074300e+01	        2.091799e+00
        6.142335e+01	        2.045360e+00
        6.211133e+01	        1.998562e+00
        6.280700e+01	        1.951332e+00
        6.351047e+01	        1.903591e+00
        6.422182e+01	        1.855376e+00
        6.494114e+01	        1.806663e+00
        6.566851e+01	        1.763587e+00
        6.640403e+01	        1.723128e+00
        6.714779e+01	        1.682224e+00
        6.789988e+01	        1.640875e+00
        6.866039e+01	        1.599070e+00
        6.942942e+01	        1.556806e+00
        7.020706e+01	        1.514169e+00
        7.099342e+01	        1.473259e+00
        7.178858e+01	        1.445382e+00
        7.259264e+01	        1.417197e+00
        7.340572e+01	        1.388696e+00
        7.422790e+01	        1.359877e+00
        7.505929e+01	        1.330740e+00
        7.589999e+01	        1.301277e+00
        7.675011e+01	        1.271484e+00
        7.760974e+01	        1.241511e+00
        7.847901e+01	        1.211641e+00
        7.935802e+01	        1.183296e+00
        8.024686e+01	        1.154633e+00
        8.114567e+01	        1.125653e+00
        8.205454e+01	        1.096352e+00
        8.297359e+01	        1.066614e+00
        8.390294e+01	        1.036560e+00
        8.484269e+01	        1.006393e+00
        8.579297e+01	        9.849943e-01
        8.675389e+01	        9.638230e-01
        8.772558e+01	        9.424254e-01
        8.870815e+01	        9.207941e-01
        8.970173e+01	        8.989245e-01
        9.070643e+01	        8.768167e-01
        9.172239e+01	        8.544637e-01
        9.274972e+01	        8.318448e-01
        9.378856e+01	        8.129444e-01
        9.483904e+01	        7.944483e-01
        9.590129e+01	        7.757487e-01
        9.697543e+01	        7.568424e-01
        9.806160e+01	        7.377273e-01
        9.915994e+01	        7.183986e-01
        1.002706e+02	        6.990255e-01
        1.013937e+02	        6.804888e-01
        1.025293e+02	        6.654535e-01
        1.036777e+02	        6.502508e-01
        1.048389e+02	        6.348778e-01
        1.060132e+02	        6.193337e-01
        1.072006e+02	        6.036159e-01
        1.084013e+02	        5.873297e-01
        1.096154e+02	        5.709412e-01
        1.108432e+02	        5.565127e-01
        1.120847e+02	        5.438888e-01
        1.133401e+02	        5.311415e-01
        1.146095e+02	        5.182883e-01
        1.158932e+02	        5.053111e-01
        1.171913e+02	        4.922016e-01
        1.185039e+02	        4.789462e-01
        1.198312e+02	        4.655516e-01
        1.211734e+02	        4.544059e-01
        1.225306e+02	        4.437026e-01
        1.239030e+02	        4.328907e-01
        1.252907e+02	        4.219732e-01
        1.266941e+02	        4.109457e-01
        1.281131e+02	        3.998057e-01
        1.295480e+02	        3.885421e-01
        1.309990e+02	        3.779480e-01
        1.324663e+02	        3.679544e-01
        1.339500e+02	        3.581609e-01
        1.354503e+02	        3.482578e-01
        1.369674e+02	        3.382377e-01
        1.385015e+02	        3.281066e-01
        1.400528e+02	        3.179600e-01
        1.416214e+02	        3.105899e-01
        1.432077e+02	        3.031379e-01
        1.448117e+02	        2.956074e-01
        1.464336e+02	        2.879949e-01
        1.480737e+02	        2.804206e-01
        1.497322e+02	        2.727634e-01
        1.514093e+02	        2.650207e-01
        1.531052e+02	        2.581761e-01
        1.548200e+02	        2.514567e-01
        1.565541e+02	        2.446623e-01
        1.583076e+02	        2.377922e-01
        1.600807e+02	        2.308562e-01
        1.618737e+02	        2.241050e-01
        1.636867e+02	        2.176493e-01
        1.655201e+02	        2.121526e-01
        1.673740e+02	        2.065945e-01
        1.692487e+02	        2.009170e-01
        1.711444e+02	        1.951768e-01
        1.730613e+02	        1.893907e-01
        1.749996e+02	        1.835509e-01
        1.769597e+02	        1.789172e-01
        1.789418e+02	        1.745934e-01
        1.809460e+02	        1.702248e-01
        1.829727e+02	        1.658119e-01
        1.850221e+02	        1.613502e-01
        1.870944e+02	        1.568401e-01
        1.891900e+02	        1.522866e-01
        1.913090e+02	        1.481236e-01
        1.934517e+02	        1.439157e-01
        1.956185e+02	        1.397791e-01
        1.978095e+02	        1.356290e-01
        2.000251e+02	        1.314341e-01
        2.022655e+02	        1.273209e-01
        2.045309e+02	        1.240070e-01
        2.068218e+02	        1.206519e-01
        2.091383e+02	        1.172672e-01
        2.114807e+02	        1.138474e-01
        2.138494e+02	        1.104071e-01
        2.162446e+02	        1.070110e-01
        2.186667e+02	        1.042631e-01
        2.211159e+02	        1.014849e-01
        2.235925e+02	        9.867567e-02
        2.260968e+02	        9.583664e-02
        2.286292e+02	        9.296655e-02
        2.311900e+02	        9.006460e-02
        2.337794e+02	        8.760137e-02
        2.363979e+02	        8.528316e-02
        2.390456e+02	        8.293945e-02
        2.417231e+02	        8.057032e-02
        2.444305e+02	        7.807689e-02
        2.471682e+02	        7.559289e-02
        2.499366e+02	        7.340563e-02
        2.527360e+02	        7.125974e-02
        2.555668e+02	        6.909407e-02
        2.584293e+02	        6.696865e-02
        2.613238e+02	        6.483328e-02
        2.642508e+02	        6.275708e-02
        2.672105e+02	        6.104313e-02
        2.702034e+02	        5.931265e-02
        2.732298e+02	        5.756495e-02
        2.762901e+02	        5.579944e-02
        2.793847e+02	        5.402958e-02
        2.825139e+02	        5.240750e-02
        2.856782e+02	        5.096145e-02
        2.888780e+02	        4.949620e-02
        2.921136e+02	        4.802017e-02
        2.953854e+02	        4.653067e-02
        2.986938e+02	        4.502592e-02
        3.020393e+02	        4.368653e-02
        3.054223e+02	        4.246744e-02
        3.088432e+02	        4.123524e-02
        3.123024e+02	        4.000648e-02
        3.158004e+02	        3.876422e-02
        3.193375e+02	        3.750855e-02
        3.229142e+02	        3.627541e-02
        3.265310e+02	        3.504606e-02
        3.301883e+02	        3.380357e-02
        3.338866e+02	        3.250821e-02
        3.376263e+02	        3.121937e-02
        3.414079e+02	        3.023440e-02
        3.452318e+02	        2.932197e-02
        3.490986e+02	        2.840202e-02
        3.530086e+02	        2.747690e-02
        3.569625e+02	        2.654656e-02
        3.609607e+02	        2.561596e-02
        3.650036e+02	        2.479354e-02
        3.690918e+02	        2.397638e-02
        3.732258e+02	        2.317341e-02
        3.774062e+02	        2.236266e-02
        3.816333e+02	        2.154471e-02
        3.859078e+02	        2.077777e-02
        3.902301e+02	        2.004731e-02
        3.946009e+02	        1.931144e-02
        3.990206e+02	        1.856783e-02
        4.034898e+02	        1.783108e-02
        4.080091e+02	        1.715490e-02
        4.125790e+02	        1.653188e-02
        4.172001e+02	        1.590197e-02
        4.218730e+02	        1.526503e-02
        4.265982e+02	        1.462184e-02
        4.313763e+02	        1.399520e-02
        4.362079e+02	        1.338625e-02
        4.410936e+02	        1.278721e-02
        4.460341e+02	        1.219542e-02
        4.510299e+02	        1.160024e-02
        4.560817e+02	        1.102371e-02
        4.611900e+02	        1.044577e-02
        4.663556e+02	        9.862418e-03
        4.715790e+02	        9.273352e-03
        4.768609e+02	        8.714383e-03
        4.822020e+02	        8.168999e-03
        4.876029e+02	        7.620912e-03
        4.930643e+02	        7.056093e-03
        4.985868e+02	        6.473628e-03
        5.041712e+02	        5.885996e-03
        5.098182e+02	        5.273418e-03
        5.155284e+02	        4.643091e-03
        5.213026e+02	        4.247644e-03
        5.271414e+02	        4.168033e-03
        5.330457e+02	        4.087751e-03
        5.390161e+02	        4.006680e-03
        5.450533e+02	        3.924850e-03
        5.511582e+02	        3.840548e-03
        5.573314e+02	        3.750449e-03
        5.635738e+02	        3.678771e-03
        5.698861e+02	        3.614356e-03
        5.762691e+02	        3.549911e-03
        5.827236e+02	        3.485538e-03
        5.892504e+02	        3.421428e-03
        5.958503e+02	        3.356856e-03
        6.025241e+02	        3.291968e-03
        6.092727e+02	        3.230125e-03
        6.160968e+02	        3.169668e-03
        6.229974e+02	        3.108822e-03
        6.299753e+02	        3.048728e-03
        6.370313e+02	        2.989985e-03
        6.441664e+02	        2.931393e-03
        6.513814e+02	        2.872755e-03
        6.586772e+02	        2.821810e-03
        6.660547e+02	        2.773045e-03
        6.735148e+02	        2.723778e-03
        6.810585e+02	        2.669678e-03
        6.886867e+02	        2.610444e-03
        6.964003e+02	        2.554801e-03
        7.042004e+02	        2.503187e-03
        7.120878e+02	        2.459741e-03
        7.200635e+02	        2.416639e-03
        7.281286e+02	        2.373827e-03
        7.362840e+02	        2.330956e-03
        7.445307e+02	        2.287873e-03
        7.528698e+02	        2.242967e-03
        7.613023e+02	        2.199867e-03
        7.698293e+02	        2.159789e-03
        7.784518e+02	        2.119934e-03
        7.871708e+02	        2.080269e-03
        7.959875e+02	        2.040591e-03
        8.049030e+02	        2.000789e-03
        8.139183e+02	        1.965593e-03
        8.230346e+02	        1.932715e-03
        8.322529e+02	        1.893853e-03
        8.415746e+02	        1.855779e-03
        8.510006e+02	        1.818748e-03
        8.605323e+02	        1.782605e-03
        8.701706e+02	        1.749862e-03
        8.799170e+02	        1.719028e-03
        8.897725e+02	        1.688152e-03
        8.997384e+02	        1.657151e-03
        9.098159e+02	        1.622983e-03
        9.200063e+02	        1.590237e-03
        9.303108e+02	        1.561588e-03
        9.407307e+02	        1.534077e-03
        9.512674e+02	        1.506646e-03
        9.619221e+02	        1.479374e-03
        9.726961e+02	        1.452059e-03
        9.835907e+02	        1.425569e-03
        9.946074e+02	        1.392966e-03
        1.005748e+03	        1.363741e-03
        1.017012e+03	        1.336195e-03
        1.028403e+03	        1.309356e-03
        1.039922e+03	        1.283465e-03
        1.051570e+03	        1.260708e-03
        1.063348e+03	        1.237983e-03
        1.075258e+03	        1.210892e-03
        1.087301e+03	        1.184686e-03
        1.099480e+03	        1.159374e-03
        1.111794e+03	        1.136803e-03
        1.124247e+03	        1.114840e-03
        1.136839e+03	        1.093248e-03
        1.149572e+03	        1.071851e-03
        1.162448e+03	        1.007771e-03
        1.175468e+03	        9.517618e-04
        1.188634e+03	        9.057691e-04
        1.201947e+03	        8.671013e-04
        1.215409e+03	        8.301167e-04
        1.229023e+03	        7.978002e-04
        1.242788e+03	        7.673455e-04
        1.256708e+03	        7.378300e-04
        1.270784e+03	        7.089005e-04
        1.285017e+03	        6.827525e-04
        1.299410e+03	        6.578600e-04
        1.313964e+03	        6.336817e-04
        1.328681e+03	        6.104400e-04
        1.343563e+03	        5.884220e-04
        1.358612e+03	        5.664804e-04
        1.373829e+03	        5.469209e-04
        1.389216e+03	        5.280078e-04
        1.404776e+03	        5.094215e-04
        1.420510e+03	        4.912487e-04
        1.436421e+03	        4.734213e-04
        1.452509e+03	        4.553829e-04
        1.468778e+03	        4.377007e-04
        1.485229e+03	        4.203941e-04
        1.501865e+03	        4.031330e-04
        1.518686e+03	        3.854631e-04
        1.535696e+03	        3.665179e-04
        1.552897e+03	        3.440304e-04
        1.570290e+03	        3.037863e-04
        1.587878e+03	        2.969111e-04
        1.605663e+03	        2.902957e-04
        1.623647e+03	        2.842181e-04
        1.641833e+03	        2.782503e-04
        1.660222e+03	        2.723830e-04
        1.678818e+03	        2.664784e-04
        1.697621e+03	        2.605236e-04
        1.716635e+03	        2.550312e-04
        1.735863e+03	        2.498343e-04
        1.755305e+03	        2.448621e-04
        1.774965e+03	        2.399284e-04
        1.794846e+03	        2.351148e-04
        1.814949e+03	        2.303359e-04
        1.835277e+03	        2.255248e-04
        1.855833e+03	        2.206878e-04
        1.876620e+03	        2.158159e-04
        1.897639e+03	        2.109426e-04
        1.918893e+03	        2.062377e-04
        1.940386e+03	        2.017137e-04
        1.962119e+03	        1.975680e-04
        1.984096e+03	        1.934704e-04
        2.006319e+03	        1.893505e-04
        2.028790e+03	        1.852118e-04
        2.051514e+03	        1.810667e-04
        2.074492e+03	        1.771411e-04
        2.097727e+03	        1.733904e-04
        2.121223e+03	        1.696913e-04
        2.144981e+03	        1.661911e-04
        2.169006e+03	        1.627205e-04
        2.193300e+03	        1.592331e-04
        2.217866e+03	        1.559279e-04
        2.242707e+03	        1.526850e-04
        2.267827e+03	        1.494330e-04
        2.293228e+03	        1.462539e-04
        2.318913e+03	        1.431121e-04
        2.344886e+03	        1.400529e-04
        2.371150e+03	        1.370225e-04
        2.397708e+03	        1.340863e-04
        2.424563e+03	        1.312165e-04
        2.451720e+03	        1.283204e-04
        2.479180e+03	        1.253988e-04
        2.506948e+03	        1.226147e-04
        2.535027e+03	        1.199244e-04
        2.563421e+03	        1.174492e-04
        2.592132e+03	        1.150701e-04
        2.621165e+03	        1.126819e-04
        2.650524e+03	        1.102688e-04
        2.680211e+03	        1.078304e-04
        2.710231e+03	        1.053689e-04
        2.740587e+03	        1.030482e-04
        2.771282e+03	        1.008893e-04
        2.802322e+03	        9.881593e-05
        2.833710e+03	        9.671903e-05
        2.865449e+03	        9.459886e-05
        2.897543e+03	        9.245597e-05
        2.929997e+03	        9.029629e-05
        2.962814e+03	        8.814115e-05
        2.995999e+03	        8.617612e-05
        3.029556e+03	        8.446440e-05
        3.063488e+03	        8.273401e-05
        3.097801e+03	        8.098440e-05
        3.132498e+03	        7.921599e-05
        3.167583e+03	        7.746745e-05
        3.203062e+03	        7.574413e-05
        3.238938e+03	        7.400562e-05
        3.275216e+03	        7.235408e-05
        3.311900e+03	        7.078247e-05
        3.348994e+03	        6.919858e-05
        3.386505e+03	        6.762490e-05
        3.424435e+03	        6.604141e-05
        3.462791e+03	        6.444534e-05
        3.501576e+03	        6.286704e-05
        3.540795e+03	        6.141502e-05
        3.580454e+03	        6.006292e-05
        3.620557e+03	        5.875964e-05
        3.661109e+03	        5.747447e-05
        3.702115e+03	        5.617498e-05
        3.743580e+03	        5.486403e-05
        3.785510e+03	        5.357833e-05
        3.827910e+03	        5.229618e-05
        3.870784e+03	        5.106172e-05
        3.914139e+03	        4.987437e-05
        3.957979e+03	        4.873753e-05
        4.002311e+03	        4.759737e-05
        4.047138e+03	        4.650295e-05
        4.092468e+03	        4.540946e-05
        4.138306e+03	        4.432724e-05
        4.184657e+03	        4.324858e-05
        4.231527e+03	        4.221071e-05
        4.278923e+03	        4.120591e-05
        4.326849e+03	        4.020836e-05
        4.375311e+03	        3.922041e-05
        4.424317e+03	        3.822676e-05
        4.473872e+03	        3.722822e-05
        4.523981e+03	        3.621909e-05
        4.574652e+03	        3.527207e-05
        4.625890e+03	        3.438626e-05
        4.677703e+03	        3.353783e-05
        4.730095e+03	        3.270052e-05
        4.783075e+03	        3.185389e-05
        4.836647e+03	        3.099185e-05
        4.890820e+03	        3.013751e-05
        4.945600e+03	        2.928591e-05
        5.000993e+03	        2.845571e-05
        5.057007e+03	        2.760798e-05
        5.113648e+03	        2.664447e-05
        5.170923e+03	        2.576492e-05
        5.228840e+03	        2.511962e-05
        5.287405e+03	        2.448230e-05
        5.346627e+03	        2.383926e-05
        5.406512e+03	        2.320266e-05
        5.467067e+03	        2.262703e-05
        5.528301e+03	        2.206038e-05
        5.590221e+03	        2.150062e-05
        5.652834e+03	        2.094148e-05
        5.716149e+03	        2.037900e-05
        5.780172e+03	        1.981494e-05
        5.844913e+03	        1.924729e-05
        5.910379e+03	        1.869873e-05
        5.976578e+03	        1.817373e-05
        6.043519e+03	        1.765948e-05
        6.111209e+03	        1.712573e-05
        6.179658e+03	        1.656748e-05
        6.248873e+03	        1.588788e-05
        6.318863e+03	        1.544673e-05
        6.389638e+03	        1.501674e-05
        6.461205e+03	        1.461803e-05
        6.533574e+03	        1.422569e-05
        6.606753e+03	        1.382941e-05
        6.680752e+03	        1.343656e-05
        6.755579e+03	        1.304472e-05
        6.831245e+03	        1.265337e-05
        6.907759e+03	        1.225615e-05
        6.985129e+03	        1.186503e-05
        7.063366e+03	        1.147620e-05
        7.142479e+03	        1.107022e-05
        7.222478e+03	        1.064585e-05
        7.303374e+03	        1.013906e-05
        7.385175e+03	        9.556623e-06
        7.467893e+03	        9.296223e-06
        7.551537e+03	        9.056940e-06
        7.636118e+03	        8.839502e-06
        7.721646e+03	        8.626573e-06
        7.808132e+03	        8.415654e-06
        7.895587e+03	        8.202816e-06
        7.984022e+03	        7.987648e-06
        8.073446e+03	        7.780117e-06
        8.163873e+03	        7.579149e-06
        8.255312e+03	        7.377962e-06
        8.347776e+03	        7.178885e-06
        8.441275e+03	        6.978397e-06
        8.535822e+03	        6.775939e-06
        8.631427e+03	        6.575727e-06
        8.728103e+03	        6.376044e-06
        8.825862e+03	        6.175550e-06
        8.924716e+03	        5.988520e-06
        9.024678e+03	        5.814987e-06
        9.125758e+03	        5.645351e-06
        9.227971e+03	        5.475449e-06
        9.331329e+03	        5.300709e-06
        9.435845e+03	        5.119922e-06
        9.541531e+03	        4.932414e-06
        9.648401e+03	        4.689876e-06
        9.756468e+03	        4.562961e-06
        9.865745e+03	        4.437789e-06
        9.976246e+03	        4.312202e-06
        1.008798e+04	        4.185346e-06
        1.020098e+04	        4.060321e-06
        1.031523e+04	        3.938141e-06
        1.043077e+04	        3.818009e-06
        1.054760e+04	        3.708785e-06
        1.066573e+04	        3.600118e-06
        1.078520e+04	        3.489990e-06
        1.090600e+04	        3.379103e-06
        1.102815e+04	        3.270194e-06
        1.115167e+04	        3.160564e-06
        1.127657e+04	        3.052579e-06
        1.140288e+04	        2.951933e-06
        1.153059e+04	        2.849775e-06
        1.165974e+04	        2.745111e-06
        1.179034e+04	        2.636117e-06
        1.192240e+04	        2.514495e-06
        1.205593e+04	        2.360880e-06
        1.219096e+04	        2.287028e-06
        1.232751e+04	        2.222608e-06
        1.246558e+04	        2.158455e-06
        1.260520e+04	        2.093565e-06
        1.274639e+04	        2.027885e-06
        1.288915e+04	        1.961271e-06
        1.303352e+04	        1.894356e-06
        1.317950e+04	        1.825087e-06
        1.332712e+04	        1.758886e-06
        1.347639e+04	        1.696001e-06
        1.362733e+04	        1.631209e-06
        1.377996e+04	        1.562847e-06
        1.393431e+04	        1.490952e-06
        1.409038e+04	        1.410852e-06
        1.424820e+04	        1.337590e-06
        1.440778e+04	        1.303624e-06
        1.456916e+04	        1.269435e-06
        1.473234e+04	        1.234900e-06
        1.489735e+04	        1.200170e-06
        1.506421e+04	        1.165182e-06
        1.523293e+04	        1.131749e-06
        1.540355e+04	        1.099218e-06
        1.557608e+04	        1.066646e-06
        1.575054e+04	        1.033692e-06
        1.592695e+04	        1.000276e-06
        1.610534e+04	        9.668626e-07
        1.628573e+04	        9.371863e-07
        1.646814e+04	        9.073510e-07
        1.665259e+04	        8.744032e-07
        1.683910e+04	        8.485065e-07
        1.702771e+04	        8.224235e-07
        1.721843e+04	        7.966405e-07
        1.741128e+04	        7.743943e-07
        1.760630e+04	        7.520061e-07
        1.780350e+04	        7.293472e-07
        1.800291e+04	        7.065641e-07
        1.820455e+04	        6.837449e-07
        1.840845e+04	        6.619867e-07
        1.861463e+04	        6.408097e-07
        1.882312e+04	        6.193154e-07
        1.903395e+04	        5.972328e-07
        1.924714e+04	        5.755291e-07
        1.946272e+04	        5.562564e-07
        1.968071e+04	        5.380222e-07
        1.990114e+04	        5.195600e-07
        2.012405e+04	        5.009280e-07
        2.034945e+04	        4.818621e-07
        2.057737e+04	        4.648241e-07
        2.080785e+04	        4.478964e-07
        2.104091e+04	        4.307198e-07
        2.127657e+04	        4.130402e-07
        2.151488e+04	        3.950905e-07
        2.175586e+04	        3.785643e-07
        2.199954e+04	        3.637107e-07
        2.224594e+04	        3.487118e-07
        2.249511e+04	        3.338562e-07
        2.274706e+04	        3.196100e-07
        2.300184e+04	        3.051034e-07
        2.325947e+04	        2.905648e-07
        2.351999e+04	        2.760824e-07
        2.378343e+04	        2.630852e-07
        2.404981e+04	        2.499603e-07
        2.431918e+04	        2.367136e-07
        2.459157e+04	        2.234414e-07
        2.486701e+04	        2.099908e-07
        2.514553e+04	        1.969218e-07
        2.542717e+04	        1.844160e-07
        2.571197e+04	        1.714853e-07
        2.599996e+04	        1.573495e-07
        2.629117e+04	        1.452769e-07
        2.658564e+04	        1.327490e-07
        2.688341e+04	        1.196157e-07
        2.718452e+04	        1.051731e-07
        2.748900e+04	        9.028675e-08
        2.779689e+04	        7.461101e-08
        2.810823e+04	        5.495073e-08
        2.842306e+04	        1.966535e-08
        2.874141e+04	        6.288633e-09
        2.906333e+04	        5.721104e-09
        2.938885e+04	        5.097999e-09
        2.971802e+04	        4.384609e-09
        3.005088e+04	        3.742336e-09
        3.038746e+04	        3.021936e-09
        3.072782e+04	        2.040471e-09
        3.107198e+04	        3.976648e-10
        3.142000e+04	        3.702320e-10
        3.177192e+04	        3.405093e-10
        3.212779e+04	        3.045821e-10
        3.248763e+04	        2.704485e-10
        3.285151e+04	        2.478598e-10
        3.321946e+04	        2.213706e-10
        3.359154e+04	        1.788410e-10
        3.396778e+04	        1.696282e-10
        3.434823e+04	        1.619221e-10
        3.473295e+04	        1.539210e-10
        3.512198e+04	        1.427119e-10
        3.551536e+04	        1.372986e-10
        3.591315e+04	        1.318435e-10
        3.631540e+04	        1.262724e-10
        3.672215e+04	        1.208444e-10
        3.713345e+04	        1.152977e-10
        3.754937e+04	        1.089958e-10
        3.796994e+04	        1.035820e-10
        3.839522e+04	        9.912681e-11
        3.882526e+04	        9.396660e-11
        3.926013e+04	        8.963711e-11
        3.969986e+04	        8.592286e-11
        4.014452e+04	        8.156011e-11
        4.059416e+04	        7.839509e-11
        4.104883e+04	        7.520713e-11
        4.150860e+04	        7.176963e-11
        4.197351e+04	        6.888979e-11
        4.244364e+04	        6.563725e-11
        4.291903e+04	        6.230873e-11
        4.339974e+04	        6.005228e-11
        4.388584e+04	        5.773785e-11
        4.437738e+04	        5.558446e-11
        4.487443e+04	        5.341374e-11
        4.537705e+04	        5.107816e-11
        4.588529e+04	        4.933625e-11
        4.639923e+04	        4.757285e-11
        4.691893e+04	        4.589312e-11
        4.744444e+04	        4.423208e-11
        4.797584e+04	        4.254023e-11
        4.851319e+04	        4.104273e-11
        4.905657e+04	        3.954264e-11
        4.960602e+04	        3.805756e-11
        5.016164e+04	        3.650823e-11
        5.072347e+04	        3.507950e-11
        5.129160e+04	        3.363416e-11
        5.186609e+04	        3.238142e-11
        5.244702e+04	        3.110609e-11
        5.303445e+04	        2.985940e-11
        5.362846e+04	        2.857998e-11
        5.422913e+04	        2.736609e-11
        5.483652e+04	        2.619366e-11
        5.545071e+04	        2.503664e-11
        5.607179e+04	        2.382142e-11
        5.669982e+04	        2.270175e-11
        5.733489e+04	        2.167187e-11
        5.797707e+04	        2.063695e-11
        5.862644e+04	        1.949942e-11
        5.928308e+04	        1.856757e-11
        5.994708e+04	        1.768986e-11
        6.061852e+04	        1.685143e-11
        6.129748e+04	        1.594095e-11
        6.198404e+04	        1.517932e-11
        6.267829e+04	        1.437542e-11
        6.338032e+04	        1.349379e-11
        6.409021e+04	        1.267130e-11
        6.480805e+04	        1.207306e-11
        6.553393e+04	        1.149706e-11
        6.626795e+04	        1.087947e-11
        6.701018e+04	        1.037456e-11
        6.776073e+04	        9.856499e-12
        6.851968e+04	        9.303435e-12
        6.928713e+04	        8.838434e-12
        7.006318e+04	        8.377030e-12
        7.084793e+04	        7.898553e-12
        7.164146e+04	        7.435316e-12
        7.244388e+04	        7.013686e-12
        7.325529e+04	        6.590062e-12
        7.407578e+04	        6.168030e-12
        7.490547e+04	        5.779761e-12
        7.574444e+04	        5.386800e-12
        7.659282e+04	        4.997735e-12
        7.745070e+04	        4.638887e-12
        7.831818e+04	        4.289519e-12
        7.919539e+04	        3.958819e-12
        8.008241e+04	        3.636238e-12
        8.097938e+04	        3.273981e-12
        8.188638e+04	        2.954803e-12
        8.280355e+04	        2.620885e-12
        8.373099e+04	        2.269720e-12
        8.466882e+04	        1.981212e-12
        8.561715e+04	        1.637567e-12
        8.657611e+04	        1.379755e-12
        8.754580e+04	        1.099872e-12
        8.852636e+04	        8.520681e-13
        8.951790e+04	        6.946614e-13
        9.052054e+04	        5.314119e-13
        9.153442e+04	        3.750842e-13
        9.255965e+04	        1.859414e-13
        9.359636e+04	        6.525285e-14
        9.464469e+04	        5.271818e-14
        9.570475e+04	        4.822712e-14
        9.677669e+04	        4.370271e-14
        9.786064e+04	        3.890907e-14
        9.895673e+04	        3.396061e-14
        1.000651e+05	        2.832751e-14
        1.011859e+05	        2.138507e-14
        1.023192e+05	        1.082409e-14
        1.034652e+05	        6.082056e-15
        1.046241e+05	        1.807004e-15
        1.057959e+05	        0.000000e+00
        1.069809e+05	        0.000000e+00
        1.081791e+05	        0.000000e+00
        1.093908e+05	        0.000000e+00

