# -------------------------------------------------------------------------------
#		C:/Users/ACUBESAT-01/Documents/OMERE 5.3/SSO_570km/LET/LET-NF-5.75-570.txt
# -------------------------------------------------------------------------------
# ID: 1 2 1

# Graph: LET without Flares  
# min: 1.60896 0.01 max: 109391 70.182
# X-axis L: LET (MeV.cm^2.g^{-1})
# Y-axis L: Flux (cm^{-2}.s^{-1})
# -------------------------------------------------------------------------------
# Curve 0: Integral spectrum
# Params: 0 5 #c967d0 2 1
#	LET (MeV.cm^2.g^{-1})		Flux (cm^{-2}.s^{-1})
# -------------------------------------------------------------------------------
        1.608960e+00	        7.018199e+01
        1.626982e+00	        7.018199e+01
        1.645205e+00	        7.018199e+01
        1.663632e+00	        7.018199e+01
        1.682265e+00	        7.006896e+01
        1.701107e+00	        6.992759e+01
        1.720161e+00	        6.983646e+01
        1.739427e+00	        6.977331e+01
        1.758910e+00	        6.971763e+01
        1.778610e+00	        6.967258e+01
        1.798532e+00	        6.963432e+01
        1.818676e+00	        6.960045e+01
        1.839046e+00	        6.956941e+01
        1.859644e+00	        6.953998e+01
        1.880473e+00	        6.951362e+01
        1.901536e+00	        6.948894e+01
        1.922834e+00	        6.946710e+01
        1.944370e+00	        6.945052e+01
        1.966148e+00	        6.943861e+01
        1.988170e+00	        6.943074e+01
        2.010439e+00	        6.942349e+01
        2.032956e+00	        6.941616e+01
        2.055727e+00	        6.940931e+01
        2.078752e+00	        6.940349e+01
        2.102035e+00	        6.939761e+01
        2.125579e+00	        6.939165e+01
        2.149386e+00	        6.938647e+01
        2.173460e+00	        6.938178e+01
        2.197804e+00	        6.937703e+01
        2.222421e+00	        6.937223e+01
        2.247313e+00	        6.936817e+01
        2.272484e+00	        6.936478e+01
        2.297937e+00	        6.936134e+01
        2.323675e+00	        6.935788e+01
        2.349701e+00	        6.935437e+01
        2.376019e+00	        6.935106e+01
        2.402632e+00	        6.934785e+01
        2.429542e+00	        6.934461e+01
        2.456754e+00	        6.934133e+01
        2.484271e+00	        6.933821e+01
        2.512096e+00	        6.933625e+01
        2.540233e+00	        6.933426e+01
        2.568685e+00	        6.933225e+01
        2.597455e+00	        6.933022e+01
        2.626548e+00	        6.932816e+01
        2.655967e+00	        6.932608e+01
        2.685715e+00	        6.932411e+01
        2.715796e+00	        6.932211e+01
        2.746214e+00	        6.932010e+01
        2.776973e+00	        6.931806e+01
        2.808077e+00	        6.931600e+01
        2.839529e+00	        6.931436e+01
        2.871333e+00	        6.931287e+01
        2.903493e+00	        6.931136e+01
        2.936014e+00	        6.930984e+01
        2.968899e+00	        6.930830e+01
        3.002152e+00	        6.930674e+01
        3.035777e+00	        6.929209e+01
        3.069779e+00	        6.927521e+01
        3.104162e+00	        6.925815e+01
        3.138931e+00	        6.924089e+01
        3.174088e+00	        6.922345e+01
        3.209640e+00	        6.920580e+01
        3.245589e+00	        6.917825e+01
        3.281941e+00	        6.914837e+01
        3.318701e+00	        6.911815e+01
        3.355872e+00	        6.908759e+01
        3.393459e+00	        6.905670e+01
        3.431468e+00	        6.902545e+01
        3.469902e+00	        6.899386e+01
        3.508766e+00	        6.888039e+01
        3.548066e+00	        6.874086e+01
        3.587806e+00	        6.859976e+01
        3.627992e+00	        6.845709e+01
        3.668627e+00	        6.831281e+01
        3.709717e+00	        6.816692e+01
        3.751268e+00	        6.801767e+01
        3.793284e+00	        6.780128e+01
        3.835771e+00	        6.758246e+01
        3.878733e+00	        6.736119e+01
        3.922177e+00	        6.713745e+01
        3.966107e+00	        6.691119e+01
        4.010530e+00	        6.668241e+01
        4.055449e+00	        6.645106e+01
        4.100872e+00	        6.619587e+01
        4.146804e+00	        6.588729e+01
        4.193250e+00	        6.557524e+01
        4.240217e+00	        6.525970e+01
        4.287709e+00	        6.494063e+01
        4.335734e+00	        6.461798e+01
        4.384296e+00	        6.429172e+01
        4.433403e+00	        6.402208e+01
        4.483059e+00	        6.375124e+01
        4.533271e+00	        6.347737e+01
        4.584046e+00	        6.320043e+01
        4.635390e+00	        6.292040e+01
        4.687308e+00	        6.263722e+01
        4.739809e+00	        6.235088e+01
        4.792897e+00	        6.206132e+01
        4.846580e+00	        6.172867e+01
        4.900864e+00	        6.138622e+01
        4.955756e+00	        6.103993e+01
        5.011263e+00	        6.068977e+01
        5.067391e+00	        6.033568e+01
        5.124149e+00	        5.997763e+01
        5.181542e+00	        5.961557e+01
        5.239577e+00	        5.928580e+01
        5.298263e+00	        5.896248e+01
        5.357606e+00	        5.863553e+01
        5.417614e+00	        5.830493e+01
        5.478294e+00	        5.797062e+01
        5.539654e+00	        5.763257e+01
        5.601701e+00	        5.729074e+01
        5.664442e+00	        5.694507e+01
        5.727887e+00	        5.660576e+01
        5.792042e+00	        5.626795e+01
        5.856916e+00	        5.592635e+01
        5.922516e+00	        5.558093e+01
        5.988851e+00	        5.523164e+01
        6.055929e+00	        5.487844e+01
        6.123759e+00	        5.452129e+01
        6.192348e+00	        5.416013e+01
        6.261705e+00	        5.378877e+01
        6.331839e+00	        5.340213e+01
        6.402759e+00	        5.301117e+01
        6.474473e+00	        5.261582e+01
        6.546991e+00	        5.221605e+01
        6.620320e+00	        5.181180e+01
        6.694471e+00	        5.140303e+01
        6.769452e+00	        5.097007e+01
        6.845274e+00	        5.056135e+01
        6.921944e+00	        5.016460e+01
        6.999473e+00	        4.976490e+01
        7.077871e+00	        4.936136e+01
        7.157146e+00	        4.895494e+01
        7.237310e+00	        4.854433e+01
        7.318371e+00	        4.812957e+01
        7.400341e+00	        4.771022e+01
        7.483228e+00	        4.730568e+01
        7.567044e+00	        4.691848e+01
        7.651799e+00	        4.652719e+01
        7.737503e+00	        4.613196e+01
        7.824166e+00	        4.573278e+01
        7.911801e+00	        4.532957e+01
        8.000417e+00	        4.492211e+01
        8.090026e+00	        4.451009e+01
        8.180638e+00	        4.409375e+01
        8.272265e+00	        4.370209e+01
        8.364918e+00	        4.330609e+01
        8.458610e+00	        4.290565e+01
        8.553350e+00	        4.250075e+01
        8.649152e+00	        4.209149e+01
        8.746027e+00	        4.167765e+01
        8.843987e+00	        4.125917e+01
        8.943044e+00	        4.083601e+01
        9.043210e+00	        4.041671e+01
        9.144499e+00	        3.999954e+01
        9.246921e+00	        3.957770e+01
        9.350492e+00	        3.915113e+01
        9.455222e+00	        3.871979e+01
        9.561125e+00	        3.828365e+01
        9.668214e+00	        3.784263e+01
        9.776503e+00	        3.739667e+01
        9.886005e+00	        3.698275e+01
        9.996733e+00	        3.661730e+01
        1.010870e+01	        3.624784e+01
        1.022192e+01	        3.587425e+01
        1.033641e+01	        3.549647e+01
        1.045219e+01	        3.511446e+01
        1.056926e+01	        3.472817e+01
        1.068764e+01	        3.433756e+01
        1.080734e+01	        3.394259e+01
        1.092839e+01	        3.353977e+01
        1.105080e+01	        3.312135e+01
        1.117457e+01	        3.269823e+01
        1.129973e+01	        3.227041e+01
        1.142629e+01	        3.183788e+01
        1.155427e+01	        3.140051e+01
        1.168369e+01	        3.095824e+01
        1.181455e+01	        3.051102e+01
        1.194688e+01	        3.009401e+01
        1.208069e+01	        2.976553e+01
        1.221600e+01	        2.943342e+01
        1.235282e+01	        2.909760e+01
        1.249118e+01	        2.875801e+01
        1.263109e+01	        2.841462e+01
        1.277256e+01	        2.806738e+01
        1.291562e+01	        2.771628e+01
        1.306028e+01	        2.736131e+01
        1.320657e+01	        2.700237e+01
        1.335449e+01	        2.662385e+01
        1.350406e+01	        2.622970e+01
        1.365531e+01	        2.583114e+01
        1.380826e+01	        2.542812e+01
        1.396292e+01	        2.502059e+01
        1.411931e+01	        2.460852e+01
        1.427746e+01	        2.419184e+01
        1.443737e+01	        2.377049e+01
        1.459908e+01	        2.341780e+01
        1.476259e+01	        2.308065e+01
        1.492794e+01	        2.273972e+01
        1.509514e+01	        2.239500e+01
        1.526421e+01	        2.204637e+01
        1.543518e+01	        2.169387e+01
        1.560806e+01	        2.133743e+01
        1.578288e+01	        2.097701e+01
        1.595966e+01	        2.061974e+01
        1.613841e+01	        2.029985e+01
        1.631917e+01	        1.997638e+01
        1.650195e+01	        1.964929e+01
        1.668678e+01	        1.931854e+01
        1.687368e+01	        1.898408e+01
        1.706268e+01	        1.864588e+01
        1.725379e+01	        1.830389e+01
        1.744704e+01	        1.795808e+01
        1.764245e+01	        1.766114e+01
        1.784006e+01	        1.738029e+01
        1.803988e+01	        1.709630e+01
        1.824193e+01	        1.680913e+01
        1.844625e+01	        1.651874e+01
        1.865286e+01	        1.622510e+01
        1.886178e+01	        1.592817e+01
        1.907304e+01	        1.562791e+01
        1.928667e+01	        1.532429e+01
        1.950269e+01	        1.507024e+01
        1.972113e+01	        1.481418e+01
        1.994201e+01	        1.455524e+01
        2.016537e+01	        1.429341e+01
        2.039124e+01	        1.402865e+01
        2.061963e+01	        1.376092e+01
        2.085058e+01	        1.349019e+01
        2.108411e+01	        1.321644e+01
        2.132027e+01	        1.296365e+01
        2.155906e+01	        1.274595e+01
        2.180054e+01	        1.252581e+01
        2.204471e+01	        1.230321e+01
        2.229162e+01	        1.207811e+01
        2.254130e+01	        1.185049e+01
        2.279378e+01	        1.162032e+01
        2.304908e+01	        1.138755e+01
        2.330724e+01	        1.115218e+01
        2.356829e+01	        1.091870e+01
        2.383227e+01	        1.068650e+01
        2.409920e+01	        1.045170e+01
        2.436912e+01	        1.021427e+01
        2.464207e+01	        9.974177e+00
        2.491807e+01	        9.731397e+00
        2.519717e+01	        9.485842e+00
        2.547939e+01	        9.254148e+00
        2.576477e+01	        9.095432e+00
        2.605335e+01	        8.934938e+00
        2.634516e+01	        8.772647e+00
        2.664024e+01	        8.608537e+00
        2.693862e+01	        8.442586e+00
        2.724035e+01	        8.274727e+00
        2.754545e+01	        8.104957e+00
        2.785397e+01	        7.933296e+00
        2.816595e+01	        7.759714e+00
        2.848142e+01	        7.604588e+00
        2.880043e+01	        7.448181e+00
        2.912301e+01	        7.290023e+00
        2.944920e+01	        7.130095e+00
        2.977905e+01	        6.968376e+00
        3.011259e+01	        6.804784e+00
        3.044986e+01	        6.639357e+00
        3.079092e+01	        6.472079e+00
        3.113579e+01	        6.343314e+00
        3.148453e+01	        6.218364e+00
        3.183717e+01	        6.092015e+00
        3.219376e+01	        5.964251e+00
        3.255435e+01	        5.835056e+00
        3.291897e+01	        5.704367e+00
        3.328768e+01	        5.572170e+00
        3.366052e+01	        5.438491e+00
        3.403753e+01	        5.313355e+00
        3.441877e+01	        5.213653e+00
        3.480428e+01	        5.112834e+00
        3.519410e+01	        5.010886e+00
        3.558829e+01	        4.907796e+00
        3.598690e+01	        4.803545e+00
        3.638997e+01	        4.697997e+00
        3.679756e+01	        4.591267e+00
        3.720971e+01	        4.483342e+00
        3.762647e+01	        4.377805e+00
        3.804791e+01	        4.282886e+00
        3.847406e+01	        4.186904e+00
        3.890499e+01	        4.089848e+00
        3.934075e+01	        3.991704e+00
        3.978138e+01	        3.892477e+00
        4.022696e+01	        3.792141e+00
        4.067752e+01	        3.690682e+00
        4.113313e+01	        3.596393e+00
        4.159384e+01	        3.522840e+00
        4.205971e+01	        3.448463e+00
        4.253080e+01	        3.373075e+00
        4.300716e+01	        3.296934e+00
        4.348887e+01	        3.219971e+00
        4.397596e+01	        3.141998e+00
        4.446851e+01	        3.063089e+00
        4.496658e+01	        2.983307e+00
        4.547023e+01	        2.918588e+00
        4.597952e+01	        2.857900e+00
        4.649451e+01	        2.796536e+00
        4.701528e+01	        2.734488e+00
        4.754187e+01	        2.671747e+00
        4.807436e+01	        2.608448e+00
        4.861282e+01	        2.544499e+00
        4.915731e+01	        2.479836e+00
        4.970789e+01	        2.417090e+00
        5.026464e+01	        2.367012e+00
        5.082763e+01	        2.316373e+00
        5.139693e+01	        2.265167e+00
        5.197260e+01	        2.213389e+00
        5.255472e+01	        2.161031e+00
        5.314336e+01	        2.108077e+00
        5.373859e+01	        2.054278e+00
        5.434049e+01	        1.999878e+00
        5.494913e+01	        1.951805e+00
        5.556458e+01	        1.906733e+00
        5.618694e+01	        1.861156e+00
        5.681626e+01	        1.815071e+00
        5.745263e+01	        1.768470e+00
        5.809612e+01	        1.721393e+00
        5.874683e+01	        1.673921e+00
        5.940482e+01	        1.625917e+00
        6.007019e+01	        1.587525e+00
        6.074300e+01	        1.551285e+00
        6.142335e+01	        1.514457e+00
        6.211133e+01	        1.477381e+00
        6.280700e+01	        1.439984e+00
        6.351047e+01	        1.402187e+00
        6.422182e+01	        1.364035e+00
        6.494114e+01	        1.325500e+00
        6.566851e+01	        1.291426e+00
        6.640403e+01	        1.259424e+00
        6.714779e+01	        1.227070e+00
        6.789988e+01	        1.194367e+00
        6.866039e+01	        1.161306e+00
        6.942942e+01	        1.127883e+00
        7.020706e+01	        1.094183e+00
        7.099342e+01	        1.061871e+00
        7.178858e+01	        1.039858e+00
        7.259264e+01	        1.017602e+00
        7.340572e+01	        9.950963e-01
        7.422790e+01	        9.723403e-01
        7.505929e+01	        9.493338e-01
        7.589999e+01	        9.260700e-01
        7.675011e+01	        9.025459e-01
        7.760974e+01	        8.789228e-01
        7.847901e+01	        8.553872e-01
        7.935802e+01	        8.330699e-01
        8.024686e+01	        8.105026e-01
        8.114567e+01	        7.876859e-01
        8.205454e+01	        7.646174e-01
        8.297359e+01	        7.411798e-01
        8.390294e+01	        7.174971e-01
        8.484269e+01	        6.937545e-01
        8.579297e+01	        6.769439e-01
        8.675389e+01	        6.603153e-01
        8.772558e+01	        6.435116e-01
        8.870815e+01	        6.265259e-01
        8.970173e+01	        6.093541e-01
        9.070643e+01	        5.919970e-01
        9.172239e+01	        5.744479e-01
        9.274972e+01	        5.567019e-01
        9.378856e+01	        5.419178e-01
        9.483904e+01	        5.274546e-01
        9.590129e+01	        5.128330e-01
        9.697543e+01	        4.980504e-01
        9.806160e+01	        4.831053e-01
        9.915994e+01	        4.679931e-01
        1.002706e+02	        4.528418e-01
        1.013937e+02	        4.383343e-01
        1.025293e+02	        4.265877e-01
        1.036777e+02	        4.147105e-01
        1.048389e+02	        4.027003e-01
        1.060132e+02	        3.905567e-01
        1.072006e+02	        3.782775e-01
        1.084013e+02	        3.654594e-01
        1.096154e+02	        3.525793e-01
        1.108432e+02	        3.412608e-01
        1.120847e+02	        3.313731e-01
        1.133401e+02	        3.213938e-01
        1.146095e+02	        3.113411e-01
        1.158932e+02	        3.011963e-01
        1.171913e+02	        2.909517e-01
        1.185039e+02	        2.805941e-01
        1.198312e+02	        2.701298e-01
        1.211734e+02	        2.614272e-01
        1.225306e+02	        2.530640e-01
        1.239030e+02	        2.446185e-01
        1.252907e+02	        2.360940e-01
        1.266941e+02	        2.274861e-01
        1.281131e+02	        2.187929e-01
        1.295480e+02	        2.100035e-01
        1.309990e+02	        2.017413e-01
        1.324663e+02	        1.939524e-01
        1.339500e+02	        1.863038e-01
        1.354503e+02	        1.785696e-01
        1.369674e+02	        1.707426e-01
        1.385015e+02	        1.628292e-01
        1.400528e+02	        1.549054e-01
        1.416214e+02	        1.491652e-01
        1.432077e+02	        1.433614e-01
        1.448117e+02	        1.374976e-01
        1.464336e+02	        1.315706e-01
        1.480737e+02	        1.256672e-01
        1.497322e+02	        1.196993e-01
        1.514093e+02	        1.136648e-01
        1.531052e+02	        1.083371e-01
        1.548200e+02	        1.031086e-01
        1.565541e+02	        9.782167e-02
        1.583076e+02	        9.247601e-02
        1.600807e+02	        8.707971e-02
        1.618737e+02	        8.181383e-02
        1.636867e+02	        7.678079e-02
        1.655201e+02	        7.250205e-02
        1.673740e+02	        6.817544e-02
        1.692487e+02	        6.374206e-02
        1.711444e+02	        5.925979e-02
        1.730613e+02	        5.474613e-02
        1.749996e+02	        5.019315e-02
        1.769597e+02	        4.757632e-02
        1.789418e+02	        4.542658e-02
        1.809460e+02	        4.325651e-02
        1.829727e+02	        4.106692e-02
        1.850221e+02	        3.885353e-02
        1.870944e+02	        3.661696e-02
        1.891900e+02	        3.437299e-02
        1.913090e+02	        3.354169e-02
        1.934517e+02	        3.270288e-02
        1.956185e+02	        3.194116e-02
        1.978095e+02	        3.119503e-02
        2.000251e+02	        3.044234e-02
        2.022655e+02	        2.969547e-02
        2.045309e+02	        2.902340e-02
        2.068218e+02	        2.833968e-02
        2.091383e+02	        2.765630e-02
        2.114807e+02	        2.696825e-02
        2.138494e+02	        2.628554e-02
        2.162446e+02	        2.565376e-02
        2.186667e+02	        2.509034e-02
        2.211159e+02	        2.452102e-02
        2.235925e+02	        2.394552e-02
        2.260968e+02	        2.336527e-02
        2.286292e+02	        2.277933e-02
        2.311900e+02	        2.218711e-02
        2.337794e+02	        2.165367e-02
        2.363979e+02	        2.119568e-02
        2.390456e+02	        2.073303e-02
        2.417231e+02	        2.026605e-02
        2.444305e+02	        1.969395e-02
        2.471682e+02	        1.915357e-02
        2.499366e+02	        1.865885e-02
        2.527360e+02	        1.817526e-02
        2.555668e+02	        1.769078e-02
        2.584293e+02	        1.725021e-02
        2.613238e+02	        1.681552e-02
        2.642508e+02	        1.638740e-02
        2.672105e+02	        1.599597e-02
        2.702034e+02	        1.560289e-02
        2.732298e+02	        1.520761e-02
        2.762901e+02	        1.480966e-02
        2.793847e+02	        1.441899e-02
        2.825139e+02	        1.410674e-02
        2.856782e+02	        1.380562e-02
        2.888780e+02	        1.349803e-02
        2.921136e+02	        1.319272e-02
        2.953854e+02	        1.288712e-02
        2.986938e+02	        1.257967e-02
        3.020393e+02	        1.229016e-02
        3.054223e+02	        1.201350e-02
        3.088432e+02	        1.173430e-02
        3.123024e+02	        1.146486e-02
        3.158004e+02	        1.119268e-02
        3.193375e+02	        1.091795e-02
        3.229142e+02	        1.064442e-02
        3.265310e+02	        1.037136e-02
        3.301883e+02	        1.009591e-02
        3.338866e+02	        9.777621e-03
        3.376263e+02	        9.462859e-03
        3.414079e+02	        9.217694e-03
        3.452318e+02	        8.991805e-03
        3.490986e+02	        8.766246e-03
        3.530086e+02	        8.543513e-03
        3.569625e+02	        8.323526e-03
        3.609607e+02	        8.104737e-03
        3.650036e+02	        7.897790e-03
        3.690918e+02	        7.699314e-03
        3.732258e+02	        7.515955e-03
        3.774062e+02	        7.331752e-03
        3.816333e+02	        7.147365e-03
        3.859078e+02	        6.965502e-03
        3.902301e+02	        6.790370e-03
        3.946009e+02	        6.616130e-03
        3.990206e+02	        6.440583e-03
        4.034898e+02	        6.274081e-03
        4.080091e+02	        6.123942e-03
        4.125790e+02	        5.979597e-03
        4.172001e+02	        5.833729e-03
        4.218730e+02	        5.686257e-03
        4.265982e+02	        5.538023e-03
        4.313763e+02	        5.391357e-03
        4.362079e+02	        5.238484e-03
        4.410936e+02	        5.094645e-03
        4.460341e+02	        4.960933e-03
        4.510299e+02	        4.829006e-03
        4.560817e+02	        4.698915e-03
        4.611900e+02	        4.568920e-03
        4.663556e+02	        4.438547e-03
        4.715790e+02	        4.307572e-03
        4.768609e+02	        4.179383e-03
        4.822020e+02	        4.062453e-03
        4.876029e+02	        3.946835e-03
        4.930643e+02	        3.827069e-03
        4.985868e+02	        3.705670e-03
        5.041712e+02	        3.584280e-03
        5.098182e+02	        3.460737e-03
        5.155284e+02	        3.335331e-03
        5.213026e+02	        3.237545e-03
        5.271414e+02	        3.178869e-03
        5.330457e+02	        3.119807e-03
        5.390161e+02	        3.060247e-03
        5.450533e+02	        3.000187e-03
        5.511582e+02	        2.937865e-03
        5.573314e+02	        2.869894e-03
        5.635738e+02	        2.816129e-03
        5.698861e+02	        2.768007e-03
        5.762691e+02	        2.720013e-03
        5.827236e+02	        2.672337e-03
        5.892504e+02	        2.625032e-03
        5.958503e+02	        2.577457e-03
        6.025241e+02	        2.529770e-03
        6.092727e+02	        2.484280e-03
        6.160968e+02	        2.438770e-03
        6.229974e+02	        2.393035e-03
        6.299753e+02	        2.348177e-03
        6.370313e+02	        2.304676e-03
        6.441664e+02	        2.261514e-03
        6.513814e+02	        2.218518e-03
        6.586772e+02	        2.181125e-03
        6.660547e+02	        2.145322e-03
        6.735148e+02	        2.109169e-03
        6.810585e+02	        2.068251e-03
        6.886867e+02	        2.022270e-03
        6.964003e+02	        1.979968e-03
        7.042004e+02	        1.941188e-03
        7.120878e+02	        1.908394e-03
        7.200635e+02	        1.876049e-03
        7.281286e+02	        1.844132e-03
        7.362840e+02	        1.812293e-03
        7.445307e+02	        1.780383e-03
        7.528698e+02	        1.746767e-03
        7.613023e+02	        1.714608e-03
        7.698293e+02	        1.684770e-03
        7.784518e+02	        1.655238e-03
        7.871708e+02	        1.625969e-03
        7.959875e+02	        1.596805e-03
        8.049030e+02	        1.567639e-03
        8.139183e+02	        1.541798e-03
        8.230346e+02	        1.517667e-03
        8.322529e+02	        1.487567e-03
        8.415746e+02	        1.458353e-03
        8.510006e+02	        1.430306e-03
        8.605323e+02	        1.403262e-03
        8.701706e+02	        1.378792e-03
        8.799170e+02	        1.355892e-03
        8.897725e+02	        1.333050e-03
        8.997384e+02	        1.310185e-03
        9.098159e+02	        1.284223e-03
        9.200063e+02	        1.259484e-03
        9.303108e+02	        1.237928e-03
        9.407307e+02	        1.217372e-03
        9.512674e+02	        1.196950e-03
        9.619221e+02	        1.176773e-03
        9.726961e+02	        1.156637e-03
        9.835907e+02	        1.137186e-03
        9.946074e+02	        1.111024e-03
        1.005748e+03	        1.088361e-03
        1.017012e+03	        1.067397e-03
        1.028403e+03	        1.047169e-03
        1.039922e+03	        1.027719e-03
        1.051570e+03	        1.010695e-03
        1.063348e+03	        9.937801e-04
        1.075258e+03	        9.724991e-04
        1.087301e+03	        9.521856e-04
        1.099480e+03	        9.328320e-04
        1.111794e+03	        9.157077e-04
        1.124247e+03	        8.991003e-04
        1.136839e+03	        8.829292e-04
        1.149572e+03	        8.670036e-04
        1.162448e+03	        8.074917e-04
        1.175468e+03	        7.557446e-04
        1.188634e+03	        7.141887e-04
        1.201947e+03	        6.801374e-04
        1.215409e+03	        6.479001e-04
        1.229023e+03	        6.202496e-04
        1.242788e+03	        5.944500e-04
        1.256708e+03	        5.696836e-04
        1.270784e+03	        5.455618e-04
        1.285017e+03	        5.237037e-04
        1.299410e+03	        5.030901e-04
        1.313964e+03	        4.832324e-04
        1.328681e+03	        4.643660e-04
        1.343563e+03	        4.465395e-04
        1.358612e+03	        4.286066e-04
        1.373829e+03	        4.131030e-04
        1.389216e+03	        3.982278e-04
        1.404776e+03	        3.836253e-04
        1.420510e+03	        3.694861e-04
        1.436421e+03	        3.557293e-04
        1.452509e+03	        3.418379e-04
        1.468778e+03	        3.282465e-04
        1.485229e+03	        3.150808e-04
        1.501865e+03	        3.019576e-04
        1.518686e+03	        2.885554e-04
        1.535696e+03	        2.742630e-04
        1.552897e+03	        2.576183e-04
        1.570290e+03	        2.283396e-04
        1.587878e+03	        2.229287e-04
        1.605663e+03	        2.177208e-04
        1.623647e+03	        2.128283e-04
        1.641833e+03	        2.080390e-04
        1.660222e+03	        2.033299e-04
        1.678818e+03	        1.985949e-04
        1.697621e+03	        1.938225e-04
        1.716635e+03	        1.895258e-04
        1.735863e+03	        1.855008e-04
        1.755305e+03	        1.816403e-04
        1.774965e+03	        1.778221e-04
        1.794846e+03	        1.740841e-04
        1.814949e+03	        1.703726e-04
        1.835277e+03	        1.666378e-04
        1.855833e+03	        1.628898e-04
        1.876620e+03	        1.591196e-04
        1.897639e+03	        1.553586e-04
        1.918893e+03	        1.517298e-04
        1.940386e+03	        1.482727e-04
        1.962119e+03	        1.450937e-04
        1.984096e+03	        1.419461e-04
        2.006319e+03	        1.387866e-04
        2.028790e+03	        1.356175e-04
        2.051514e+03	        1.324528e-04
        2.074492e+03	        1.294788e-04
        2.097727e+03	        1.266471e-04
        2.121223e+03	        1.238539e-04
        2.144981e+03	        1.211763e-04
        2.169006e+03	        1.185160e-04
        2.193300e+03	        1.158480e-04
        2.217866e+03	        1.133758e-04
        2.242707e+03	        1.109594e-04
        2.267827e+03	        1.085388e-04
        2.293228e+03	        1.061761e-04
        2.318913e+03	        1.038433e-04
        2.344886e+03	        1.015621e-04
        2.371150e+03	        9.929774e-05
        2.397708e+03	        9.712784e-05
        2.424563e+03	        9.500440e-05
        2.451720e+03	        9.286202e-05
        2.479180e+03	        9.070173e-05
        2.506948e+03	        8.863337e-05
        2.535027e+03	        8.663007e-05
        2.563421e+03	        8.478396e-05
        2.592132e+03	        8.304236e-05
        2.621165e+03	        8.129314e-05
        2.650524e+03	        7.952614e-05
        2.680211e+03	        7.774112e-05
        2.710231e+03	        7.593988e-05
        2.740587e+03	        7.423905e-05
        2.771282e+03	        7.264712e-05
        2.802322e+03	        7.110994e-05
        2.833710e+03	        6.955601e-05
        2.865449e+03	        6.798488e-05
        2.897543e+03	        6.639721e-05
        2.929997e+03	        6.479727e-05
        2.962814e+03	        6.319875e-05
        2.995999e+03	        6.176778e-05
        3.029556e+03	        6.052644e-05
        3.063488e+03	        5.927163e-05
        3.097801e+03	        5.800294e-05
        3.132498e+03	        5.672082e-05
        3.167583e+03	        5.545048e-05
        3.203062e+03	        5.419519e-05
        3.238938e+03	        5.292941e-05
        3.275216e+03	        5.173204e-05
        3.311900e+03	        5.059490e-05
        3.348994e+03	        4.944858e-05
        3.386505e+03	        4.830775e-05
        3.424435e+03	        4.715924e-05
        3.462791e+03	        4.600213e-05
        3.501576e+03	        4.485444e-05
        3.540795e+03	        4.381585e-05
        3.580454e+03	        4.284727e-05
        3.620557e+03	        4.191312e-05
        3.661109e+03	        4.098989e-05
        3.702115e+03	        4.005640e-05
        3.743580e+03	        3.911452e-05
        3.785510e+03	        3.818594e-05
        3.827910e+03	        3.726130e-05
        3.870784e+03	        3.638341e-05
        3.914139e+03	        3.554060e-05
        3.957979e+03	        3.473152e-05
        4.002311e+03	        3.392001e-05
        4.047138e+03	        3.313176e-05
        4.092468e+03	        3.234312e-05
        4.138306e+03	        3.156140e-05
        4.184657e+03	        3.078436e-05
        4.231527e+03	        3.004450e-05
        4.278923e+03	        2.932673e-05
        4.326849e+03	        2.861345e-05
        4.375311e+03	        2.790538e-05
        4.424317e+03	        2.719287e-05
        4.473872e+03	        2.647708e-05
        4.523981e+03	        2.575411e-05
        4.574652e+03	        2.508475e-05
        4.625890e+03	        2.445568e-05
        4.677703e+03	        2.385234e-05
        4.730095e+03	        2.325622e-05
        4.783075e+03	        2.265346e-05
        4.836647e+03	        2.204011e-05
        4.890820e+03	        2.143026e-05
        4.945600e+03	        2.082406e-05
        5.000993e+03	        2.024285e-05
        5.057007e+03	        1.965174e-05
        5.113648e+03	        1.898609e-05
        5.170923e+03	        1.837328e-05
        5.228840e+03	        1.791056e-05
        5.287405e+03	        1.745295e-05
        5.346627e+03	        1.699155e-05
        5.406512e+03	        1.653755e-05
        5.467067e+03	        1.612946e-05
        5.528301e+03	        1.572853e-05
        5.590221e+03	        1.533220e-05
        5.652834e+03	        1.493606e-05
        5.716149e+03	        1.453699e-05
        5.780172e+03	        1.413672e-05
        5.844913e+03	        1.373391e-05
        5.910379e+03	        1.334794e-05
        5.976578e+03	        1.298102e-05
        6.043519e+03	        1.262190e-05
        6.111209e+03	        1.225031e-05
        6.179658e+03	        1.186268e-05
        6.248873e+03	        1.139702e-05
        6.318863e+03	        1.108235e-05
        6.389638e+03	        1.077693e-05
        6.461205e+03	        1.049879e-05
        6.533574e+03	        1.022629e-05
        6.606753e+03	        9.951664e-06
        6.680752e+03	        9.678626e-06
        6.755579e+03	        9.406355e-06
        6.831245e+03	        9.134280e-06
        6.907759e+03	        8.858614e-06
        6.985129e+03	        8.588115e-06
        7.063366e+03	        8.323023e-06
        7.142479e+03	        8.049069e-06
        7.222478e+03	        7.765305e-06
        7.303374e+03	        7.436260e-06
        7.385175e+03	        7.065654e-06
        7.467893e+03	        6.871382e-06
        7.551537e+03	        6.693765e-06
        7.636118e+03	        6.534329e-06
        7.721646e+03	        6.378459e-06
        7.808132e+03	        6.223973e-06
        7.895587e+03	        6.068128e-06
        7.984022e+03	        5.910586e-06
        8.073446e+03	        5.757828e-06
        8.163873e+03	        5.609073e-06
        8.255312e+03	        5.460369e-06
        8.347776e+03	        5.314149e-06
        8.441275e+03	        5.167077e-06
        8.535822e+03	        5.018631e-06
        8.631427e+03	        4.871557e-06
        8.728103e+03	        4.724877e-06
        8.825862e+03	        4.577632e-06
        8.924716e+03	        4.441551e-06
        9.024678e+03	        4.315728e-06
        9.125758e+03	        4.192869e-06
        9.227971e+03	        4.069705e-06
        9.331329e+03	        3.943298e-06
        9.435845e+03	        3.812849e-06
        9.541531e+03	        3.677953e-06
        9.648401e+03	        3.508104e-06
        9.756468e+03	        3.414597e-06
        9.865745e+03	        3.322458e-06
        9.976246e+03	        3.230009e-06
        1.008798e+04	        3.136640e-06
        1.020098e+04	        3.044384e-06
        1.031523e+04	        2.953967e-06
        1.043077e+04	        2.865341e-06
        1.054760e+04	        2.785544e-06
        1.066573e+04	        2.706347e-06
        1.078520e+04	        2.626151e-06
        1.090600e+04	        2.545409e-06
        1.102815e+04	        2.466035e-06
        1.115167e+04	        2.386212e-06
        1.127657e+04	        2.307359e-06
        1.140288e+04	        2.234601e-06
        1.153059e+04	        2.161211e-06
        1.165974e+04	        2.086146e-06
        1.179034e+04	        2.008315e-06
        1.192240e+04	        1.922537e-06
        1.205593e+04	        1.816807e-06
        1.219096e+04	        1.760783e-06
        1.232751e+04	        1.712313e-06
        1.246558e+04	        1.664156e-06
        1.260520e+04	        1.615480e-06
        1.274639e+04	        1.566229e-06
        1.288915e+04	        1.516275e-06
        1.303352e+04	        1.466141e-06
        1.317950e+04	        1.414490e-06
        1.332712e+04	        1.365351e-06
        1.347639e+04	        1.318420e-06
        1.362733e+04	        1.270212e-06
        1.377996e+04	        1.219704e-06
        1.393431e+04	        1.166879e-06
        1.409038e+04	        1.109076e-06
        1.424820e+04	        1.057059e-06
        1.440778e+04	        1.030165e-06
        1.456916e+04	        1.003098e-06
        1.473234e+04	        9.757568e-07
        1.489735e+04	        9.482749e-07
        1.506421e+04	        9.206086e-07
        1.523293e+04	        8.942367e-07
        1.540355e+04	        8.685836e-07
        1.557608e+04	        8.429208e-07
        1.575054e+04	        8.169766e-07
        1.592695e+04	        7.906992e-07
        1.610534e+04	        7.644505e-07
        1.628573e+04	        7.412155e-07
        1.646814e+04	        7.179646e-07
        1.665259e+04	        6.925815e-07
        1.683910e+04	        6.719486e-07
        1.702771e+04	        6.511771e-07
        1.721843e+04	        6.306674e-07
        1.741128e+04	        6.129305e-07
        1.760630e+04	        5.950845e-07
        1.780350e+04	        5.770118e-07
        1.800291e+04	        5.588703e-07
        1.820455e+04	        5.407345e-07
        1.840845e+04	        5.234458e-07
        1.861463e+04	        5.066153e-07
        1.882312e+04	        4.895397e-07
        1.903395e+04	        4.720154e-07
        1.924714e+04	        4.547952e-07
        1.946272e+04	        4.394680e-07
        1.968071e+04	        4.249479e-07
        1.990114e+04	        4.102477e-07
        2.012405e+04	        3.954219e-07
        2.034945e+04	        3.802265e-07
        2.057737e+04	        3.666862e-07
        2.080785e+04	        3.532312e-07
        2.104091e+04	        3.395903e-07
        2.127657e+04	        3.255588e-07
        2.151488e+04	        3.113162e-07
        2.175586e+04	        2.981821e-07
        2.199954e+04	        2.863561e-07
        2.224594e+04	        2.744172e-07
        2.249511e+04	        2.625778e-07
        2.274706e+04	        2.512001e-07
        2.300184e+04	        2.395938e-07
        2.325947e+04	        2.279855e-07
        2.351999e+04	        2.163061e-07
        2.378343e+04	        2.060266e-07
        2.404981e+04	        1.956411e-07
        2.431918e+04	        1.851481e-07
        2.459157e+04	        1.746021e-07
        2.486701e+04	        1.639088e-07
        2.514553e+04	        1.536058e-07
        2.542717e+04	        1.437302e-07
        2.571197e+04	        1.334786e-07
        2.599996e+04	        1.221438e-07
        2.629117e+04	        1.127218e-07
        2.658564e+04	        1.029411e-07
        2.688341e+04	        9.267462e-08
        2.718452e+04	        8.131297e-08
        2.748900e+04	        6.974719e-08
        2.779689e+04	        5.762397e-08
        2.810823e+04	        4.242537e-08
        2.842306e+04	        1.516248e-08
        2.874141e+04	        4.831684e-09
        2.906333e+04	        4.395468e-09
        2.938885e+04	        3.916176e-09
        2.971802e+04	        3.364196e-09
        3.005088e+04	        2.873875e-09
        3.038746e+04	        2.325481e-09
        3.072782e+04	        1.579490e-09
        3.107198e+04	        3.327975e-10
        3.142000e+04	        3.105117e-10
        3.177192e+04	        2.864435e-10
        3.212779e+04	        2.575156e-10
        3.248763e+04	        2.300255e-10
        3.285151e+04	        2.117108e-10
        3.321946e+04	        1.903897e-10
        3.359154e+04	        1.566263e-10
        3.396778e+04	        1.486935e-10
        3.434823e+04	        1.420531e-10
        3.473295e+04	        1.351885e-10
        3.512198e+04	        1.257529e-10
        3.551536e+04	        1.209996e-10
        3.591315e+04	        1.162218e-10
        3.631540e+04	        1.113514e-10
        3.672215e+04	        1.066097e-10
        3.713345e+04	        1.017781e-10
        3.754937e+04	        9.636388e-11
        3.796994e+04	        9.165318e-11
        3.839522e+04	        8.767539e-11
        3.882526e+04	        8.302097e-11
        3.926013e+04	        7.917681e-11
        3.969986e+04	        7.595205e-11
        4.014452e+04	        7.220649e-11
        4.059416e+04	        6.944186e-11
        4.104883e+04	        6.666523e-11
        4.150860e+04	        6.369586e-11
        4.197351e+04	        6.116869e-11
        4.244364e+04	        5.834121e-11
        4.291903e+04	        5.545326e-11
        4.339974e+04	        5.344394e-11
        4.388584e+04	        5.139055e-11
        4.437738e+04	        4.947385e-11
        4.487443e+04	        4.754314e-11
        4.537705e+04	        4.547473e-11
        4.588529e+04	        4.391007e-11
        4.639923e+04	        4.232579e-11
        4.691893e+04	        4.081783e-11
        4.744444e+04	        3.932717e-11
        4.797584e+04	        3.780848e-11
        4.851319e+04	        3.646750e-11
        4.905657e+04	        3.512431e-11
        4.960602e+04	        3.379766e-11
        5.016164e+04	        3.241516e-11
        5.072347e+04	        3.113917e-11
        5.129160e+04	        2.984497e-11
        5.186609e+04	        2.872679e-11
        5.244702e+04	        2.758820e-11
        5.303445e+04	        2.647807e-11
        5.362846e+04	        2.533929e-11
        5.422913e+04	        2.426184e-11
        5.483652e+04	        2.322559e-11
        5.545071e+04	        2.220210e-11
        5.607179e+04	        2.112668e-11
        5.669982e+04	        2.013456e-11
        5.733489e+04	        1.921888e-11
        5.797707e+04	        1.830059e-11
        5.862644e+04	        1.729602e-11
        5.928308e+04	        1.646851e-11
        5.994708e+04	        1.568651e-11
        6.061852e+04	        1.494074e-11
        6.129748e+04	        1.413298e-11
        6.198404e+04	        1.345559e-11
        6.267829e+04	        1.274183e-11
        6.338032e+04	        1.196138e-11
        6.409021e+04	        1.123250e-11
        6.480805e+04	        1.069808e-11
        6.553393e+04	        1.018267e-11
        6.626795e+04	        9.631000e-12
        6.701018e+04	        9.177344e-12
        6.776073e+04	        8.712061e-12
        6.851968e+04	        8.216416e-12
        6.928713e+04	        7.798089e-12
        7.006318e+04	        7.382190e-12
        7.084793e+04	        6.950510e-12
        7.164146e+04	        6.533437e-12
        7.244388e+04	        6.155365e-12
        7.325529e+04	        5.775275e-12
        7.407578e+04	        5.396606e-12
        7.490547e+04	        5.049174e-12
        7.574444e+04	        4.697926e-12
        7.659282e+04	        4.350332e-12
        7.745070e+04	        4.030790e-12
        7.831818e+04	        3.720677e-12
        7.919539e+04	        3.428070e-12
        8.008241e+04	        3.143414e-12
        8.097938e+04	        2.822871e-12
        8.188638e+04	        2.544568e-12
        8.280355e+04	        2.249923e-12
        8.373099e+04	        1.939219e-12
        8.466882e+04	        1.687435e-12
        8.561715e+04	        1.387809e-12
        8.657611e+04	        1.165391e-12
        8.754580e+04	        9.248130e-13
        8.852636e+04	        7.129511e-13
        8.951790e+04	        5.792567e-13
        9.052054e+04	        4.405951e-13
        9.153442e+04	        3.128174e-13
        9.255965e+04	        1.587153e-13
        9.359636e+04	        6.023477e-14
        9.464469e+04	        4.955365e-14
        9.570475e+04	        4.533753e-14
        9.677669e+04	        4.109159e-14
        9.786064e+04	        3.659372e-14
        9.895673e+04	        3.195113e-14
        1.000651e+05	        2.667023e-14
        1.011859e+05	        2.017259e-14
        1.023192e+05	        1.030985e-14
        1.034652e+05	        5.825900e-15
        1.046241e+05	        1.730926e-15
        1.057959e+05	        0.000000e+00
        1.069809e+05	        0.000000e+00
        1.081791e+05	        0.000000e+00
        1.093908e+05	        0.000000e+00

