# -------------------------------------------------------------------------------
#		C:/Users/Michael Chadolias/Documents/OMERE/LEO ISS/LET_WF_5.7_ISS.txt
# -------------------------------------------------------------------------------
# ID: 1 2 1

# Graph: Integral LET spectrum 
# min: 1.60896 0.01 max: 109391 41.2547
# X-axis L: LET (MeV.cm^2.g^{-1})
# Y-axis L: Flux (cm^{-2}.s^{-1})
# -------------------------------------------------------------------------------
# Curve 0: Integral spectrum
# Params: 0 5 #169ced 2 1
#	LET (MeV.cm^2.g^{-1})		Flux (cm^{-2}.s^{-1})
# -------------------------------------------------------------------------------
        1.608960e+00	        4.125471e+01
        1.626982e+00	        4.125471e+01
        1.645205e+00	        4.125471e+01
        1.663632e+00	        4.125471e+01
        1.682265e+00	        4.120230e+01
        1.701107e+00	        4.113279e+01
        1.720161e+00	        4.108774e+01
        1.739427e+00	        4.105430e+01
        1.758910e+00	        4.102510e+01
        1.778610e+00	        4.100056e+01
        1.798532e+00	        4.097896e+01
        1.818676e+00	        4.095966e+01
        1.839046e+00	        4.094173e+01
        1.859644e+00	        4.090987e+01
        1.880473e+00	        4.082062e+01
        1.901536e+00	        4.073166e+01
        1.922834e+00	        4.060446e+01
        1.944370e+00	        4.045386e+01
        1.966148e+00	        4.030621e+01
        1.988170e+00	        4.016016e+01
        2.010439e+00	        4.001287e+01
        2.032956e+00	        3.986393e+01
        2.055727e+00	        3.971179e+01
        2.078752e+00	        3.955495e+01
        2.102035e+00	        3.939636e+01
        2.125579e+00	        3.923599e+01
        2.149386e+00	        3.907162e+01
        2.173460e+00	        3.890397e+01
        2.197804e+00	        3.873444e+01
        2.222421e+00	        3.856301e+01
        2.247313e+00	        3.839709e+01
        2.272484e+00	        3.823601e+01
        2.297937e+00	        3.807312e+01
        2.323675e+00	        3.790841e+01
        2.349701e+00	        3.774185e+01
        2.376019e+00	        3.755296e+01
        2.402632e+00	        3.734994e+01
        2.429542e+00	        3.714465e+01
        2.456754e+00	        3.693705e+01
        2.484271e+00	        3.673394e+01
        2.512096e+00	        3.656822e+01
        2.540233e+00	        3.640064e+01
        2.568685e+00	        3.623119e+01
        2.597455e+00	        3.605984e+01
        2.626548e+00	        3.588657e+01
        2.655967e+00	        3.571135e+01
        2.685715e+00	        3.549061e+01
        2.715796e+00	        3.526619e+01
        2.746214e+00	        3.503927e+01
        2.776973e+00	        3.480980e+01
        2.808077e+00	        3.457776e+01
        2.839529e+00	        3.435326e+01
        2.871333e+00	        3.412996e+01
        2.903493e+00	        3.390416e+01
        2.936014e+00	        3.367583e+01
        2.968899e+00	        3.344494e+01
        3.002152e+00	        3.321147e+01
        3.035777e+00	        3.297278e+01
        3.069779e+00	        3.273101e+01
        3.104162e+00	        3.248653e+01
        3.138931e+00	        3.223931e+01
        3.174088e+00	        3.198932e+01
        3.209640e+00	        3.173653e+01
        3.245589e+00	        3.151021e+01
        3.281941e+00	        3.128743e+01
        3.318701e+00	        3.106216e+01
        3.355872e+00	        3.083437e+01
        3.393459e+00	        3.060402e+01
        3.431468e+00	        3.037110e+01
        3.469902e+00	        3.013557e+01
        3.508766e+00	        2.986628e+01
        3.548066e+00	        2.958452e+01
        3.587806e+00	        2.929960e+01
        3.627992e+00	        2.901149e+01
        3.668627e+00	        2.872016e+01
        3.709717e+00	        2.842556e+01
        3.751268e+00	        2.812815e+01
        3.793284e+00	        2.784635e+01
        3.835771e+00	        2.756139e+01
        3.878733e+00	        2.727323e+01
        3.922177e+00	        2.698185e+01
        3.966107e+00	        2.668720e+01
        4.010530e+00	        2.638926e+01
        4.055449e+00	        2.608798e+01
        4.100872e+00	        2.576537e+01
        4.146804e+00	        2.539646e+01
        4.193250e+00	        2.502341e+01
        4.240217e+00	        2.464618e+01
        4.287709e+00	        2.426473e+01
        4.335734e+00	        2.387900e+01
        4.384296e+00	        2.348896e+01
        4.433403e+00	        2.318358e+01
        4.483059e+00	        2.287748e+01
        4.533271e+00	        2.256795e+01
        4.584046e+00	        2.225495e+01
        4.635390e+00	        2.193845e+01
        4.687308e+00	        2.161840e+01
        4.739809e+00	        2.129477e+01
        4.792897e+00	        2.096751e+01
        4.846580e+00	        2.060209e+01
        4.900864e+00	        2.022732e+01
        4.955756e+00	        1.984835e+01
        5.011263e+00	        1.946513e+01
        5.067391e+00	        1.907763e+01
        5.124149e+00	        1.868578e+01
        5.181542e+00	        1.828954e+01
        5.239577e+00	        1.794069e+01
        5.298263e+00	        1.760240e+01
        5.357606e+00	        1.726032e+01
        5.417614e+00	        1.691440e+01
        5.478294e+00	        1.656461e+01
        5.539654e+00	        1.621090e+01
        5.601701e+00	        1.585324e+01
        5.664442e+00	        1.549156e+01
        5.727887e+00	        1.515161e+01
        5.792042e+00	        1.482124e+01
        5.856916e+00	        1.448717e+01
        5.922516e+00	        1.414935e+01
        5.988851e+00	        1.380775e+01
        6.055929e+00	        1.346233e+01
        6.123759e+00	        1.311304e+01
        6.192348e+00	        1.275983e+01
        6.261705e+00	        1.241022e+01
        6.331839e+00	        1.207031e+01
        6.402759e+00	        1.172660e+01
        6.474473e+00	        1.137903e+01
        6.546991e+00	        1.102757e+01
        6.620320e+00	        1.067218e+01
        6.694471e+00	        1.031280e+01
        6.769452e+00	        9.935158e+00
        6.845274e+00	        9.608497e+00
        6.921944e+00	        9.312101e+00
        6.999473e+00	        9.013427e+00
        7.077871e+00	        8.711897e+00
        7.157146e+00	        8.408114e+00
        7.237310e+00	        8.101238e+00
        7.318371e+00	        7.791228e+00
        7.400341e+00	        7.477765e+00
        7.483228e+00	        7.207070e+00
        7.567044e+00	        6.985579e+00
        7.651799e+00	        6.761856e+00
        7.737503e+00	        6.535943e+00
        7.824166e+00	        6.307969e+00
        7.911801e+00	        6.077858e+00
        8.000417e+00	        5.845295e+00
        8.090026e+00	        5.610128e+00
        8.180638e+00	        5.373517e+00
        8.272265e+00	        5.249218e+00
        8.364918e+00	        5.123546e+00
        8.458610e+00	        4.996466e+00
        8.553350e+00	        4.867970e+00
        8.649152e+00	        4.738111e+00
        8.746027e+00	        4.606797e+00
        8.843987e+00	        4.474012e+00
        8.943044e+00	        4.339741e+00
        9.043210e+00	        4.240370e+00
        9.144499e+00	        4.169468e+00
        9.246921e+00	        4.097772e+00
        9.350492e+00	        4.025273e+00
        9.455222e+00	        3.951962e+00
        9.561125e+00	        3.877832e+00
        9.668214e+00	        3.802872e+00
        9.776503e+00	        3.727072e+00
        9.886005e+00	        3.659181e+00
        9.996733e+00	        3.603111e+00
        1.010870e+01	        3.546451e+00
        1.022192e+01	        3.489155e+00
        1.033641e+01	        3.431218e+00
        1.045219e+01	        3.372633e+00
        1.056926e+01	        3.313391e+00
        1.068764e+01	        3.253475e+00
        1.080734e+01	        3.192875e+00
        1.092839e+01	        3.132683e+00
        1.105080e+01	        3.075353e+00
        1.117457e+01	        3.017380e+00
        1.129973e+01	        2.958765e+00
        1.142629e+01	        2.899521e+00
        1.155427e+01	        2.839613e+00
        1.168369e+01	        2.779033e+00
        1.181455e+01	        2.717776e+00
        1.194688e+01	        2.661931e+00
        1.208069e+01	        2.621598e+00
        1.221600e+01	        2.580819e+00
        1.235282e+01	        2.539584e+00
        1.249118e+01	        2.497887e+00
        1.263109e+01	        2.455723e+00
        1.277256e+01	        2.413086e+00
        1.291562e+01	        2.369982e+00
        1.306028e+01	        2.326418e+00
        1.320657e+01	        2.282366e+00
        1.335449e+01	        2.238645e+00
        1.350406e+01	        2.195039e+00
        1.365531e+01	        2.150945e+00
        1.380826e+01	        2.106356e+00
        1.396292e+01	        2.061264e+00
        1.411931e+01	        2.015654e+00
        1.427746e+01	        1.969534e+00
        1.443737e+01	        1.922896e+00
        1.459908e+01	        1.886516e+00
        1.476259e+01	        1.852591e+00
        1.492794e+01	        1.818285e+00
        1.509514e+01	        1.783608e+00
        1.526421e+01	        1.748486e+00
        1.543518e+01	        1.713006e+00
        1.560806e+01	        1.677140e+00
        1.578288e+01	        1.640875e+00
        1.595966e+01	        1.605303e+00
        1.613841e+01	        1.575653e+00
        1.631917e+01	        1.545671e+00
        1.650195e+01	        1.515297e+00
        1.668678e+01	        1.484568e+00
        1.687368e+01	        1.453496e+00
        1.706268e+01	        1.422078e+00
        1.725379e+01	        1.390309e+00
        1.744704e+01	        1.358185e+00
        1.764245e+01	        1.331746e+00
        1.784006e+01	        1.307254e+00
        1.803988e+01	        1.282489e+00
        1.824193e+01	        1.257447e+00
        1.844625e+01	        1.232124e+00
        1.865286e+01	        1.206517e+00
        1.886178e+01	        1.180624e+00
        1.907304e+01	        1.154442e+00
        1.928667e+01	        1.127936e+00
        1.950269e+01	        1.106737e+00
        1.972113e+01	        1.085389e+00
        1.994201e+01	        1.063802e+00
        2.016537e+01	        1.041974e+00
        2.039124e+01	        1.019901e+00
        2.061963e+01	        9.975808e-01
        2.085058e+01	        9.750192e-01
        2.108411e+01	        9.522273e-01
        2.132027e+01	        9.314859e-01
        2.155906e+01	        9.141509e-01
        2.180054e+01	        8.966218e-01
        2.204471e+01	        8.788963e-01
        2.229162e+01	        8.609723e-01
        2.254130e+01	        8.428479e-01
        2.279378e+01	        8.245217e-01
        2.304908e+01	        8.059967e-01
        2.330724e+01	        7.872642e-01
        2.356829e+01	        7.690287e-01
        2.383227e+01	        7.511942e-01
        2.409920e+01	        7.331601e-01
        2.436912e+01	        7.149239e-01
        2.464207e+01	        6.964835e-01
        2.491807e+01	        6.778366e-01
        2.519717e+01	        6.589696e-01
        2.547939e+01	        6.411826e-01
        2.576477e+01	        6.290768e-01
        2.605335e+01	        6.168354e-01
        2.634516e+01	        6.044570e-01
        2.664024e+01	        5.919398e-01
        2.693862e+01	        5.792799e-01
        2.724035e+01	        5.664520e-01
        2.754545e+01	        5.535781e-01
        2.785397e+01	        5.405669e-01
        2.816595e+01	        5.274114e-01
        2.848142e+01	        5.158537e-01
        2.880043e+01	        5.042073e-01
        2.912301e+01	        4.924309e-01
        2.944920e+01	        4.805235e-01
        2.977905e+01	        4.684834e-01
        3.011259e+01	        4.564608e-01
        3.044986e+01	        4.443094e-01
        3.079092e+01	        4.320224e-01
        3.113579e+01	        4.227054e-01
        3.148453e+01	        4.136889e-01
        3.183717e+01	        4.045721e-01
        3.219376e+01	        3.953535e-01
        3.255435e+01	        3.860316e-01
        3.291897e+01	        3.767286e-01
        3.328768e+01	        3.674415e-01
        3.366052e+01	        3.580505e-01
        3.403753e+01	        3.492998e-01
        3.441877e+01	        3.424440e-01
        3.480428e+01	        3.355116e-01
        3.519410e+01	        3.285016e-01
        3.558829e+01	        3.214130e-01
        3.598690e+01	        3.142512e-01
        3.638997e+01	        3.071433e-01
        3.679756e+01	        2.999557e-01
        3.720971e+01	        2.926877e-01
        3.762647e+01	        2.856052e-01
        3.804791e+01	        2.793191e-01
        3.847406e+01	        2.729627e-01
        3.890499e+01	        2.665350e-01
        3.934075e+01	        2.600354e-01
        3.978138e+01	        2.534636e-01
        4.022696e+01	        2.468185e-01
        4.067752e+01	        2.400990e-01
        4.113313e+01	        2.338787e-01
        4.159384e+01	        2.290960e-01
        4.205971e+01	        2.242597e-01
        4.253080e+01	        2.192367e-01
        4.300716e+01	        2.142263e-01
        4.348887e+01	        2.091824e-01
        4.397596e+01	        2.040884e-01
        4.446851e+01	        1.989433e-01
        4.496658e+01	        1.937482e-01
        4.547023e+01	        1.895843e-01
        4.597952e+01	        1.857012e-01
        4.649451e+01	        1.817768e-01
        4.701528e+01	        1.778121e-01
        4.754187e+01	        1.738048e-01
        4.807436e+01	        1.697548e-01
        4.861282e+01	        1.656623e-01
        4.915731e+01	        1.615266e-01
        4.970789e+01	        1.575223e-01
        5.026464e+01	        1.543630e-01
        5.082763e+01	        1.511682e-01
        5.139693e+01	        1.479377e-01
        5.197260e+01	        1.446721e-01
        5.255472e+01	        1.413699e-01
        5.314336e+01	        1.380307e-01
        5.373859e+01	        1.346545e-01
        5.434049e+01	        1.312410e-01
        5.494913e+01	        1.282502e-01
        5.556458e+01	        1.254611e-01
        5.618694e+01	        1.226409e-01
        5.681626e+01	        1.197899e-01
        5.745263e+01	        1.169069e-01
        5.809612e+01	        1.139917e-01
        5.874683e+01	        1.110439e-01
        5.940482e+01	        1.080632e-01
        6.007019e+01	        1.057045e-01
        6.074300e+01	        1.033160e-01
        6.142335e+01	        1.007687e-01
        6.211133e+01	        9.831718e-02
        6.280700e+01	        9.590219e-02
        6.351047e+01	        9.347495e-02
        6.422182e+01	        9.104308e-02
        6.494114e+01	        8.860536e-02
        6.566851e+01	        8.645965e-02
        6.640403e+01	        8.444886e-02
        6.714779e+01	        8.242154e-02
        6.789988e+01	        8.038292e-02
        6.866039e+01	        7.832832e-02
        6.942942e+01	        7.625800e-02
        7.020706e+01	        7.417687e-02
        7.099342e+01	        7.218914e-02
        7.178858e+01	        7.087036e-02
        7.259264e+01	        6.953833e-02
        7.340572e+01	        6.819139e-02
        7.422790e+01	        6.683013e-02
        7.505929e+01	        6.545565e-02
        7.589999e+01	        6.406590e-02
        7.675011e+01	        6.266068e-02
        7.760974e+01	        6.124105e-02
        7.847901e+01	        5.982997e-02
        7.935802e+01	        5.850481e-02
        8.024686e+01	        5.716481e-02
        8.114567e+01	        5.581105e-02
        8.205454e+01	        5.444359e-02
        8.297359e+01	        5.298022e-02
        8.390294e+01	        5.151308e-02
        8.484269e+01	        5.005074e-02
        8.579297e+01	        4.903714e-02
        8.675389e+01	        4.804007e-02
        8.772558e+01	        4.703923e-02
        8.870815e+01	        4.603184e-02
        8.970173e+01	        4.501605e-02
        9.070643e+01	        4.399155e-02
        9.172239e+01	        4.295772e-02
        9.274972e+01	        4.191495e-02
        9.378856e+01	        4.106399e-02
        9.483904e+01	        4.023643e-02
        9.590129e+01	        3.940289e-02
        9.697543e+01	        3.856204e-02
        9.806160e+01	        3.771361e-02
        9.915994e+01	        3.685587e-02
        1.002706e+02	        3.598854e-02
        1.013937e+02	        3.513846e-02
        1.025293e+02	        3.446457e-02
        1.036777e+02	        3.378345e-02
        1.048389e+02	        3.309471e-02
        1.060132e+02	        3.239875e-02
        1.072006e+02	        3.169516e-02
        1.084013e+02	        3.069180e-02
        1.096154e+02	        2.973457e-02
        1.108432e+02	        2.893550e-02
        1.120847e+02	        2.825687e-02
        1.133401e+02	        2.758638e-02
        1.146095e+02	        2.693375e-02
        1.158932e+02	        2.628965e-02
        1.171913e+02	        2.564781e-02
        1.185039e+02	        2.499829e-02
        1.198312e+02	        2.434958e-02
        1.211734e+02	        2.380973e-02
        1.225306e+02	        2.328930e-02
        1.239030e+02	        2.277068e-02
        1.252907e+02	        2.226072e-02
        1.266941e+02	        2.175640e-02
        1.281131e+02	        2.125333e-02
        1.295480e+02	        2.074516e-02
        1.309990e+02	        2.026965e-02
        1.324663e+02	        1.982441e-02
        1.339500e+02	        1.937545e-02
        1.354503e+02	        1.892149e-02
        1.369674e+02	        1.845748e-02
        1.385015e+02	        1.798793e-02
        1.400528e+02	        1.752110e-02
        1.416214e+02	        1.719031e-02
        1.432077e+02	        1.685627e-02
        1.448117e+02	        1.652080e-02
        1.464336e+02	        1.618271e-02
        1.480737e+02	        1.584071e-02
        1.497322e+02	        1.549440e-02
        1.514093e+02	        1.514440e-02
        1.531052e+02	        1.483814e-02
        1.548200e+02	        1.453831e-02
        1.565541e+02	        1.423531e-02
        1.583076e+02	        1.392926e-02
        1.600807e+02	        1.362252e-02
        1.618737e+02	        1.331441e-02
        1.636867e+02	        1.302087e-02
        1.655201e+02	        1.277404e-02
        1.673740e+02	        1.252447e-02
        1.692487e+02	        1.222944e-02
        1.711444e+02	        1.193140e-02
        1.730613e+02	        1.164342e-02
        1.749996e+02	        1.135885e-02
        1.769597e+02	        1.113120e-02
        1.789418e+02	        1.091768e-02
        1.809460e+02	        1.070463e-02
        1.829727e+02	        1.049160e-02
        1.850221e+02	        1.027641e-02
        1.870944e+02	        1.006006e-02
        1.891900e+02	        9.844006e-03
        1.913090e+02	        9.648295e-03
        1.934517e+02	        9.451627e-03
        1.956185e+02	        9.255073e-03
        1.978095e+02	        9.058061e-03
        2.000251e+02	        8.860040e-03
        2.022655e+02	        8.666153e-03
        2.045309e+02	        8.504497e-03
        2.068218e+02	        8.338096e-03
        2.091383e+02	        8.175426e-03
        2.114807e+02	        8.012978e-03
        2.138494e+02	        7.849285e-03
        2.162446e+02	        7.685102e-03
        2.186667e+02	        7.553278e-03
        2.211159e+02	        7.420309e-03
        2.235925e+02	        7.285953e-03
        2.260968e+02	        7.150295e-03
        2.286292e+02	        7.013693e-03
        2.311900e+02	        6.875803e-03
        2.337794e+02	        6.758445e-03
        2.363979e+02	        6.643584e-03
        2.390456e+02	        6.527742e-03
        2.417231e+02	        6.411235e-03
        2.444305e+02	        6.220434e-03
        2.471682e+02	        6.056069e-03
        2.499366e+02	        5.918813e-03
        2.527360e+02	        5.789557e-03
        2.555668e+02	        5.662424e-03
        2.584293e+02	        5.540212e-03
        2.613238e+02	        5.419044e-03
        2.642508e+02	        5.301463e-03
        2.672105e+02	        5.200177e-03
        2.702034e+02	        5.100584e-03
        2.732298e+02	        5.002047e-03
        2.762901e+02	        4.904083e-03
        2.793847e+02	        4.806340e-03
        2.825139e+02	        4.714643e-03
        2.856782e+02	        4.627839e-03
        2.888780e+02	        4.537343e-03
        2.921136e+02	        4.450247e-03
        2.953854e+02	        4.364447e-03
        2.986938e+02	        4.279599e-03
        3.020393e+02	        4.203712e-03
        3.054223e+02	        4.134441e-03
        3.088432e+02	        4.064591e-03
        3.123024e+02	        3.993751e-03
        3.158004e+02	        3.922333e-03
        3.193375e+02	        3.850519e-03
        3.229142e+02	        3.779965e-03
        3.265310e+02	        3.710965e-03
        3.301883e+02	        3.642040e-03
        3.338866e+02	        3.543513e-03
        3.376263e+02	        3.425371e-03
        3.414079e+02	        3.338638e-03
        3.452318e+02	        3.263709e-03
        3.490986e+02	        3.190156e-03
        3.530086e+02	        3.119304e-03
        3.569625e+02	        3.052194e-03
        3.609607e+02	        2.987255e-03
        3.650036e+02	        2.928033e-03
        3.690918e+02	        2.869646e-03
        3.732258e+02	        2.812194e-03
        3.774062e+02	        2.755283e-03
        3.816333e+02	        2.699033e-03
        3.859078e+02	        2.643698e-03
        3.902301e+02	        2.593207e-03
        3.946009e+02	        2.544504e-03
        3.990206e+02	        2.496046e-03
        4.034898e+02	        2.447419e-03
        4.080091e+02	        2.401248e-03
        4.125790e+02	        2.357841e-03
        4.172001e+02	        2.313958e-03
        4.218730e+02	        2.269589e-03
        4.265982e+02	        2.225104e-03
        4.313763e+02	        2.181982e-03
        4.362079e+02	        2.134413e-03
        4.410936e+02	        2.084230e-03
        4.460341e+02	        2.037889e-03
        4.510299e+02	        1.993171e-03
        4.560817e+02	        1.949615e-03
        4.611900e+02	        1.906525e-03
        4.663556e+02	        1.863792e-03
        4.715790e+02	        1.821116e-03
        4.768609e+02	        1.779800e-03
        4.822020e+02	        1.740084e-03
        4.876029e+02	        1.700583e-03
        4.930643e+02	        1.658766e-03
        4.985868e+02	        1.616483e-03
        5.041712e+02	        1.574828e-03
        5.098182e+02	        1.532665e-03
        5.155284e+02	        1.489962e-03
        5.213026e+02	        1.458703e-03
        5.271414e+02	        1.444240e-03
        5.330457e+02	        1.430195e-03
        5.390161e+02	        1.416159e-03
        5.450533e+02	        1.402364e-03
        5.511582e+02	        1.387462e-03
        5.573314e+02	        1.368621e-03
        5.635738e+02	        1.352184e-03
        5.698861e+02	        1.336696e-03
        5.762691e+02	        1.321828e-03
        5.827236e+02	        1.308483e-03
        5.892504e+02	        1.295467e-03
        5.958503e+02	        1.282331e-03
        6.025241e+02	        1.269184e-03
        6.092727e+02	        1.255989e-03
        6.160968e+02	        1.240188e-03
        6.229974e+02	        1.224438e-03
        6.299753e+02	        1.209466e-03
        6.370313e+02	        1.197358e-03
        6.441664e+02	        1.186243e-03
        6.513814e+02	        1.175447e-03
        6.586772e+02	        1.164776e-03
        6.660547e+02	        1.154086e-03
        6.735148e+02	        1.143299e-03
        6.810585e+02	        1.129192e-03
        6.886867e+02	        1.111646e-03
        6.964003e+02	        1.096733e-03
        7.042004e+02	        1.083575e-03
        7.120878e+02	        1.070833e-03
        7.200635e+02	        1.058494e-03
        7.281286e+02	        1.046578e-03
        7.362840e+02	        1.034795e-03
        7.445307e+02	        1.023149e-03
        7.528698e+02	        1.010711e-03
        7.613023e+02	        9.989208e-04
        7.698293e+02	        9.890644e-04
        7.784518e+02	        9.796892e-04
        7.871708e+02	        9.705968e-04
        7.959875e+02	        9.617784e-04
        8.049030e+02	        9.530960e-04
        8.139183e+02	        9.442120e-04
        8.230346e+02	        9.354087e-04
        8.322529e+02	        9.224510e-04
        8.415746e+02	        9.102036e-04
        8.510006e+02	        8.990569e-04
        8.605323e+02	        8.888135e-04
        8.701706e+02	        8.791575e-04
        8.799170e+02	        8.700539e-04
        8.897725e+02	        8.610968e-04
        8.997384e+02	        8.522185e-04
        9.098159e+02	        8.412695e-04
        9.200063e+02	        8.308361e-04
        9.303108e+02	        8.216695e-04
        9.407307e+02	        8.132152e-04
        9.512674e+02	        8.048804e-04
        9.619221e+02	        7.968068e-04
        9.726961e+02	        7.888693e-04
        9.835907e+02	        7.811417e-04
        9.946074e+02	        7.677749e-04
        1.005748e+03	        7.571399e-04
        1.017012e+03	        7.478075e-04
        1.028403e+03	        7.395637e-04
        1.039922e+03	        7.316528e-04
        1.051570e+03	        7.241531e-04
        1.063348e+03	        7.167717e-04
        1.075258e+03	        7.061928e-04
        1.087301e+03	        6.966289e-04
        1.099480e+03	        6.878773e-04
        1.111794e+03	        6.797971e-04
        1.124247e+03	        6.725752e-04
        1.136839e+03	        6.657898e-04
        1.149572e+03	        6.592283e-04
        1.162448e+03	        6.197281e-04
        1.175468e+03	        5.850884e-04
        1.188634e+03	        5.586174e-04
        1.201947e+03	        5.375245e-04
        1.215409e+03	        5.178591e-04
        1.229023e+03	        5.014537e-04
        1.242788e+03	        4.864023e-04
        1.256708e+03	        4.721668e-04
        1.270784e+03	        4.584921e-04
        1.285017e+03	        4.455317e-04
        1.299410e+03	        4.335076e-04
        1.313964e+03	        4.223793e-04
        1.328681e+03	        4.119236e-04
        1.343563e+03	        4.025052e-04
        1.358612e+03	        3.935490e-04
        1.373829e+03	        3.863116e-04
        1.389216e+03	        3.794253e-04
        1.404776e+03	        3.725836e-04
        1.420510e+03	        3.660248e-04
        1.436421e+03	        3.599357e-04
        1.452509e+03	        3.539351e-04
        1.468778e+03	        3.482490e-04
        1.485229e+03	        3.427646e-04
        1.501865e+03	        3.373898e-04
        1.518686e+03	        3.320264e-04
        1.535696e+03	        3.266828e-04
        1.552897e+03	        3.215757e-04
        1.570290e+03	        3.165251e-04
        1.587878e+03	        3.116237e-04
        1.605663e+03	        3.069176e-04
        1.623647e+03	        3.025523e-04
        1.641833e+03	        2.980646e-04
        1.660222e+03	        2.935468e-04
        1.678818e+03	        2.890062e-04
        1.697621e+03	        2.844277e-04
        1.716635e+03	        2.801476e-04
        1.735863e+03	        2.762118e-04
        1.755305e+03	        2.724260e-04
        1.774965e+03	        2.686900e-04
        1.794846e+03	        2.650408e-04
        1.814949e+03	        2.613761e-04
        1.835277e+03	        2.575513e-04
        1.855833e+03	        2.536335e-04
        1.876620e+03	        2.496826e-04
        1.897639e+03	        2.457060e-04
        1.918893e+03	        2.419482e-04
        1.940386e+03	        2.383104e-04
        1.962119e+03	        2.348400e-04
        1.984096e+03	        2.313465e-04
        2.006319e+03	        2.278252e-04
        2.028790e+03	        2.242885e-04
        2.051514e+03	        2.207313e-04
        2.074492e+03	        2.171739e-04
        2.097727e+03	        2.138005e-04
        2.121223e+03	        2.105005e-04
        2.144981e+03	        2.072653e-04
        2.169006e+03	        2.040099e-04
        2.193300e+03	        2.007317e-04
        2.217866e+03	        1.976192e-04
        2.242707e+03	        1.945183e-04
        2.267827e+03	        1.913914e-04
        2.293228e+03	        1.884548e-04
        2.318913e+03	        1.855990e-04
        2.344886e+03	        1.827449e-04
        2.371150e+03	        1.798853e-04
        2.397708e+03	        1.769879e-04
        2.424563e+03	        1.740613e-04
        2.451720e+03	        1.711102e-04
        2.479180e+03	        1.681364e-04
        2.506948e+03	        1.652860e-04
        2.535027e+03	        1.624868e-04
        2.563421e+03	        1.598330e-04
        2.592132e+03	        1.573232e-04
        2.621165e+03	        1.547858e-04
        2.650524e+03	        1.522217e-04
        2.680211e+03	        1.496306e-04
        2.710231e+03	        1.470170e-04
        2.740587e+03	        1.446228e-04
        2.771282e+03	        1.422976e-04
        2.802322e+03	        1.398542e-04
        2.833710e+03	        1.373544e-04
        2.865449e+03	        1.348267e-04
        2.897543e+03	        1.322715e-04
        2.929997e+03	        1.296976e-04
        2.962814e+03	        1.271007e-04
        2.995999e+03	        1.248129e-04
        3.029556e+03	        1.228246e-04
        3.063488e+03	        1.208140e-04
        3.097801e+03	        1.187811e-04
        3.132498e+03	        1.167261e-04
        3.167583e+03	        1.146497e-04
        3.203062e+03	        1.125538e-04
        3.238938e+03	        1.104370e-04
        3.275216e+03	        1.083473e-04
        3.311900e+03	        1.063512e-04
        3.348994e+03	        1.043371e-04
        3.386505e+03	        1.023007e-04
        3.424435e+03	        1.002420e-04
        3.462791e+03	        9.816675e-05
        3.501576e+03	        9.609537e-05
        3.540795e+03	        9.430168e-05
        3.580454e+03	        9.258720e-05
        3.620557e+03	        9.092871e-05
        3.661109e+03	        8.926386e-05
        3.702115e+03	        8.758038e-05
        3.743580e+03	        8.587792e-05
        3.785510e+03	        8.417040e-05
        3.827910e+03	        8.247478e-05
        3.870784e+03	        8.091132e-05
        3.914139e+03	        7.937025e-05
        3.957979e+03	        7.787283e-05
        4.002311e+03	        7.637531e-05
        4.047138e+03	        7.488504e-05
        4.092468e+03	        7.339033e-05
        4.138306e+03	        7.188455e-05
        4.184657e+03	        7.039322e-05
        4.231527e+03	        6.897712e-05
        4.278923e+03	        6.758592e-05
        4.326849e+03	        6.619804e-05
        4.375311e+03	        6.480722e-05
        4.424317e+03	        6.340100e-05
        4.473872e+03	        6.198542e-05
        4.523981e+03	        6.055642e-05
        4.574652e+03	        5.928633e-05
        4.625890e+03	        5.806011e-05
        4.677703e+03	        5.688927e-05
        4.730095e+03	        5.573391e-05
        4.783075e+03	        5.456559e-05
        4.836647e+03	        5.338424e-05
        4.890820e+03	        5.220081e-05
        4.945600e+03	        5.104507e-05
        5.000993e+03	        5.001578e-05
        5.057007e+03	        4.898781e-05
        5.113648e+03	        4.796587e-05
        5.170923e+03	        4.694814e-05
        5.228840e+03	        4.592325e-05
        5.287405e+03	        4.489558e-05
        5.346627e+03	        4.386068e-05
        5.406512e+03	        4.285818e-05
        5.467067e+03	        4.196308e-05
        5.528301e+03	        4.108300e-05
        5.590221e+03	        4.021400e-05
        5.652834e+03	        3.933776e-05
        5.716149e+03	        3.845378e-05
        5.780172e+03	        3.756746e-05
        5.844913e+03	        3.667463e-05
        5.910379e+03	        3.583991e-05
        5.976578e+03	        3.504858e-05
        6.043519e+03	        3.427499e-05
        6.111209e+03	        3.349413e-05
        6.179658e+03	        3.270544e-05
        6.248873e+03	        3.191253e-05
        6.318863e+03	        3.112264e-05
        6.389638e+03	        3.036398e-05
        6.461205e+03	        2.971027e-05
        6.533574e+03	        2.906906e-05
        6.606753e+03	        2.842466e-05
        6.680752e+03	        2.777586e-05
        6.755579e+03	        2.712299e-05
        6.831245e+03	        2.646836e-05
        6.907759e+03	        2.580795e-05
        6.985129e+03	        2.516390e-05
        7.063366e+03	        2.454589e-05
        7.142479e+03	        2.391927e-05
        7.222478e+03	        2.328528e-05
        7.303374e+03	        2.261693e-05
        7.385175e+03	        2.191750e-05
        7.467893e+03	        2.134028e-05
        7.551537e+03	        2.082719e-05
        7.636118e+03	        2.039050e-05
        7.721646e+03	        1.995755e-05
        7.808132e+03	        1.952500e-05
        7.895587e+03	        1.908814e-05
        7.984022e+03	        1.864646e-05
        8.073446e+03	        1.821222e-05
        8.163873e+03	        1.778123e-05
        8.255312e+03	        1.735021e-05
        8.347776e+03	        1.692632e-05
        8.441275e+03	        1.649911e-05
        8.535822e+03	        1.606803e-05
        8.631427e+03	        1.563764e-05
        8.728103e+03	        1.520751e-05
        8.825862e+03	        1.477496e-05
        8.924716e+03	        1.439458e-05
        9.024678e+03	        1.404901e-05
        9.125758e+03	        1.371018e-05
        9.227971e+03	        1.337046e-05
        9.331329e+03	        1.302615e-05
        9.435845e+03	        1.267762e-05
        9.541531e+03	        1.232475e-05
        9.648401e+03	        1.196597e-05
        9.756468e+03	        1.167528e-05
        9.865745e+03	        1.138599e-05
        9.976246e+03	        1.109457e-05
        1.008798e+04	        1.079999e-05
        1.020098e+04	        1.050670e-05
        1.031523e+04	        1.021724e-05
        1.043077e+04	        9.937785e-06
        1.054760e+04	        9.696857e-06
        1.066573e+04	        9.456552e-06
        1.078520e+04	        9.214331e-06
        1.090600e+04	        8.969940e-06
        1.102815e+04	        8.725106e-06
        1.115167e+04	        8.479465e-06
        1.127657e+04	        8.234589e-06
        1.140288e+04	        8.017558e-06
        1.153059e+04	        7.800175e-06
        1.165974e+04	        7.579274e-06
        1.179034e+04	        7.353854e-06
        1.192240e+04	        7.116555e-06
        1.205593e+04	        6.852218e-06
        1.219096e+04	        6.654326e-06
        1.232751e+04	        6.488196e-06
        1.246558e+04	        6.323347e-06
        1.260520e+04	        6.156499e-06
        1.274639e+04	        5.987666e-06
        1.288915e+04	        5.816714e-06
        1.303352e+04	        5.645572e-06
        1.317950e+04	        5.470676e-06
        1.332712e+04	        5.304826e-06
        1.347639e+04	        5.141710e-06
        1.362733e+04	        4.975213e-06
        1.377996e+04	        4.803187e-06
        1.393431e+04	        4.625373e-06
        1.409038e+04	        4.439565e-06
        1.424820e+04	        4.282083e-06
        1.440778e+04	        4.177695e-06
        1.456916e+04	        4.072607e-06
        1.473234e+04	        3.966479e-06
        1.489735e+04	        3.859327e-06
        1.506421e+04	        3.751231e-06
        1.523293e+04	        3.648366e-06
        1.540355e+04	        3.548981e-06
        1.557608e+04	        3.448867e-06
        1.575054e+04	        3.347605e-06
        1.592695e+04	        3.245097e-06
        1.610534e+04	        3.142911e-06
        1.628573e+04	        3.054863e-06
        1.646814e+04	        2.968906e-06
        1.665259e+04	        2.879817e-06
        1.683910e+04	        2.795409e-06
        1.702771e+04	        2.710233e-06
        1.721843e+04	        2.626117e-06
        1.741128e+04	        2.554274e-06
        1.760630e+04	        2.481900e-06
        1.780350e+04	        2.408831e-06
        1.800291e+04	        2.335016e-06
        1.820455e+04	        2.260896e-06
        1.840845e+04	        2.190341e-06
        1.861463e+04	        2.121937e-06
        1.882312e+04	        2.052671e-06
        1.903395e+04	        1.982587e-06
        1.924714e+04	        1.912346e-06
        1.946272e+04	        1.848938e-06
        1.968071e+04	        1.789126e-06
        1.990114e+04	        1.728542e-06
        2.012405e+04	        1.667389e-06
        2.034945e+04	        1.604925e-06
        2.057737e+04	        1.549030e-06
        2.080785e+04	        1.493602e-06
        2.104091e+04	        1.437416e-06
        2.127657e+04	        1.379588e-06
        2.151488e+04	        1.321326e-06
        2.175586e+04	        1.267703e-06
        2.199954e+04	        1.218819e-06
        2.224594e+04	        1.169421e-06
        2.249511e+04	        1.120659e-06
        2.274706e+04	        1.074227e-06
        2.300184e+04	        1.027192e-06
        2.325947e+04	        9.796722e-07
        2.351999e+04	        9.336895e-07
        2.378343e+04	        8.901336e-07
        2.404981e+04	        8.461978e-07
        2.431918e+04	        8.020523e-07
        2.459157e+04	        7.583300e-07
        2.486701e+04	        7.140853e-07
        2.514553e+04	        6.696160e-07
        2.542717e+04	        6.271349e-07
        2.571197e+04	        5.832819e-07
        2.599996e+04	        5.354329e-07
        2.629117e+04	        4.944117e-07
        2.658564e+04	        4.519136e-07
        2.688341e+04	        4.076767e-07
        2.718452e+04	        3.600541e-07
        2.748900e+04	        3.094525e-07
        2.779689e+04	        2.556546e-07
        2.810823e+04	        1.885051e-07
        2.842306e+04	        6.878734e-08
        2.874141e+04	        2.339371e-08
        2.906333e+04	        2.130521e-08
        2.938885e+04	        1.902199e-08
        2.971802e+04	        1.643439e-08
        3.005088e+04	        1.408225e-08
        3.038746e+04	        1.145843e-08
        3.072782e+04	        7.930409e-09
        3.107198e+04	        2.100534e-09
        3.142000e+04	        1.941644e-09
        3.177192e+04	        1.773478e-09
        3.212779e+04	        1.584956e-09
        3.248763e+04	        1.398792e-09
        3.285151e+04	        1.225485e-09
        3.321946e+04	        1.015013e-09
        3.359154e+04	        6.531406e-10
        3.396778e+04	        6.156772e-10
        3.434823e+04	        5.819769e-10
        3.473295e+04	        5.466872e-10
        3.512198e+04	        4.970132e-10
        3.551536e+04	        4.723003e-10
        3.591315e+04	        4.463623e-10
        3.631540e+04	        4.188434e-10
        3.672215e+04	        3.918730e-10
        3.713345e+04	        3.628591e-10
        3.754937e+04	        3.206221e-10
        3.796994e+04	        2.925068e-10
        3.839522e+04	        2.815188e-10
        3.882526e+04	        2.695745e-10
        3.926013e+04	        2.586462e-10
        3.969986e+04	        2.483280e-10
        4.014452e+04	        2.365146e-10
        4.059416e+04	        2.276731e-10
        4.104883e+04	        2.187134e-10
        4.150860e+04	        2.090424e-10
        4.197351e+04	        2.010554e-10
        4.244364e+04	        1.922065e-10
        4.291903e+04	        1.831636e-10
        4.339974e+04	        1.767167e-10
        4.388584e+04	        1.700297e-10
        4.437738e+04	        1.638155e-10
        4.487443e+04	        1.575515e-10
        4.537705e+04	        1.508306e-10
        4.588529e+04	        1.457098e-10
        4.639923e+04	        1.406594e-10
        4.691893e+04	        1.358259e-10
        4.744444e+04	        1.310956e-10
        4.797584e+04	        1.263197e-10
        4.851319e+04	        1.218985e-10
        4.905657e+04	        1.174763e-10
        4.960602e+04	        1.130318e-10
        5.016164e+04	        1.085018e-10
        5.072347e+04	        1.041731e-10
        5.129160e+04	        9.981874e-11
        5.186609e+04	        9.572789e-11
        5.244702e+04	        9.158255e-11
        5.303445e+04	        8.736886e-11
        5.362846e+04	        8.287781e-11
        5.422913e+04	        7.882472e-11
        5.483652e+04	        7.518619e-11
        5.545071e+04	        7.148784e-11
        5.607179e+04	        6.748286e-11
        5.669982e+04	        6.364901e-11
        5.733489e+04	        5.988897e-11
        5.797707e+04	        5.602132e-11
        5.862644e+04	        5.084540e-11
        5.928308e+04	        4.768839e-11
        5.994708e+04	        4.536772e-11
        6.061852e+04	        4.329233e-11
        6.129748e+04	        4.105875e-11
        6.198404e+04	        3.914173e-11
        6.267829e+04	        3.707185e-11
        6.338032e+04	        3.496059e-11
        6.409021e+04	        3.300265e-11
        6.480805e+04	        3.161984e-11
        6.553393e+04	        3.026749e-11
        6.626795e+04	        2.882123e-11
        6.701018e+04	        2.762885e-11
        6.776073e+04	        2.645217e-11
        6.851968e+04	        2.520863e-11
        6.928713e+04	        2.411002e-11
        7.006318e+04	        2.303507e-11
        7.084793e+04	        2.196061e-11
        7.164146e+04	        2.089103e-11
        7.244388e+04	        1.984623e-11
        7.325529e+04	        1.882545e-11
        7.407578e+04	        1.782142e-11
        7.490547e+04	        1.685312e-11
        7.574444e+04	        1.587635e-11
        7.659282e+04	        1.491124e-11
        7.745070e+04	        1.397329e-11
        7.831818e+04	        1.303995e-11
        7.919539e+04	        1.213057e-11
        8.008241e+04	        1.122937e-11
        8.097938e+04	        1.028343e-11
        8.188638e+04	        9.348522e-12
        8.280355e+04	        8.399511e-12
        8.373099e+04	        7.389697e-12
        8.466882e+04	        6.366546e-12
        8.561715e+04	        5.199900e-12
        8.657611e+04	        4.129651e-12
        8.754580e+04	        2.789606e-12
        8.852636e+04	        1.583968e-12
        8.951790e+04	        1.248194e-12
        9.052054e+04	        8.902130e-13
        9.153442e+04	        6.301495e-13
        9.255965e+04	        3.928226e-13
        9.359636e+04	        1.891722e-13
        9.464469e+04	        8.688500e-14
        9.570475e+04	        7.971259e-14
        9.677669e+04	        7.250129e-14
        9.786064e+04	        6.486760e-14
        9.895673e+04	        5.698090e-14
        1.000651e+05	        4.809968e-14
        1.011859e+05	        3.741678e-14
        1.023192e+05	        2.171630e-14
        1.034652e+05	        1.312269e-14
        1.046241e+05	        3.900943e-15
        1.057959e+05	        0.000000e+00
        1.069809e+05	        0.000000e+00
        1.081791e+05	        0.000000e+00
        1.093908e+05	        0.000000e+00

