# -------------------------------------------------------------------------------
#		C:/Users/ASAT 02/Documents/OMERE 5.4/CDR CLOSE-OUT/SSO 450/SSO 450 - 1.5 year/LET/Vessel/Integral LET spectrum.txt
# -------------------------------------------------------------------------------
# ID: 1 2 1

# Graph: Integral LET spectrum 
# min: 0.000160896 1e-06 max: 1.09391e+09 1.59324e+08
# X-axis L: LET (MeV.cm^2.g^{-1})
# Y-axis L: Flux (cm^{-2}.s^{-1})
# -------------------------------------------------------------------------------
# Curve 0: LET spectrum with Flares
# Params: 0 5 #7def21 2 1
#	LET (MeV.cm^2.g^{-1})		Flux (cm^{-2}.s^{-1})
# -------------------------------------------------------------------------------
        1.608960e+00	        1.593242e+04
        1.626982e+00	        1.593242e+04
        1.645205e+00	        1.593242e+04
        1.663632e+00	        1.593242e+04
        1.682265e+00	        1.593232e+04
        1.701107e+00	        1.593218e+04
        1.720161e+00	        1.593209e+04
        1.739427e+00	        1.593203e+04
        1.758910e+00	        1.593198e+04
        1.778610e+00	        1.593194e+04
        1.798532e+00	        1.593190e+04
        1.818676e+00	        1.593160e+04
        1.839046e+00	        1.593108e+04
        1.859644e+00	        1.593046e+04
        1.880473e+00	        1.592944e+04
        1.901536e+00	        1.592842e+04
        1.922834e+00	        1.592727e+04
        1.944370e+00	        1.592604e+04
        1.966148e+00	        1.592480e+04
        1.988170e+00	        1.592345e+04
        2.010439e+00	        1.592204e+04
        2.032956e+00	        1.592062e+04
        2.055727e+00	        1.591908e+04
        2.078752e+00	        1.591733e+04
        2.102035e+00	        1.591555e+04
        2.125579e+00	        1.591375e+04
        2.149386e+00	        1.591169e+04
        2.173460e+00	        1.590946e+04
        2.197804e+00	        1.590719e+04
        2.222421e+00	        1.590490e+04
        2.247313e+00	        1.590246e+04
        2.272484e+00	        1.589989e+04
        2.297937e+00	        1.589728e+04
        2.323675e+00	        1.589465e+04
        2.349701e+00	        1.589199e+04
        2.376019e+00	        1.588856e+04
        2.402632e+00	        1.588466e+04
        2.429542e+00	        1.588072e+04
        2.456754e+00	        1.587673e+04
        2.484271e+00	        1.587274e+04
        2.512096e+00	        1.586891e+04
        2.540233e+00	        1.586504e+04
        2.568685e+00	        1.586112e+04
        2.597455e+00	        1.585716e+04
        2.626548e+00	        1.585316e+04
        2.655967e+00	        1.584911e+04
        2.685715e+00	        1.584298e+04
        2.715796e+00	        1.583673e+04
        2.746214e+00	        1.583040e+04
        2.776973e+00	        1.582401e+04
        2.808077e+00	        1.581754e+04
        2.839529e+00	        1.581033e+04
        2.871333e+00	        1.580279e+04
        2.903493e+00	        1.579516e+04
        2.936014e+00	        1.578744e+04
        2.968899e+00	        1.577964e+04
        3.002152e+00	        1.577176e+04
        3.035777e+00	        1.576218e+04
        3.069779e+00	        1.575224e+04
        3.104162e+00	        1.574219e+04
        3.138931e+00	        1.573203e+04
        3.174088e+00	        1.572175e+04
        3.209640e+00	        1.571136e+04
        3.245589e+00	        1.570097e+04
        3.281941e+00	        1.569048e+04
        3.318701e+00	        1.567988e+04
        3.355872e+00	        1.566916e+04
        3.393459e+00	        1.565832e+04
        3.431468e+00	        1.564735e+04
        3.469902e+00	        1.563627e+04
        3.508766e+00	        1.562430e+04
        3.548066e+00	        1.561196e+04
        3.587806e+00	        1.559948e+04
        3.627992e+00	        1.558686e+04
        3.668627e+00	        1.557410e+04
        3.709717e+00	        1.556120e+04
        3.751268e+00	        1.554820e+04
        3.793284e+00	        1.553670e+04
        3.835771e+00	        1.552508e+04
        3.878733e+00	        1.551332e+04
        3.922177e+00	        1.550144e+04
        3.966107e+00	        1.548942e+04
        4.010530e+00	        1.547726e+04
        4.055449e+00	        1.546497e+04
        4.100872e+00	        1.545166e+04
        4.146804e+00	        1.543609e+04
        4.193250e+00	        1.542036e+04
        4.240217e+00	        1.540444e+04
        4.287709e+00	        1.538835e+04
        4.335734e+00	        1.537208e+04
        4.384296e+00	        1.535562e+04
        4.433403e+00	        1.534206e+04
        4.483059e+00	        1.532843e+04
        4.533271e+00	        1.531466e+04
        4.584046e+00	        1.530073e+04
        4.635390e+00	        1.528664e+04
        4.687308e+00	        1.527240e+04
        4.739809e+00	        1.525800e+04
        4.792897e+00	        1.524343e+04
        4.846580e+00	        1.522605e+04
        4.900864e+00	        1.520808e+04
        4.955756e+00	        1.518990e+04
        5.011263e+00	        1.517152e+04
        5.067391e+00	        1.515293e+04
        5.124149e+00	        1.513414e+04
        5.181542e+00	        1.511513e+04
        5.239577e+00	        1.509687e+04
        5.298263e+00	        1.507867e+04
        5.357606e+00	        1.506027e+04
        5.417614e+00	        1.504166e+04
        5.478294e+00	        1.502284e+04
        5.539654e+00	        1.500381e+04
        5.601701e+00	        1.498457e+04
        5.664442e+00	        1.496511e+04
        5.727887e+00	        1.494441e+04
        5.792042e+00	        1.492295e+04
        5.856916e+00	        1.490124e+04
        5.922516e+00	        1.487930e+04
        5.988851e+00	        1.485710e+04
        6.055929e+00	        1.483466e+04
        6.123759e+00	        1.481197e+04
        6.192348e+00	        1.478902e+04
        6.261705e+00	        1.476388e+04
        6.331839e+00	        1.473496e+04
        6.402759e+00	        1.470572e+04
        6.474473e+00	        1.467615e+04
        6.546991e+00	        1.464625e+04
        6.620320e+00	        1.461601e+04
        6.694471e+00	        1.458544e+04
        6.769452e+00	        1.455450e+04
        6.845274e+00	        1.452169e+04
        6.921944e+00	        1.448753e+04
        6.999473e+00	        1.445299e+04
        7.077871e+00	        1.441806e+04
        7.157146e+00	        1.438274e+04
        7.237310e+00	        1.434703e+04
        7.318371e+00	        1.431092e+04
        7.400341e+00	        1.427440e+04
        7.483228e+00	        1.423580e+04
        7.567044e+00	        1.419486e+04
        7.651799e+00	        1.415347e+04
        7.737503e+00	        1.411161e+04
        7.824166e+00	        1.406928e+04
        7.911801e+00	        1.402649e+04
        8.000417e+00	        1.398321e+04
        8.090026e+00	        1.393944e+04
        8.180638e+00	        1.389512e+04
        8.272265e+00	        1.384317e+04
        8.364918e+00	        1.379063e+04
        8.458610e+00	        1.373751e+04
        8.553350e+00	        1.368380e+04
        8.649152e+00	        1.362948e+04
        8.746027e+00	        1.357455e+04
        8.843987e+00	        1.351901e+04
        8.943044e+00	        1.346285e+04
        9.043210e+00	        1.339978e+04
        9.144499e+00	        1.333089e+04
        9.246921e+00	        1.326123e+04
        9.350492e+00	        1.319079e+04
        9.455222e+00	        1.311956e+04
        9.561125e+00	        1.304753e+04
        9.668214e+00	        1.297469e+04
        9.776503e+00	        1.290104e+04
        9.886005e+00	        1.282705e+04
        9.996733e+00	        1.275291e+04
        1.010870e+01	        1.267793e+04
        1.022192e+01	        1.260212e+04
        1.033641e+01	        1.252546e+04
        1.045219e+01	        1.244794e+04
        1.056926e+01	        1.236956e+04
        1.068764e+01	        1.229029e+04
        1.080734e+01	        1.221014e+04
        1.092839e+01	        1.212478e+04
        1.105080e+01	        1.202447e+04
        1.117457e+01	        1.192303e+04
        1.129973e+01	        1.182045e+04
        1.142629e+01	        1.171673e+04
        1.155427e+01	        1.161184e+04
        1.168369e+01	        1.150578e+04
        1.181455e+01	        1.139854e+04
        1.194688e+01	        1.129599e+04
        1.208069e+01	        1.120793e+04
        1.221600e+01	        1.111889e+04
        1.235282e+01	        1.102885e+04
        1.249118e+01	        1.093779e+04
        1.263109e+01	        1.084572e+04
        1.277256e+01	        1.075262e+04
        1.291562e+01	        1.065848e+04
        1.306028e+01	        1.056328e+04
        1.320657e+01	        1.046701e+04
        1.335449e+01	        1.035937e+04
        1.350406e+01	        1.024300e+04
        1.365531e+01	        1.012532e+04
        1.380826e+01	        1.000632e+04
        1.396292e+01	        9.885989e+03
        1.411931e+01	        9.764310e+03
        1.427746e+01	        9.641268e+03
        1.443737e+01	        9.516848e+03
        1.459908e+01	        9.405472e+03
        1.476259e+01	        9.296680e+03
        1.492794e+01	        9.186670e+03
        1.509514e+01	        9.075427e+03
        1.526421e+01	        8.962939e+03
        1.543518e+01	        8.849190e+03
        1.560806e+01	        8.734168e+03
        1.578288e+01	        8.617857e+03
        1.595966e+01	        8.501444e+03
        1.613841e+01	        8.390651e+03
        1.631917e+01	        8.278617e+03
        1.650195e+01	        8.165328e+03
        1.668678e+01	        8.050770e+03
        1.687368e+01	        7.934929e+03
        1.706268e+01	        7.817791e+03
        1.725379e+01	        7.699340e+03
        1.744704e+01	        7.579563e+03
        1.764245e+01	        7.472621e+03
        1.784006e+01	        7.369694e+03
        1.803988e+01	        7.265615e+03
        1.824193e+01	        7.160369e+03
        1.844625e+01	        7.053945e+03
        1.865286e+01	        6.946329e+03
        1.886178e+01	        6.837507e+03
        1.907304e+01	        6.727467e+03
        1.928667e+01	        6.616194e+03
        1.950269e+01	        6.517609e+03
        1.972113e+01	        6.418138e+03
        1.994201e+01	        6.317553e+03
        2.016537e+01	        6.215842e+03
        2.039124e+01	        6.112991e+03
        2.061963e+01	        6.008989e+03
        2.085058e+01	        5.903821e+03
        2.108411e+01	        5.797475e+03
        2.132027e+01	        5.697522e+03
        2.155906e+01	        5.608417e+03
        2.180054e+01	        5.518314e+03
        2.204471e+01	        5.427201e+03
        2.229162e+01	        5.335068e+03
        2.254130e+01	        5.241904e+03
        2.279378e+01	        5.147695e+03
        2.304908e+01	        5.052431e+03
        2.330724e+01	        4.956100e+03
        2.356829e+01	        4.858752e+03
        2.383227e+01	        4.760367e+03
        2.409920e+01	        4.660880e+03
        2.436912e+01	        4.560279e+03
        2.464207e+01	        4.458551e+03
        2.491807e+01	        4.355683e+03
        2.519717e+01	        4.251663e+03
        2.547939e+01	        4.153146e+03
        2.576477e+01	        4.083844e+03
        2.605335e+01	        4.013765e+03
        2.634516e+01	        3.942902e+03
        2.664024e+01	        3.871245e+03
        2.693862e+01	        3.798785e+03
        2.724035e+01	        3.725514e+03
        2.754545e+01	        3.651422e+03
        2.785397e+01	        3.576500e+03
        2.816595e+01	        3.500739e+03
        2.848142e+01	        3.431273e+03
        2.880043e+01	        3.361188e+03
        2.912301e+01	        3.290317e+03
        2.944920e+01	        3.218654e+03
        2.977905e+01	        3.146187e+03
        3.011259e+01	        3.072909e+03
        3.044986e+01	        2.998810e+03
        3.079092e+01	        2.923881e+03
        3.113579e+01	        2.865855e+03
        3.148453e+01	        2.809489e+03
        3.183717e+01	        2.752491e+03
        3.219376e+01	        2.694855e+03
        3.255435e+01	        2.636573e+03
        3.291897e+01	        2.577639e+03
        3.328768e+01	        2.518044e+03
        3.366052e+01	        2.457782e+03
        3.403753e+01	        2.401388e+03
        3.441877e+01	        2.356506e+03
        3.480428e+01	        2.311121e+03
        3.519410e+01	        2.265229e+03
        3.558829e+01	        2.218822e+03
        3.598690e+01	        2.171895e+03
        3.638997e+01	        2.124442e+03
        3.679756e+01	        2.076458e+03
        3.720971e+01	        2.027937e+03
        3.762647e+01	        1.980420e+03
        3.804791e+01	        1.937450e+03
        3.847406e+01	        1.893999e+03
        3.890499e+01	        1.850062e+03
        3.934075e+01	        1.805632e+03
        3.978138e+01	        1.760705e+03
        4.022696e+01	        1.715275e+03
        4.067752e+01	        1.669337e+03
        4.113313e+01	        1.626604e+03
        4.159384e+01	        1.593154e+03
        4.205971e+01	        1.559329e+03
        4.253080e+01	        1.525125e+03
        4.300716e+01	        1.490538e+03
        4.348887e+01	        1.455564e+03
        4.397596e+01	        1.420198e+03
        4.446851e+01	        1.384435e+03
        4.496658e+01	        1.348272e+03
        4.547023e+01	        1.319014e+03
        4.597952e+01	        1.291605e+03
        4.649451e+01	        1.263890e+03
        4.701528e+01	        1.235864e+03
        4.754187e+01	        1.207524e+03
        4.807436e+01	        1.178868e+03
        4.861282e+01	        1.149891e+03
        4.915731e+01	        1.120590e+03
        4.970789e+01	        1.092170e+03
        5.026464e+01	        1.069561e+03
        5.082763e+01	        1.046697e+03
        5.139693e+01	        1.023578e+03
        5.197260e+01	        1.000200e+03
        5.255472e+01	        9.765603e+02
        5.314336e+01	        9.526556e+02
        5.373859e+01	        9.284825e+02
        5.434049e+01	        9.040386e+02
        5.494913e+01	        8.824763e+02
        5.556458e+01	        8.622823e+02
        5.618694e+01	        8.418621e+02
        5.681626e+01	        8.212132e+02
        5.745263e+01	        8.003330e+02
        5.809612e+01	        7.792193e+02
        5.874683e+01	        7.578700e+02
        5.940482e+01	        7.362816e+02
        6.007019e+01	        7.190981e+02
        6.074300e+01	        7.030210e+02
        6.142335e+01	        6.867637e+02
        6.211133e+01	        6.703244e+02
        6.280700e+01	        6.537011e+02
        6.351047e+01	        6.368916e+02
        6.422182e+01	        6.198944e+02
        6.494114e+01	        6.027069e+02
        6.566851e+01	        5.875495e+02
        6.640403e+01	        5.733368e+02
        6.714779e+01	        5.589649e+02
        6.789988e+01	        5.444321e+02
        6.866039e+01	        5.297365e+02
        6.942942e+01	        5.148763e+02
        7.020706e+01	        4.998501e+02
        7.099342e+01	        4.854231e+02
        7.178858e+01	        4.758279e+02
        7.259264e+01	        4.661252e+02
        7.340572e+01	        4.563138e+02
        7.422790e+01	        4.463926e+02
        7.505929e+01	        4.363602e+02
        7.589999e+01	        4.262155e+02
        7.675011e+01	        4.159572e+02
        7.760974e+01	        4.055846e+02
        7.847901e+01	        3.952648e+02
        7.935802e+01	        3.855632e+02
        8.024686e+01	        3.757528e+02
        8.114567e+01	        3.658326e+02
        8.205454e+01	        3.558013e+02
        8.297359e+01	        3.456575e+02
        8.390294e+01	        3.354001e+02
        8.484269e+01	        3.250285e+02
        8.579297e+01	        3.178270e+02
        8.675389e+01	        3.107135e+02
        8.772558e+01	        3.035204e+02
        8.870815e+01	        2.962466e+02
        8.970173e+01	        2.888914e+02
        9.070643e+01	        2.814539e+02
        9.172239e+01	        2.739330e+02
        9.274972e+01	        2.663279e+02
        9.378856e+01	        2.601139e+02
        9.483904e+01	        2.540555e+02
        9.590129e+01	        2.479293e+02
        9.697543e+01	        2.417345e+02
        9.806160e+01	        2.354702e+02
        9.915994e+01	        2.291359e+02
        1.002706e+02	        2.227310e+02
        1.013937e+02	        2.164525e+02
        1.025293e+02	        2.114717e+02
        1.036777e+02	        2.064351e+02
        1.048389e+02	        2.013420e+02
        1.060132e+02	        1.961920e+02
        1.072006e+02	        1.909842e+02
        1.084013e+02	        1.857178e+02
        1.096154e+02	        1.803924e+02
        1.108432e+02	        1.757455e+02
        1.120847e+02	        1.717163e+02
        1.133401e+02	        1.676420e+02
        1.146095e+02	        1.635221e+02
        1.158932e+02	        1.593561e+02
        1.171913e+02	        1.551434e+02
        1.185039e+02	        1.508836e+02
        1.198312e+02	        1.465760e+02
        1.211734e+02	        1.430302e+02
        1.225306e+02	        1.395809e+02
        1.239030e+02	        1.360929e+02
        1.252907e+02	        1.325659e+02
        1.266941e+02	        1.289994e+02
        1.281131e+02	        1.253929e+02
        1.295480e+02	        1.217461e+02
        1.309990e+02	        1.183457e+02
        1.324663e+02	        1.151650e+02
        1.339500e+02	        1.119495e+02
        1.354503e+02	        1.086980e+02
        1.369674e+02	        1.054100e+02
        1.385015e+02	        1.020852e+02
        1.400528e+02	        9.875636e+01
        1.416214e+02	        9.642600e+01
        1.432077e+02	        9.406953e+01
        1.448117e+02	        9.168668e+01
        1.464336e+02	        8.927714e+01
        1.480737e+02	        8.684092e+01
        1.497322e+02	        8.437740e+01
        1.514093e+02	        8.188629e+01
        1.531052e+02	        7.971595e+01
        1.548200e+02	        7.759267e+01
        1.565541e+02	        7.544560e+01
        1.583076e+02	        7.327449e+01
        1.600807e+02	        7.107909e+01
        1.618737e+02	        6.885969e+01
        1.636867e+02	        6.674825e+01
        1.655201e+02	        6.498223e+01
        1.673740e+02	        6.319643e+01
        1.692487e+02	        6.139058e+01
        1.711444e+02	        5.956450e+01
        1.730613e+02	        5.771798e+01
        1.749996e+02	        5.585078e+01
        1.769597e+02	        5.439515e+01
        1.789418e+02	        5.301787e+01
        1.809460e+02	        5.162517e+01
        1.829727e+02	        5.021687e+01
        1.850221e+02	        4.879280e+01
        1.870944e+02	        4.735278e+01
        1.891900e+02	        4.589832e+01
        1.913090e+02	        4.458853e+01
        1.934517e+02	        4.326406e+01
        1.956185e+02	        4.192503e+01
        1.978095e+02	        4.057107e+01
        2.000251e+02	        3.920194e+01
        2.022655e+02	        3.786436e+01
        2.045309e+02	        3.682423e+01
        2.068218e+02	        3.577245e+01
        2.091383e+02	        3.470889e+01
        2.114807e+02	        3.363342e+01
        2.138494e+02	        3.254594e+01
        2.162446e+02	        3.144744e+01
        2.186667e+02	        3.058982e+01
        2.211159e+02	        2.972260e+01
        2.235925e+02	        2.884567e+01
        2.260968e+02	        2.795891e+01
        2.286292e+02	        2.706222e+01
        2.311900e+02	        2.615548e+01
        2.337794e+02	        2.540456e+01
        2.363979e+02	        2.467148e+01
        2.390456e+02	        2.393018e+01
        2.417231e+02	        2.318058e+01
        2.444305e+02	        2.242249e+01
        2.471682e+02	        2.165595e+01
        2.499366e+02	        2.099408e+01
        2.527360e+02	        2.034531e+01
        2.555668e+02	        1.968928e+01
        2.584293e+02	        1.902602e+01
        2.613238e+02	        1.835537e+01
        2.642508e+02	        1.770690e+01
        2.672105e+02	        1.719342e+01
        2.702034e+02	        1.667420e+01
        2.732298e+02	        1.614915e+01
        2.762901e+02	        1.561824e+01
        2.793847e+02	        1.508140e+01
        2.825139e+02	        1.456215e+01
        2.856782e+02	        1.411124e+01
        2.888780e+02	        1.365529e+01
        2.921136e+02	        1.319423e+01
        2.953854e+02	        1.272801e+01
        2.986938e+02	        1.225658e+01
        3.020393e+02	        1.184639e+01
        3.054223e+02	        1.148094e+01
        3.088432e+02	        1.111139e+01
        3.123024e+02	        1.073773e+01
        3.158004e+02	        1.035989e+01
        3.193375e+02	        9.977811e+00
        3.229142e+02	        9.604790e+00
        3.265310e+02	        9.233431e+00
        3.301883e+02	        8.857913e+00
        3.338866e+02	        8.478150e+00
        3.376263e+02	        8.094211e+00
        3.414079e+02	        7.804569e+00
        3.452318e+02	        7.537208e+00
        3.490986e+02	        7.266855e+00
        3.530086e+02	        6.993479e+00
        3.569625e+02	        6.717051e+00
        3.609607e+02	        6.440279e+00
        3.650036e+02	        6.203751e+00
        3.690918e+02	        5.964602e+00
        3.732258e+02	        5.722823e+00
        3.774062e+02	        5.478337e+00
        3.816333e+02	        5.231115e+00
        3.859078e+02	        5.004108e+00
        3.902301e+02	        4.789607e+00
        3.946009e+02	        4.572706e+00
        3.990206e+02	        4.353376e+00
        4.034898e+02	        4.131619e+00
        4.080091e+02	        3.926432e+00
        4.125790e+02	        3.741025e+00
        4.172001e+02	        3.553541e+00
        4.218730e+02	        3.363957e+00
        4.265982e+02	        3.172250e+00
        4.313763e+02	        2.986838e+00
        4.362079e+02	        2.811311e+00
        4.410936e+02	        2.633860e+00
        4.460341e+02	        2.454445e+00
        4.510299e+02	        2.273023e+00
        4.560817e+02	        2.098582e+00
        4.611900e+02	        1.923638e+00
        4.663556e+02	        1.746736e+00
        4.715790e+02	        1.567853e+00
        4.768609e+02	        1.400324e+00
        4.822020e+02	        1.232001e+00
        4.876029e+02	        1.061800e+00
        4.930643e+02	        8.864842e-01
        4.985868e+02	        7.046647e-01
        5.041712e+02	        5.208101e-01
        5.098182e+02	        3.276885e-01
        5.155284e+02	        1.281371e-01
        5.213026e+02	        1.408182e-02
        5.271414e+02	        1.385229e-02
        5.330457e+02	        1.362165e-02
        5.390161e+02	        1.338860e-02
        5.450533e+02	        1.315301e-02
        5.511582e+02	        1.291316e-02
        5.573314e+02	        1.266588e-02
        5.635738e+02	        1.245340e-02
        5.698861e+02	        1.225405e-02
        5.762691e+02	        1.205528e-02
        5.827236e+02	        1.185870e-02
        5.892504e+02	        1.166248e-02
        5.958503e+02	        1.146404e-02
        6.025241e+02	        1.126359e-02
        6.092727e+02	        1.106885e-02
        6.160968e+02	        1.088024e-02
        6.229974e+02	        1.068979e-02
        6.299753e+02	        1.049988e-02
        6.370313e+02	        1.032380e-02
        6.441664e+02	        1.014669e-02
        6.513814e+02	        9.968173e-03
        6.586772e+02	        9.805177e-03
        6.660547e+02	        9.646075e-03
        6.735148e+02	        9.485231e-03
        6.810585e+02	        9.318396e-03
        6.886867e+02	        9.145332e-03
        6.964003e+02	        8.976601e-03
        7.042004e+02	        8.815012e-03
        7.120878e+02	        8.670790e-03
        7.200635e+02	        8.526230e-03
        7.281286e+02	        8.380806e-03
        7.362840e+02	        8.234156e-03
        7.445307e+02	        8.086039e-03
        7.528698e+02	        7.935131e-03
        7.613023e+02	        7.787284e-03
        7.698293e+02	        7.658843e-03
        7.784518e+02	        7.531393e-03
        7.871708e+02	        7.403712e-03
        7.959875e+02	        7.275029e-03
        8.049030e+02	        7.145218e-03
        8.139183e+02	        7.024275e-03
        8.230346e+02	        6.907655e-03
        8.322529e+02	        6.784242e-03
        8.415746e+02	        6.660927e-03
        8.510006e+02	        6.538291e-03
        8.605323e+02	        6.416251e-03
        8.701706e+02	        6.300440e-03
        8.799170e+02	        6.187400e-03
        8.897725e+02	        6.073382e-03
        8.997384e+02	        5.958300e-03
        9.098159e+02	        5.839023e-03
        9.200063e+02	        5.724541e-03
        9.303108e+02	        5.623505e-03
        9.407307e+02	        5.526760e-03
        9.512674e+02	        5.429194e-03
        9.619221e+02	        5.330804e-03
        9.726961e+02	        5.231544e-03
        9.835907e+02	        5.133282e-03
        9.946074e+02	        5.031764e-03
        1.005748e+03	        4.932927e-03
        1.017012e+03	        4.837503e-03
        1.028403e+03	        4.746074e-03
        1.039922e+03	        4.656211e-03
        1.051570e+03	        4.572030e-03
        1.063348e+03	        4.487117e-03
        1.075258e+03	        4.397266e-03
        1.087301e+03	        4.307932e-03
        1.099480e+03	        4.218979e-03
        1.111794e+03	        4.136543e-03
        1.124247e+03	        4.060210e-03
        1.136839e+03	        3.983627e-03
        1.149572e+03	        3.906778e-03
        1.162448e+03	        3.788452e-03
        1.175468e+03	        3.679222e-03
        1.188634e+03	        3.579527e-03
        1.201947e+03	        3.487865e-03
        1.215409e+03	        3.397937e-03
        1.229023e+03	        3.315910e-03
        1.242788e+03	        3.237701e-03
        1.256708e+03	        3.160051e-03
        1.270784e+03	        3.082453e-03
        1.285017e+03	        3.009472e-03
        1.299410e+03	        2.937565e-03
        1.313964e+03	        2.866147e-03
        1.328681e+03	        2.795132e-03
        1.343563e+03	        2.726581e-03
        1.358612e+03	        2.662509e-03
        1.373829e+03	        2.600447e-03
        1.389216e+03	        2.538917e-03
        1.404776e+03	        2.477746e-03
        1.420510e+03	        2.416706e-03
        1.436421e+03	        2.356581e-03
        1.452509e+03	        2.296350e-03
        1.468778e+03	        2.237873e-03
        1.485229e+03	        2.179719e-03
        1.501865e+03	        2.122215e-03
        1.518686e+03	        2.063559e-03
        1.535696e+03	        2.001837e-03
        1.552897e+03	        1.931559e-03
        1.570290e+03	        1.822301e-03
        1.587878e+03	        1.784664e-03
        1.605663e+03	        1.748373e-03
        1.623647e+03	        1.718129e-03
        1.641833e+03	        1.687929e-03
        1.660222e+03	        1.657743e-03
        1.678818e+03	        1.627297e-03
        1.697621e+03	        1.596540e-03
        1.716635e+03	        1.566077e-03
        1.735863e+03	        1.537003e-03
        1.755305e+03	        1.509333e-03
        1.774965e+03	        1.481675e-03
        1.794846e+03	        1.455295e-03
        1.814949e+03	        1.428851e-03
        1.835277e+03	        1.402152e-03
        1.855833e+03	        1.375183e-03
        1.876620e+03	        1.347933e-03
        1.897639e+03	        1.320460e-03
        1.918893e+03	        1.294240e-03
        1.940386e+03	        1.268632e-03
        1.962119e+03	        1.245584e-03
        1.984096e+03	        1.222525e-03
        2.006319e+03	        1.199231e-03
        2.028790e+03	        1.175748e-03
        2.051514e+03	        1.152054e-03
        2.074492e+03	        1.128846e-03
        2.097727e+03	        1.106788e-03
        2.121223e+03	        1.085184e-03
        2.144981e+03	        1.065501e-03
        2.169006e+03	        1.045937e-03
        2.193300e+03	        1.026176e-03
        2.217866e+03	        1.006404e-03
        2.242707e+03	        9.867069e-04
        2.267827e+03	        9.668773e-04
        2.293228e+03	        9.478931e-04
        2.318913e+03	        9.293326e-04
        2.344886e+03	        9.112873e-04
        2.371150e+03	        8.935307e-04
        2.397708e+03	        8.757880e-04
        2.424563e+03	        8.582908e-04
        2.451720e+03	        8.406288e-04
        2.479180e+03	        8.228005e-04
        2.506948e+03	        8.061341e-04
        2.535027e+03	        7.901085e-04
        2.563421e+03	        7.754342e-04
        2.592132e+03	        7.606971e-04
        2.621165e+03	        7.458811e-04
        2.650524e+03	        7.309152e-04
        2.680211e+03	        7.157899e-04
        2.710231e+03	        7.005124e-04
        2.740587e+03	        6.865042e-04
        2.771282e+03	        6.736604e-04
        2.802322e+03	        6.613526e-04
        2.833710e+03	        6.488810e-04
        2.865449e+03	        6.362701e-04
        2.897543e+03	        6.235264e-04
        2.929997e+03	        6.106862e-04
        2.962814e+03	        5.978015e-04
        2.995999e+03	        5.854979e-04
        3.029556e+03	        5.748892e-04
        3.063488e+03	        5.641635e-04
        3.097801e+03	        5.533179e-04
        3.132498e+03	        5.423538e-04
        3.167583e+03	        5.314379e-04
        3.203062e+03	        5.205857e-04
        3.238938e+03	        5.096264e-04
        3.275216e+03	        4.991516e-04
        3.311900e+03	        4.893341e-04
        3.348994e+03	        4.794449e-04
        3.386505e+03	        4.695854e-04
        3.424435e+03	        4.596379e-04
        3.462791e+03	        4.495898e-04
        3.501576e+03	        4.397398e-04
        3.540795e+03	        4.303441e-04
        3.580454e+03	        4.216017e-04
        3.620557e+03	        4.132917e-04
        3.661109e+03	        4.050354e-04
        3.702115e+03	        3.966868e-04
        3.743580e+03	        3.882590e-04
        3.785510e+03	        3.801020e-04
        3.827910e+03	        3.719505e-04
        3.870784e+03	        3.637932e-04
        3.914139e+03	        3.558535e-04
        3.957979e+03	        3.483331e-04
        4.002311e+03	        3.408270e-04
        4.047138e+03	        3.338235e-04
        4.092468e+03	        3.268468e-04
        4.138306e+03	        3.198731e-04
        4.184657e+03	        3.128558e-04
        4.231527e+03	        3.058899e-04
        4.278923e+03	        2.991817e-04
        4.326849e+03	        2.925571e-04
        4.375311e+03	        2.860037e-04
        4.424317e+03	        2.793982e-04
        4.473872e+03	        2.727400e-04
        4.523981e+03	        2.660294e-04
        4.574652e+03	        2.595364e-04
        4.625890e+03	        2.534766e-04
        4.677703e+03	        2.477742e-04
        4.730095e+03	        2.422111e-04
        4.783075e+03	        2.365859e-04
        4.836647e+03	        2.308614e-04
        4.890820e+03	        2.252322e-04
        4.945600e+03	        2.196458e-04
        5.000993e+03	        2.140773e-04
        5.057007e+03	        2.083969e-04
        5.113648e+03	        2.021876e-04
        5.170923e+03	        1.964750e-04
        5.228840e+03	        1.919459e-04
        5.287405e+03	        1.874487e-04
        5.346627e+03	        1.829126e-04
        5.406512e+03	        1.783871e-04
        5.467067e+03	        1.742334e-04
        5.528301e+03	        1.701577e-04
        5.590221e+03	        1.661657e-04
        5.652834e+03	        1.621689e-04
        5.716149e+03	        1.581696e-04
        5.780172e+03	        1.541588e-04
        5.844913e+03	        1.501276e-04
        5.910379e+03	        1.462100e-04
        5.976578e+03	        1.424326e-04
        6.043519e+03	        1.387923e-04
        6.111209e+03	        1.350732e-04
        6.179658e+03	        1.312737e-04
        6.248873e+03	        1.271769e-04
        6.318863e+03	        1.237657e-04
        6.389638e+03	        1.204256e-04
        6.461205e+03	        1.172559e-04
        6.533574e+03	        1.141263e-04
        6.606753e+03	        1.109595e-04
        6.680752e+03	        1.078145e-04
        6.755579e+03	        1.046642e-04
        6.831245e+03	        1.015112e-04
        6.907759e+03	        9.830219e-05
        6.985129e+03	        9.514227e-05
        7.063366e+03	        9.195018e-05
        7.142479e+03	        8.857945e-05
        7.222478e+03	        8.501831e-05
        7.303374e+03	        8.064444e-05
        7.385175e+03	        7.553294e-05
        7.467893e+03	        7.357717e-05
        7.551537e+03	        7.178775e-05
        7.636118e+03	        7.013957e-05
        7.721646e+03	        6.851454e-05
        7.808132e+03	        6.690063e-05
        7.895587e+03	        6.527096e-05
        7.984022e+03	        6.362341e-05
        8.073446e+03	        6.205046e-05
        8.163873e+03	        6.053264e-05
        8.255312e+03	        5.900748e-05
        8.347776e+03	        5.747394e-05
        8.441275e+03	        5.592520e-05
        8.535822e+03	        5.436109e-05
        8.631427e+03	        5.282102e-05
        8.728103e+03	        5.128350e-05
        8.825862e+03	        4.974364e-05
        8.924716e+03	        4.829849e-05
        9.024678e+03	        4.694935e-05
        9.125758e+03	        4.563254e-05
        9.227971e+03	        4.431793e-05
        9.331329e+03	        4.296809e-05
        9.435845e+03	        4.158453e-05
        9.541531e+03	        4.016002e-05
        9.648401e+03	        3.838268e-05
        9.756468e+03	        3.736182e-05
        9.865745e+03	        3.634998e-05
        9.976246e+03	        3.533338e-05
        1.008798e+04	        3.430752e-05
        1.020098e+04	        3.330245e-05
        1.031523e+04	        3.232413e-05
        1.043077e+04	        3.136021e-05
        1.054760e+04	        3.047576e-05
        1.066573e+04	        2.959044e-05
        1.078520e+04	        2.869849e-05
        1.090600e+04	        2.780221e-05
        1.102815e+04	        2.691506e-05
        1.115167e+04	        2.602068e-05
        1.127657e+04	        2.514182e-05
        1.140288e+04	        2.431882e-05
        1.153059e+04	        2.347870e-05
        1.165974e+04	        2.261807e-05
        1.179034e+04	        2.172367e-05
        1.192240e+04	        2.072525e-05
        1.205593e+04	        1.946577e-05
        1.219096e+04	        1.885746e-05
        1.232751e+04	        1.832197e-05
        1.246558e+04	        1.778635e-05
        1.260520e+04	        1.724368e-05
        1.274639e+04	        1.669521e-05
        1.288915e+04	        1.614004e-05
        1.303352e+04	        1.558447e-05
        1.317950e+04	        1.501059e-05
        1.332712e+04	        1.445423e-05
        1.347639e+04	        1.391413e-05
        1.362733e+04	        1.335558e-05
        1.377996e+04	        1.276174e-05
        1.393431e+04	        1.213144e-05
        1.409038e+04	        1.141034e-05
        1.424820e+04	        1.073415e-05
        1.440778e+04	        1.046321e-05
        1.456916e+04	        1.019062e-05
        1.473234e+04	        9.915281e-06
        1.489735e+04	        9.637929e-06
        1.506421e+04	        9.358742e-06
        1.523293e+04	        9.090425e-06
        1.540355e+04	        8.828994e-06
        1.557608e+04	        8.566871e-06
        1.575054e+04	        8.301395e-06
        1.592695e+04	        8.031663e-06
        1.610534e+04	        7.761272e-06
        1.628573e+04	        7.519391e-06
        1.646814e+04	        7.275215e-06
        1.665259e+04	        7.001591e-06
        1.683910e+04	        6.794302e-06
        1.702771e+04	        6.585361e-06
        1.721843e+04	        6.377842e-06
        1.741128e+04	        6.199048e-06
        1.760630e+04	        6.018929e-06
        1.780350e+04	        5.836449e-06
        1.800291e+04	        5.652123e-06
        1.820455e+04	        5.466580e-06
        1.840845e+04	        5.288801e-06
        1.861463e+04	        5.114880e-06
        1.882312e+04	        4.936564e-06
        1.903395e+04	        4.744745e-06
        1.924714e+04	        4.564800e-06
        1.946272e+04	        4.414620e-06
        1.968071e+04	        4.273059e-06
        1.990114e+04	        4.129676e-06
        2.012405e+04	        3.984695e-06
        2.034945e+04	        3.837106e-06
        2.057737e+04	        3.704016e-06
        2.080785e+04	        3.571886e-06
        2.104091e+04	        3.437454e-06
        2.127657e+04	        3.298844e-06
        2.151488e+04	        3.158179e-06
        2.175586e+04	        3.029189e-06
        2.199954e+04	        2.913628e-06
        2.224594e+04	        2.796873e-06
        2.249511e+04	        2.681645e-06
        2.274706e+04	        2.571762e-06
        2.300184e+04	        2.460507e-06
        2.325947e+04	        2.348284e-06
        2.351999e+04	        2.240053e-06
        2.378343e+04	        2.136781e-06
        2.404981e+04	        2.032695e-06
        2.431918e+04	        1.928044e-06
        2.459157e+04	        1.824441e-06
        2.486701e+04	        1.719648e-06
        2.514553e+04	        1.615002e-06
        2.542717e+04	        1.515391e-06
        2.571197e+04	        1.413749e-06
        2.599996e+04	        1.306831e-06
        2.629117e+04	        1.206601e-06
        2.658564e+04	        1.102702e-06
        2.688341e+04	        9.943377e-07
        2.718452e+04	        8.771296e-07
        2.748900e+04	        7.533689e-07
        2.779689e+04	        6.220447e-07
        2.810823e+04	        4.579294e-07
        2.842306e+04	        1.648912e-07
        2.874141e+04	        5.390643e-08
        2.906333e+04	        4.898533e-08
        2.938885e+04	        4.360111e-08
        2.971802e+04	        3.755249e-08
        3.005088e+04	        3.192515e-08
        3.038746e+04	        2.559870e-08
        3.072782e+04	        1.702025e-08
        3.107198e+04	        2.728052e-09
        3.142000e+04	        2.503285e-09
        3.177192e+04	        2.260407e-09
        3.212779e+04	        1.973091e-09
        3.248763e+04	        1.695581e-09
        3.285151e+04	        1.479651e-09
        3.321946e+04	        1.217322e-09
        3.359154e+04	        7.677819e-10
        3.396778e+04	        7.100802e-10
        3.434823e+04	        6.668492e-10
        3.473295e+04	        6.202571e-10
        3.512198e+04	        5.450127e-10
        3.551536e+04	        5.197021e-10
        3.591315e+04	        4.934696e-10
        3.631540e+04	        4.660141e-10
        3.672215e+04	        4.391580e-10
        3.713345e+04	        4.109011e-10
        3.754937e+04	        3.740031e-10
        3.796994e+04	        3.459943e-10
        3.839522e+04	        3.286071e-10
        3.882526e+04	        3.090461e-10
        3.926013e+04	        2.913214e-10
        3.969986e+04	        2.736299e-10
        4.014452e+04	        2.478711e-10
        4.059416e+04	        2.361705e-10
        4.104883e+04	        2.251391e-10
        4.150860e+04	        2.129535e-10
        4.197351e+04	        2.030462e-10
        4.244364e+04	        1.912137e-10
        4.291903e+04	        1.789903e-10
        4.339974e+04	        1.718953e-10
        4.388584e+04	        1.643106e-10
        4.437738e+04	        1.574512e-10
        4.487443e+04	        1.504723e-10
        4.537705e+04	        1.426785e-10
        4.588529e+04	        1.375871e-10
        4.639923e+04	        1.324147e-10
        4.691893e+04	        1.274312e-10
        4.744444e+04	        1.223915e-10
        4.797584e+04	        1.171872e-10
        4.851319e+04	        1.128851e-10
        4.905657e+04	        1.085771e-10
        4.960602e+04	        1.042227e-10
        5.016164e+04	        9.961612e-11
        5.072347e+04	        9.542419e-11
        5.129160e+04	        9.118543e-11
        5.186609e+04	        8.748079e-11
        5.244702e+04	        8.368880e-11
        5.303445e+04	        7.995600e-11
        5.362846e+04	        7.608676e-11
        5.422913e+04	        7.238085e-11
        5.483652e+04	        6.881272e-11
        5.545071e+04	        6.518205e-11
        5.607179e+04	        6.111835e-11
        5.669982e+04	        5.746523e-11
        5.733489e+04	        5.425887e-11
        5.797707e+04	        5.092044e-11
        5.862644e+04	        4.682544e-11
        5.928308e+04	        4.386310e-11
        5.994708e+04	        4.115906e-11
        6.061852e+04	        3.866615e-11
        6.129748e+04	        3.546240e-11
        6.198404e+04	        3.368819e-11
        6.267829e+04	        3.177165e-11
        6.338032e+04	        2.960099e-11
        6.409021e+04	        2.761033e-11
        6.480805e+04	        2.633727e-11
        6.553393e+04	        2.512825e-11
        6.626795e+04	        2.381080e-11
        6.701018e+04	        2.279088e-11
        6.776073e+04	        2.174013e-11
        6.851968e+04	        2.060434e-11
        6.928713e+04	        1.967552e-11
        7.006318e+04	        1.876759e-11
        7.084793e+04	        1.783355e-11
        7.164146e+04	        1.691553e-11
        7.244388e+04	        1.605254e-11
        7.325529e+04	        1.518516e-11
        7.407578e+04	        1.432133e-11
        7.490547e+04	        1.351862e-11
        7.574444e+04	        1.270355e-11
        7.659282e+04	        1.189477e-11
        7.745070e+04	        1.113854e-11
        7.831818e+04	        1.039544e-11
        7.919539e+04	        9.679054e-12
        8.008241e+04	        8.971686e-12
        8.097938e+04	        8.203716e-12
        8.188638e+04	        7.483458e-12
        8.280355e+04	        6.725761e-12
        8.373099e+04	        5.934862e-12
        8.466882e+04	        5.211763e-12
        8.561715e+04	        4.333665e-12
        8.657611e+04	        3.640226e-12
        8.754580e+04	        2.894064e-12
        8.852636e+04	        2.243194e-12
        8.951790e+04	        1.837806e-12
        9.052054e+04	        1.422200e-12
        9.153442e+04	        9.883734e-13
        9.255965e+04	        4.583363e-13
        9.359636e+04	        1.214059e-13
        9.464469e+04	        9.053738e-14
        9.570475e+04	        8.292373e-14
        9.677669e+04	        7.522131e-14
        9.786064e+04	        6.704369e-14
        9.895673e+04	        5.857621e-14
        1.000651e+05	        4.891290e-14
        1.011859e+05	        3.695893e-14
        1.023192e+05	        1.872979e-14
        1.034652e+05	        1.053604e-14
        1.046241e+05	        3.133148e-15
        1.057959e+05	        0.000000e+00
        1.069809e+05	        0.000000e+00
        1.081791e+05	        0.000000e+00
        1.093908e+05	        0.000000e+00

# -------------------------------------------------------------------------------
# Curve 1: LET spectrum without Flares
# Params: 0 5 #c967d0 2 1
#	LET (MeV.cm^2.g^{-1})		Flux (cm^{-2}.s^{-1})
# -------------------------------------------------------------------------------
        1.608960e+00	        6.313283e+01
        1.626982e+00	        6.313283e+01
        1.645205e+00	        6.313283e+01
        1.663632e+00	        6.313283e+01
        1.682265e+00	        6.302539e+01
        1.701107e+00	        6.289096e+01
        1.720161e+00	        6.280423e+01
        1.739427e+00	        6.274413e+01
        1.758910e+00	        6.269114e+01
        1.778610e+00	        6.264832e+01
        1.798532e+00	        6.261199e+01
        1.818676e+00	        6.257989e+01
        1.839046e+00	        6.255060e+01
        1.859644e+00	        6.252290e+01
        1.880473e+00	        6.249803e+01
        1.901536e+00	        6.247455e+01
        1.922834e+00	        6.245363e+01
        1.944370e+00	        6.243771e+01
        1.966148e+00	        6.242627e+01
        1.988170e+00	        6.241873e+01
        2.010439e+00	        6.241178e+01
        2.032956e+00	        6.240475e+01
        2.055727e+00	        6.239819e+01
        2.078752e+00	        6.239262e+01
        2.102035e+00	        6.238699e+01
        2.125579e+00	        6.238130e+01
        2.149386e+00	        6.237634e+01
        2.173460e+00	        6.237184e+01
        2.197804e+00	        6.236730e+01
        2.222421e+00	        6.236270e+01
        2.247313e+00	        6.235880e+01
        2.272484e+00	        6.235555e+01
        2.297937e+00	        6.235225e+01
        2.323675e+00	        6.234892e+01
        2.349701e+00	        6.234555e+01
        2.376019e+00	        6.234236e+01
        2.402632e+00	        6.233928e+01
        2.429542e+00	        6.233615e+01
        2.456754e+00	        6.233300e+01
        2.484271e+00	        6.233000e+01
        2.512096e+00	        6.232811e+01
        2.540233e+00	        6.232619e+01
        2.568685e+00	        6.232426e+01
        2.597455e+00	        6.232230e+01
        2.626548e+00	        6.232032e+01
        2.655967e+00	        6.231832e+01
        2.685715e+00	        6.231642e+01
        2.715796e+00	        6.231451e+01
        2.746214e+00	        6.231257e+01
        2.776973e+00	        6.231060e+01
        2.808077e+00	        6.230862e+01
        2.839529e+00	        6.230705e+01
        2.871333e+00	        6.230562e+01
        2.903493e+00	        6.230417e+01
        2.936014e+00	        6.230271e+01
        2.968899e+00	        6.230123e+01
        3.002152e+00	        6.229973e+01
        3.035777e+00	        6.226101e+01
        3.069779e+00	        6.221599e+01
        3.104162e+00	        6.217047e+01
        3.138931e+00	        6.212445e+01
        3.174088e+00	        6.207790e+01
        3.209640e+00	        6.203084e+01
        3.245589e+00	        6.195643e+01
        3.281941e+00	        6.187562e+01
        3.318701e+00	        6.179390e+01
        3.355872e+00	        6.171127e+01
        3.393459e+00	        6.162771e+01
        3.431468e+00	        6.154322e+01
        3.469902e+00	        6.145778e+01
        3.508766e+00	        6.135719e+01
        3.548066e+00	        6.125115e+01
        3.587806e+00	        6.114392e+01
        3.627992e+00	        6.103550e+01
        3.668627e+00	        6.092586e+01
        3.709717e+00	        6.081499e+01
        3.751268e+00	        6.070293e+01
        3.793284e+00	        6.059145e+01
        3.835771e+00	        6.047873e+01
        3.878733e+00	        6.036474e+01
        3.922177e+00	        6.024947e+01
        3.966107e+00	        6.013292e+01
        4.010530e+00	        6.001506e+01
        4.055449e+00	        5.989588e+01
        4.100872e+00	        5.976243e+01
        4.146804e+00	        5.959669e+01
        4.193250e+00	        5.942911e+01
        4.240217e+00	        5.925964e+01
        4.287709e+00	        5.908828e+01
        4.335734e+00	        5.891499e+01
        4.384296e+00	        5.873977e+01
        4.433403e+00	        5.858835e+01
        4.483059e+00	        5.843603e+01
        4.533271e+00	        5.828199e+01
        4.584046e+00	        5.812623e+01
        4.635390e+00	        5.796873e+01
        4.687308e+00	        5.780946e+01
        4.739809e+00	        5.764840e+01
        4.792897e+00	        5.748555e+01
        4.846580e+00	        5.729000e+01
        4.900864e+00	        5.708756e+01
        4.955756e+00	        5.688285e+01
        5.011263e+00	        5.667584e+01
        5.067391e+00	        5.646652e+01
        5.124149e+00	        5.625486e+01
        5.181542e+00	        5.604082e+01
        5.239577e+00	        5.583799e+01
        5.298263e+00	        5.563670e+01
        5.357606e+00	        5.543314e+01
        5.417614e+00	        5.522731e+01
        5.478294e+00	        5.501917e+01
        5.539654e+00	        5.480870e+01
        5.601701e+00	        5.459587e+01
        5.664442e+00	        5.438066e+01
        5.727887e+00	        5.416186e+01
        5.792042e+00	        5.394000e+01
        5.856916e+00	        5.371565e+01
        5.922516e+00	        5.348878e+01
        5.988851e+00	        5.325938e+01
        6.055929e+00	        5.302741e+01
        6.123759e+00	        5.279284e+01
        6.192348e+00	        5.255564e+01
        6.261705e+00	        5.230677e+01
        6.331839e+00	        5.203885e+01
        6.402759e+00	        5.176794e+01
        6.474473e+00	        5.149400e+01
        6.546991e+00	        5.121698e+01
        6.620320e+00	        5.093686e+01
        6.694471e+00	        5.065361e+01
        6.769452e+00	        5.034849e+01
        6.845274e+00	        5.005369e+01
        6.921944e+00	        4.976238e+01
        6.999473e+00	        4.946922e+01
        7.077871e+00	        4.917334e+01
        7.157146e+00	        4.887570e+01
        7.237310e+00	        4.857505e+01
        7.318371e+00	        4.827143e+01
        7.400341e+00	        4.796443e+01
        7.483228e+00	        4.766153e+01
        7.567044e+00	        4.736354e+01
        7.651799e+00	        4.706247e+01
        7.737503e+00	        4.675845e+01
        7.824166e+00	        4.645151e+01
        7.911801e+00	        4.614157e+01
        8.000417e+00	        4.582842e+01
        8.090026e+00	        4.551175e+01
        8.180638e+00	        4.519162e+01
        8.272265e+00	        4.487533e+01
        8.364918e+00	        4.455554e+01
        8.458610e+00	        4.423217e+01
        8.553350e+00	        4.390519e+01
        8.649152e+00	        4.357473e+01
        8.746027e+00	        4.324056e+01
        8.843987e+00	        4.290265e+01
        8.943044e+00	        4.256096e+01
        9.043210e+00	        4.221368e+01
        9.144499e+00	        4.186091e+01
        9.246921e+00	        4.150418e+01
        9.350492e+00	        4.114346e+01
        9.455222e+00	        4.077870e+01
        9.561125e+00	        4.040990e+01
        9.668214e+00	        4.003696e+01
        9.776503e+00	        3.965984e+01
        9.886005e+00	        3.930374e+01
        9.996733e+00	        3.897987e+01
        1.010870e+01	        3.865247e+01
        1.022192e+01	        3.832140e+01
        1.033641e+01	        3.798662e+01
        1.045219e+01	        3.764809e+01
        1.056926e+01	        3.730577e+01
        1.068764e+01	        3.695962e+01
        1.080734e+01	        3.660960e+01
        1.092839e+01	        3.624908e+01
        1.105080e+01	        3.586315e+01
        1.117457e+01	        3.547290e+01
        1.129973e+01	        3.507829e+01
        1.142629e+01	        3.467936e+01
        1.155427e+01	        3.427596e+01
        1.168369e+01	        3.386804e+01
        1.181455e+01	        3.345555e+01
        1.194688e+01	        3.306821e+01
        1.208069e+01	        3.275533e+01
        1.221600e+01	        3.243898e+01
        1.235282e+01	        3.211910e+01
        1.249118e+01	        3.179563e+01
        1.263109e+01	        3.146854e+01
        1.277256e+01	        3.113778e+01
        1.291562e+01	        3.080335e+01
        1.306028e+01	        3.046523e+01
        1.320657e+01	        3.012332e+01
        1.335449e+01	        2.975398e+01
        1.350406e+01	        2.936321e+01
        1.365531e+01	        2.896806e+01
        1.380826e+01	        2.856848e+01
        1.396292e+01	        2.816444e+01
        1.411931e+01	        2.775590e+01
        1.427746e+01	        2.734279e+01
        1.443737e+01	        2.692504e+01
        1.459908e+01	        2.656662e+01
        1.476259e+01	        2.622117e+01
        1.492794e+01	        2.587185e+01
        1.509514e+01	        2.551865e+01
        1.526421e+01	        2.516143e+01
        1.543518e+01	        2.480026e+01
        1.560806e+01	        2.443506e+01
        1.578288e+01	        2.406577e+01
        1.595966e+01	        2.369865e+01
        1.613841e+01	        2.336379e+01
        1.631917e+01	        2.302518e+01
        1.650195e+01	        2.268278e+01
        1.668678e+01	        2.233655e+01
        1.687368e+01	        2.198644e+01
        1.706268e+01	        2.163241e+01
        1.725379e+01	        2.127441e+01
        1.744704e+01	        2.091241e+01
        1.764245e+01	        2.059607e+01
        1.784006e+01	        2.029449e+01
        1.803988e+01	        1.998954e+01
        1.824193e+01	        1.968117e+01
        1.844625e+01	        1.936934e+01
        1.865286e+01	        1.905403e+01
        1.886178e+01	        1.873518e+01
        1.907304e+01	        1.841276e+01
        1.928667e+01	        1.808672e+01
        1.950269e+01	        1.780575e+01
        1.972113e+01	        1.752238e+01
        1.994201e+01	        1.723585e+01
        2.016537e+01	        1.694610e+01
        2.039124e+01	        1.665311e+01
        2.061963e+01	        1.635684e+01
        2.085058e+01	        1.605725e+01
        2.108411e+01	        1.575431e+01
        2.132027e+01	        1.547195e+01
        2.155906e+01	        1.522426e+01
        2.180054e+01	        1.497379e+01
        2.204471e+01	        1.472051e+01
        2.229162e+01	        1.446440e+01
        2.254130e+01	        1.420542e+01
        2.279378e+01	        1.394354e+01
        2.304908e+01	        1.367870e+01
        2.330724e+01	        1.341090e+01
        2.356829e+01	        1.314185e+01
        2.383227e+01	        1.287129e+01
        2.409920e+01	        1.259770e+01
        2.436912e+01	        1.232104e+01
        2.464207e+01	        1.204128e+01
        2.491807e+01	        1.175839e+01
        2.519717e+01	        1.147228e+01
        2.547939e+01	        1.120189e+01
        2.576477e+01	        1.101459e+01
        2.605335e+01	        1.082520e+01
        2.634516e+01	        1.063368e+01
        2.664024e+01	        1.044002e+01
        2.693862e+01	        1.024418e+01
        2.724035e+01	        1.004610e+01
        2.754545e+01	        9.845774e+00
        2.785397e+01	        9.643210e+00
        2.816595e+01	        9.438378e+00
        2.848142e+01	        9.254489e+00
        2.880043e+01	        9.069059e+00
        2.912301e+01	        8.881553e+00
        2.944920e+01	        8.691948e+00
        2.977905e+01	        8.500220e+00
        3.011259e+01	        8.306276e+00
        3.044986e+01	        8.110157e+00
        3.079092e+01	        7.911843e+00
        3.113579e+01	        7.758529e+00
        3.148453e+01	        7.609645e+00
        3.183717e+01	        7.459093e+00
        3.219376e+01	        7.306856e+00
        3.255435e+01	        7.152914e+00
        3.291897e+01	        6.997194e+00
        3.328768e+01	        6.839678e+00
        3.366052e+01	        6.680398e+00
        3.403753e+01	        6.531159e+00
        3.441877e+01	        6.411854e+00
        3.480428e+01	        6.291214e+00
        3.519410e+01	        6.169222e+00
        3.558829e+01	        6.045864e+00
        3.598690e+01	        5.921118e+00
        3.638997e+01	        5.794825e+00
        3.679756e+01	        5.667117e+00
        3.720971e+01	        5.537979e+00
        3.762647e+01	        5.411625e+00
        3.804791e+01	        5.297734e+00
        3.847406e+01	        5.182567e+00
        3.890499e+01	        5.066109e+00
        3.934075e+01	        4.948348e+00
        3.978138e+01	        4.829262e+00
        4.022696e+01	        4.708842e+00
        4.067752e+01	        4.587073e+00
        4.113313e+01	        4.473852e+00
        4.159384e+01	        4.385365e+00
        4.205971e+01	        4.295888e+00
        4.253080e+01	        4.205239e+00
        4.300716e+01	        4.113661e+00
        4.348887e+01	        4.021088e+00
        4.397596e+01	        3.927296e+00
        4.446851e+01	        3.832379e+00
        4.496658e+01	        3.736408e+00
        4.547023e+01	        3.658452e+00
        4.597952e+01	        3.585314e+00
        4.649451e+01	        3.511359e+00
        4.701528e+01	        3.436580e+00
        4.754187e+01	        3.360965e+00
        4.807436e+01	        3.284648e+00
        4.861282e+01	        3.207537e+00
        4.915731e+01	        3.129564e+00
        4.970789e+01	        3.053892e+00
        5.026464e+01	        2.993435e+00
        5.082763e+01	        2.932301e+00
        5.139693e+01	        2.870483e+00
        5.197260e+01	        2.807974e+00
        5.255472e+01	        2.744766e+00
        5.314336e+01	        2.680835e+00
        5.373859e+01	        2.615854e+00
        5.434049e+01	        2.550146e+00
        5.494913e+01	        2.492039e+00
        5.556458e+01	        2.437534e+00
        5.618694e+01	        2.382419e+00
        5.681626e+01	        2.326689e+00
        5.745263e+01	        2.270334e+00
        5.809612e+01	        2.213393e+00
        5.874683e+01	        2.155939e+00
        5.940482e+01	        2.097842e+00
        6.007019e+01	        2.051353e+00
        6.074300e+01	        2.007527e+00
        6.142335e+01	        1.963035e+00
        6.211133e+01	        1.918203e+00
        6.280700e+01	        1.872960e+00
        6.351047e+01	        1.827227e+00
        6.422182e+01	        1.781041e+00
        6.494114e+01	        1.734379e+00
        6.566851e+01	        1.693108e+00
        6.640403e+01	        1.654340e+00
        6.714779e+01	        1.615144e+00
        6.789988e+01	        1.575523e+00
        6.866039e+01	        1.535465e+00
        6.942942e+01	        1.494968e+00
        7.020706e+01	        1.454116e+00
        7.099342e+01	        1.414920e+00
        7.178858e+01	        1.388190e+00
        7.259264e+01	        1.361163e+00
        7.340572e+01	        1.333834e+00
        7.422790e+01	        1.306200e+00
        7.505929e+01	        1.278261e+00
        7.589999e+01	        1.250010e+00
        7.675011e+01	        1.221442e+00
        7.760974e+01	        1.192706e+00
        7.847901e+01	        1.164067e+00
        7.935802e+01	        1.136881e+00
        8.024686e+01	        1.109391e+00
        8.114567e+01	        1.081596e+00
        8.205454e+01	        1.053493e+00
        8.297359e+01	        1.024970e+00
        8.390294e+01	        9.961438e-01
        8.484269e+01	        9.672155e-01
        8.579297e+01	        9.466776e-01
        8.675389e+01	        9.263569e-01
        8.772558e+01	        9.058191e-01
        8.870815e+01	        8.850571e-01
        8.970173e+01	        8.640664e-01
        9.070643e+01	        8.428470e-01
        9.172239e+01	        8.213923e-01
        9.274972e+01	        7.996820e-01
        9.378856e+01	        7.815274e-01
        9.483904e+01	        7.637589e-01
        9.590129e+01	        7.457950e-01
        9.697543e+01	        7.276326e-01
        9.806160e+01	        7.092698e-01
        9.915994e+01	        6.907017e-01
        1.002706e+02	        6.720956e-01
        1.013937e+02	        6.543052e-01
        1.025293e+02	        6.398652e-01
        1.036777e+02	        6.252644e-01
        1.048389e+02	        6.105001e-01
        1.060132e+02	        5.955716e-01
        1.072006e+02	        5.804762e-01
        1.084013e+02	        5.648275e-01
        1.096154e+02	        5.490824e-01
        1.108432e+02	        5.352168e-01
        1.120847e+02	        5.230823e-01
        1.133401e+02	        5.108292e-01
        1.146095e+02	        4.984746e-01
        1.158932e+02	        4.860009e-01
        1.171913e+02	        4.733999e-01
        1.185039e+02	        4.606584e-01
        1.198312e+02	        4.477833e-01
        1.211734e+02	        4.370673e-01
        1.225306e+02	        4.267806e-01
        1.239030e+02	        4.163897e-01
        1.252907e+02	        4.058981e-01
        1.266941e+02	        3.953011e-01
        1.281131e+02	        3.845963e-01
        1.295480e+02	        3.737726e-01
        1.309990e+02	        3.635901e-01
        1.324663e+02	        3.539825e-01
        1.339500e+02	        3.445753e-01
        1.354503e+02	        3.350629e-01
        1.369674e+02	        3.254380e-01
        1.385015e+02	        3.157066e-01
        1.400528e+02	        3.059602e-01
        1.416214e+02	        2.988729e-01
        1.432077e+02	        2.917068e-01
        1.448117e+02	        2.844653e-01
        1.464336e+02	        2.771451e-01
        1.480737e+02	        2.698648e-01
        1.497322e+02	        2.625048e-01
        1.514093e+02	        2.550627e-01
        1.531052e+02	        2.484806e-01
        1.548200e+02	        2.420181e-01
        1.565541e+02	        2.354835e-01
        1.583076e+02	        2.288761e-01
        1.600807e+02	        2.222056e-01
        1.618737e+02	        2.157195e-01
        1.636867e+02	        2.095163e-01
        1.655201e+02	        2.042315e-01
        1.673740e+02	        1.988875e-01
        1.692487e+02	        1.934278e-01
        1.711444e+02	        1.879078e-01
        1.730613e+02	        1.823441e-01
        1.749996e+02	        1.767289e-01
        1.769597e+02	        1.722711e-01
        1.789418e+02	        1.681129e-01
        1.809460e+02	        1.639117e-01
        1.829727e+02	        1.596680e-01
        1.850221e+02	        1.553772e-01
        1.870944e+02	        1.510400e-01
        1.891900e+02	        1.466611e-01
        1.913090e+02	        1.426559e-01
        1.934517e+02	        1.386077e-01
        1.956185e+02	        1.346311e-01
        1.978095e+02	        1.306423e-01
        2.000251e+02	        1.266106e-01
        2.022655e+02	        1.226570e-01
        2.045309e+02	        1.194684e-01
        2.068218e+02	        1.162402e-01
        2.091383e+02	        1.129835e-01
        2.114807e+02	        1.096933e-01
        2.138494e+02	        1.063837e-01
        2.162446e+02	        1.031185e-01
        2.186667e+02	        1.004743e-01
        2.211159e+02	        9.780077e-02
        2.235925e+02	        9.509748e-02
        2.260968e+02	        9.236550e-02
        2.286292e+02	        8.960365e-02
        2.311900e+02	        8.681115e-02
        2.337794e+02	        8.443936e-02
        2.363979e+02	        8.220940e-02
        2.390456e+02	        7.995491e-02
        2.417231e+02	        7.767601e-02
        2.444305e+02	        7.527590e-02
        2.471682e+02	        7.288553e-02
        2.499366e+02	        7.077958e-02
        2.527360e+02	        6.871331e-02
        2.555668e+02	        6.662793e-02
        2.584293e+02	        6.458278e-02
        2.613238e+02	        6.252837e-02
        2.642508e+02	        6.053051e-02
        2.672105e+02	        5.887943e-02
        2.702034e+02	        5.721250e-02
        2.732298e+02	        5.552902e-02
        2.762901e+02	        5.382847e-02
        2.793847e+02	        5.212410e-02
        2.825139e+02	        5.056436e-02
        2.856782e+02	        4.917314e-02
        2.888780e+02	        4.776340e-02
        2.921136e+02	        4.634341e-02
        2.953854e+02	        4.491051e-02
        2.986938e+02	        4.346295e-02
        3.020393e+02	        4.217369e-02
        3.054223e+02	        4.099962e-02
        3.088432e+02	        3.981292e-02
        3.123024e+02	        3.862993e-02
        3.158004e+02	        3.743395e-02
        3.193375e+02	        3.622507e-02
        3.229142e+02	        3.503768e-02
        3.265310e+02	        3.385389e-02
        3.301883e+02	        3.265747e-02
        3.338866e+02	        3.140951e-02
        3.376263e+02	        3.016864e-02
        3.414079e+02	        2.921990e-02
        3.452318e+02	        2.834085e-02
        3.490986e+02	        2.745457e-02
        3.530086e+02	        2.656331e-02
        3.569625e+02	        2.566707e-02
        3.609607e+02	        2.477054e-02
        3.650036e+02	        2.397744e-02
        3.690918e+02	        2.318974e-02
        3.732258e+02	        2.241628e-02
        3.774062e+02	        2.163538e-02
        3.816333e+02	        2.084758e-02
        3.859078e+02	        2.010862e-02
        3.902301e+02	        1.940469e-02
        3.946009e+02	        1.869561e-02
        3.990206e+02	        1.797907e-02
        4.034898e+02	        1.726951e-02
        4.080091e+02	        1.661844e-02
        4.125790e+02	        1.601831e-02
        4.172001e+02	        1.541154e-02
        4.218730e+02	        1.479800e-02
        4.265982e+02	        1.417844e-02
        4.313763e+02	        1.357474e-02
        4.362079e+02	        1.298781e-02
        4.410936e+02	        1.241087e-02
        4.460341e+02	        1.184123e-02
        4.510299e+02	        1.126837e-02
        4.560817e+02	        1.071335e-02
        4.611900e+02	        1.015697e-02
        4.663556e+02	        9.595375e-03
        4.715790e+02	        9.028289e-03
        4.768609e+02	        8.489955e-03
        4.822020e+02	        7.965102e-03
        4.876029e+02	        7.437732e-03
        4.930643e+02	        6.894256e-03
        4.985868e+02	        6.333845e-03
        5.041712e+02	        5.768498e-03
        5.098182e+02	        5.179211e-03
        5.155284e+02	        4.572877e-03
        5.213026e+02	        4.191571e-03
        5.271414e+02	        4.112953e-03
        5.330457e+02	        4.033667e-03
        5.390161e+02	        3.953597e-03
        5.450533e+02	        3.872779e-03
        5.511582e+02	        3.789534e-03
        5.573314e+02	        3.700616e-03
        5.635738e+02	        3.629870e-03
        5.698861e+02	        3.566283e-03
        5.762691e+02	        3.502658e-03
        5.827236e+02	        3.439096e-03
        5.892504e+02	        3.375787e-03
        5.958503e+02	        3.312018e-03
        6.025241e+02	        3.247936e-03
        6.092727e+02	        3.186864e-03
        6.160968e+02	        3.127192e-03
        6.229974e+02	        3.067136e-03
        6.299753e+02	        3.007816e-03
        6.370313e+02	        2.949823e-03
        6.441664e+02	        2.891970e-03
        6.513814e+02	        2.834067e-03
        6.586772e+02	        2.783760e-03
        6.660547e+02	        2.735603e-03
        6.735148e+02	        2.686948e-03
        6.810585e+02	        2.633558e-03
        6.886867e+02	        2.575140e-03
        6.964003e+02	        2.520244e-03
        7.042004e+02	        2.469312e-03
        7.120878e+02	        2.426440e-03
        7.200635e+02	        2.383897e-03
        7.281286e+02	        2.341632e-03
        7.362840e+02	        2.299299e-03
        7.445307e+02	        2.256750e-03
        7.528698e+02	        2.212411e-03
        7.613023e+02	        2.169858e-03
        7.698293e+02	        2.130288e-03
        7.784518e+02	        2.090936e-03
        7.871708e+02	        2.051768e-03
        7.959875e+02	        2.012590e-03
        8.049030e+02	        1.973286e-03
        8.139183e+02	        1.938530e-03
        8.230346e+02	        1.906063e-03
        8.322529e+02	        1.867735e-03
        8.415746e+02	        1.830186e-03
        8.510006e+02	        1.793659e-03
        8.605323e+02	        1.757994e-03
        8.701706e+02	        1.725677e-03
        8.799170e+02	        1.695238e-03
        8.897725e+02	        1.664751e-03
        8.997384e+02	        1.634139e-03
        9.098159e+02	        1.600426e-03
        9.200063e+02	        1.568115e-03
        9.303108e+02	        1.539844e-03
        9.407307e+02	        1.512691e-03
        9.512674e+02	        1.485610e-03
        9.619221e+02	        1.458683e-03
        9.726961e+02	        1.431712e-03
        9.835907e+02	        1.405553e-03
        9.946074e+02	        1.373427e-03
        1.005748e+03	        1.344618e-03
        1.017012e+03	        1.317453e-03
        1.028403e+03	        1.290972e-03
        1.039922e+03	        1.265417e-03
        1.051570e+03	        1.242950e-03
        1.063348e+03	        1.220512e-03
        1.075258e+03	        1.193797e-03
        1.087301e+03	        1.167955e-03
        1.099480e+03	        1.142988e-03
        1.111794e+03	        1.120718e-03
        1.124247e+03	        1.099041e-03
        1.136839e+03	        1.077724e-03
        1.149572e+03	        1.056598e-03
        1.162448e+03	        9.936666e-04
        1.175468e+03	        9.387435e-04
        1.188634e+03	        8.936744e-04
        1.201947e+03	        8.557318e-04
        1.215409e+03	        8.193467e-04
        1.229023e+03	        7.874998e-04
        1.242788e+03	        7.574381e-04
        1.256708e+03	        7.282691e-04
        1.270784e+03	        6.996784e-04
        1.285017e+03	        6.738359e-04
        1.299410e+03	        6.492346e-04
        1.313964e+03	        6.253468e-04
        1.328681e+03	        6.023843e-04
        1.343563e+03	        5.806566e-04
        1.358612e+03	        5.590366e-04
        1.373829e+03	        5.397625e-04
        1.389216e+03	        5.211230e-04
        1.404776e+03	        5.028007e-04
        1.420510e+03	        4.848773e-04
        1.436421e+03	        4.672903e-04
        1.452509e+03	        4.494935e-04
        1.468778e+03	        4.320462e-04
        1.485229e+03	        4.149649e-04
        1.501865e+03	        3.979286e-04
        1.518686e+03	        3.804888e-04
        1.535696e+03	        3.617898e-04
        1.552897e+03	        3.395901e-04
        1.570290e+03	        2.998531e-04
        1.587878e+03	        2.930747e-04
        1.605663e+03	        2.865528e-04
        1.623647e+03	        2.805620e-04
        1.641833e+03	        2.746789e-04
        1.660222e+03	        2.688941e-04
        1.678818e+03	        2.630725e-04
        1.697621e+03	        2.572013e-04
        1.716635e+03	        2.517844e-04
        1.735863e+03	        2.466587e-04
        1.755305e+03	        2.417550e-04
        1.774965e+03	        2.368895e-04
        1.794846e+03	        2.321424e-04
        1.814949e+03	        2.274293e-04
        1.835277e+03	        2.226834e-04
        1.855833e+03	        2.179111e-04
        1.876620e+03	        2.131046e-04
        1.897639e+03	        2.082970e-04
        1.918893e+03	        2.036557e-04
        1.940386e+03	        1.991909e-04
        1.962119e+03	        1.950975e-04
        1.984096e+03	        1.910514e-04
        2.006319e+03	        1.869832e-04
        2.028790e+03	        1.828963e-04
        2.051514e+03	        1.788032e-04
        2.074492e+03	        1.749267e-04
        2.097727e+03	        1.712226e-04
        2.121223e+03	        1.675696e-04
        2.144981e+03	        1.641130e-04
        2.169006e+03	        1.606856e-04
        2.193300e+03	        1.572414e-04
        2.217866e+03	        1.539785e-04
        2.242707e+03	        1.507774e-04
        2.267827e+03	        1.475673e-04
        2.293228e+03	        1.444291e-04
        2.318913e+03	        1.413278e-04
        2.344886e+03	        1.383081e-04
        2.371150e+03	        1.353168e-04
        2.397708e+03	        1.324185e-04
        2.424563e+03	        1.295857e-04
        2.451720e+03	        1.267270e-04
        2.479180e+03	        1.238431e-04
        2.506948e+03	        1.210950e-04
        2.535027e+03	        1.184397e-04
        2.563421e+03	        1.159963e-04
        2.592132e+03	        1.136471e-04
        2.621165e+03	        1.112889e-04
        2.650524e+03	        1.089061e-04
        2.680211e+03	        1.064984e-04
        2.710231e+03	        1.040678e-04
        2.740587e+03	        1.017764e-04
        2.771282e+03	        9.964472e-05
        2.802322e+03	        9.759691e-05
        2.833710e+03	        9.552572e-05
        2.865449e+03	        9.343154e-05
        2.897543e+03	        9.131493e-05
        2.929997e+03	        8.918173e-05
        2.962814e+03	        8.705302e-05
        2.995999e+03	        8.511197e-05
        3.029556e+03	        8.342110e-05
        3.063488e+03	        8.171179e-05
        3.097801e+03	        7.998349e-05
        3.132498e+03	        7.823662e-05
        3.167583e+03	        7.650938e-05
        3.203062e+03	        7.480704e-05
        3.238938e+03	        7.308970e-05
        3.275216e+03	        7.145846e-05
        3.311900e+03	        6.990623e-05
        3.348994e+03	        6.834188e-05
        3.386505e+03	        6.678762e-05
        3.424435e+03	        6.522366e-05
        3.462791e+03	        6.364728e-05
        3.501576e+03	        6.208846e-05
        3.540795e+03	        6.065457e-05
        3.580454e+03	        5.931936e-05
        3.620557e+03	        5.803239e-05
        3.661109e+03	        5.676332e-05
        3.702115e+03	        5.548010e-05
        3.743580e+03	        5.418557e-05
        3.785510e+03	        5.291599e-05
        3.827910e+03	        5.164994e-05
        3.870784e+03	        5.043105e-05
        3.914139e+03	        4.925867e-05
        3.957979e+03	        4.813618e-05
        4.002311e+03	        4.701042e-05
        4.047138e+03	        4.592984e-05
        4.092468e+03	        4.485021e-05
        4.138306e+03	        4.378170e-05
        4.184657e+03	        4.271672e-05
        4.231527e+03	        4.169205e-05
        4.278923e+03	        4.070000e-05
        4.326849e+03	        3.971513e-05
        4.375311e+03	        3.873975e-05
        4.424317e+03	        3.775874e-05
        4.473872e+03	        3.677291e-05
        4.523981e+03	        3.577662e-05
        4.574652e+03	        3.484161e-05
        4.625890e+03	        3.396702e-05
        4.677703e+03	        3.312934e-05
        4.730095e+03	        3.230266e-05
        4.783075e+03	        3.146677e-05
        4.836647e+03	        3.061567e-05
        4.890820e+03	        2.977218e-05
        4.945600e+03	        2.893137e-05
        5.000993e+03	        2.811157e-05
        5.057007e+03	        2.727442e-05
        5.113648e+03	        2.632290e-05
        5.170923e+03	        2.545434e-05
        5.228840e+03	        2.481715e-05
        5.287405e+03	        2.418785e-05
        5.346627e+03	        2.355289e-05
        5.406512e+03	        2.292425e-05
        5.467067e+03	        2.235573e-05
        5.528301e+03	        2.179609e-05
        5.590221e+03	        2.124325e-05
        5.652834e+03	        2.069102e-05
        5.716149e+03	        2.013550e-05
        5.780172e+03	        1.957840e-05
        5.844913e+03	        1.901777e-05
        5.910379e+03	        1.847593e-05
        5.976578e+03	        1.795734e-05
        6.043519e+03	        1.744935e-05
        6.111209e+03	        1.692211e-05
        6.179658e+03	        1.637067e-05
        6.248873e+03	        1.569937e-05
        6.318863e+03	        1.526359e-05
        6.389638e+03	        1.483882e-05
        6.461205e+03	        1.444491e-05
        6.533574e+03	        1.405731e-05
        6.606753e+03	        1.366582e-05
        6.680752e+03	        1.327770e-05
        6.755579e+03	        1.289059e-05
        6.831245e+03	        1.250396e-05
        6.907759e+03	        1.211152e-05
        6.985129e+03	        1.172511e-05
        7.063366e+03	        1.134093e-05
        7.142479e+03	        1.093982e-05
        7.222478e+03	        1.052054e-05
        7.303374e+03	        1.001986e-05
        7.385175e+03	        9.444435e-06
        7.467893e+03	        9.187124e-06
        7.551537e+03	        8.950672e-06
        7.636118e+03	        8.735802e-06
        7.721646e+03	        8.525391e-06
        7.808132e+03	        8.316965e-06
        7.895587e+03	        8.106643e-06
        7.984022e+03	        7.894019e-06
        8.073446e+03	        7.688935e-06
        8.163873e+03	        7.490333e-06
        8.255312e+03	        7.291512e-06
        8.347776e+03	        7.094772e-06
        8.441275e+03	        6.896639e-06
        8.535822e+03	        6.696560e-06
        8.631427e+03	        6.498698e-06
        8.728103e+03	        6.301358e-06
        8.825862e+03	        6.103216e-06
        8.924716e+03	        5.918386e-06
        9.024678e+03	        5.746895e-06
        9.125758e+03	        5.579258e-06
        9.227971e+03	        5.411357e-06
        9.331329e+03	        5.238677e-06
        9.435845e+03	        5.060022e-06
        9.541531e+03	        4.874729e-06
        9.648401e+03	        4.635086e-06
        9.756468e+03	        4.509656e-06
        9.865745e+03	        4.385950e-06
        9.976246e+03	        4.261833e-06
        1.008798e+04	        4.136462e-06
        1.020098e+04	        4.012899e-06
        1.031523e+04	        3.892145e-06
        1.043077e+04	        3.773418e-06
        1.054760e+04	        3.665479e-06
        1.066573e+04	        3.558091e-06
        1.078520e+04	        3.449259e-06
        1.090600e+04	        3.339678e-06
        1.102815e+04	        3.232049e-06
        1.115167e+04	        3.123708e-06
        1.127657e+04	        3.016991e-06
        1.140288e+04	        2.917533e-06
        1.153059e+04	        2.816583e-06
        1.165974e+04	        2.713158e-06
        1.179034e+04	        2.605456e-06
        1.192240e+04	        2.485280e-06
        1.205593e+04	        2.333506e-06
        1.219096e+04	        2.260512e-06
        1.232751e+04	        2.196843e-06
        1.246558e+04	        2.133438e-06
        1.260520e+04	        2.069306e-06
        1.274639e+04	        2.004392e-06
        1.288915e+04	        1.938557e-06
        1.303352e+04	        1.872424e-06
        1.317950e+04	        1.803965e-06
        1.332712e+04	        1.738541e-06
        1.347639e+04	        1.676391e-06
        1.362733e+04	        1.612358e-06
        1.377996e+04	        1.544798e-06
        1.393431e+04	        1.473749e-06
        1.409038e+04	        1.394598e-06
        1.424820e+04	        1.322208e-06
        1.440778e+04	        1.288631e-06
        1.456916e+04	        1.254833e-06
        1.473234e+04	        1.220695e-06
        1.489735e+04	        1.186363e-06
        1.506421e+04	        1.151776e-06
        1.523293e+04	        1.118727e-06
        1.540355e+04	        1.086570e-06
        1.557608e+04	        1.054372e-06
        1.575054e+04	        1.021797e-06
        1.592695e+04	        9.887660e-07
        1.610534e+04	        9.557368e-07
        1.628573e+04	        9.264026e-07
        1.646814e+04	        8.969119e-07
        1.665259e+04	        8.643462e-07
        1.683910e+04	        8.387461e-07
        1.702771e+04	        8.129619e-07
        1.721843e+04	        7.874745e-07
        1.741128e+04	        7.654833e-07
        1.760630e+04	        7.433516e-07
        1.780350e+04	        7.209523e-07
        1.800291e+04	        6.984304e-07
        1.820455e+04	        6.758731e-07
        1.840845e+04	        6.543647e-07
        1.861463e+04	        6.334308e-07
        1.882312e+04	        6.121834e-07
        1.903395e+04	        5.903546e-07
        1.924714e+04	        5.689003e-07
        1.946272e+04	        5.498487e-07
        1.968071e+04	        5.318238e-07
        1.990114e+04	        5.135734e-07
        2.012405e+04	        4.951552e-07
        2.034945e+04	        4.763082e-07
        2.057737e+04	        4.594657e-07
        2.080785e+04	        4.427324e-07
        2.104091e+04	        4.257531e-07
        2.127657e+04	        4.082766e-07
        2.151488e+04	        3.905331e-07
        2.175586e+04	        3.741967e-07
        2.199954e+04	        3.595137e-07
        2.224594e+04	        3.446871e-07
        2.249511e+04	        3.300020e-07
        2.274706e+04	        3.159193e-07
        2.300184e+04	        3.015792e-07
        2.325947e+04	        2.872074e-07
        2.351999e+04	        2.728908e-07
        2.378343e+04	        2.600431e-07
        2.404981e+04	        2.470691e-07
        2.431918e+04	        2.339747e-07
        2.459157e+04	        2.208548e-07
        2.486701e+04	        2.075586e-07
        2.514553e+04	        1.946401e-07
        2.542717e+04	        1.822784e-07
        2.571197e+04	        1.694963e-07
        2.599996e+04	        1.555221e-07
        2.629117e+04	        1.435892e-07
        2.658564e+04	        1.312062e-07
        2.688341e+04	        1.182247e-07
        2.718452e+04	        1.039486e-07
        2.748900e+04	        8.923495e-08
        2.779689e+04	        7.374165e-08
        2.810823e+04	        5.431024e-08
        2.842306e+04	        1.943581e-08
        2.874141e+04	        6.214906e-09
        2.906333e+04	        5.653972e-09
        2.938885e+04	        5.038100e-09
        2.971802e+04	        4.332960e-09
        3.005088e+04	        3.698170e-09
        3.038746e+04	        2.986171e-09
        3.072782e+04	        2.016149e-09
        3.107198e+04	        3.924924e-10
        3.142000e+04	        3.653980e-10
        3.177192e+04	        3.360401e-10
        3.212779e+04	        3.005496e-10
        3.248763e+04	        2.668321e-10
        3.285151e+04	        2.445265e-10
        3.321946e+04	        2.183663e-10
        3.359154e+04	        1.763564e-10
        3.396778e+04	        1.672682e-10
        3.434823e+04	        1.596680e-10
        3.473295e+04	        1.517768e-10
        3.512198e+04	        1.407198e-10
        3.551536e+04	        1.353823e-10
        3.591315e+04	        1.300035e-10
        3.631540e+04	        1.245104e-10
        3.672215e+04	        1.191584e-10
        3.713345e+04	        1.136895e-10
        3.754937e+04	        1.074759e-10
        3.796994e+04	        1.021383e-10
        3.839522e+04	        9.774640e-11
        3.882526e+04	        9.266087e-11
        3.926013e+04	        8.839259e-11
        3.969986e+04	        8.472932e-11
        4.014452e+04	        8.042639e-11
        4.059416e+04	        7.730485e-11
        4.104883e+04	        7.416060e-11
        4.150860e+04	        7.077007e-11
        4.197351e+04	        6.792983e-11
        4.244364e+04	        6.472189e-11
        4.291903e+04	        6.143895e-11
        4.339974e+04	        5.921367e-11
        4.388584e+04	        5.693120e-11
        4.437738e+04	        5.480758e-11
        4.487443e+04	        5.266686e-11
        4.537705e+04	        5.036344e-11
        4.588529e+04	        4.864566e-11
        4.639923e+04	        4.690667e-11
        4.691893e+04	        4.525019e-11
        4.744444e+04	        4.361211e-11
        4.797584e+04	        4.194363e-11
        4.851319e+04	        4.046684e-11
        4.905657e+04	        3.898745e-11
        4.960602e+04	        3.752282e-11
        5.016164e+04	        3.599475e-11
        5.072347e+04	        3.458566e-11
        5.129160e+04	        3.316014e-11
        5.186609e+04	        3.192466e-11
        5.244702e+04	        3.066685e-11
        5.303445e+04	        2.943725e-11
        5.362846e+04	        2.817530e-11
        5.422913e+04	        2.697797e-11
        5.483652e+04	        2.582155e-11
        5.545071e+04	        2.468029e-11
        5.607179e+04	        2.348149e-11
        5.669982e+04	        2.237702e-11
        5.733489e+04	        2.136124e-11
        5.797707e+04	        2.034046e-11
        5.862644e+04	        1.921817e-11
        5.928308e+04	        1.829912e-11
        5.994708e+04	        1.743356e-11
        6.061852e+04	        1.660684e-11
        6.129748e+04	        1.570887e-11
        6.198404e+04	        1.495796e-11
        6.267829e+04	        1.416529e-11
        6.338032e+04	        1.329583e-11
        6.409021e+04	        1.248477e-11
        6.480805e+04	        1.189517e-11
        6.553393e+04	        1.132751e-11
        6.626795e+04	        1.071876e-11
        6.701018e+04	        1.022126e-11
        6.776073e+04	        9.710771e-12
        6.851968e+04	        9.165721e-12
        6.928713e+04	        8.707599e-12
        7.006318e+04	        8.253035e-12
        7.084793e+04	        7.781630e-12
        7.164146e+04	        7.325252e-12
        7.244388e+04	        6.909909e-12
        7.325529e+04	        6.492609e-12
        7.407578e+04	        6.076877e-12
        7.490547e+04	        5.694424e-12
        7.574444e+04	        5.307350e-12
        7.659282e+04	        4.924111e-12
        7.745070e+04	        4.570641e-12
        7.831818e+04	        4.226498e-12
        7.919539e+04	        3.900728e-12
        8.008241e+04	        3.582946e-12
        8.097938e+04	        3.226103e-12
        8.188638e+04	        2.911594e-12
        8.280355e+04	        2.582589e-12
        8.373099e+04	        2.236616e-12
        8.466882e+04	        1.952300e-12
        8.561715e+04	        1.613634e-12
        8.657611e+04	        1.359580e-12
        8.754580e+04	        1.083770e-12
        8.852636e+04	        8.395797e-13
        8.951790e+04	        6.844977e-13
        9.052054e+04	        5.236696e-13
        9.153442e+04	        3.696175e-13
        9.255965e+04	        1.832261e-13
        9.359636e+04	        6.429244e-14
        9.464469e+04	        5.194043e-14
        9.570475e+04	        4.751521e-14
        9.677669e+04	        4.305730e-14
        9.786064e+04	        3.833420e-14
        9.895673e+04	        3.345867e-14
        1.000651e+05	        2.790874e-14
        1.011859e+05	        2.106906e-14
        1.023192e+05	        1.066477e-14
        1.034652e+05	        5.992724e-15
        1.046241e+05	        1.780450e-15
        1.057959e+05	        0.000000e+00
        1.069809e+05	        0.000000e+00
        1.081791e+05	        0.000000e+00
        1.093908e+05	        0.000000e+00

