# -------------------------------------------------------------------------------
#		C:/Users/ASAT 02/Documents/OMERE 5.4/CDR CLOSE-OUT/SSO 600/1 year/LET/Vessel/Integral LET spectrum.txt
# -------------------------------------------------------------------------------
# ID: 1 2 1

# Graph: Integral LET spectrum 
# min: 0.000160896 1e-06 max: 1.09391e+09 1.39256e+08
# X-axis L: LET (MeV.cm^2.g^{-1})
# Y-axis L: Flux (cm^{-2}.s^{-1})
# -------------------------------------------------------------------------------
# Curve 0: LET spectrum without Flares 
# Params: 0 5 #7def21 2 1
#	LET (MeV.cm^2.g^{-1})		Flux (cm^{-2}.s^{-1})
# -------------------------------------------------------------------------------
        1.608960e+00	        8.849398e+01
        1.626982e+00	        8.849398e+01
        1.645205e+00	        8.849398e+01
        1.663632e+00	        8.849398e+01
        1.682265e+00	        8.838106e+01
        1.701107e+00	        8.823988e+01
        1.720161e+00	        8.814885e+01
        1.739427e+00	        8.808581e+01
        1.758910e+00	        8.803021e+01
        1.778610e+00	        8.798520e+01
        1.798532e+00	        8.794698e+01
        1.818676e+00	        8.791313e+01
        1.839046e+00	        8.788208e+01
        1.859644e+00	        8.785261e+01
        1.880473e+00	        8.782624e+01
        1.901536e+00	        8.780158e+01
        1.922834e+00	        8.777978e+01
        1.944370e+00	        8.776325e+01
        1.966148e+00	        8.775135e+01
        1.988170e+00	        8.774351e+01
        2.010439e+00	        8.773628e+01
        2.032956e+00	        8.772897e+01
        2.055727e+00	        8.772214e+01
        2.078752e+00	        8.771632e+01
        2.102035e+00	        8.771044e+01
        2.125579e+00	        8.770449e+01
        2.149386e+00	        8.769931e+01
        2.173460e+00	        8.769462e+01
        2.197804e+00	        8.768986e+01
        2.222421e+00	        8.768506e+01
        2.247313e+00	        8.768100e+01
        2.272484e+00	        8.767761e+01
        2.297937e+00	        8.767418e+01
        2.323675e+00	        8.767071e+01
        2.349701e+00	        8.766720e+01
        2.376019e+00	        8.766390e+01
        2.402632e+00	        8.766070e+01
        2.429542e+00	        8.765746e+01
        2.456754e+00	        8.765418e+01
        2.484271e+00	        8.765107e+01
        2.512096e+00	        8.764911e+01
        2.540233e+00	        8.764713e+01
        2.568685e+00	        8.764512e+01
        2.597455e+00	        8.764309e+01
        2.626548e+00	        8.764104e+01
        2.655967e+00	        8.763897e+01
        2.685715e+00	        8.763699e+01
        2.715796e+00	        8.763500e+01
        2.746214e+00	        8.763299e+01
        2.776973e+00	        8.763095e+01
        2.808077e+00	        8.762889e+01
        2.839529e+00	        8.762726e+01
        2.871333e+00	        8.762577e+01
        2.903493e+00	        8.762426e+01
        2.936014e+00	        8.762274e+01
        2.968899e+00	        8.762120e+01
        3.002152e+00	        8.761964e+01
        3.035777e+00	        8.752291e+01
        3.069779e+00	        8.741011e+01
        3.104162e+00	        8.729604e+01
        3.138931e+00	        8.718070e+01
        3.174088e+00	        8.706407e+01
        3.209640e+00	        8.694612e+01
        3.245589e+00	        8.676122e+01
        3.281941e+00	        8.656061e+01
        3.318701e+00	        8.635776e+01
        3.355872e+00	        8.615263e+01
        3.393459e+00	        8.594521e+01
        3.431468e+00	        8.573546e+01
        3.469902e+00	        8.552336e+01
        3.508766e+00	        8.528014e+01
        3.548066e+00	        8.502545e+01
        3.587806e+00	        8.476790e+01
        3.627992e+00	        8.450748e+01
        3.668627e+00	        8.424413e+01
        3.709717e+00	        8.397784e+01
        3.751268e+00	        8.370894e+01
        3.793284e+00	        8.345155e+01
        3.835771e+00	        8.319128e+01
        3.878733e+00	        8.292809e+01
        3.922177e+00	        8.266195e+01
        3.966107e+00	        8.239284e+01
        4.010530e+00	        8.212070e+01
        4.055449e+00	        8.184552e+01
        4.100872e+00	        8.154259e+01
        4.146804e+00	        8.117754e+01
        4.193250e+00	        8.080841e+01
        4.240217e+00	        8.043514e+01
        4.287709e+00	        8.005769e+01
        4.335734e+00	        7.967602e+01
        4.384296e+00	        7.929006e+01
        4.433403e+00	        7.897251e+01
        4.483059e+00	        7.865360e+01
        4.533271e+00	        7.833111e+01
        4.584046e+00	        7.800502e+01
        4.635390e+00	        7.767527e+01
        4.687308e+00	        7.734183e+01
        4.739809e+00	        7.700465e+01
        4.792897e+00	        7.666370e+01
        4.846580e+00	        7.627306e+01
        4.900864e+00	        7.587106e+01
        4.955756e+00	        7.546455e+01
        5.011263e+00	        7.505349e+01
        5.067391e+00	        7.463782e+01
        5.124149e+00	        7.421750e+01
        5.181542e+00	        7.379248e+01
        5.239577e+00	        7.340629e+01
        5.298263e+00	        7.302796e+01
        5.357606e+00	        7.264538e+01
        5.417614e+00	        7.225852e+01
        5.478294e+00	        7.186732e+01
        5.539654e+00	        7.147175e+01
        5.601701e+00	        7.107174e+01
        5.664442e+00	        7.066726e+01
        5.727887e+00	        7.027051e+01
        5.792042e+00	        6.987569e+01
        5.856916e+00	        6.947645e+01
        5.922516e+00	        6.907274e+01
        5.988851e+00	        6.866451e+01
        6.055929e+00	        6.825170e+01
        6.123759e+00	        6.783427e+01
        6.192348e+00	        6.741217e+01
        6.261705e+00	        6.697853e+01
        6.331839e+00	        6.652778e+01
        6.402759e+00	        6.607197e+01
        6.474473e+00	        6.561106e+01
        6.546991e+00	        6.514499e+01
        6.620320e+00	        6.467370e+01
        6.694471e+00	        6.419712e+01
        6.769452e+00	        6.369556e+01
        6.845274e+00	        6.322161e+01
        6.921944e+00	        6.276157e+01
        6.999473e+00	        6.229787e+01
        7.077871e+00	        6.182963e+01
        7.157146e+00	        6.135780e+01
        7.237310e+00	        6.088104e+01
        7.318371e+00	        6.039939e+01
        7.400341e+00	        5.991239e+01
        7.483228e+00	        5.944253e+01
        7.567044e+00	        5.899274e+01
        7.651799e+00	        5.853817e+01
        7.737503e+00	        5.807896e+01
        7.824166e+00	        5.761508e+01
        7.911801e+00	        5.714645e+01
        8.000417e+00	        5.667283e+01
        8.090026e+00	        5.619391e+01
        8.180638e+00	        5.570996e+01
        8.272265e+00	        5.525318e+01
        8.364918e+00	        5.479132e+01
        8.458610e+00	        5.432429e+01
        8.553350e+00	        5.385204e+01
        8.649152e+00	        5.337469e+01
        8.746027e+00	        5.289199e+01
        8.843987e+00	        5.240389e+01
        8.943044e+00	        5.191032e+01
        9.043210e+00	        5.141986e+01
        9.144499e+00	        5.093076e+01
        9.246921e+00	        5.043619e+01
        9.350492e+00	        4.993607e+01
        9.455222e+00	        4.943035e+01
        9.561125e+00	        4.891901e+01
        9.668214e+00	        4.840194e+01
        9.776503e+00	        4.787908e+01
        9.886005e+00	        4.739181e+01
        9.996733e+00	        4.695848e+01
        1.010870e+01	        4.652040e+01
        1.022192e+01	        4.607741e+01
        1.033641e+01	        4.562946e+01
        1.045219e+01	        4.517649e+01
        1.056926e+01	        4.471845e+01
        1.068764e+01	        4.425528e+01
        1.080734e+01	        4.378693e+01
        1.092839e+01	        4.330830e+01
        1.105080e+01	        4.280791e+01
        1.117457e+01	        4.230192e+01
        1.129973e+01	        4.179029e+01
        1.142629e+01	        4.127302e+01
        1.155427e+01	        4.074995e+01
        1.168369e+01	        4.022103e+01
        1.181455e+01	        3.968618e+01
        1.194688e+01	        3.918672e+01
        1.208069e+01	        3.879115e+01
        1.221600e+01	        3.839120e+01
        1.235282e+01	        3.798678e+01
        1.249118e+01	        3.757782e+01
        1.263109e+01	        3.716428e+01
        1.277256e+01	        3.674611e+01
        1.291562e+01	        3.632329e+01
        1.306028e+01	        3.589579e+01
        1.320657e+01	        3.546350e+01
        1.335449e+01	        3.500260e+01
        1.350406e+01	        3.451914e+01
        1.365531e+01	        3.403025e+01
        1.380826e+01	        3.353590e+01
        1.396292e+01	        3.303601e+01
        1.411931e+01	        3.253055e+01
        1.427746e+01	        3.201943e+01
        1.443737e+01	        3.150259e+01
        1.459908e+01	        3.106500e+01
        1.476259e+01	        3.064509e+01
        1.492794e+01	        3.022048e+01
        1.509514e+01	        2.979114e+01
        1.526421e+01	        2.935693e+01
        1.543518e+01	        2.891790e+01
        1.560806e+01	        2.847397e+01
        1.578288e+01	        2.802507e+01
        1.595966e+01	        2.757961e+01
        1.613841e+01	        2.717796e+01
        1.631917e+01	        2.677181e+01
        1.650195e+01	        2.636111e+01
        1.668678e+01	        2.594581e+01
        1.687368e+01	        2.552586e+01
        1.706268e+01	        2.510121e+01
        1.725379e+01	        2.467180e+01
        1.744704e+01	        2.423759e+01
        1.764245e+01	        2.386092e+01
        1.784006e+01	        2.350300e+01
        1.803988e+01	        2.314108e+01
        1.824193e+01	        2.277510e+01
        1.844625e+01	        2.240503e+01
        1.865286e+01	        2.203080e+01
        1.886178e+01	        2.165239e+01
        1.907304e+01	        2.126974e+01
        1.928667e+01	        2.088280e+01
        1.950269e+01	        2.055222e+01
        1.972113e+01	        2.021889e+01
        1.994201e+01	        1.988183e+01
        2.016537e+01	        1.954099e+01
        2.039124e+01	        1.919634e+01
        2.061963e+01	        1.884783e+01
        2.085058e+01	        1.849541e+01
        2.108411e+01	        1.813905e+01
        2.132027e+01	        1.780775e+01
        2.155906e+01	        1.751857e+01
        2.180054e+01	        1.722616e+01
        2.204471e+01	        1.693047e+01
        2.229162e+01	        1.663147e+01
        2.254130e+01	        1.632912e+01
        2.279378e+01	        1.602338e+01
        2.304908e+01	        1.571420e+01
        2.330724e+01	        1.540155e+01
        2.356829e+01	        1.508844e+01
        2.383227e+01	        1.477443e+01
        2.409920e+01	        1.445691e+01
        2.436912e+01	        1.413583e+01
        2.464207e+01	        1.381116e+01
        2.491807e+01	        1.348284e+01
        2.519717e+01	        1.315079e+01
        2.547939e+01	        1.283713e+01
        2.576477e+01	        1.262058e+01
        2.605335e+01	        1.240160e+01
        2.634516e+01	        1.218017e+01
        2.664024e+01	        1.195626e+01
        2.693862e+01	        1.172983e+01
        2.724035e+01	        1.150082e+01
        2.754545e+01	        1.126920e+01
        2.785397e+01	        1.103500e+01
        2.816595e+01	        1.079818e+01
        2.848142e+01	        1.058613e+01
        2.880043e+01	        1.037232e+01
        2.912301e+01	        1.015612e+01
        2.944920e+01	        9.937494e+00
        2.977905e+01	        9.716422e+00
        3.011259e+01	        9.492795e+00
        3.044986e+01	        9.266662e+00
        3.079092e+01	        9.037996e+00
        3.113579e+01	        8.861694e+00
        3.148453e+01	        8.690566e+00
        3.183717e+01	        8.517522e+00
        3.219376e+01	        8.342541e+00
        3.255435e+01	        8.165599e+00
        3.291897e+01	        7.986616e+00
        3.328768e+01	        7.805569e+00
        3.366052e+01	        7.622494e+00
        3.403753e+01	        7.451062e+00
        3.441877e+01	        7.314309e+00
        3.480428e+01	        7.176026e+00
        3.519410e+01	        7.036193e+00
        3.558829e+01	        6.894794e+00
        3.598690e+01	        6.751804e+00
        3.638997e+01	        6.607044e+00
        3.679756e+01	        6.460662e+00
        3.720971e+01	        6.312641e+00
        3.762647e+01	        6.167861e+00
        3.804791e+01	        6.037527e+00
        3.847406e+01	        5.905733e+00
        3.890499e+01	        5.772463e+00
        3.934075e+01	        5.637701e+00
        3.978138e+01	        5.501422e+00
        4.022696e+01	        5.363616e+00
        4.067752e+01	        5.224268e+00
        4.113313e+01	        5.094743e+00
        4.159384e+01	        4.993638e+00
        4.205971e+01	        4.891401e+00
        4.253080e+01	        4.787840e+00
        4.300716e+01	        4.683211e+00
        4.348887e+01	        4.577440e+00
        4.397596e+01	        4.470282e+00
        4.446851e+01	        4.361837e+00
        4.496658e+01	        4.252189e+00
        4.547023e+01	        4.163210e+00
        4.597952e+01	        4.079761e+00
        4.649451e+01	        3.995379e+00
        4.701528e+01	        3.910057e+00
        4.754187e+01	        3.823781e+00
        4.807436e+01	        3.736701e+00
        4.861282e+01	        3.648713e+00
        4.915731e+01	        3.559743e+00
        4.970789e+01	        3.473405e+00
        5.026464e+01	        3.404478e+00
        5.082763e+01	        3.334780e+00
        5.139693e+01	        3.264300e+00
        5.197260e+01	        3.193033e+00
        5.255472e+01	        3.120968e+00
        5.314336e+01	        3.048081e+00
        5.373859e+01	        2.974000e+00
        5.434049e+01	        2.899091e+00
        5.494913e+01	        2.832880e+00
        5.556458e+01	        2.770793e+00
        5.618694e+01	        2.708010e+00
        5.681626e+01	        2.644527e+00
        5.745263e+01	        2.580332e+00
        5.809612e+01	        2.515469e+00
        5.874683e+01	        2.450019e+00
        5.940482e+01	        2.383836e+00
        6.007019e+01	        2.330896e+00
        6.074300e+01	        2.281016e+00
        6.142335e+01	        2.230393e+00
        6.211133e+01	        2.179368e+00
        6.280700e+01	        2.127867e+00
        6.351047e+01	        2.075808e+00
        6.422182e+01	        2.023231e+00
        6.494114e+01	        1.970110e+00
        6.566851e+01	        1.923131e+00
        6.640403e+01	        1.879005e+00
        6.714779e+01	        1.834391e+00
        6.789988e+01	        1.789292e+00
        6.866039e+01	        1.743694e+00
        6.942942e+01	        1.697595e+00
        7.020706e+01	        1.651090e+00
        7.099342e+01	        1.606469e+00
        7.178858e+01	        1.576058e+00
        7.259264e+01	        1.545310e+00
        7.340572e+01	        1.514217e+00
        7.422790e+01	        1.482777e+00
        7.505929e+01	        1.450990e+00
        7.589999e+01	        1.418848e+00
        7.675011e+01	        1.386345e+00
        7.760974e+01	        1.353649e+00
        7.847901e+01	        1.321067e+00
        7.935802e+01	        1.290157e+00
        8.024686e+01	        1.258901e+00
        8.114567e+01	        1.227298e+00
        8.205454e+01	        1.195345e+00
        8.297359e+01	        1.162923e+00
        8.390294e+01	        1.130155e+00
        8.484269e+01	        1.097265e+00
        8.579297e+01	        1.073934e+00
        8.675389e+01	        1.050851e+00
        8.772558e+01	        1.027520e+00
        8.870815e+01	        1.003935e+00
        8.970173e+01	        9.800891e-01
        9.070643e+01	        9.559835e-01
        9.172239e+01	        9.316103e-01
        9.274972e+01	        9.069466e-01
        9.378856e+01	        8.863350e-01
        9.483904e+01	        8.661639e-01
        9.590129e+01	        8.457704e-01
        9.697543e+01	        8.251514e-01
        9.806160e+01	        8.043044e-01
        9.915994e+01	        7.832243e-01
        1.002706e+02	        7.620993e-01
        1.013937e+02	        7.418963e-01
        1.025293e+02	        7.255079e-01
        1.036777e+02	        7.089369e-01
        1.048389e+02	        6.921804e-01
        1.060132e+02	        6.752373e-01
        1.072006e+02	        6.581048e-01
        1.084013e+02	        6.403766e-01
        1.096154e+02	        6.225318e-01
        1.108432e+02	        6.068158e-01
        1.120847e+02	        5.930625e-01
        1.133401e+02	        5.791749e-01
        1.146095e+02	        5.651705e-01
        1.158932e+02	        5.510298e-01
        1.171913e+02	        5.367445e-01
        1.185039e+02	        5.223009e-01
        1.198312e+02	        5.077049e-01
        1.211734e+02	        4.955583e-01
        1.225306e+02	        4.838964e-01
        1.239030e+02	        4.721153e-01
        1.252907e+02	        4.602179e-01
        1.266941e+02	        4.481995e-01
        1.281131e+02	        4.360576e-01
        1.295480e+02	        4.237809e-01
        1.309990e+02	        4.122318e-01
        1.324663e+02	        4.013350e-01
        1.339500e+02	        3.906624e-01
        1.354503e+02	        3.798704e-01
        1.369674e+02	        3.689512e-01
        1.385015e+02	        3.579111e-01
        1.400528e+02	        3.468535e-01
        1.416214e+02	        3.388155e-01
        1.432077e+02	        3.306881e-01
        1.448117e+02	        3.224749e-01
        1.464336e+02	        3.141721e-01
        1.480737e+02	        3.059134e-01
        1.497322e+02	        2.975643e-01
        1.514093e+02	        2.891219e-01
        1.531052e+02	        2.816559e-01
        1.548200e+02	        2.743258e-01
        1.565541e+02	        2.669137e-01
        1.583076e+02	        2.594192e-01
        1.600807e+02	        2.518526e-01
        1.618737e+02	        2.444922e-01
        1.636867e+02	        2.374533e-01
        1.655201e+02	        2.314573e-01
        1.673740e+02	        2.253942e-01
        1.692487e+02	        2.192044e-01
        1.711444e+02	        2.129461e-01
        1.730613e+02	        2.066366e-01
        1.749996e+02	        2.002677e-01
        1.769597e+02	        1.952129e-01
        1.789418e+02	        1.904972e-01
        1.809460e+02	        1.857325e-01
        1.829727e+02	        1.809192e-01
        1.850221e+02	        1.760527e-01
        1.870944e+02	        1.711334e-01
        1.891900e+02	        1.661665e-01
        1.913090e+02	        1.616243e-01
        1.934517e+02	        1.570330e-01
        1.956185e+02	        1.525215e-01
        1.978095e+02	        1.479957e-01
        2.000251e+02	        1.434210e-01
        2.022655e+02	        1.389350e-01
        2.045309e+02	        1.353193e-01
        2.068218e+02	        1.316590e-01
        2.091383e+02	        1.279657e-01
        2.114807e+02	        1.242340e-01
        2.138494e+02	        1.204803e-01
        2.162446e+02	        1.167762e-01
        2.186667e+02	        1.137771e-01
        2.211159e+02	        1.107449e-01
        2.235925e+02	        1.076789e-01
        2.260968e+02	        1.045802e-01
        2.286292e+02	        1.014476e-01
        2.311900e+02	        9.828013e-02
        2.337794e+02	        9.559049e-02
        2.363979e+02	        9.306081e-02
        2.390456e+02	        9.050325e-02
        2.417231e+02	        8.791790e-02
        2.444305e+02	        8.520288e-02
        2.471682e+02	        8.249577e-02
        2.499366e+02	        8.011052e-02
        2.527360e+02	        7.776973e-02
        2.555668e+02	        7.540737e-02
        2.584293e+02	        7.308961e-02
        2.613238e+02	        7.076104e-02
        2.642508e+02	        6.849673e-02
        2.672105e+02	        6.662659e-02
        2.702034e+02	        6.473818e-02
        2.732298e+02	        6.283079e-02
        2.762901e+02	        6.090382e-02
        2.793847e+02	        5.897220e-02
        2.825139e+02	        5.720316e-02
        2.856782e+02	        5.562571e-02
        2.888780e+02	        5.402746e-02
        2.921136e+02	        5.241708e-02
        2.953854e+02	        5.079180e-02
        2.986938e+02	        4.914983e-02
        3.020393e+02	        4.768768e-02
        3.054223e+02	        4.635632e-02
        3.088432e+02	        4.501062e-02
        3.123024e+02	        4.366891e-02
        3.158004e+02	        4.231245e-02
        3.193375e+02	        4.094130e-02
        3.229142e+02	        3.959464e-02
        3.265310e+02	        3.825197e-02
        3.301883e+02	        3.689489e-02
        3.338866e+02	        3.548250e-02
        3.376263e+02	        3.407969e-02
        3.414079e+02	        3.300683e-02
        3.452318e+02	        3.201209e-02
        3.490986e+02	        3.100914e-02
        3.530086e+02	        3.000039e-02
        3.569625e+02	        2.898569e-02
        3.609607e+02	        2.797061e-02
        3.650036e+02	        2.707341e-02
        3.690918e+02	        2.618214e-02
        3.732258e+02	        2.530663e-02
        3.774062e+02	        2.442252e-02
        3.816333e+02	        2.353042e-02
        3.859078e+02	        2.269381e-02
        3.902301e+02	        2.189651e-02
        3.946009e+02	        2.109307e-02
        3.990206e+02	        2.028113e-02
        4.034898e+02	        1.947695e-02
        4.080091e+02	        1.873892e-02
        4.125790e+02	        1.805858e-02
        4.172001e+02	        1.737071e-02
        4.218730e+02	        1.667516e-02
        4.265982e+02	        1.597273e-02
        4.313763e+02	        1.528825e-02
        4.362079e+02	        1.462346e-02
        4.410936e+02	        1.397011e-02
        4.460341e+02	        1.332446e-02
        4.510299e+02	        1.267488e-02
        4.560817e+02	        1.204558e-02
        4.611900e+02	        1.141469e-02
        4.663556e+02	        1.077782e-02
        4.715790e+02	        1.013468e-02
        4.768609e+02	        9.524362e-03
        4.822020e+02	        8.929150e-03
        4.876029e+02	        8.331003e-03
        4.930643e+02	        7.714784e-03
        4.985868e+02	        7.079344e-03
        5.041712e+02	        6.438169e-03
        5.098182e+02	        5.769890e-03
        5.155284e+02	        5.082323e-03
        5.213026e+02	        4.650457e-03
        5.271414e+02	        4.562490e-03
        5.330457e+02	        4.473760e-03
        5.390161e+02	        4.384141e-03
        5.450533e+02	        4.293671e-03
        5.511582e+02	        4.200580e-03
        5.573314e+02	        4.101440e-03
        5.635738e+02	        4.022468e-03
        5.698861e+02	        3.951454e-03
        5.762691e+02	        3.880390e-03
        5.827236e+02	        3.809357e-03
        5.892504e+02	        3.738584e-03
        5.958503e+02	        3.667292e-03
        6.025241e+02	        3.595622e-03
        6.092727e+02	        3.527327e-03
        6.160968e+02	        3.460837e-03
        6.229974e+02	        3.393889e-03
        6.299753e+02	        3.327673e-03
        6.370313e+02	        3.262861e-03
        6.441664e+02	        3.198164e-03
        6.513814e+02	        3.133372e-03
        6.586772e+02	        3.077101e-03
        6.660547e+02	        3.023248e-03
        6.735148e+02	        2.968841e-03
        6.810585e+02	        2.909417e-03
        6.886867e+02	        2.844653e-03
        6.964003e+02	        2.783560e-03
        7.042004e+02	        2.726762e-03
        7.120878e+02	        2.679022e-03
        7.200635e+02	        2.631630e-03
        7.281286e+02	        2.584507e-03
        7.362840e+02	        2.537293e-03
        7.445307e+02	        2.489837e-03
        7.528698e+02	        2.440467e-03
        7.613023e+02	        2.393054e-03
        7.698293e+02	        2.348941e-03
        7.784518e+02	        2.305035e-03
        7.871708e+02	        2.261306e-03
        7.959875e+02	        2.217528e-03
        8.049030e+02	        2.173586e-03
        8.139183e+02	        2.134750e-03
        8.230346e+02	        2.098475e-03
        8.322529e+02	        2.056006e-03
        8.415746e+02	        2.014313e-03
        8.510006e+02	        1.973663e-03
        8.605323e+02	        1.933923e-03
        8.701706e+02	        1.897932e-03
        8.799170e+02	        1.864014e-03
        8.897725e+02	        1.830034e-03
        8.997384e+02	        1.795908e-03
        9.098159e+02	        1.758487e-03
        9.200063e+02	        1.722570e-03
        9.303108e+02	        1.691128e-03
        9.407307e+02	        1.660908e-03
        9.512674e+02	        1.630760e-03
        9.619221e+02	        1.600752e-03
        9.726961e+02	        1.570677e-03
        9.835907e+02	        1.541498e-03
        9.946074e+02	        1.506155e-03
        1.005748e+03	        1.474258e-03
        1.017012e+03	        1.444088e-03
        1.028403e+03	        1.414657e-03
        1.039922e+03	        1.386263e-03
        1.051570e+03	        1.361305e-03
        1.063348e+03	        1.336368e-03
        1.075258e+03	        1.306917e-03
        1.087301e+03	        1.278349e-03
        1.099480e+03	        1.250682e-03
        1.111794e+03	        1.225992e-03
        1.124247e+03	        1.201956e-03
        1.136839e+03	        1.178290e-03
        1.149572e+03	        1.154816e-03
        1.162448e+03	        1.087403e-03
        1.175468e+03	        1.028318e-03
        1.188634e+03	        9.794677e-04
        1.201947e+03	        9.382229e-04
        1.215409e+03	        8.988126e-04
        1.229023e+03	        8.643283e-04
        1.242788e+03	        8.318597e-04
        1.256708e+03	        8.003998e-04
        1.270784e+03	        7.695222e-04
        1.285017e+03	        7.416363e-04
        1.299410e+03	        7.150235e-04
        1.313964e+03	        6.891124e-04
        1.328681e+03	        6.641438e-04
        1.343563e+03	        6.404350e-04
        1.358612e+03	        6.167818e-04
        1.373829e+03	        5.955595e-04
        1.389216e+03	        5.750113e-04
        1.404776e+03	        5.548247e-04
        1.420510e+03	        5.350544e-04
        1.436421e+03	        5.156314e-04
        1.452509e+03	        4.959715e-04
        1.468778e+03	        4.766956e-04
        1.485229e+03	        4.577939e-04
        1.501865e+03	        4.389366e-04
        1.518686e+03	        4.196204e-04
        1.535696e+03	        3.988824e-04
        1.552897e+03	        3.741639e-04
        1.570290e+03	        3.297116e-04
        1.587878e+03	        3.223070e-04
        1.605663e+03	        3.151861e-04
        1.623647e+03	        3.086603e-04
        1.641833e+03	        3.022521e-04
        1.660222e+03	        2.959511e-04
        1.678818e+03	        2.896095e-04
        1.697621e+03	        2.832130e-04
        1.716635e+03	        2.772890e-04
        1.735863e+03	        2.716767e-04
        1.755305e+03	        2.663122e-04
        1.774965e+03	        2.609874e-04
        1.794846e+03	        2.557934e-04
        1.814949e+03	        2.506369e-04
        1.835277e+03	        2.454430e-04
        1.855833e+03	        2.402183e-04
        1.876620e+03	        2.349552e-04
        1.897639e+03	        2.296887e-04
        1.918893e+03	        2.246068e-04
        1.940386e+03	        2.197123e-04
        1.962119e+03	        2.152244e-04
        1.984096e+03	        2.107896e-04
        2.006319e+03	        2.063294e-04
        2.028790e+03	        2.018481e-04
        2.051514e+03	        1.973580e-04
        2.074492e+03	        1.931008e-04
        2.097727e+03	        1.890322e-04
        2.121223e+03	        1.850206e-04
        2.144981e+03	        1.812290e-04
        2.169006e+03	        1.774701e-04
        2.193300e+03	        1.736922e-04
        2.217866e+03	        1.701013e-04
        2.242707e+03	        1.665767e-04
        2.267827e+03	        1.630417e-04
        2.293228e+03	        1.595863e-04
        2.318913e+03	        1.561718e-04
        2.344886e+03	        1.528485e-04
        2.371150e+03	        1.495569e-04
        2.397708e+03	        1.463627e-04
        2.424563e+03	        1.432415e-04
        2.451720e+03	        1.400916e-04
        2.479180e+03	        1.369139e-04
        2.506948e+03	        1.338885e-04
        2.535027e+03	        1.309660e-04
        2.563421e+03	        1.282761e-04
        2.592132e+03	        1.256848e-04
        2.621165e+03	        1.230840e-04
        2.650524e+03	        1.204559e-04
        2.680211e+03	        1.178004e-04
        2.710231e+03	        1.151194e-04
        2.740587e+03	        1.125935e-04
        2.771282e+03	        1.102450e-04
        2.802322e+03	        1.079898e-04
        2.833710e+03	        1.057088e-04
        2.865449e+03	        1.034024e-04
        2.897543e+03	        1.010713e-04
        2.929997e+03	        9.872194e-05
        2.962814e+03	        9.637796e-05
        2.995999e+03	        9.423612e-05
        3.029556e+03	        9.236900e-05
        3.063488e+03	        9.048148e-05
        3.097801e+03	        8.857300e-05
        3.132498e+03	        8.664396e-05
        3.167583e+03	        8.473723e-05
        3.203062e+03	        8.285878e-05
        3.238938e+03	        8.096366e-05
        3.275216e+03	        7.916150e-05
        3.311900e+03	        7.744662e-05
        3.348994e+03	        7.571840e-05
        3.386505e+03	        7.400179e-05
        3.424435e+03	        7.227460e-05
        3.462791e+03	        7.053361e-05
        3.501576e+03	        6.881225e-05
        3.540795e+03	        6.722508e-05
        3.580454e+03	        6.574728e-05
        3.620557e+03	        6.432318e-05
        3.661109e+03	        6.291937e-05
        3.702115e+03	        6.149992e-05
        3.743580e+03	        6.006799e-05
        3.785510e+03	        5.866414e-05
        3.827910e+03	        5.726379e-05
        3.870784e+03	        5.591308e-05
        3.914139e+03	        5.461366e-05
        3.957979e+03	        5.337008e-05
        4.002311e+03	        5.212292e-05
        4.047138e+03	        5.092663e-05
        4.092468e+03	        4.973142e-05
        4.138306e+03	        4.854879e-05
        4.184657e+03	        4.736962e-05
        4.231527e+03	        4.623349e-05
        4.278923e+03	        4.513372e-05
        4.326849e+03	        4.404196e-05
        4.375311e+03	        4.296097e-05
        4.424317e+03	        4.187381e-05
        4.473872e+03	        4.078128e-05
        4.523981e+03	        3.967707e-05
        4.574652e+03	        3.863943e-05
        4.625890e+03	        3.766881e-05
        4.677703e+03	        3.673917e-05
        4.730095e+03	        3.582187e-05
        4.783075e+03	        3.489435e-05
        4.836647e+03	        3.394986e-05
        4.890820e+03	        3.301393e-05
        4.945600e+03	        3.208070e-05
        5.000993e+03	        3.116956e-05
        5.057007e+03	        3.023864e-05
        5.113648e+03	        2.917922e-05
        5.170923e+03	        2.821296e-05
        5.228840e+03	        2.750663e-05
        5.287405e+03	        2.680919e-05
        5.346627e+03	        2.610543e-05
        5.406512e+03	        2.540842e-05
        5.467067e+03	        2.477783e-05
        5.528301e+03	        2.415687e-05
        5.590221e+03	        2.354351e-05
        5.652834e+03	        2.293089e-05
        5.716149e+03	        2.231464e-05
        5.780172e+03	        2.169663e-05
        5.844913e+03	        2.107470e-05
        5.910379e+03	        2.047338e-05
        5.976578e+03	        1.989762e-05
        6.043519e+03	        1.933356e-05
        6.111209e+03	        1.874788e-05
        6.179658e+03	        1.813508e-05
        6.248873e+03	        1.738764e-05
        6.318863e+03	        1.690486e-05
        6.389638e+03	        1.643421e-05
        6.461205e+03	        1.599731e-05
        6.533574e+03	        1.556719e-05
        6.606753e+03	        1.513267e-05
        6.680752e+03	        1.470198e-05
        6.755579e+03	        1.427247e-05
        6.831245e+03	        1.384353e-05
        6.907759e+03	        1.340810e-05
        6.985129e+03	        1.297930e-05
        7.063366e+03	        1.255262e-05
        7.142479e+03	        1.210687e-05
        7.222478e+03	        1.164072e-05
        7.303374e+03	        1.108328e-05
        7.385175e+03	        1.044199e-05
        7.467893e+03	        1.015766e-05
        7.551537e+03	        9.896315e-06
        7.636118e+03	        9.658628e-06
        7.721646e+03	        9.425787e-06
        7.808132e+03	        9.195144e-06
        7.895587e+03	        8.962393e-06
        7.984022e+03	        8.727093e-06
        8.073446e+03	        8.500252e-06
        8.163873e+03	        8.280703e-06
        8.255312e+03	        8.060874e-06
        8.347776e+03	        7.843179e-06
        8.441275e+03	        7.623903e-06
        8.535822e+03	        7.402457e-06
        8.631427e+03	        7.183500e-06
        8.728103e+03	        6.965133e-06
        8.825862e+03	        6.745876e-06
        8.924716e+03	        6.541205e-06
        9.024678e+03	        6.351242e-06
        9.125758e+03	        6.165480e-06
        9.227971e+03	        5.979436e-06
        9.331329e+03	        5.788050e-06
        9.435845e+03	        5.589976e-06
        9.541531e+03	        5.384468e-06
        9.648401e+03	        5.117885e-06
        9.756468e+03	        4.979224e-06
        9.865745e+03	        4.842432e-06
        9.976246e+03	        4.705182e-06
        1.008798e+04	        4.566543e-06
        1.020098e+04	        4.429935e-06
        1.031523e+04	        4.296471e-06
        1.043077e+04	        4.165220e-06
        1.054760e+04	        4.045809e-06
        1.066573e+04	        3.926959e-06
        1.078520e+04	        3.806499e-06
        1.090600e+04	        3.685206e-06
        1.102815e+04	        3.566086e-06
        1.115167e+04	        3.446170e-06
        1.127657e+04	        3.328080e-06
        1.140288e+04	        3.217935e-06
        1.153059e+04	        3.106061e-06
        1.165974e+04	        2.991428e-06
        1.179034e+04	        2.872003e-06
        1.192240e+04	        2.738595e-06
        1.205593e+04	        2.569741e-06
        1.219096e+04	        2.489268e-06
        1.232751e+04	        2.419034e-06
        1.246558e+04	        2.349073e-06
        1.260520e+04	        2.278303e-06
        1.274639e+04	        2.206667e-06
        1.288915e+04	        2.134013e-06
        1.303352e+04	        2.061022e-06
        1.317950e+04	        1.985426e-06
        1.332712e+04	        1.913149e-06
        1.347639e+04	        1.844524e-06
        1.362733e+04	        1.773798e-06
        1.377996e+04	        1.699127e-06
        1.393431e+04	        1.620564e-06
        1.409038e+04	        1.532911e-06
        1.424820e+04	        1.452658e-06
        1.440778e+04	        1.415795e-06
        1.456916e+04	        1.378686e-06
        1.473234e+04	        1.341203e-06
        1.489735e+04	        1.303503e-06
        1.506421e+04	        1.265518e-06
        1.523293e+04	        1.229212e-06
        1.540355e+04	        1.193888e-06
        1.557608e+04	        1.158512e-06
        1.575054e+04	        1.122716e-06
        1.592695e+04	        1.086414e-06
        1.610534e+04	        1.050108e-06
        1.628573e+04	        1.017861e-06
        1.646814e+04	        9.854302e-07
        1.665259e+04	        9.495787e-07
        1.683910e+04	        9.214846e-07
        1.702771e+04	        8.931851e-07
        1.721843e+04	        8.652061e-07
        1.741128e+04	        8.410806e-07
        1.760630e+04	        8.167987e-07
        1.780350e+04	        7.922249e-07
        1.800291e+04	        7.675095e-07
        1.820455e+04	        7.427466e-07
        1.840845e+04	        7.191357e-07
        1.861463e+04	        6.961582e-07
        1.882312e+04	        6.728357e-07
        1.903395e+04	        6.488732e-07
        1.924714e+04	        6.253165e-07
        1.946272e+04	        6.044054e-07
        1.968071e+04	        5.846273e-07
        1.990114e+04	        5.646018e-07
        2.012405e+04	        5.443899e-07
        2.034945e+04	        5.237145e-07
        2.057737e+04	        5.052304e-07
        2.080785e+04	        4.868683e-07
        2.104091e+04	        4.682347e-07
        2.127657e+04	        4.490564e-07
        2.151488e+04	        4.295965e-07
        2.175586e+04	        4.116802e-07
        2.199954e+04	        3.955585e-07
        2.224594e+04	        3.792785e-07
        2.249511e+04	        3.631580e-07
        2.274706e+04	        3.477057e-07
        2.300184e+04	        3.319764e-07
        2.325947e+04	        3.162059e-07
        2.351999e+04	        3.005273e-07
        2.378343e+04	        2.864032e-07
        2.404981e+04	        2.721418e-07
        2.431918e+04	        2.577509e-07
        2.459157e+04	        2.433412e-07
        2.486701e+04	        2.287395e-07
        2.514553e+04	        2.145290e-07
        2.542717e+04	        2.009355e-07
        2.571197e+04	        1.868908e-07
        2.599996e+04	        1.715713e-07
        2.629117e+04	        1.584189e-07
        2.658564e+04	        1.447712e-07
        2.688341e+04	        1.304673e-07
        2.718452e+04	        1.147548e-07
        2.748900e+04	        9.852425e-08
        2.779689e+04	        8.141940e-08
        2.810823e+04	        5.996494e-08
        2.842306e+04	        2.145499e-08
        2.874141e+04	        6.855376e-09
        2.906333e+04	        6.236464e-09
        2.938885e+04	        5.556959e-09
        2.971802e+04	        4.779407e-09
        3.005088e+04	        4.078435e-09
        3.038746e+04	        3.291924e-09
        3.072782e+04	        2.220104e-09
        3.107198e+04	        4.255629e-10
        3.142000e+04	        3.960089e-10
        3.177192e+04	        3.639671e-10
        3.212779e+04	        3.251912e-10
        3.248763e+04	        2.883547e-10
        3.285151e+04	        2.640213e-10
        3.321946e+04	        2.354448e-10
        3.359154e+04	        1.894414e-10
        3.396778e+04	        1.796397e-10
        3.434823e+04	        1.714438e-10
        3.473295e+04	        1.629270e-10
        3.512198e+04	        1.509514e-10
        3.551536e+04	        1.452159e-10
        3.591315e+04	        1.394329e-10
        3.631540e+04	        1.335246e-10
        3.672215e+04	        1.277673e-10
        3.713345e+04	        1.218809e-10
        3.754937e+04	        1.151737e-10
        3.796994e+04	        1.094268e-10
        3.839522e+04	        1.047228e-10
        3.882526e+04	        9.928632e-11
        3.926013e+04	        9.470956e-11
        3.969986e+04	        9.076429e-11
        4.014452e+04	        8.611815e-11
        4.059416e+04	        8.276091e-11
        4.104883e+04	        7.937684e-11
        4.150860e+04	        7.572064e-11
        4.197351e+04	        7.266911e-11
        4.244364e+04	        6.921373e-11
        4.291903e+04	        6.567595e-11
        4.339974e+04	        6.329441e-11
        4.388584e+04	        6.084903e-11
        4.437738e+04	        5.857616e-11
        4.487443e+04	        5.628450e-11
        4.537705e+04	        5.381577e-11
        4.588529e+04	        5.198277e-11
        4.639923e+04	        5.012716e-11
        4.691893e+04	        4.835935e-11
        4.744444e+04	        4.661116e-11
        4.797584e+04	        4.483058e-11
        4.851319e+04	        4.325414e-11
        4.905657e+04	        4.167496e-11
        4.960602e+04	        4.011071e-11
        5.016164e+04	        3.847834e-11
        5.072347e+04	        3.697359e-11
        5.129160e+04	        3.545225e-11
        5.186609e+04	        3.413296e-11
        5.244702e+04	        3.278998e-11
        5.303445e+04	        3.147647e-11
        5.362846e+04	        3.012835e-11
        5.422913e+04	        2.884862e-11
        5.483652e+04	        2.761153e-11
        5.545071e+04	        2.639101e-11
        5.607179e+04	        2.510928e-11
        5.669982e+04	        2.392872e-11
        5.733489e+04	        2.284370e-11
        5.797707e+04	        2.175296e-11
        5.862644e+04	        2.055301e-11
        5.928308e+04	        1.957120e-11
        5.994708e+04	        1.864725e-11
        6.061852e+04	        1.776429e-11
        6.129748e+04	        1.680515e-11
        6.198404e+04	        1.600313e-11
        6.267829e+04	        1.515648e-11
        6.338032e+04	        1.422763e-11
        6.409021e+04	        1.336121e-11
        6.480805e+04	        1.273159e-11
        6.553393e+04	        1.212563e-11
        6.626795e+04	        1.147591e-11
        6.701018e+04	        1.094501e-11
        6.776073e+04	        1.040034e-11
        6.851968e+04	        9.818755e-12
        6.928713e+04	        9.329977e-12
        7.006318e+04	        8.845194e-12
        7.084793e+04	        8.342695e-12
        7.164146e+04	        7.855929e-12
        7.244388e+04	        7.412374e-12
        7.325529e+04	        6.966814e-12
        7.407578e+04	        6.522943e-12
        7.490547e+04	        6.114233e-12
        7.574444e+04	        5.700518e-12
        7.659282e+04	        5.290864e-12
        7.745070e+04	        4.912699e-12
        7.831818e+04	        4.544263e-12
        7.919539e+04	        4.195282e-12
        8.008241e+04	        3.854670e-12
        8.097938e+04	        3.472389e-12
        8.188638e+04	        3.134653e-12
        8.280355e+04	        2.782152e-12
        8.373099e+04	        2.411656e-12
        8.466882e+04	        2.106423e-12
        8.561715e+04	        1.742840e-12
        8.657611e+04	        1.469438e-12
        8.754580e+04	        1.172435e-12
        8.852636e+04	        9.091838e-13
        8.951790e+04	        7.416881e-13
        9.052054e+04	        5.679677e-13
        9.153442e+04	        4.004351e-13
        9.255965e+04	        1.976208e-13
        9.359636e+04	        6.824836e-14
        9.464469e+04	        5.492080e-14
        9.570475e+04	        5.024114e-14
        9.677669e+04	        4.552618e-14
        9.786064e+04	        4.053037e-14
        9.895673e+04	        3.537294e-14
        1.000651e+05	        2.950080e-14
        1.011859e+05	        2.226070e-14
        1.023192e+05	        1.124099e-14
        1.034652e+05	        6.307671e-15
        1.046241e+05	        1.874044e-15
        1.057959e+05	        0.000000e+00
        1.069809e+05	        0.000000e+00
        1.081791e+05	        0.000000e+00
        1.093908e+05	        0.000000e+00

# -------------------------------------------------------------------------------
# Curve 1: LET spectrum with Flares 
# Params: 0 5 #c967d0 2 1
#	LET (MeV.cm^2.g^{-1})		Flux (cm^{-2}.s^{-1})
# -------------------------------------------------------------------------------
        1.608960e+00	        1.392564e+04
        1.626982e+00	        1.392564e+04
        1.645205e+00	        1.392564e+04
        1.663632e+00	        1.392564e+04
        1.682265e+00	        1.392553e+04
        1.701107e+00	        1.392538e+04
        1.720161e+00	        1.392529e+04
        1.739427e+00	        1.392523e+04
        1.758910e+00	        1.392517e+04
        1.778610e+00	        1.392513e+04
        1.798532e+00	        1.392509e+04
        1.818676e+00	        1.392482e+04
        1.839046e+00	        1.392436e+04
        1.859644e+00	        1.392381e+04
        1.880473e+00	        1.392292e+04
        1.901536e+00	        1.392202e+04
        1.922834e+00	        1.392101e+04
        1.944370e+00	        1.391994e+04
        1.966148e+00	        1.391886e+04
        1.988170e+00	        1.391768e+04
        2.010439e+00	        1.391646e+04
        2.032956e+00	        1.391522e+04
        2.055727e+00	        1.391389e+04
        2.078752e+00	        1.391237e+04
        2.102035e+00	        1.391084e+04
        2.125579e+00	        1.390929e+04
        2.149386e+00	        1.390753e+04
        2.173460e+00	        1.390563e+04
        2.197804e+00	        1.390370e+04
        2.222421e+00	        1.390175e+04
        2.247313e+00	        1.389969e+04
        2.272484e+00	        1.389752e+04
        2.297937e+00	        1.389534e+04
        2.323675e+00	        1.389313e+04
        2.349701e+00	        1.389089e+04
        2.376019e+00	        1.388804e+04
        2.402632e+00	        1.388482e+04
        2.429542e+00	        1.388155e+04
        2.456754e+00	        1.387825e+04
        2.484271e+00	        1.387495e+04
        2.512096e+00	        1.387181e+04
        2.540233e+00	        1.386864e+04
        2.568685e+00	        1.386544e+04
        2.597455e+00	        1.386219e+04
        2.626548e+00	        1.385892e+04
        2.655967e+00	        1.385560e+04
        2.685715e+00	        1.385063e+04
        2.715796e+00	        1.384555e+04
        2.746214e+00	        1.384042e+04
        2.776973e+00	        1.383523e+04
        2.808077e+00	        1.382998e+04
        2.839529e+00	        1.382416e+04
        2.871333e+00	        1.381810e+04
        2.903493e+00	        1.381196e+04
        2.936014e+00	        1.380576e+04
        2.968899e+00	        1.379949e+04
        3.002152e+00	        1.379315e+04
        3.035777e+00	        1.378545e+04
        3.069779e+00	        1.377747e+04
        3.104162e+00	        1.376939e+04
        3.138931e+00	        1.376123e+04
        3.174088e+00	        1.375297e+04
        3.209640e+00	        1.374462e+04
        3.245589e+00	        1.373625e+04
        3.281941e+00	        1.372780e+04
        3.318701e+00	        1.371925e+04
        3.355872e+00	        1.371061e+04
        3.393459e+00	        1.370188e+04
        3.431468e+00	        1.369304e+04
        3.469902e+00	        1.368410e+04
        3.508766e+00	        1.367440e+04
        3.548066e+00	        1.366438e+04
        3.587806e+00	        1.365424e+04
        3.627992e+00	        1.364400e+04
        3.668627e+00	        1.363363e+04
        3.709717e+00	        1.362316e+04
        3.751268e+00	        1.361259e+04
        3.793284e+00	        1.360314e+04
        3.835771e+00	        1.359358e+04
        3.878733e+00	        1.358391e+04
        3.922177e+00	        1.357414e+04
        3.966107e+00	        1.356425e+04
        4.010530e+00	        1.355426e+04
        4.055449e+00	        1.354415e+04
        4.100872e+00	        1.353314e+04
        4.146804e+00	        1.352012e+04
        4.193250e+00	        1.350696e+04
        4.240217e+00	        1.349365e+04
        4.287709e+00	        1.348020e+04
        4.335734e+00	        1.346659e+04
        4.384296e+00	        1.345283e+04
        4.433403e+00	        1.344124e+04
        4.483059e+00	        1.342960e+04
        4.533271e+00	        1.341783e+04
        4.584046e+00	        1.340592e+04
        4.635390e+00	        1.339388e+04
        4.687308e+00	        1.338171e+04
        4.739809e+00	        1.336940e+04
        4.792897e+00	        1.335695e+04
        4.846580e+00	        1.334177e+04
        4.900864e+00	        1.332603e+04
        4.955756e+00	        1.331011e+04
        5.011263e+00	        1.329401e+04
        5.067391e+00	        1.327773e+04
        5.124149e+00	        1.326127e+04
        5.181542e+00	        1.324463e+04
        5.239577e+00	        1.322841e+04
        5.298263e+00	        1.321219e+04
        5.357606e+00	        1.319578e+04
        5.417614e+00	        1.317919e+04
        5.478294e+00	        1.316241e+04
        5.539654e+00	        1.314545e+04
        5.601701e+00	        1.312829e+04
        5.664442e+00	        1.311095e+04
        5.727887e+00	        1.309243e+04
        5.792042e+00	        1.307320e+04
        5.856916e+00	        1.305375e+04
        5.922516e+00	        1.303409e+04
        5.988851e+00	        1.301420e+04
        6.055929e+00	        1.299410e+04
        6.123759e+00	        1.297377e+04
        6.192348e+00	        1.295321e+04
        6.261705e+00	        1.293071e+04
        6.331839e+00	        1.290487e+04
        6.402759e+00	        1.287874e+04
        6.474473e+00	        1.285233e+04
        6.546991e+00	        1.282561e+04
        6.620320e+00	        1.279860e+04
        6.694471e+00	        1.277128e+04
        6.769452e+00	        1.274364e+04
        6.845274e+00	        1.271440e+04
        6.921944e+00	        1.268399e+04
        6.999473e+00	        1.265325e+04
        7.077871e+00	        1.262216e+04
        7.157146e+00	        1.259072e+04
        7.237310e+00	        1.255894e+04
        7.318371e+00	        1.252680e+04
        7.400341e+00	        1.249429e+04
        7.483228e+00	        1.246000e+04
        7.567044e+00	        1.242370e+04
        7.651799e+00	        1.238699e+04
        7.737503e+00	        1.234988e+04
        7.824166e+00	        1.231235e+04
        7.911801e+00	        1.227439e+04
        8.000417e+00	        1.223602e+04
        8.090026e+00	        1.219721e+04
        8.180638e+00	        1.215791e+04
        8.272265e+00	        1.211200e+04
        8.364918e+00	        1.206558e+04
        8.458610e+00	        1.201865e+04
        8.553350e+00	        1.197118e+04
        8.649152e+00	        1.192319e+04
        8.746027e+00	        1.187465e+04
        8.843987e+00	        1.182558e+04
        8.943044e+00	        1.177595e+04
        9.043210e+00	        1.172032e+04
        9.144499e+00	        1.165964e+04
        9.246921e+00	        1.159828e+04
        9.350492e+00	        1.153623e+04
        9.455222e+00	        1.147348e+04
        9.561125e+00	        1.141003e+04
        9.668214e+00	        1.134587e+04
        9.776503e+00	        1.128099e+04
        9.886005e+00	        1.121588e+04
        9.996733e+00	        1.115074e+04
        1.010870e+01	        1.108487e+04
        1.022192e+01	        1.101826e+04
        1.033641e+01	        1.095091e+04
        1.045219e+01	        1.088280e+04
        1.056926e+01	        1.081393e+04
        1.068764e+01	        1.074429e+04
        1.080734e+01	        1.067387e+04
        1.092839e+01	        1.059891e+04
        1.105080e+01	        1.051094e+04
        1.117457e+01	        1.042199e+04
        1.129973e+01	        1.033204e+04
        1.142629e+01	        1.024108e+04
        1.155427e+01	        1.014910e+04
        1.168369e+01	        1.005609e+04
        1.181455e+01	        9.962040e+03
        1.194688e+01	        9.872141e+03
        1.208069e+01	        9.795002e+03
        1.221600e+01	        9.716998e+03
        1.235282e+01	        9.638122e+03
        1.249118e+01	        9.558361e+03
        1.263109e+01	        9.477708e+03
        1.277256e+01	        9.396151e+03
        1.291562e+01	        9.313680e+03
        1.306028e+01	        9.230286e+03
        1.320657e+01	        9.145958e+03
        1.335449e+01	        9.051711e+03
        1.350406e+01	        8.949838e+03
        1.365531e+01	        8.846824e+03
        1.380826e+01	        8.742656e+03
        1.396292e+01	        8.637321e+03
        1.411931e+01	        8.530807e+03
        1.427746e+01	        8.423099e+03
        1.443737e+01	        8.314185e+03
        1.459908e+01	        8.216732e+03
        1.476259e+01	        8.121553e+03
        1.492794e+01	        8.025308e+03
        1.509514e+01	        7.927985e+03
        1.526421e+01	        7.829572e+03
        1.543518e+01	        7.730057e+03
        1.560806e+01	        7.629427e+03
        1.578288e+01	        7.527670e+03
        1.595966e+01	        7.425830e+03
        1.613841e+01	        7.328942e+03
        1.631917e+01	        7.230969e+03
        1.650195e+01	        7.131898e+03
        1.668678e+01	        7.031718e+03
        1.687368e+01	        6.930416e+03
        1.706268e+01	        6.827979e+03
        1.725379e+01	        6.724394e+03
        1.744704e+01	        6.619650e+03
        1.764245e+01	        6.526151e+03
        1.784006e+01	        6.436171e+03
        1.803988e+01	        6.345184e+03
        1.824193e+01	        6.253177e+03
        1.844625e+01	        6.160140e+03
        1.865286e+01	        6.066061e+03
        1.886178e+01	        5.970929e+03
        1.907304e+01	        5.874730e+03
        1.928667e+01	        5.777454e+03
        1.950269e+01	        5.691298e+03
        1.972113e+01	        5.604367e+03
        1.994201e+01	        5.516463e+03
        2.016537e+01	        5.427574e+03
        2.039124e+01	        5.337690e+03
        2.061963e+01	        5.246798e+03
        2.085058e+01	        5.154889e+03
        2.108411e+01	        5.061950e+03
        2.132027e+01	        4.974607e+03
        2.155906e+01	        4.896758e+03
        2.180054e+01	        4.818037e+03
        2.204471e+01	        4.738434e+03
        2.229162e+01	        4.657940e+03
        2.254130e+01	        4.576544e+03
        2.279378e+01	        4.494236e+03
        2.304908e+01	        4.411006e+03
        2.330724e+01	        4.326844e+03
        2.356829e+01	        4.241804e+03
        2.383227e+01	        4.155867e+03
        2.409920e+01	        4.068968e+03
        2.436912e+01	        3.981095e+03
        2.464207e+01	        3.892238e+03
        2.491807e+01	        3.802386e+03
        2.519717e+01	        3.711527e+03
        2.547939e+01	        3.625477e+03
        2.576477e+01	        3.564956e+03
        2.605335e+01	        3.503756e+03
        2.634516e+01	        3.441871e+03
        2.664024e+01	        3.379293e+03
        2.693862e+01	        3.316014e+03
        2.724035e+01	        3.252026e+03
        2.754545e+01	        3.187322e+03
        2.785397e+01	        3.121892e+03
        2.816595e+01	        3.055730e+03
        2.848142e+01	        2.995076e+03
        2.880043e+01	        2.933882e+03
        2.912301e+01	        2.872002e+03
        2.944920e+01	        2.809429e+03
        2.977905e+01	        2.746156e+03
        3.011259e+01	        2.682173e+03
        3.044986e+01	        2.617474e+03
        3.079092e+01	        2.552050e+03
        3.113579e+01	        2.501392e+03
        3.148453e+01	        2.452182e+03
        3.183717e+01	        2.402422e+03
        3.219376e+01	        2.352104e+03
        3.255435e+01	        2.301222e+03
        3.291897e+01	        2.249771e+03
        3.328768e+01	        2.197743e+03
        3.366052e+01	        2.145133e+03
        3.403753e+01	        2.095901e+03
        3.441877e+01	        2.056721e+03
        3.480428e+01	        2.017103e+03
        3.519410e+01	        1.977041e+03
        3.558829e+01	        1.936531e+03
        3.598690e+01	        1.895567e+03
        3.638997e+01	        1.854143e+03
        3.679756e+01	        1.812256e+03
        3.720971e+01	        1.769899e+03
        3.762647e+01	        1.728421e+03
        3.804791e+01	        1.690914e+03
        3.847406e+01	        1.652988e+03
        3.890499e+01	        1.614636e+03
        3.934075e+01	        1.575855e+03
        3.978138e+01	        1.536640e+03
        4.022696e+01	        1.496986e+03
        4.067752e+01	        1.456888e+03
        4.113313e+01	        1.419589e+03
        4.159384e+01	        1.390393e+03
        4.205971e+01	        1.360871e+03
        4.253080e+01	        1.331018e+03
        4.300716e+01	        1.300830e+03
        4.348887e+01	        1.270304e+03
        4.397596e+01	        1.239437e+03
        4.446851e+01	        1.208223e+03
        4.496658e+01	        1.176659e+03
        4.547023e+01	        1.151123e+03
        4.597952e+01	        1.127202e+03
        4.649451e+01	        1.103013e+03
        4.701528e+01	        1.078553e+03
        4.754187e+01	        1.053818e+03
        4.807436e+01	        1.028809e+03
        4.861282e+01	        1.003519e+03
        4.915731e+01	        9.779462e+02
        4.970789e+01	        9.531428e+02
        5.026464e+01	        9.334106e+02
        5.082763e+01	        9.134573e+02
        5.139693e+01	        8.932805e+02
        5.197260e+01	        8.728778e+02
        5.255472e+01	        8.522465e+02
        5.314336e+01	        8.313842e+02
        5.373859e+01	        8.102874e+02
        5.434049e+01	        7.889544e+02
        5.494913e+01	        7.701365e+02
        5.556458e+01	        7.525130e+02
        5.618694e+01	        7.346920e+02
        5.681626e+01	        7.166714e+02
        5.745263e+01	        6.984490e+02
        5.809612e+01	        6.800229e+02
        5.874683e+01	        6.613913e+02
        5.940482e+01	        6.425510e+02
        6.007019e+01	        6.275550e+02
        6.074300e+01	        6.135246e+02
        6.142335e+01	        5.993369e+02
        6.211133e+01	        5.849904e+02
        6.280700e+01	        5.704833e+02
        6.351047e+01	        5.558138e+02
        6.422182e+01	        5.409804e+02
        6.494114e+01	        5.259811e+02
        6.566851e+01	        5.127535e+02
        6.640403e+01	        5.003504e+02
        6.714779e+01	        4.878083e+02
        6.789988e+01	        4.751258e+02
        6.866039e+01	        4.623013e+02
        6.942942e+01	        4.493331e+02
        7.020706e+01	        4.362201e+02
        7.099342e+01	        4.236301e+02
        7.178858e+01	        4.152564e+02
        7.259264e+01	        4.067890e+02
        7.340572e+01	        3.982267e+02
        7.422790e+01	        3.895686e+02
        7.505929e+01	        3.808134e+02
        7.589999e+01	        3.719602e+02
        7.675011e+01	        3.630078e+02
        7.760974e+01	        3.539559e+02
        7.847901e+01	        3.449501e+02
        7.935802e+01	        3.364837e+02
        8.024686e+01	        3.279224e+02
        8.114567e+01	        3.192653e+02
        8.205454e+01	        3.105111e+02
        8.297359e+01	        3.016589e+02
        8.390294e+01	        2.927075e+02
        8.484269e+01	        2.836565e+02
        8.579297e+01	        2.773719e+02
        8.675389e+01	        2.711641e+02
        8.772558e+01	        2.648867e+02
        8.870815e+01	        2.585390e+02
        8.970173e+01	        2.521202e+02
        9.070643e+01	        2.456295e+02
        9.172239e+01	        2.390662e+02
        9.274972e+01	        2.324293e+02
        9.378856e+01	        2.270063e+02
        9.483904e+01	        2.217191e+02
        9.590129e+01	        2.163726e+02
        9.697543e+01	        2.109663e+02
        9.806160e+01	        2.054995e+02
        9.915994e+01	        1.999714e+02
        1.002706e+02	        1.943819e+02
        1.013937e+02	        1.889029e+02
        1.025293e+02	        1.845562e+02
        1.036777e+02	        1.801609e+02
        1.048389e+02	        1.757163e+02
        1.060132e+02	        1.712219e+02
        1.072006e+02	        1.666772e+02
        1.084013e+02	        1.620812e+02
        1.096154e+02	        1.574338e+02
        1.108432e+02	        1.533785e+02
        1.120847e+02	        1.498621e+02
        1.133401e+02	        1.463064e+02
        1.146095e+02	        1.427110e+02
        1.158932e+02	        1.390752e+02
        1.171913e+02	        1.353988e+02
        1.185039e+02	        1.316811e+02
        1.198312e+02	        1.279219e+02
        1.211734e+02	        1.248275e+02
        1.225306e+02	        1.218172e+02
        1.239030e+02	        1.187733e+02
        1.252907e+02	        1.156953e+02
        1.266941e+02	        1.125828e+02
        1.281131e+02	        1.094355e+02
        1.295480e+02	        1.062529e+02
        1.309990e+02	        1.032853e+02
        1.324663e+02	        1.005095e+02
        1.339500e+02	        9.770344e+01
        1.354503e+02	        9.486593e+01
        1.369674e+02	        9.199662e+01
        1.385015e+02	        8.909518e+01
        1.400528e+02	        8.619018e+01
        1.416214e+02	        8.415642e+01
        1.432077e+02	        8.209988e+01
        1.448117e+02	        8.002031e+01
        1.464336e+02	        7.791746e+01
        1.480737e+02	        7.579136e+01
        1.497322e+02	        7.364146e+01
        1.514093e+02	        7.146748e+01
        1.531052e+02	        6.957338e+01
        1.548200e+02	        6.772034e+01
        1.565541e+02	        6.584655e+01
        1.583076e+02	        6.395177e+01
        1.600807e+02	        6.203579e+01
        1.618737e+02	        6.009899e+01
        1.636867e+02	        5.825640e+01
        1.655201e+02	        5.671519e+01
        1.673740e+02	        5.515672e+01
        1.692487e+02	        5.358074e+01
        1.711444e+02	        5.198711e+01
        1.730613e+02	        5.037564e+01
        1.749996e+02	        4.874613e+01
        1.769597e+02	        4.747576e+01
        1.789418e+02	        4.627379e+01
        1.809460e+02	        4.505837e+01
        1.829727e+02	        4.382934e+01
        1.850221e+02	        4.258655e+01
        1.870944e+02	        4.132983e+01
        1.891900e+02	        4.006052e+01
        1.913090e+02	        3.891743e+01
        1.934517e+02	        3.776153e+01
        1.956185e+02	        3.659297e+01
        1.978095e+02	        3.541140e+01
        2.000251e+02	        3.421660e+01
        2.022655e+02	        3.304932e+01
        2.045309e+02	        3.214156e+01
        2.068218e+02	        3.122364e+01
        2.091383e+02	        3.029544e+01
        2.114807e+02	        2.935685e+01
        2.138494e+02	        2.840778e+01
        2.162446e+02	        2.744913e+01
        2.186667e+02	        2.670065e+01
        2.211159e+02	        2.594380e+01
        2.235925e+02	        2.517846e+01
        2.260968e+02	        2.440455e+01
        2.286292e+02	        2.362197e+01
        2.311900e+02	        2.283063e+01
        2.337794e+02	        2.217524e+01
        2.363979e+02	        2.153546e+01
        2.390456e+02	        2.088852e+01
        2.417231e+02	        2.023433e+01
        2.444305e+02	        1.957271e+01
        2.471682e+02	        1.890372e+01
        2.499366e+02	        1.832606e+01
        2.527360e+02	        1.775983e+01
        2.555668e+02	        1.718726e+01
        2.584293e+02	        1.660842e+01
        2.613238e+02	        1.602313e+01
        2.642508e+02	        1.545718e+01
        2.672105e+02	        1.500902e+01
        2.702034e+02	        1.455584e+01
        2.732298e+02	        1.409759e+01
        2.762901e+02	        1.363421e+01
        2.793847e+02	        1.316567e+01
        2.825139e+02	        1.271251e+01
        2.856782e+02	        1.231899e+01
        2.888780e+02	        1.192106e+01
        2.921136e+02	        1.151868e+01
        2.953854e+02	        1.111180e+01
        2.986938e+02	        1.070036e+01
        3.020393e+02	        1.034236e+01
        3.054223e+02	        1.002339e+01
        3.088432e+02	        9.700840e+00
        3.123024e+02	        9.374716e+00
        3.158004e+02	        9.044939e+00
        3.193375e+02	        8.711469e+00
        3.229142e+02	        8.385897e+00
        3.265310e+02	        8.061774e+00
        3.301883e+02	        7.734022e+00
        3.338866e+02	        7.402558e+00
        3.376263e+02	        7.067465e+00
        3.414079e+02	        6.814663e+00
        3.452318e+02	        6.581303e+00
        3.490986e+02	        6.345332e+00
        3.530086e+02	        6.106723e+00
        3.569625e+02	        5.865452e+00
        3.609607e+02	        5.623882e+00
        3.650036e+02	        5.417424e+00
        3.690918e+02	        5.208684e+00
        3.732258e+02	        4.997659e+00
        3.774062e+02	        4.784271e+00
        3.816333e+02	        4.568496e+00
        3.859078e+02	        4.370357e+00
        3.902301e+02	        4.183129e+00
        3.946009e+02	        3.993807e+00
        3.990206e+02	        3.802365e+00
        4.034898e+02	        3.608811e+00
        4.080091e+02	        3.429721e+00
        4.125790e+02	        3.267889e+00
        4.172001e+02	        3.104243e+00
        4.218730e+02	        2.938764e+00
        4.265982e+02	        2.771433e+00
        4.313763e+02	        2.609594e+00
        4.362079e+02	        2.456379e+00
        4.410936e+02	        2.301493e+00
        4.460341e+02	        2.144897e+00
        4.510299e+02	        1.986551e+00
        4.560817e+02	        1.834294e+00
        4.611900e+02	        1.681599e+00
        4.663556e+02	        1.527194e+00
        4.715790e+02	        1.371061e+00
        4.768609e+02	        1.224834e+00
        4.822020e+02	        1.077922e+00
        4.876029e+02	        9.293719e-01
        4.930643e+02	        7.763580e-01
        4.985868e+02	        6.176696e-01
        5.041712e+02	        4.572050e-01
        5.098182e+02	        2.886548e-01
        5.155284e+02	        1.144942e-01
        5.213026e+02	        1.493110e-02
        5.271414e+02	        1.468627e-02
        5.330457e+02	        1.444020e-02
        5.390161e+02	        1.419154e-02
        5.450533e+02	        1.394018e-02
        5.511582e+02	        1.368429e-02
        5.573314e+02	        1.342052e-02
        5.635738e+02	        1.319422e-02
        5.698861e+02	        1.298210e-02
        5.762691e+02	        1.277058e-02
        5.827236e+02	        1.256123e-02
        5.892504e+02	        1.235228e-02
        5.958503e+02	        1.214096e-02
        6.025241e+02	        1.192750e-02
        6.092727e+02	        1.172024e-02
        6.160968e+02	        1.151969e-02
        6.229974e+02	        1.131718e-02
        6.299753e+02	        1.111519e-02
        6.370313e+02	        1.092757e-02
        6.441664e+02	        1.073885e-02
        6.513814e+02	        1.054861e-02
        6.586772e+02	        1.037515e-02
        6.660547e+02	        1.020593e-02
        6.735148e+02	        1.003485e-02
        6.810585e+02	        9.857453e-03
        6.886867e+02	        9.673466e-03
        6.964003e+02	        9.493984e-03
        7.042004e+02	        9.322081e-03
        7.120878e+02	        9.168915e-03
        7.200635e+02	        9.015405e-03
        7.281286e+02	        8.860975e-03
        7.362840e+02	        8.705251e-03
        7.445307e+02	        8.547982e-03
        7.528698e+02	        8.387758e-03
        7.613023e+02	        8.230820e-03
        7.698293e+02	        8.094273e-03
        7.784518e+02	        7.958741e-03
        7.871708e+02	        7.822953e-03
        7.959875e+02	        7.686085e-03
        8.049030e+02	        7.548010e-03
        8.139183e+02	        7.419535e-03
        8.230346e+02	        7.295737e-03
        8.322529e+02	        7.164781e-03
        8.415746e+02	        7.033891e-03
        8.510006e+02	        6.903692e-03
        8.605323e+02	        6.774138e-03
        8.701706e+02	        6.651331e-03
        8.799170e+02	        6.531527e-03
        8.897725e+02	        6.410693e-03
        8.997384e+02	        6.288736e-03
        9.098159e+02	        6.162352e-03
        9.200063e+02	        6.040986e-03
        9.303108e+02	        5.933894e-03
        9.407307e+02	        5.831333e-03
        9.512674e+02	        5.727912e-03
        9.619221e+02	        5.623613e-03
        9.726961e+02	        5.518391e-03
        9.835907e+02	        5.414258e-03
        9.946074e+02	        5.306780e-03
        1.005748e+03	        5.202085e-03
        1.017012e+03	        5.100958e-03
        1.028403e+03	        5.004024e-03
        1.039922e+03	        4.908793e-03
        1.051570e+03	        4.819700e-03
        1.063348e+03	        4.729836e-03
        1.075258e+03	        4.634770e-03
        1.087301e+03	        4.540217e-03
        1.099480e+03	        4.446049e-03
        1.111794e+03	        4.358825e-03
        1.124247e+03	        4.277994e-03
        1.136839e+03	        4.196900e-03
        1.149572e+03	        4.115524e-03
        1.162448e+03	        3.990551e-03
        1.175468e+03	        3.875038e-03
        1.188634e+03	        3.769427e-03
        1.201947e+03	        3.672362e-03
        1.215409e+03	        3.577313e-03
        1.229023e+03	        3.490691e-03
        1.242788e+03	        3.408200e-03
        1.256708e+03	        3.326371e-03
        1.270784e+03	        3.244577e-03
        1.285017e+03	        3.167720e-03
        1.299410e+03	        3.091963e-03
        1.313964e+03	        3.016674e-03
        1.328681e+03	        2.941783e-03
        1.343563e+03	        2.869435e-03
        1.358612e+03	        2.801685e-03
        1.373829e+03	        2.736018e-03
        1.389216e+03	        2.670918e-03
        1.404776e+03	        2.606225e-03
        1.420510e+03	        2.541670e-03
        1.436421e+03	        2.478059e-03
        1.452509e+03	        2.414319e-03
        1.468778e+03	        2.352422e-03
        1.485229e+03	        2.290855e-03
        1.501865e+03	        2.229963e-03
        1.518686e+03	        2.167832e-03
        1.535696e+03	        2.102401e-03
        1.552897e+03	        2.027731e-03
        1.570290e+03	        1.911016e-03
        1.587878e+03	        1.871574e-03
        1.605663e+03	        1.833547e-03
        1.623647e+03	        1.801844e-03
        1.641833e+03	        1.770194e-03
        1.660222e+03	        1.738562e-03
        1.678818e+03	        1.706658e-03
        1.697621e+03	        1.674428e-03
        1.716635e+03	        1.642503e-03
        1.735863e+03	        1.612027e-03
        1.755305e+03	        1.583027e-03
        1.774965e+03	        1.554040e-03
        1.794846e+03	        1.526388e-03
        1.814949e+03	        1.498672e-03
        1.835277e+03	        1.470688e-03
        1.855833e+03	        1.442420e-03
        1.876620e+03	        1.413857e-03
        1.897639e+03	        1.385061e-03
        1.918893e+03	        1.357576e-03
        1.940386e+03	        1.330730e-03
        1.962119e+03	        1.306562e-03
        1.984096e+03	        1.282388e-03
        2.006319e+03	        1.257967e-03
        2.028790e+03	        1.233348e-03
        2.051514e+03	        1.208507e-03
        2.074492e+03	        1.184178e-03
        2.097727e+03	        1.161054e-03
        2.121223e+03	        1.138405e-03
        2.144981e+03	        1.117766e-03
        2.169006e+03	        1.097254e-03
        2.193300e+03	        1.076536e-03
        2.217866e+03	        1.055805e-03
        2.242707e+03	        1.035154e-03
        2.267827e+03	        1.014364e-03
        2.293228e+03	        9.944551e-04
        2.318913e+03	        9.749883e-04
        2.344886e+03	        9.560629e-04
        2.371150e+03	        9.374394e-04
        2.397708e+03	        9.188308e-04
        2.424563e+03	        9.004820e-04
        2.451720e+03	        8.819604e-04
        2.479180e+03	        8.632642e-04
        2.506948e+03	        8.457872e-04
        2.535027e+03	        8.289820e-04
        2.563421e+03	        8.135919e-04
        2.592132e+03	        7.981377e-04
        2.621165e+03	        7.826014e-04
        2.650524e+03	        7.669078e-04
        2.680211e+03	        7.510472e-04
        2.710231e+03	        7.350269e-04
        2.740587e+03	        7.203335e-04
        2.771282e+03	        7.068605e-04
        2.802322e+03	        6.939505e-04
        2.833710e+03	        6.808689e-04
        2.865449e+03	        6.676411e-04
        2.897543e+03	        6.542742e-04
        2.929997e+03	        6.408060e-04
        2.962814e+03	        6.272923e-04
        2.995999e+03	        6.143894e-04
        3.029556e+03	        6.032613e-04
        3.063488e+03	        5.920106e-04
        3.097801e+03	        5.806342e-04
        3.132498e+03	        5.691333e-04
        3.167583e+03	        5.576844e-04
        3.203062e+03	        5.463040e-04
        3.238938e+03	        5.348114e-04
        3.275216e+03	        5.238247e-04
        3.311900e+03	        5.135255e-04
        3.348994e+03	        5.031510e-04
        3.386505e+03	        4.928085e-04
        3.424435e+03	        4.823739e-04
        3.462791e+03	        4.718340e-04
        3.501576e+03	        4.615012e-04
        3.540795e+03	        4.516431e-04
        3.580454e+03	        4.424711e-04
        3.620557e+03	        4.337515e-04
        3.661109e+03	        4.250894e-04
        3.702115e+03	        4.163304e-04
        3.743580e+03	        4.074883e-04
        3.785510e+03	        3.989295e-04
        3.827910e+03	        3.903759e-04
        3.870784e+03	        3.818157e-04
        3.914139e+03	        3.734847e-04
        3.957979e+03	        3.655930e-04
        4.002311e+03	        3.577158e-04
        4.047138e+03	        3.503640e-04
        4.092468e+03	        3.430401e-04
        4.138306e+03	        3.357202e-04
        4.184657e+03	        3.283543e-04
        4.231527e+03	        3.210418e-04
        4.278923e+03	        3.139997e-04
        4.326849e+03	        3.070448e-04
        4.375311e+03	        3.001645e-04
        4.424317e+03	        2.932297e-04
        4.473872e+03	        2.862397e-04
        4.523981e+03	        2.791944e-04
        4.574652e+03	        2.723779e-04
        4.625890e+03	        2.660151e-04
        4.677703e+03	        2.600264e-04
        4.730095e+03	        2.541829e-04
        4.783075e+03	        2.482744e-04
        4.836647e+03	        2.422615e-04
        4.890820e+03	        2.363480e-04
        4.945600e+03	        2.304791e-04
        5.000993e+03	        2.246298e-04
        5.057007e+03	        2.186626e-04
        5.113648e+03	        2.121369e-04
        5.170923e+03	        2.061335e-04
        5.228840e+03	        2.013779e-04
        5.287405e+03	        1.966561e-04
        5.346627e+03	        1.918934e-04
        5.406512e+03	        1.871423e-04
        5.467067e+03	        1.827823e-04
        5.528301e+03	        1.785036e-04
        5.590221e+03	        1.743124e-04
        5.652834e+03	        1.701161e-04
        5.716149e+03	        1.659171e-04
        5.780172e+03	        1.617059e-04
        5.844913e+03	        1.574732e-04
        5.910379e+03	        1.533604e-04
        5.976578e+03	        1.493951e-04
        6.043519e+03	        1.455727e-04
        6.111209e+03	        1.416669e-04
        6.179658e+03	        1.376757e-04
        6.248873e+03	        1.333657e-04
        6.318863e+03	        1.297872e-04
        6.389638e+03	        1.262836e-04
        6.461205e+03	        1.229596e-04
        6.533574e+03	        1.196775e-04
        6.606753e+03	        1.163564e-04
        6.680752e+03	        1.130582e-04
        6.755579e+03	        1.097546e-04
        6.831245e+03	        1.064484e-04
        6.907759e+03	        1.030836e-04
        6.985129e+03	        9.977026e-05
        7.063366e+03	        9.642377e-05
        7.142479e+03	        9.289036e-05
        7.222478e+03	        8.915793e-05
        7.303374e+03	        8.457541e-05
        7.385175e+03	        7.922122e-05
        7.467893e+03	        7.716825e-05
        7.551537e+03	        7.528989e-05
        7.636118e+03	        7.356016e-05
        7.721646e+03	        7.185472e-05
        7.808132e+03	        7.016093e-05
        7.895587e+03	        6.845058e-05
        7.984022e+03	        6.672149e-05
        8.073446e+03	        6.507056e-05
        8.163873e+03	        6.347753e-05
        8.255312e+03	        6.187685e-05
        8.347776e+03	        6.026756e-05
        8.441275e+03	        5.864232e-05
        8.535822e+03	        5.700093e-05
        8.631427e+03	        5.538467e-05
        8.728103e+03	        5.377113e-05
        8.825862e+03	        5.215505e-05
        8.924716e+03	        5.063855e-05
        9.024678e+03	        4.922295e-05
        9.125758e+03	        4.784112e-05
        9.227971e+03	        4.646155e-05
        9.331329e+03	        4.504493e-05
        9.435845e+03	        4.359273e-05
        9.541531e+03	        4.209736e-05
        9.648401e+03	        4.023044e-05
        9.756468e+03	        3.915990e-05
        9.865745e+03	        3.809881e-05
        9.976246e+03	        3.703273e-05
        1.008798e+04	        3.595692e-05
        1.020098e+04	        3.490286e-05
        1.031523e+04	        3.387685e-05
        1.043077e+04	        3.286598e-05
        1.054760e+04	        3.193858e-05
        1.066573e+04	        3.101024e-05
        1.078520e+04	        3.007487e-05
        1.090600e+04	        2.913493e-05
        1.102815e+04	        2.820462e-05
        1.115167e+04	        2.726675e-05
        1.127657e+04	        2.634515e-05
        1.140288e+04	        2.548215e-05
        1.153059e+04	        2.460115e-05
        1.165974e+04	        2.369863e-05
        1.179034e+04	        2.276060e-05
        1.192240e+04	        2.171331e-05
        1.205593e+04	        2.039174e-05
        1.219096e+04	        1.975431e-05
        1.232751e+04	        1.919327e-05
        1.246558e+04	        1.863209e-05
        1.260520e+04	        1.806352e-05
        1.274639e+04	        1.748887e-05
        1.288915e+04	        1.690719e-05
        1.303352e+04	        1.632505e-05
        1.317950e+04	        1.572370e-05
        1.332712e+04	        1.514078e-05
        1.347639e+04	        1.457500e-05
        1.362733e+04	        1.398989e-05
        1.377996e+04	        1.336780e-05
        1.393431e+04	        1.270752e-05
        1.409038e+04	        1.195223e-05
        1.424820e+04	        1.124411e-05
        1.440778e+04	        1.096031e-05
        1.456916e+04	        1.067477e-05
        1.473234e+04	        1.038635e-05
        1.489735e+04	        1.009582e-05
        1.506421e+04	        9.803355e-06
        1.523293e+04	        9.522296e-06
        1.540355e+04	        9.248469e-06
        1.557608e+04	        8.973908e-06
        1.575054e+04	        8.695832e-06
        1.592695e+04	        8.413300e-06
        1.610534e+04	        8.130080e-06
        1.628573e+04	        7.876773e-06
        1.646814e+04	        7.621086e-06
        1.665259e+04	        7.334605e-06
        1.683910e+04	        7.117479e-06
        1.702771e+04	        6.898618e-06
        1.721843e+04	        6.681251e-06
        1.741128e+04	        6.494006e-06
        1.760630e+04	        6.305370e-06
        1.780350e+04	        6.114266e-06
        1.800291e+04	        5.921226e-06
        1.820455e+04	        5.726910e-06
        1.840845e+04	        5.540742e-06
        1.861463e+04	        5.358634e-06
        1.882312e+04	        5.171943e-06
        1.903395e+04	        4.971216e-06
        1.924714e+04	        4.782805e-06
        1.946272e+04	        4.625461e-06
        1.968071e+04	        4.477152e-06
        1.990114e+04	        4.326936e-06
        2.012405e+04	        4.175046e-06
        2.034945e+04	        4.020428e-06
        2.057737e+04	        3.881005e-06
        2.080785e+04	        3.742592e-06
        2.104091e+04	        3.601771e-06
        2.127657e+04	        3.456582e-06
        2.151488e+04	        3.309276e-06
        2.175586e+04	        3.174184e-06
        2.199954e+04	        3.053092e-06
        2.224594e+04	        2.930748e-06
        2.249511e+04	        2.810007e-06
        2.274706e+04	        2.694871e-06
        2.300184e+04	        2.578299e-06
        2.325947e+04	        2.460711e-06
        2.351999e+04	        2.347314e-06
        2.378343e+04	        2.239102e-06
        2.404981e+04	        2.130037e-06
        2.431918e+04	        2.020380e-06
        2.459157e+04	        1.911823e-06
        2.486701e+04	        1.802020e-06
        2.514553e+04	        1.692368e-06
        2.542717e+04	        1.587995e-06
        2.571197e+04	        1.481494e-06
        2.599996e+04	        1.369474e-06
        2.629117e+04	        1.264451e-06
        2.658564e+04	        1.155583e-06
        2.688341e+04	        1.042036e-06
        2.718452e+04	        9.192271e-07
        2.748900e+04	        7.895388e-07
        2.779689e+04	        6.519190e-07
        2.810823e+04	        4.799314e-07
        2.842306e+04	        1.728247e-07
        2.874141e+04	        5.650893e-08
        2.906333e+04	        5.135070e-08
        2.938885e+04	        4.570695e-08
        2.971802e+04	        3.936613e-08
        3.005088e+04	        3.346788e-08
        3.038746e+04	        2.683690e-08
        3.072782e+04	        1.784522e-08
        3.107198e+04	        2.864026e-09
        3.142000e+04	        2.628099e-09
        3.177192e+04	        2.373147e-09
        3.212779e+04	        2.071488e-09
        3.248763e+04	        1.780148e-09
        3.285151e+04	        1.553648e-09
        3.321946e+04	        1.278490e-09
        3.359154e+04	        8.070198e-10
        3.396778e+04	        7.464121e-10
        3.434823e+04	        7.009741e-10
        3.473295e+04	        6.520039e-10
        3.512198e+04	        5.729151e-10
        3.551536e+04	        5.463135e-10
        3.591315e+04	        5.187424e-10
        3.631540e+04	        4.898855e-10
        3.672215e+04	        4.616585e-10
        3.713345e+04	        4.319581e-10
        3.754937e+04	        3.931699e-10
        3.796994e+04	        3.637297e-10
        3.839522e+04	        3.454615e-10
        3.882526e+04	        3.249119e-10
        3.926013e+04	        3.062892e-10
        3.969986e+04	        2.877018e-10
        4.014452e+04	        2.606501e-10
        4.059416e+04	        2.483452e-10
        4.104883e+04	        2.367369e-10
        4.150860e+04	        2.239079e-10
        4.197351e+04	        2.134887e-10
        4.244364e+04	        2.010390e-10
        4.291903e+04	        1.881771e-10
        4.339974e+04	        1.807217e-10
        4.388584e+04	        1.727508e-10
        4.437738e+04	        1.655434e-10
        4.487443e+04	        1.582107e-10
        4.537705e+04	        1.500205e-10
        4.588529e+04	        1.446743e-10
        4.639923e+04	        1.392432e-10
        4.691893e+04	        1.340108e-10
        4.744444e+04	        1.287204e-10
        4.797584e+04	        1.232578e-10
        4.851319e+04	        1.187395e-10
        4.905657e+04	        1.142151e-10
        4.960602e+04	        1.096420e-10
        5.016164e+04	        1.048044e-10
        5.072347e+04	        1.004022e-10
        5.129160e+04	        9.595190e-11
        5.186609e+04	        9.206183e-11
        5.244702e+04	        8.808046e-11
        5.303445e+04	        8.416090e-11
        5.362846e+04	        8.009859e-11
        5.422913e+04	        7.620754e-11
        5.483652e+04	        7.245988e-11
        5.545071e+04	        6.864813e-11
        5.607179e+04	        6.438514e-11
        5.669982e+04	        6.055197e-11
        5.733489e+04	        5.718642e-11
        5.797707e+04	        5.368328e-11
        5.862644e+04	        4.939091e-11
        5.928308e+04	        4.628184e-11
        5.994708e+04	        4.344338e-11
        6.061852e+04	        4.082464e-11
        6.129748e+04	        3.746538e-11
        6.198404e+04	        3.559558e-11
        6.267829e+04	        3.357660e-11
        6.338032e+04	        3.129098e-11
        6.409021e+04	        2.919428e-11
        6.480805e+04	        2.785035e-11
        6.553393e+04	        2.657395e-11
        6.626795e+04	        2.518377e-11
        6.701018e+04	        2.410619e-11
        6.776073e+04	        2.299635e-11
        6.851968e+04	        2.179703e-11
        6.928713e+04	        2.081548e-11
        7.006318e+04	        1.985596e-11
        7.084793e+04	        1.886909e-11
        7.164146e+04	        1.789899e-11
        7.244388e+04	        1.698671e-11
        7.325529e+04	        1.606990e-11
        7.407578e+04	        1.515686e-11
        7.490547e+04	        1.430804e-11
        7.574444e+04	        1.344612e-11
        7.659282e+04	        1.259085e-11
        7.745070e+04	        1.179088e-11
        7.831818e+04	        1.100466e-11
        7.919539e+04	        1.024666e-11
        8.008241e+04	        9.498117e-12
        8.097938e+04	        8.685368e-12
        8.188638e+04	        7.922902e-12
        8.280355e+04	        7.121710e-12
        8.373099e+04	        6.285554e-12
        8.466882e+04	        5.521097e-12
        8.561715e+04	        4.593140e-12
        8.657611e+04	        3.859797e-12
        8.754580e+04	        3.070419e-12
        8.852636e+04	        2.381306e-12
        8.951790e+04	        1.951372e-12
        9.052054e+04	        1.510452e-12
        9.153442e+04	        1.049442e-12
        9.255965e+04	        4.861242e-13
        9.359636e+04	        1.280655e-13
        9.464469e+04	        9.531534e-14
        9.570475e+04	        8.729921e-14
        9.677669e+04	        7.918887e-14
        9.786064e+04	        7.057780e-14
        9.895673e+04	        6.166113e-14
        1.000651e+05	        5.148379e-14
        1.011859e+05	        3.889039e-14
        1.023192e+05	        1.967943e-14
        1.034652e+05	        1.106069e-14
        1.046241e+05	        3.289196e-15
        1.057959e+05	        0.000000e+00
        1.069809e+05	        0.000000e+00
        1.081791e+05	        0.000000e+00
        1.093908e+05	        0.000000e+00

