# -------------------------------------------------------------------------------
#		C:/Users/Michael Chadolias/Documents/CubeSat/Radiation Analysis (Viyas Da Best)/Scenarios/CDR/SSO_500km/dose_muscle.txt
# -------------------------------------------------------------------------------
# ID: 1 2 1

# Graph: Dose - Shieldose2 
# min: -4.9895 0.01 max: 104.999 556227
# X-axis: Thickness  (mm Al)
# Y-axis L: Dose (rad)
# -------------------------------------------------------------------------------
# Curve 0: Trapped electrons
# Params: 2 5 #ff5b17 1 1
#	Thickness  (mm Al)		Dose (rad)
# -------------------------------------------------------------------------------
            0.010000	        4.287185e+05
            0.100000	        1.001863e+05
            0.200000	        4.587103e+04
            0.300000	        2.644689e+04
            0.400000	        1.753753e+04
            0.500000	        1.270628e+04
            0.600000	        9.774200e+03
            0.700000	        7.839585e+03
            0.800000	        6.482885e+03
            0.900000	        5.486177e+03
            1.000000	        4.725484e+03
            1.100000	        4.126415e+03
            1.200000	        3.642981e+03
            1.300000	        3.244509e+03
            1.400000	        2.908360e+03
            1.500000	        2.619544e+03
            1.600000	        2.368560e+03
            1.700000	        2.147890e+03
            1.800000	        1.951812e+03
            1.900000	        1.776427e+03
            2.000000	        1.618807e+03
            2.250000	        1.288664e+03
            2.500000	        1.030941e+03
            2.750000	        8.283033e+02
            3.000000	        6.678755e+02
            3.250000	        5.399358e+02
            3.500000	        4.369421e+02
            3.750000	        3.533374e+02
            4.000000	        2.851624e+02
            4.250000	        2.294921e+02
            4.500000	        1.841099e+02
            4.750000	        1.472416e+02
            5.000000	        1.174042e+02
            5.250000	        9.334555e+01
            5.500000	        7.400922e+01
            5.750000	        5.851022e+01
            6.000000	        4.611501e+01
            6.250000	        3.622231e+01
            6.500000	        2.834425e+01
            6.750000	        2.208702e+01
            7.000000	        1.713312e+01
            7.250000	        1.322633e+01
            7.500000	        1.015911e+01
            7.750000	        7.762911e+00
            8.000000	        5.900826e+00
            8.250000	        4.461777e+00
            8.500000	        3.355822e+00
            8.750000	        2.510530e+00
            9.000000	        1.867811e+00
            9.500000	        1.016017e+00
           10.000000	        5.381125e-01
           10.500000	        2.760130e-01
           11.000000	        1.363114e-01
           11.500000	        6.451526e-02
           12.000000	        2.916439e-02
           12.500000	        1.255261e-02
           13.000000	        5.113084e-03
           13.500000	        1.944921e-03
           14.000000	        6.746435e-04
           14.500000	        2.098580e-04
           15.000000	        5.709214e-05
           16.000000	        4.799375e-06
           17.000000	        4.896296e-07
           18.000000	        7.312571e-08
           19.000000	        3.168257e-09
           20.000000	        0.000000e+00
           30.000000	        0.000000e+00
           40.000000	        0.000000e+00
           50.000000	        0.000000e+00
          100.000000	        0.000000e+00

# -------------------------------------------------------------------------------
# Curve 1: Trapped protons
# Params: 2 5 #3690cb 1 1
#	Thickness  (mm Al)		Dose (rad)
# -------------------------------------------------------------------------------
            0.010000	        1.469723e+04
            0.100000	        1.454929e+03
            0.200000	        7.099141e+02
            0.300000	        4.727318e+02
            0.400000	        3.603353e+02
            0.500000	        2.960527e+02
            0.600000	        2.554899e+02
            0.700000	        2.298122e+02
            0.800000	        2.106648e+02
            0.900000	        1.967693e+02
            1.000000	        1.845126e+02
            1.100000	        1.761053e+02
            1.200000	        1.672277e+02
            1.300000	        1.604197e+02
            1.400000	        1.541542e+02
            1.500000	        1.487764e+02
            1.600000	        1.443320e+02
            1.700000	        1.391682e+02
            1.800000	        1.357218e+02
            1.900000	        1.324506e+02
            2.000000	        1.290778e+02
            2.250000	        1.222839e+02
            2.500000	        1.168791e+02
            2.750000	        1.122970e+02
            3.000000	        1.093439e+02
            3.250000	        1.059442e+02
            3.500000	        1.034451e+02
            3.750000	        1.014111e+02
            4.000000	        9.887391e+01
            4.250000	        9.684258e+01
            4.500000	        9.532048e+01
            4.750000	        9.320548e+01
            5.000000	        9.201933e+01
            5.250000	        9.008441e+01
            5.500000	        8.848467e+01
            5.750000	        8.722201e+01
            6.000000	        8.595528e+01
            6.250000	        8.500586e+01
            6.500000	        8.268948e+01
            6.750000	        8.247099e+01
            7.000000	        8.118050e+01
            7.250000	        7.974019e+01
            7.500000	        7.909160e+01
            7.750000	        7.722991e+01
            8.000000	        7.780195e+01
            8.250000	        7.677914e+01
            8.500000	        7.474949e+01
            8.750000	        7.446240e+01
            9.000000	        7.313939e+01
            9.500000	        7.175436e+01
           10.000000	        7.066570e+01
           10.500000	        6.957777e+01
           11.000000	        6.791597e+01
           11.500000	        6.645305e+01
           12.000000	        6.559514e+01
           12.500000	        6.340476e+01
           13.000000	        6.295111e+01
           13.500000	        6.232271e+01
           14.000000	        6.035913e+01
           14.500000	        5.902768e+01
           15.000000	        5.851614e+01
           16.000000	        5.664687e+01
           17.000000	        5.437015e+01
           18.000000	        5.283413e+01
           19.000000	        5.129206e+01
           20.000000	        4.972960e+01
           30.000000	        3.737228e+01
           40.000000	        2.894035e+01
           50.000000	        2.343976e+01
          100.000000	        7.816465e+00

# -------------------------------------------------------------------------------
# Curve 2: Solar protons
# Params: 2 5 #e086ff 1 1
#	Thickness  (mm Al)		Dose (rad)
# -------------------------------------------------------------------------------
            0.010000	        1.122851e+05
            0.100000	        2.551839e+04
            0.200000	        1.403080e+04
            0.300000	        9.636047e+03
            0.400000	        7.348948e+03
            0.500000	        5.928276e+03
            0.600000	        4.929265e+03
            0.700000	        4.233366e+03
            0.800000	        3.674370e+03
            0.900000	        3.260011e+03
            1.000000	        2.889380e+03
            1.100000	        2.637437e+03
            1.200000	        2.375483e+03
            1.300000	        2.182338e+03
            1.400000	        2.004410e+03
            1.500000	        1.859491e+03
            1.600000	        1.737577e+03
            1.700000	        1.605569e+03
            1.800000	        1.514209e+03
            1.900000	        1.429207e+03
            2.000000	        1.342372e+03
            2.250000	        1.168618e+03
            2.500000	        1.028350e+03
            2.750000	        9.125252e+02
            3.000000	        8.323387e+02
            3.250000	        7.484328e+02
            3.500000	        6.858810e+02
            3.750000	        6.344930e+02
            4.000000	        5.797624e+02
            4.250000	        5.367391e+02
            4.500000	        5.035391e+02
            4.750000	        4.654730e+02
            5.000000	        4.411792e+02
            5.250000	        4.100554e+02
            5.500000	        3.850317e+02
            5.750000	        3.648775e+02
            6.000000	        3.459917e+02
            6.250000	        3.309496e+02
            6.500000	        3.048798e+02
            6.750000	        2.982629e+02
            7.000000	        2.828039e+02
            7.250000	        2.671871e+02
            7.500000	        2.582194e+02
            7.750000	        2.408227e+02
            8.000000	        2.414425e+02
            8.250000	        2.305613e+02
            8.500000	        2.137035e+02
            8.750000	        2.088370e+02
            9.000000	        1.976695e+02
            9.500000	        1.843193e+02
           10.000000	        1.735329e+02
           10.500000	        1.633863e+02
           11.000000	        1.514083e+02
           11.500000	        1.413862e+02
           12.000000	        1.347353e+02
           12.500000	        1.232074e+02
           13.000000	        1.193130e+02
           13.500000	        1.148280e+02
           14.000000	        1.059381e+02
           14.500000	        9.989694e+01
           15.000000	        9.681221e+01
           16.000000	        8.841435e+01
           17.000000	        7.971759e+01
           18.000000	        7.377756e+01
           19.000000	        6.821727e+01
           20.000000	        6.307036e+01
           30.000000	        3.256851e+01
           40.000000	        1.992974e+01
           50.000000	        1.363544e+01
          100.000000	        3.241936e+00

# -------------------------------------------------------------------------------
# Curve 3: Secondary photons
# Params: 2 5 #14bf4c 1 1
#	Thickness  (mm Al)		Dose (rad)
# -------------------------------------------------------------------------------
            0.010000	        5.257443e+02
            0.100000	        2.119788e+02
            0.200000	        1.166832e+02
            0.300000	        7.663190e+01
            0.400000	        5.592873e+01
            0.500000	        4.388444e+01
            0.600000	        3.614037e+01
            0.700000	        3.084165e+01
            0.800000	        2.699886e+01
            0.900000	        2.398308e+01
            1.000000	        2.155119e+01
            1.100000	        1.971534e+01
            1.200000	        1.815933e+01
            1.300000	        1.673476e+01
            1.400000	        1.552400e+01
            1.500000	        1.450729e+01
            1.600000	        1.359828e+01
            1.700000	        1.276149e+01
            1.800000	        1.202329e+01
            1.900000	        1.135990e+01
            2.000000	        1.075598e+01
            2.250000	        9.480982e+00
            2.500000	        8.456058e+00
            2.750000	        7.609320e+00
            3.000000	        6.937979e+00
            3.250000	        6.367211e+00
            3.500000	        5.865619e+00
            3.750000	        5.467476e+00
            4.000000	        5.114387e+00
            4.250000	        4.789409e+00
            4.500000	        4.509940e+00
            4.750000	        4.262333e+00
            5.000000	        4.043216e+00
            5.250000	        3.846445e+00
            5.500000	        3.674417e+00
            5.750000	        3.520299e+00
            6.000000	        3.376957e+00
            6.250000	        3.246824e+00
            6.500000	        3.128423e+00
            6.750000	        3.020033e+00
            7.000000	        2.921031e+00
            7.250000	        2.828036e+00
            7.500000	        2.736682e+00
            7.750000	        2.655263e+00
            8.000000	        2.583767e+00
            8.250000	        2.516134e+00
            8.500000	        2.453324e+00
            8.750000	        2.394611e+00
            9.000000	        2.339733e+00
            9.500000	        2.240190e+00
           10.000000	        2.151971e+00
           10.500000	        2.074760e+00
           11.000000	        2.000853e+00
           11.500000	        1.933142e+00
           12.000000	        1.875842e+00
           12.500000	        1.823519e+00
           13.000000	        1.775314e+00
           13.500000	        1.730687e+00
           14.000000	        1.689032e+00
           14.500000	        1.650451e+00
           15.000000	        1.614884e+00
           16.000000	        1.548195e+00
           17.000000	        1.487246e+00
           18.000000	        1.430771e+00
           19.000000	        1.377709e+00
           20.000000	        1.328728e+00
           30.000000	        9.944345e-01
           40.000000	        7.790740e-01
           50.000000	        6.599872e-01
          100.000000	        2.223722e-01

# -------------------------------------------------------------------------------
# Curve 4: Total dose
# Params: 2 5 #fe1448 1 1
#	Thickness  (mm Al)		Dose (rad)
# -------------------------------------------------------------------------------
            0.010000	        5.562266e+05
            0.100000	        1.273716e+05
            0.200000	        6.072843e+04
            0.300000	        3.663230e+04
            0.400000	        2.530274e+04
            0.500000	        1.897449e+04
            0.600000	        1.499509e+04
            0.700000	        1.233360e+04
            0.800000	        1.039492e+04
            0.900000	        8.966941e+03
            1.000000	        7.820928e+03
            1.100000	        6.959673e+03
            1.200000	        6.203851e+03
            1.300000	        5.604001e+03
            1.400000	        5.082448e+03
            1.500000	        4.642319e+03
            1.600000	        4.264067e+03
            1.700000	        3.905388e+03
            1.800000	        3.613766e+03
            1.900000	        3.349445e+03
            2.000000	        3.101013e+03
            2.250000	        2.589047e+03
            2.500000	        2.184626e+03
            2.750000	        1.860735e+03
            3.000000	        1.616496e+03
            3.250000	        1.400680e+03
            3.500000	        1.232134e+03
            3.750000	        1.094709e+03
            4.000000	        9.689131e+02
            4.250000	        8.678632e+02
            4.500000	        7.874794e+02
            4.750000	        7.101824e+02
            5.000000	        6.546460e+02
            5.250000	        5.973318e+02
            5.500000	        5.512000e+02
            5.750000	        5.141301e+02
            6.000000	        4.814390e+02
            6.250000	        4.554246e+02
            6.500000	        4.190419e+02
            6.750000	        4.058409e+02
            7.000000	        3.840386e+02
            7.250000	        3.629817e+02
            7.500000	        3.502067e+02
            7.750000	        3.284707e+02
            8.000000	        3.277290e+02
            8.250000	        3.143184e+02
            8.500000	        2.942622e+02
            8.750000	        2.882045e+02
            9.000000	        2.750164e+02
            9.500000	        2.593298e+02
           10.000000	        2.468887e+02
           10.500000	        2.353148e+02
           11.000000	        2.214614e+02
           11.500000	        2.098369e+02
           12.000000	        2.022355e+02
           12.500000	        1.884482e+02
           13.000000	        1.840446e+02
           13.500000	        1.788834e+02
           14.000000	        1.679870e+02
           14.500000	        1.605753e+02
           15.000000	        1.569433e+02
           16.000000	        1.466094e+02
           17.000000	        1.355750e+02
           18.000000	        1.280425e+02
           19.000000	        1.208870e+02
           20.000000	        1.141287e+02
           30.000000	        7.093522e+01
           40.000000	        4.964916e+01
           50.000000	        3.773519e+01
          100.000000	        1.128077e+01

