# -------------------------------------------------------------------------------
#		C:/Users/Michael Chadolias/Documents/OMERE/LEO ISS/Proton and Ion differential flux.txt
# -------------------------------------------------------------------------------
# ID: 1 2 1

# Graph: Proton and Ion differential flux 
# min: 152.715 3.7339e-17 max: 1052.55 0.147299
# X-axis L: Energy (MeV/nuc)
# Y-axis L: flux (ion..cm^{-2}.s^{-1}.(MeV/nuc)^{-1})
# -------------------------------------------------------------------------------
# Curve 0: Diff flux - SAPPHIRE-ions, Z=1
# Params: 2 5 #ff5b17 1 1
#	Energy (MeV/nuc)		flux (ion..cm^{-2}.s^{-1}.(MeV/nuc)^{-1})
# -------------------------------------------------------------------------------
        1.000000e-01	        0.000000e+00
        2.500000e-01	        0.000000e+00
        6.300000e-01	        0.000000e+00
        1.600000e+00	        0.000000e+00
        4.000000e+00	        0.000000e+00
        1.000000e+01	        0.000000e+00
        2.500000e+01	        0.000000e+00
        6.300000e+01	        0.000000e+00
        1.600000e+02	        4.758480e-02
        4.000000e+02	        1.022679e-02
        1.000000e+03	        1.072058e-03

# -------------------------------------------------------------------------------
# Curve 1: Diff flux - SAPPHIRE-ions, Z=2
# Params: 2 5 #3690cb 1 1
#	Energy (MeV/nuc)		flux (ion..cm^{-2}.s^{-1}.(MeV/nuc)^{-1})
# -------------------------------------------------------------------------------
        1.000000e-01	        0.000000e+00
        2.500000e-01	        0.000000e+00
        6.300000e-01	        0.000000e+00
        1.600000e+00	        0.000000e+00
        4.000000e+00	        0.000000e+00
        1.000000e+01	        0.000000e+00
        2.500000e+01	        0.000000e+00
        6.300000e+01	        0.000000e+00
        1.600000e+02	        1.152353e-04
        4.000000e+02	        1.072176e-05
        1.000000e+03	        5.695855e-07

# -------------------------------------------------------------------------------
# Curve 2: Diff flux - SAPPHIRE-ions, Z=3
# Params: 2 5 #e086ff 1 1
#	Energy (MeV/nuc)		flux (ion..cm^{-2}.s^{-1}.(MeV/nuc)^{-1})
# -------------------------------------------------------------------------------
        1.000000e-01	        0.000000e+00
        2.500000e-01	        0.000000e+00
        6.300000e-01	        0.000000e+00
        1.600000e+00	        0.000000e+00
        4.000000e+00	        0.000000e+00
        1.000000e+01	        0.000000e+00
        2.500000e+01	        0.000000e+00
        6.300000e+01	        0.000000e+00
        1.600000e+02	        2.605470e-13
        4.000000e+02	        2.573222e-14
        1.000000e+03	        1.367005e-15

# -------------------------------------------------------------------------------
# Curve 3: Diff flux - SAPPHIRE-ions, Z=4
# Params: 2 5 #14bf4c 1 1
#	Energy (MeV/nuc)		flux (ion..cm^{-2}.s^{-1}.(MeV/nuc)^{-1})
# -------------------------------------------------------------------------------
        1.000000e-01	        0.000000e+00
        2.500000e-01	        0.000000e+00
        6.300000e-01	        0.000000e+00
        1.600000e+00	        0.000000e+00
        4.000000e+00	        0.000000e+00
        1.000000e+01	        0.000000e+00
        2.500000e+01	        0.000000e+00
        6.300000e+01	        0.000000e+00
        1.600000e+02	        5.575083e-13
        4.000000e+02	        5.500262e-14
        1.000000e+03	        2.921974e-15

# -------------------------------------------------------------------------------
# Curve 4: Diff flux - SAPPHIRE-ions, Z=5
# Params: 2 5 #fe1448 1 1
#	Energy (MeV/nuc)		flux (ion..cm^{-2}.s^{-1}.(MeV/nuc)^{-1})
# -------------------------------------------------------------------------------
        1.000000e-01	        0.000000e+00
        2.500000e-01	        0.000000e+00
        6.300000e-01	        0.000000e+00
        1.600000e+00	        0.000000e+00
        4.000000e+00	        0.000000e+00
        1.000000e+01	        0.000000e+00
        2.500000e+01	        0.000000e+00
        6.300000e+01	        0.000000e+00
        1.600000e+02	        1.160419e-11
        4.000000e+02	        1.147228e-12
        1.000000e+03	        6.094565e-14

# -------------------------------------------------------------------------------
# Curve 5: Diff flux - SAPPHIRE-ions, Z=6
# Params: 2 5 #169ced 1 1
#	Energy (MeV/nuc)		flux (ion..cm^{-2}.s^{-1}.(MeV/nuc)^{-1})
# -------------------------------------------------------------------------------
        1.000000e-01	        0.000000e+00
        2.500000e-01	        0.000000e+00
        6.300000e-01	        0.000000e+00
        1.600000e+00	        0.000000e+00
        4.000000e+00	        0.000000e+00
        1.000000e+01	        0.000000e+00
        2.500000e+01	        0.000000e+00
        6.300000e+01	        0.000000e+00
        1.600000e+02	        2.684982e-06
        4.000000e+02	        2.648274e-07
        1.000000e+03	        1.406876e-08

# -------------------------------------------------------------------------------
# Curve 6: Diff flux - SAPPHIRE-ions, Z=7
# Params: 2 5 #c967d0 1 1
#	Energy (MeV/nuc)		flux (ion..cm^{-2}.s^{-1}.(MeV/nuc)^{-1})
# -------------------------------------------------------------------------------
        1.000000e-01	        0.000000e+00
        2.500000e-01	        0.000000e+00
        6.300000e-01	        0.000000e+00
        1.600000e+00	        0.000000e+00
        4.000000e+00	        0.000000e+00
        1.000000e+01	        0.000000e+00
        2.500000e+01	        0.000000e+00
        6.300000e+01	        0.000000e+00
        1.600000e+02	        2.808284e-07
        4.000000e+02	        2.551778e-08
        1.000000e+03	        1.355614e-09

# -------------------------------------------------------------------------------
# Curve 7: Diff flux - SAPPHIRE-ions, Z=8
# Params: 2 5 #7def21 1 1
#	Energy (MeV/nuc)		flux (ion..cm^{-2}.s^{-1}.(MeV/nuc)^{-1})
# -------------------------------------------------------------------------------
        1.000000e-01	        0.000000e+00
        2.500000e-01	        0.000000e+00
        6.300000e-01	        0.000000e+00
        1.600000e+00	        0.000000e+00
        4.000000e+00	        0.000000e+00
        1.000000e+01	        0.000000e+00
        2.500000e+01	        0.000000e+00
        6.300000e+01	        0.000000e+00
        1.600000e+02	        4.189955e-06
        4.000000e+02	        4.610356e-07
        1.000000e+03	        2.449218e-08

# -------------------------------------------------------------------------------
# Curve 8: Diff flux - SAPPHIRE-ions, Z=9
# Params: 2 5 #ff963e 1 1
#	Energy (MeV/nuc)		flux (ion..cm^{-2}.s^{-1}.(MeV/nuc)^{-1})
# -------------------------------------------------------------------------------
        1.000000e-01	        0.000000e+00
        2.500000e-01	        0.000000e+00
        6.300000e-01	        0.000000e+00
        1.600000e+00	        0.000000e+00
        4.000000e+00	        0.000000e+00
        1.000000e+01	        0.000000e+00
        2.500000e+01	        0.000000e+00
        6.300000e+01	        0.000000e+00
        1.600000e+02	        2.048883e-10
        4.000000e+02	        2.251569e-11
        1.000000e+03	        1.196130e-12

# -------------------------------------------------------------------------------
# Curve 9: Diff flux - SAPPHIRE-ions, Z=10
# Params: 2 5 #1bcdff 1 1
#	Energy (MeV/nuc)		flux (ion..cm^{-2}.s^{-1}.(MeV/nuc)^{-1})
# -------------------------------------------------------------------------------
        1.000000e-01	        0.000000e+00
        2.500000e-01	        0.000000e+00
        6.300000e-01	        0.000000e+00
        1.600000e+00	        0.000000e+00
        4.000000e+00	        0.000000e+00
        1.000000e+01	        0.000000e+00
        2.500000e+01	        0.000000e+00
        6.300000e+01	        0.000000e+00
        1.600000e+02	        4.340913e-07
        4.000000e+02	        4.374477e-08
        1.000000e+03	        2.323909e-09

# -------------------------------------------------------------------------------
# Curve 10: Diff flux - SAPPHIRE-ions, Z=11
# Params: 2 5 #c314fe 1 1
#	Energy (MeV/nuc)		flux (ion..cm^{-2}.s^{-1}.(MeV/nuc)^{-1})
# -------------------------------------------------------------------------------
        1.000000e-01	        0.000000e+00
        2.500000e-01	        0.000000e+00
        6.300000e-01	        0.000000e+00
        1.600000e+00	        0.000000e+00
        4.000000e+00	        0.000000e+00
        1.000000e+01	        0.000000e+00
        2.500000e+01	        0.000000e+00
        6.300000e+01	        0.000000e+00
        1.600000e+02	        7.035114e-08
        4.000000e+02	        9.435147e-09
        1.000000e+03	        5.012353e-10

# -------------------------------------------------------------------------------
# Curve 11: Diff flux - SAPPHIRE-ions, Z=12
# Params: 2 5 #14ce57 1 1
#	Energy (MeV/nuc)		flux (ion..cm^{-2}.s^{-1}.(MeV/nuc)^{-1})
# -------------------------------------------------------------------------------
        1.000000e-01	        0.000000e+00
        2.500000e-01	        0.000000e+00
        6.300000e-01	        0.000000e+00
        1.600000e+00	        0.000000e+00
        4.000000e+00	        0.000000e+00
        1.000000e+01	        0.000000e+00
        2.500000e+01	        0.000000e+00
        6.300000e+01	        0.000000e+00
        1.600000e+02	        1.204209e-06
        4.000000e+02	        2.273013e-07
        1.000000e+03	        1.207521e-08

# -------------------------------------------------------------------------------
# Curve 12: Diff flux - SAPPHIRE-ions, Z=13
# Params: 2 5 #ff5b17 1 1
#	Energy (MeV/nuc)		flux (ion..cm^{-2}.s^{-1}.(MeV/nuc)^{-1})
# -------------------------------------------------------------------------------
        1.000000e-01	        0.000000e+00
        2.500000e-01	        0.000000e+00
        6.300000e-01	        0.000000e+00
        1.600000e+00	        0.000000e+00
        4.000000e+00	        0.000000e+00
        1.000000e+01	        0.000000e+00
        2.500000e+01	        0.000000e+00
        6.300000e+01	        0.000000e+00
        1.600000e+02	        1.064544e-07
        4.000000e+02	        1.425994e-08
        1.000000e+03	        7.575488e-10

# -------------------------------------------------------------------------------
# Curve 13: Diff flux - SAPPHIRE-ions, Z=14
# Params: 2 5 #3690cb 1 1
#	Energy (MeV/nuc)		flux (ion..cm^{-2}.s^{-1}.(MeV/nuc)^{-1})
# -------------------------------------------------------------------------------
        1.000000e-01	        0.000000e+00
        2.500000e-01	        0.000000e+00
        6.300000e-01	        0.000000e+00
        1.600000e+00	        0.000000e+00
        4.000000e+00	        0.000000e+00
        1.000000e+01	        0.000000e+00
        2.500000e+01	        0.000000e+00
        6.300000e+01	        0.000000e+00
        1.600000e+02	        1.040114e-06
        4.000000e+02	        1.393829e-07
        1.000000e+03	        7.404612e-09

# -------------------------------------------------------------------------------
# Curve 14: Diff flux - SAPPHIRE-ions, Z=15
# Params: 2 5 #e086ff 1 1
#	Energy (MeV/nuc)		flux (ion..cm^{-2}.s^{-1}.(MeV/nuc)^{-1})
# -------------------------------------------------------------------------------
        1.000000e-01	        0.000000e+00
        2.500000e-01	        0.000000e+00
        6.300000e-01	        0.000000e+00
        1.600000e+00	        0.000000e+00
        4.000000e+00	        0.000000e+00
        1.000000e+01	        0.000000e+00
        2.500000e+01	        0.000000e+00
        6.300000e+01	        0.000000e+00
        1.600000e+02	        4.438863e-09
        4.000000e+02	        5.950576e-10
        1.000000e+03	        3.161200e-11

# -------------------------------------------------------------------------------
# Curve 15: Diff flux - SAPPHIRE-ions, Z=16
# Params: 2 5 #14bf4c 1 1
#	Energy (MeV/nuc)		flux (ion..cm^{-2}.s^{-1}.(MeV/nuc)^{-1})
# -------------------------------------------------------------------------------
        1.000000e-01	        0.000000e+00
        2.500000e-01	        0.000000e+00
        6.300000e-01	        0.000000e+00
        1.600000e+00	        0.000000e+00
        4.000000e+00	        0.000000e+00
        1.000000e+01	        0.000000e+00
        2.500000e+01	        0.000000e+00
        6.300000e+01	        0.000000e+00
        1.600000e+02	        7.247147e-08
        4.000000e+02	        9.713912e-09
        1.000000e+03	        5.160445e-10

# -------------------------------------------------------------------------------
# Curve 16: Diff flux - SAPPHIRE-ions, Z=17
# Params: 2 5 #fe1448 1 1
#	Energy (MeV/nuc)		flux (ion..cm^{-2}.s^{-1}.(MeV/nuc)^{-1})
# -------------------------------------------------------------------------------
        1.000000e-01	        0.000000e+00
        2.500000e-01	        0.000000e+00
        6.300000e-01	        0.000000e+00
        1.600000e+00	        0.000000e+00
        4.000000e+00	        0.000000e+00
        1.000000e+01	        0.000000e+00
        2.500000e+01	        0.000000e+00
        6.300000e+01	        0.000000e+00
        1.600000e+02	        1.609837e-09
        4.000000e+02	        2.165795e-10
        1.000000e+03	        1.150563e-11

# -------------------------------------------------------------------------------
# Curve 17: Diff flux - SAPPHIRE-ions, Z=18
# Params: 2 5 #169ced 1 1
#	Energy (MeV/nuc)		flux (ion..cm^{-2}.s^{-1}.(MeV/nuc)^{-1})
# -------------------------------------------------------------------------------
        1.000000e-01	        0.000000e+00
        2.500000e-01	        0.000000e+00
        6.300000e-01	        0.000000e+00
        1.600000e+00	        0.000000e+00
        4.000000e+00	        0.000000e+00
        1.000000e+01	        0.000000e+00
        2.500000e+01	        0.000000e+00
        6.300000e+01	        0.000000e+00
        1.600000e+02	        7.414238e-09
        4.000000e+02	        9.949791e-10
        1.000000e+03	        5.285754e-11

# -------------------------------------------------------------------------------
# Curve 18: Diff flux - SAPPHIRE-ions, Z=19
# Params: 2 5 #c967d0 1 1
#	Energy (MeV/nuc)		flux (ion..cm^{-2}.s^{-1}.(MeV/nuc)^{-1})
# -------------------------------------------------------------------------------
        1.000000e-01	        0.000000e+00
        2.500000e-01	        0.000000e+00
        6.300000e-01	        0.000000e+00
        1.600000e+00	        0.000000e+00
        4.000000e+00	        0.000000e+00
        1.000000e+01	        0.000000e+00
        2.500000e+01	        0.000000e+00
        6.300000e+01	        0.000000e+00
        1.600000e+02	        1.107181e-08
        4.000000e+02	        1.490324e-09
        1.000000e+03	        7.917239e-11

# -------------------------------------------------------------------------------
# Curve 19: Diff flux - SAPPHIRE-ions, Z=20
# Params: 2 5 #7def21 1 1
#	Energy (MeV/nuc)		flux (ion..cm^{-2}.s^{-1}.(MeV/nuc)^{-1})
# -------------------------------------------------------------------------------
        1.000000e-01	        0.000000e+00
        2.500000e-01	        0.000000e+00
        6.300000e-01	        0.000000e+00
        1.600000e+00	        0.000000e+00
        4.000000e+00	        0.000000e+00
        1.000000e+01	        0.000000e+00
        2.500000e+01	        0.000000e+00
        6.300000e+01	        0.000000e+00
        1.600000e+02	        9.201538e-08
        4.000000e+02	        1.029289e-08
        1.000000e+03	        5.468021e-10

# -------------------------------------------------------------------------------
# Curve 20: Diff flux - SAPPHIRE-ions, Z=21
# Params: 2 5 #ff963e 1 1
#	Energy (MeV/nuc)		flux (ion..cm^{-2}.s^{-1}.(MeV/nuc)^{-1})
# -------------------------------------------------------------------------------
        1.000000e-01	        0.000000e+00
        2.500000e-01	        0.000000e+00
        6.300000e-01	        0.000000e+00
        1.600000e+00	        0.000000e+00
        4.000000e+00	        0.000000e+00
        1.000000e+01	        0.000000e+00
        2.500000e+01	        0.000000e+00
        6.300000e+01	        0.000000e+00
        1.600000e+02	        4.912480e-11
        4.000000e+02	        5.489540e-12
        1.000000e+03	        2.916278e-13

# -------------------------------------------------------------------------------
# Curve 21: Diff flux - SAPPHIRE-ions, Z=22
# Params: 2 5 #1bcdff 1 1
#	Energy (MeV/nuc)		flux (ion..cm^{-2}.s^{-1}.(MeV/nuc)^{-1})
# -------------------------------------------------------------------------------
        1.000000e-01	        0.000000e+00
        2.500000e-01	        0.000000e+00
        6.300000e-01	        0.000000e+00
        1.600000e+00	        0.000000e+00
        4.000000e+00	        0.000000e+00
        1.000000e+01	        0.000000e+00
        2.500000e+01	        0.000000e+00
        6.300000e+01	        0.000000e+00
        1.600000e+02	        8.939954e-09
        4.000000e+02	        9.992678e-10
        1.000000e+03	        5.308537e-11

# -------------------------------------------------------------------------------
# Curve 22: Diff flux - SAPPHIRE-ions, Z=23
# Params: 2 5 #c314fe 1 1
#	Energy (MeV/nuc)		flux (ion..cm^{-2}.s^{-1}.(MeV/nuc)^{-1})
# -------------------------------------------------------------------------------
        1.000000e-01	        0.000000e+00
        2.500000e-01	        0.000000e+00
        6.300000e-01	        0.000000e+00
        1.600000e+00	        0.000000e+00
        4.000000e+00	        0.000000e+00
        1.000000e+01	        0.000000e+00
        2.500000e+01	        0.000000e+00
        6.300000e+01	        0.000000e+00
        1.600000e+02	        2.961547e-10
        4.000000e+02	        3.313023e-11
        1.000000e+03	        1.760019e-12

# -------------------------------------------------------------------------------
# Curve 23: Diff flux - SAPPHIRE-ions, Z=24
# Params: 2 5 #14ce57 1 1
#	Energy (MeV/nuc)		flux (ion..cm^{-2}.s^{-1}.(MeV/nuc)^{-1})
# -------------------------------------------------------------------------------
        1.000000e-01	        0.000000e+00
        2.500000e-01	        0.000000e+00
        6.300000e-01	        0.000000e+00
        1.600000e+00	        0.000000e+00
        4.000000e+00	        0.000000e+00
        1.000000e+01	        0.000000e+00
        2.500000e+01	        0.000000e+00
        6.300000e+01	        0.000000e+00
        1.600000e+02	        5.512856e-08
        4.000000e+02	        6.165011e-09
        1.000000e+03	        3.275117e-10

# -------------------------------------------------------------------------------
# Curve 24: Diff flux - SAPPHIRE-ions, Z=25
# Params: 2 5 #ff5b17 1 1
#	Energy (MeV/nuc)		flux (ion..cm^{-2}.s^{-1}.(MeV/nuc)^{-1})
# -------------------------------------------------------------------------------
        1.000000e-01	        0.000000e+00
        2.500000e-01	        0.000000e+00
        6.300000e-01	        0.000000e+00
        1.600000e+00	        0.000000e+00
        4.000000e+00	        0.000000e+00
        1.000000e+01	        0.000000e+00
        2.500000e+01	        0.000000e+00
        6.300000e+01	        0.000000e+00
        1.600000e+02	        9.359410e-09
        4.000000e+02	        1.046444e-09
        1.000000e+03	        5.559155e-11

# -------------------------------------------------------------------------------
# Curve 25: Diff flux - SAPPHIRE-ions, Z=26
# Params: 2 5 #3690cb 1 1
#	Energy (MeV/nuc)		flux (ion..cm^{-2}.s^{-1}.(MeV/nuc)^{-1})
# -------------------------------------------------------------------------------
        1.000000e-01	        0.000000e+00
        2.500000e-01	        0.000000e+00
        6.300000e-01	        0.000000e+00
        1.600000e+00	        0.000000e+00
        4.000000e+00	        0.000000e+00
        1.000000e+01	        0.000000e+00
        2.500000e+01	        0.000000e+00
        6.300000e+01	        0.000000e+00
        1.600000e+02	        1.156962e-06
        4.000000e+02	        1.297333e-07
        1.000000e+03	        6.891985e-09

# -------------------------------------------------------------------------------
# Curve 26: Diff flux - SAPPHIRE-ions, Z=27
# Params: 2 5 #e086ff 1 1
#	Energy (MeV/nuc)		flux (ion..cm^{-2}.s^{-1}.(MeV/nuc)^{-1})
# -------------------------------------------------------------------------------
        1.000000e-01	        0.000000e+00
        2.500000e-01	        0.000000e+00
        6.300000e-01	        0.000000e+00
        1.600000e+00	        0.000000e+00
        4.000000e+00	        0.000000e+00
        1.000000e+01	        0.000000e+00
        2.500000e+01	        0.000000e+00
        6.300000e+01	        0.000000e+00
        1.600000e+02	        3.392527e-09
        4.000000e+02	        3.795502e-10
        1.000000e+03	        2.016333e-11

# -------------------------------------------------------------------------------
# Curve 27: Diff flux - SAPPHIRE-ions, Z=28
# Params: 2 5 #14bf4c 1 1
#	Energy (MeV/nuc)		flux (ion..cm^{-2}.s^{-1}.(MeV/nuc)^{-1})
# -------------------------------------------------------------------------------
        1.000000e-01	        0.000000e+00
        2.500000e-01	        0.000000e+00
        6.300000e-01	        0.000000e+00
        1.600000e+00	        0.000000e+00
        4.000000e+00	        0.000000e+00
        1.000000e+01	        0.000000e+00
        2.500000e+01	        0.000000e+00
        6.300000e+01	        0.000000e+00
        1.600000e+02	        5.547427e-08
        4.000000e+02	        6.207898e-09
        1.000000e+03	        3.297900e-10

# -------------------------------------------------------------------------------
# Curve 28: Diff flux - SAPPHIRE-ions, Z=29
# Params: 2 5 #fe1448 1 1
#	Energy (MeV/nuc)		flux (ion..cm^{-2}.s^{-1}.(MeV/nuc)^{-1})
# -------------------------------------------------------------------------------
        1.000000e-01	        0.000000e+00
        2.500000e-01	        0.000000e+00
        6.300000e-01	        0.000000e+00
        1.600000e+00	        0.000000e+00
        4.000000e+00	        0.000000e+00
        1.000000e+01	        0.000000e+00
        2.500000e+01	        0.000000e+00
        6.300000e+01	        0.000000e+00
        1.600000e+02	        5.388402e-10
        4.000000e+02	        6.025628e-11
        1.000000e+03	        3.201071e-12

# -------------------------------------------------------------------------------
# Curve 29: Diff flux - SAPPHIRE-ions, Z=30
# Params: 2 5 #169ced 1 1
#	Energy (MeV/nuc)		flux (ion..cm^{-2}.s^{-1}.(MeV/nuc)^{-1})
# -------------------------------------------------------------------------------
        1.000000e-01	        0.000000e+00
        2.500000e-01	        0.000000e+00
        6.300000e-01	        0.000000e+00
        1.600000e+00	        0.000000e+00
        4.000000e+00	        0.000000e+00
        1.000000e+01	        0.000000e+00
        2.500000e+01	        0.000000e+00
        6.300000e+01	        0.000000e+00
        1.600000e+02	        2.893558e-09
        4.000000e+02	        3.237971e-10
        1.000000e+03	        1.720148e-11

# -------------------------------------------------------------------------------
# Curve 30: Diff flux - SAPPHIRE-ions, Z=31
# Params: 2 5 #c967d0 1 1
#	Energy (MeV/nuc)		flux (ion..cm^{-2}.s^{-1}.(MeV/nuc)^{-1})
# -------------------------------------------------------------------------------
        1.000000e-01	        0.000000e+00
        2.500000e-01	        0.000000e+00
        6.300000e-01	        0.000000e+00
        1.600000e+00	        0.000000e+00
        4.000000e+00	        0.000000e+00
        1.000000e+01	        0.000000e+00
        2.500000e+01	        0.000000e+00
        6.300000e+01	        0.000000e+00
        1.600000e+02	        3.810831e-11
        4.000000e+02	        4.267260e-12
        1.000000e+03	        2.266950e-13

# -------------------------------------------------------------------------------
# Curve 31: Diff flux - SAPPHIRE-ions, Z=32
# Params: 2 5 #7def21 1 1
#	Energy (MeV/nuc)		flux (ion..cm^{-2}.s^{-1}.(MeV/nuc)^{-1})
# -------------------------------------------------------------------------------
        1.000000e-01	        0.000000e+00
        2.500000e-01	        0.000000e+00
        6.300000e-01	        0.000000e+00
        1.600000e+00	        0.000000e+00
        4.000000e+00	        0.000000e+00
        1.000000e+01	        0.000000e+00
        2.500000e+01	        0.000000e+00
        6.300000e+01	        0.000000e+00
        1.600000e+02	        1.554524e-10
        4.000000e+02	        1.736925e-11
        1.000000e+03	        9.227286e-13

# -------------------------------------------------------------------------------
# Curve 32: Diff flux - SAPPHIRE-ions, Z=33
# Params: 2 5 #ff963e 1 1
#	Energy (MeV/nuc)		flux (ion..cm^{-2}.s^{-1}.(MeV/nuc)^{-1})
# -------------------------------------------------------------------------------
        1.000000e-01	        0.000000e+00
        2.500000e-01	        0.000000e+00
        6.300000e-01	        0.000000e+00
        1.600000e+00	        0.000000e+00
        4.000000e+00	        0.000000e+00
        1.000000e+01	        0.000000e+00
        2.500000e+01	        0.000000e+00
        6.300000e+01	        0.000000e+00
        1.600000e+02	        2.461426e-11
        4.000000e+02	        2.755492e-12
        1.000000e+03	        1.463835e-13

# -------------------------------------------------------------------------------
# Curve 33: Diff flux - SAPPHIRE-ions, Z=34
# Params: 2 5 #1bcdff 1 1
#	Energy (MeV/nuc)		flux (ion..cm^{-2}.s^{-1}.(MeV/nuc)^{-1})
# -------------------------------------------------------------------------------
        1.000000e-01	        0.000000e+00
        2.500000e-01	        0.000000e+00
        6.300000e-01	        0.000000e+00
        1.600000e+00	        0.000000e+00
        4.000000e+00	        0.000000e+00
        1.000000e+01	        0.000000e+00
        2.500000e+01	        0.000000e+00
        6.300000e+01	        0.000000e+00
        1.600000e+02	        2.699963e-10
        4.000000e+02	        3.012814e-11
        1.000000e+03	        1.600535e-12

# -------------------------------------------------------------------------------
# Curve 34: Diff flux - SAPPHIRE-ions, Z=35
# Params: 2 5 #c314fe 1 1
#	Energy (MeV/nuc)		flux (ion..cm^{-2}.s^{-1}.(MeV/nuc)^{-1})
# -------------------------------------------------------------------------------
        1.000000e-01	        0.000000e+00
        2.500000e-01	        0.000000e+00
        6.300000e-01	        0.000000e+00
        1.600000e+00	        0.000000e+00
        4.000000e+00	        0.000000e+00
        1.000000e+01	        0.000000e+00
        2.500000e+01	        0.000000e+00
        6.300000e+01	        0.000000e+00
        1.600000e+02	        1.428918e-11
        4.000000e+02	        1.597542e-12
        1.000000e+03	        8.486825e-14

# -------------------------------------------------------------------------------
# Curve 35: Diff flux - SAPPHIRE-ions, Z=36
# Params: 2 5 #14ce57 1 1
#	Energy (MeV/nuc)		flux (ion..cm^{-2}.s^{-1}.(MeV/nuc)^{-1})
# -------------------------------------------------------------------------------
        1.000000e-01	        0.000000e+00
        2.500000e-01	        0.000000e+00
        6.300000e-01	        0.000000e+00
        1.600000e+00	        0.000000e+00
        4.000000e+00	        0.000000e+00
        1.000000e+01	        0.000000e+00
        2.500000e+01	        0.000000e+00
        6.300000e+01	        0.000000e+00
        1.600000e+02	        2.063864e-11
        4.000000e+02	        2.305178e-12
        1.000000e+03	        1.224609e-13

# -------------------------------------------------------------------------------
# Curve 36: Diff flux - SAPPHIRE-ions, Z=37
# Params: 2 5 #ff5b17 1 1
#	Energy (MeV/nuc)		flux (ion..cm^{-2}.s^{-1}.(MeV/nuc)^{-1})
# -------------------------------------------------------------------------------
        1.000000e-01	        0.000000e+00
        2.500000e-01	        0.000000e+00
        6.300000e-01	        0.000000e+00
        1.600000e+00	        0.000000e+00
        4.000000e+00	        0.000000e+00
        1.000000e+01	        0.000000e+00
        2.500000e+01	        0.000000e+00
        6.300000e+01	        0.000000e+00
        1.600000e+02	        1.146361e-11
        4.000000e+02	        1.286611e-12
        1.000000e+03	        6.835026e-14

# -------------------------------------------------------------------------------
# Curve 37: Diff flux - SAPPHIRE-ions, Z=38
# Params: 2 5 #3690cb 1 1
#	Energy (MeV/nuc)		flux (ion..cm^{-2}.s^{-1}.(MeV/nuc)^{-1})
# -------------------------------------------------------------------------------
        1.000000e-01	        0.000000e+00
        2.500000e-01	        0.000000e+00
        6.300000e-01	        0.000000e+00
        1.600000e+00	        0.000000e+00
        4.000000e+00	        0.000000e+00
        1.000000e+01	        0.000000e+00
        2.500000e+01	        0.000000e+00
        6.300000e+01	        0.000000e+00
        1.600000e+02	        2.575509e-11
        4.000000e+02	        2.884153e-12
        1.000000e+03	        1.532185e-13

# -------------------------------------------------------------------------------
# Curve 38: Diff flux - SAPPHIRE-ions, Z=39
# Params: 2 5 #e086ff 1 1
#	Energy (MeV/nuc)		flux (ion..cm^{-2}.s^{-1}.(MeV/nuc)^{-1})
# -------------------------------------------------------------------------------
        1.000000e-01	        0.000000e+00
        2.500000e-01	        0.000000e+00
        6.300000e-01	        0.000000e+00
        1.600000e+00	        0.000000e+00
        4.000000e+00	        0.000000e+00
        1.000000e+01	        0.000000e+00
        2.500000e+01	        0.000000e+00
        6.300000e+01	        0.000000e+00
        1.600000e+02	        5.638463e-12
        4.000000e+02	        6.304394e-13
        1.000000e+03	        3.349163e-14

# -------------------------------------------------------------------------------
# Curve 39: Diff flux - SAPPHIRE-ions, Z=40
# Params: 2 5 #14bf4c 1 1
#	Energy (MeV/nuc)		flux (ion..cm^{-2}.s^{-1}.(MeV/nuc)^{-1})
# -------------------------------------------------------------------------------
        1.000000e-01	        0.000000e+00
        2.500000e-01	        0.000000e+00
        6.300000e-01	        0.000000e+00
        1.600000e+00	        0.000000e+00
        4.000000e+00	        0.000000e+00
        1.000000e+01	        0.000000e+00
        2.500000e+01	        0.000000e+00
        6.300000e+01	        0.000000e+00
        1.600000e+02	        1.326358e-11
        4.000000e+02	        1.479603e-12
        1.000000e+03	        7.860280e-14

# -------------------------------------------------------------------------------
# Curve 40: Diff flux - SAPPHIRE-ions, Z=41
# Params: 2 5 #fe1448 1 1
#	Energy (MeV/nuc)		flux (ion..cm^{-2}.s^{-1}.(MeV/nuc)^{-1})
# -------------------------------------------------------------------------------
        1.000000e-01	        0.000000e+00
        2.500000e-01	        0.000000e+00
        6.300000e-01	        0.000000e+00
        1.600000e+00	        0.000000e+00
        4.000000e+00	        0.000000e+00
        1.000000e+01	        0.000000e+00
        2.500000e+01	        0.000000e+00
        6.300000e+01	        0.000000e+00
        1.600000e+02	        1.002777e-12
        4.000000e+02	        1.125785e-13
        1.000000e+03	        5.980648e-15

# -------------------------------------------------------------------------------
# Curve 41: Diff flux - SAPPHIRE-ions, Z=42
# Params: 2 5 #169ced 1 1
#	Energy (MeV/nuc)		flux (ion..cm^{-2}.s^{-1}.(MeV/nuc)^{-1})
# -------------------------------------------------------------------------------
        1.000000e-01	        0.000000e+00
        2.500000e-01	        0.000000e+00
        6.300000e-01	        0.000000e+00
        1.600000e+00	        0.000000e+00
        4.000000e+00	        0.000000e+00
        1.000000e+01	        0.000000e+00
        2.500000e+01	        0.000000e+00
        6.300000e+01	        0.000000e+00
        1.600000e+02	        2.631974e-12
        4.000000e+02	        2.948483e-13
        1.000000e+03	        1.566360e-14

# -------------------------------------------------------------------------------
# Curve 42: Diff flux - SAPPHIRE-ions, Z=43
# Params: 2 5 #c967d0 1 1
#	Energy (MeV/nuc)		flux (ion..cm^{-2}.s^{-1}.(MeV/nuc)^{-1})
# -------------------------------------------------------------------------------
        1.000000e-01	        0.000000e+00
        2.500000e-01	        0.000000e+00
        6.300000e-01	        0.000000e+00
        1.600000e+00	        0.000000e+00
        4.000000e+00	        0.000000e+00
        1.000000e+01	        0.000000e+00
        2.500000e+01	        0.000000e+00
        6.300000e+01	        0.000000e+00
        1.600000e+02	        0.000000e+00
        4.000000e+02	        0.000000e+00
        1.000000e+03	        0.000000e+00

# -------------------------------------------------------------------------------
# Curve 43: Diff flux - SAPPHIRE-ions, Z=44
# Params: 2 5 #7def21 1 1
#	Energy (MeV/nuc)		flux (ion..cm^{-2}.s^{-1}.(MeV/nuc)^{-1})
# -------------------------------------------------------------------------------
        1.000000e-01	        0.000000e+00
        2.500000e-01	        0.000000e+00
        6.300000e-01	        0.000000e+00
        1.600000e+00	        0.000000e+00
        4.000000e+00	        0.000000e+00
        1.000000e+01	        0.000000e+00
        2.500000e+01	        0.000000e+00
        6.300000e+01	        0.000000e+00
        1.600000e+02	        1.950933e-12
        4.000000e+02	        2.187239e-13
        1.000000e+03	        1.161955e-14

# -------------------------------------------------------------------------------
# Curve 44: Diff flux - SAPPHIRE-ions, Z=45
# Params: 2 5 #ff963e 1 1
#	Energy (MeV/nuc)		flux (ion..cm^{-2}.s^{-1}.(MeV/nuc)^{-1})
# -------------------------------------------------------------------------------
        1.000000e-01	        0.000000e+00
        2.500000e-01	        0.000000e+00
        6.300000e-01	        0.000000e+00
        1.600000e+00	        0.000000e+00
        4.000000e+00	        0.000000e+00
        1.000000e+01	        0.000000e+00
        2.500000e+01	        0.000000e+00
        6.300000e+01	        0.000000e+00
        1.600000e+02	        2.825569e-13
        4.000000e+02	        3.162919e-14
        1.000000e+03	        1.680277e-15

# -------------------------------------------------------------------------------
# Curve 45: Diff flux - SAPPHIRE-ions, Z=46
# Params: 2 5 #1bcdff 1 1
#	Energy (MeV/nuc)		flux (ion..cm^{-2}.s^{-1}.(MeV/nuc)^{-1})
# -------------------------------------------------------------------------------
        1.000000e-01	        0.000000e+00
        2.500000e-01	        0.000000e+00
        6.300000e-01	        0.000000e+00
        1.600000e+00	        0.000000e+00
        4.000000e+00	        0.000000e+00
        1.000000e+01	        0.000000e+00
        2.500000e+01	        0.000000e+00
        6.300000e+01	        0.000000e+00
        1.600000e+02	        1.292940e-12
        4.000000e+02	        1.447437e-13
        1.000000e+03	        7.689405e-15

# -------------------------------------------------------------------------------
# Curve 46: Diff flux - SAPPHIRE-ions, Z=47
# Params: 2 5 #c314fe 1 1
#	Energy (MeV/nuc)		flux (ion..cm^{-2}.s^{-1}.(MeV/nuc)^{-1})
# -------------------------------------------------------------------------------
        1.000000e-01	        0.000000e+00
        2.500000e-01	        0.000000e+00
        6.300000e-01	        0.000000e+00
        1.600000e+00	        0.000000e+00
        4.000000e+00	        0.000000e+00
        1.000000e+01	        0.000000e+00
        2.500000e+01	        0.000000e+00
        6.300000e+01	        0.000000e+00
        1.600000e+02	        3.029536e-13
        4.000000e+02	        3.388075e-14
        1.000000e+03	        1.799890e-15

# -------------------------------------------------------------------------------
# Curve 47: Diff flux - SAPPHIRE-ions, Z=48
# Params: 2 5 #14ce57 1 1
#	Energy (MeV/nuc)		flux (ion..cm^{-2}.s^{-1}.(MeV/nuc)^{-1})
# -------------------------------------------------------------------------------
        1.000000e-01	        0.000000e+00
        2.500000e-01	        0.000000e+00
        6.300000e-01	        0.000000e+00
        1.600000e+00	        0.000000e+00
        4.000000e+00	        0.000000e+00
        1.000000e+01	        0.000000e+00
        2.500000e+01	        0.000000e+00
        6.300000e+01	        0.000000e+00
        1.600000e+02	        6.329874e-12
        4.000000e+02	        7.076360e-13
        1.000000e+03	        3.759265e-14

# -------------------------------------------------------------------------------
# Curve 48: Diff flux - SAPPHIRE-ions, Z=49
# Params: 2 5 #ff5b17 1 1
#	Energy (MeV/nuc)		flux (ion..cm^{-2}.s^{-1}.(MeV/nuc)^{-1})
# -------------------------------------------------------------------------------
        1.000000e-01	        0.000000e+00
        2.500000e-01	        0.000000e+00
        6.300000e-01	        0.000000e+00
        1.600000e+00	        0.000000e+00
        4.000000e+00	        0.000000e+00
        1.000000e+01	        0.000000e+00
        2.500000e+01	        0.000000e+00
        6.300000e+01	        0.000000e+00
        1.600000e+02	        2.190623e-13
        4.000000e+02	        2.455283e-14
        1.000000e+03	        1.304351e-15

# -------------------------------------------------------------------------------
# Curve 49: Diff flux - SAPPHIRE-ions, Z=50
# Params: 2 5 #3690cb 1 1
#	Energy (MeV/nuc)		flux (ion..cm^{-2}.s^{-1}.(MeV/nuc)^{-1})
# -------------------------------------------------------------------------------
        1.000000e-01	        0.000000e+00
        2.500000e-01	        0.000000e+00
        6.300000e-01	        0.000000e+00
        1.600000e+00	        0.000000e+00
        4.000000e+00	        0.000000e+00
        1.000000e+01	        0.000000e+00
        2.500000e+01	        0.000000e+00
        6.300000e+01	        0.000000e+00
        1.600000e+02	        3.810831e-12
        4.000000e+02	        4.267260e-13
        1.000000e+03	        2.266950e-14

# -------------------------------------------------------------------------------
# Curve 50: Diff flux - SAPPHIRE-ions, Z=51
# Params: 2 5 #e086ff 1 1
#	Energy (MeV/nuc)		flux (ion..cm^{-2}.s^{-1}.(MeV/nuc)^{-1})
# -------------------------------------------------------------------------------
        1.000000e-01	        0.000000e+00
        2.500000e-01	        0.000000e+00
        6.300000e-01	        0.000000e+00
        1.600000e+00	        0.000000e+00
        4.000000e+00	        0.000000e+00
        1.000000e+01	        0.000000e+00
        2.500000e+01	        0.000000e+00
        6.300000e+01	        0.000000e+00
        1.600000e+02	        1.259522e-12
        4.000000e+02	        1.415272e-13
        1.000000e+03	        7.518529e-15

# -------------------------------------------------------------------------------
# Curve 51: Diff flux - SAPPHIRE-ions, Z=52
# Params: 2 5 #14bf4c 1 1
#	Energy (MeV/nuc)		flux (ion..cm^{-2}.s^{-1}.(MeV/nuc)^{-1})
# -------------------------------------------------------------------------------
        1.000000e-01	        0.000000e+00
        2.500000e-01	        0.000000e+00
        6.300000e-01	        0.000000e+00
        1.600000e+00	        0.000000e+00
        4.000000e+00	        0.000000e+00
        1.000000e+01	        0.000000e+00
        2.500000e+01	        0.000000e+00
        6.300000e+01	        0.000000e+00
        1.600000e+02	        1.871421e-11
        4.000000e+02	        2.090743e-12
        1.000000e+03	        1.110692e-13

# -------------------------------------------------------------------------------
# Curve 52: Diff flux - SAPPHIRE-ions, Z=53
# Params: 2 5 #fe1448 1 1
#	Energy (MeV/nuc)		flux (ion..cm^{-2}.s^{-1}.(MeV/nuc)^{-1})
# -------------------------------------------------------------------------------
        1.000000e-01	        0.000000e+00
        2.500000e-01	        0.000000e+00
        6.300000e-01	        0.000000e+00
        1.600000e+00	        0.000000e+00
        4.000000e+00	        0.000000e+00
        1.000000e+01	        0.000000e+00
        2.500000e+01	        0.000000e+00
        6.300000e+01	        0.000000e+00
        1.600000e+02	        1.463488e-12
        4.000000e+02	        1.629707e-13
        1.000000e+03	        8.657700e-15

# -------------------------------------------------------------------------------
# Curve 53: Diff flux - SAPPHIRE-ions, Z=54
# Params: 2 5 #169ced 1 1
#	Energy (MeV/nuc)		flux (ion..cm^{-2}.s^{-1}.(MeV/nuc)^{-1})
# -------------------------------------------------------------------------------
        1.000000e-01	        0.000000e+00
        2.500000e-01	        0.000000e+00
        6.300000e-01	        0.000000e+00
        1.600000e+00	        0.000000e+00
        4.000000e+00	        0.000000e+00
        1.000000e+01	        0.000000e+00
        2.500000e+01	        0.000000e+00
        6.300000e+01	        0.000000e+00
        1.600000e+02	        2.018922e-12
        4.000000e+02	        2.251569e-13
        1.000000e+03	        1.196130e-14

# -------------------------------------------------------------------------------
# Curve 54: Diff flux - SAPPHIRE-ions, Z=55
# Params: 2 5 #c967d0 1 1
#	Energy (MeV/nuc)		flux (ion..cm^{-2}.s^{-1}.(MeV/nuc)^{-1})
# -------------------------------------------------------------------------------
        1.000000e-01	        0.000000e+00
        2.500000e-01	        0.000000e+00
        6.300000e-01	        0.000000e+00
        1.600000e+00	        0.000000e+00
        4.000000e+00	        0.000000e+00
        1.000000e+01	        0.000000e+00
        2.500000e+01	        0.000000e+00
        6.300000e+01	        0.000000e+00
        1.600000e+02	        1.486535e-12
        4.000000e+02	        1.661872e-13
        1.000000e+03	        8.828576e-15

# -------------------------------------------------------------------------------
# Curve 55: Diff flux - SAPPHIRE-ions, Z=56
# Params: 2 5 #7def21 1 1
#	Energy (MeV/nuc)		flux (ion..cm^{-2}.s^{-1}.(MeV/nuc)^{-1})
# -------------------------------------------------------------------------------
        1.000000e-01	        0.000000e+00
        2.500000e-01	        0.000000e+00
        6.300000e-01	        0.000000e+00
        1.600000e+00	        0.000000e+00
        4.000000e+00	        0.000000e+00
        1.000000e+01	        0.000000e+00
        2.500000e+01	        0.000000e+00
        6.300000e+01	        0.000000e+00
        1.600000e+02	        5.263948e-12
        4.000000e+02	        5.886245e-13
        1.000000e+03	        3.127025e-14

# -------------------------------------------------------------------------------
# Curve 56: Diff flux - SAPPHIRE-ions, Z=57
# Params: 2 5 #ff963e 1 1
#	Energy (MeV/nuc)		flux (ion..cm^{-2}.s^{-1}.(MeV/nuc)^{-1})
# -------------------------------------------------------------------------------
        1.000000e-01	        0.000000e+00
        2.500000e-01	        0.000000e+00
        6.300000e-01	        0.000000e+00
        1.600000e+00	        0.000000e+00
        4.000000e+00	        0.000000e+00
        1.000000e+01	        0.000000e+00
        2.500000e+01	        0.000000e+00
        6.300000e+01	        0.000000e+00
        1.600000e+02	        4.377789e-13
        4.000000e+02	        4.899843e-14
        1.000000e+03	        2.603006e-15

# -------------------------------------------------------------------------------
# Curve 57: Diff flux - SAPPHIRE-ions, Z=58
# Params: 2 5 #1bcdff 1 1
#	Energy (MeV/nuc)		flux (ion..cm^{-2}.s^{-1}.(MeV/nuc)^{-1})
# -------------------------------------------------------------------------------
        1.000000e-01	        0.000000e+00
        2.500000e-01	        0.000000e+00
        6.300000e-01	        0.000000e+00
        1.600000e+00	        0.000000e+00
        4.000000e+00	        0.000000e+00
        1.000000e+01	        0.000000e+00
        2.500000e+01	        0.000000e+00
        6.300000e+01	        0.000000e+00
        1.600000e+02	        1.326358e-12
        4.000000e+02	        1.479603e-13
        1.000000e+03	        7.860280e-15

# -------------------------------------------------------------------------------
# Curve 58: Diff flux - SAPPHIRE-ions, Z=59
# Params: 2 5 #c314fe 1 1
#	Energy (MeV/nuc)		flux (ion..cm^{-2}.s^{-1}.(MeV/nuc)^{-1})
# -------------------------------------------------------------------------------
        1.000000e-01	        0.000000e+00
        2.500000e-01	        0.000000e+00
        6.300000e-01	        0.000000e+00
        1.600000e+00	        0.000000e+00
        4.000000e+00	        0.000000e+00
        1.000000e+01	        0.000000e+00
        2.500000e+01	        0.000000e+00
        6.300000e+01	        0.000000e+00
        1.600000e+02	        1.826479e-13
        4.000000e+02	        2.037134e-14
        1.000000e+03	        1.082213e-15

# -------------------------------------------------------------------------------
# Curve 59: Diff flux - SAPPHIRE-ions, Z=60
# Params: 2 5 #14ce57 1 1
#	Energy (MeV/nuc)		flux (ion..cm^{-2}.s^{-1}.(MeV/nuc)^{-1})
# -------------------------------------------------------------------------------
        1.000000e-01	        0.000000e+00
        2.500000e-01	        0.000000e+00
        6.300000e-01	        0.000000e+00
        1.600000e+00	        0.000000e+00
        4.000000e+00	        0.000000e+00
        1.000000e+01	        0.000000e+00
        2.500000e+01	        0.000000e+00
        6.300000e+01	        0.000000e+00
        1.600000e+02	        9.142768e-13
        4.000000e+02	        1.022856e-13
        1.000000e+03	        5.433846e-15

# -------------------------------------------------------------------------------
# Curve 60: Diff flux - SAPPHIRE-ions, Z=61
# Params: 2 5 #ff5b17 1 1
#	Energy (MeV/nuc)		flux (ion..cm^{-2}.s^{-1}.(MeV/nuc)^{-1})
# -------------------------------------------------------------------------------
        1.000000e-01	        0.000000e+00
        2.500000e-01	        0.000000e+00
        6.300000e-01	        0.000000e+00
        1.600000e+00	        0.000000e+00
        4.000000e+00	        0.000000e+00
        1.000000e+01	        0.000000e+00
        2.500000e+01	        0.000000e+00
        6.300000e+01	        0.000000e+00
        1.600000e+02	        0.000000e+00
        4.000000e+02	        0.000000e+00
        1.000000e+03	        0.000000e+00

# -------------------------------------------------------------------------------
# Curve 61: Diff flux - SAPPHIRE-ions, Z=62
# Params: 2 5 #3690cb 1 1
#	Energy (MeV/nuc)		flux (ion..cm^{-2}.s^{-1}.(MeV/nuc)^{-1})
# -------------------------------------------------------------------------------
        1.000000e-01	        0.000000e+00
        2.500000e-01	        0.000000e+00
        6.300000e-01	        0.000000e+00
        1.600000e+00	        0.000000e+00
        4.000000e+00	        0.000000e+00
        1.000000e+01	        0.000000e+00
        2.500000e+01	        0.000000e+00
        6.300000e+01	        0.000000e+00
        1.600000e+02	        3.175885e-13
        4.000000e+02	        3.548902e-14
        1.000000e+03	        1.885328e-15

# -------------------------------------------------------------------------------
# Curve 62: Diff flux - SAPPHIRE-ions, Z=63
# Params: 2 5 #e086ff 1 1
#	Energy (MeV/nuc)		flux (ion..cm^{-2}.s^{-1}.(MeV/nuc)^{-1})
# -------------------------------------------------------------------------------
        1.000000e-01	        0.000000e+00
        2.500000e-01	        0.000000e+00
        6.300000e-01	        0.000000e+00
        1.600000e+00	        0.000000e+00
        4.000000e+00	        0.000000e+00
        1.000000e+01	        0.000000e+00
        2.500000e+01	        0.000000e+00
        6.300000e+01	        0.000000e+00
        1.600000e+02	        1.146361e-13
        4.000000e+02	        1.286611e-14
        1.000000e+03	        6.835026e-16

# -------------------------------------------------------------------------------
# Curve 63: Diff flux - SAPPHIRE-ions, Z=64
# Params: 2 5 #14bf4c 1 1
#	Energy (MeV/nuc)		flux (ion..cm^{-2}.s^{-1}.(MeV/nuc)^{-1})
# -------------------------------------------------------------------------------
        1.000000e-01	        0.000000e+00
        2.500000e-01	        0.000000e+00
        6.300000e-01	        0.000000e+00
        1.600000e+00	        0.000000e+00
        4.000000e+00	        0.000000e+00
        1.000000e+01	        0.000000e+00
        2.500000e+01	        0.000000e+00
        6.300000e+01	        0.000000e+00
        1.600000e+02	        4.083939e-13
        4.000000e+02	        4.567469e-14
        1.000000e+03	        2.426434e-15

# -------------------------------------------------------------------------------
# Curve 64: Diff flux - SAPPHIRE-ions, Z=65
# Params: 2 5 #fe1448 1 1
#	Energy (MeV/nuc)		flux (ion..cm^{-2}.s^{-1}.(MeV/nuc)^{-1})
# -------------------------------------------------------------------------------
        1.000000e-01	        0.000000e+00
        2.500000e-01	        0.000000e+00
        6.300000e-01	        0.000000e+00
        1.600000e+00	        0.000000e+00
        4.000000e+00	        0.000000e+00
        1.000000e+01	        0.000000e+00
        2.500000e+01	        0.000000e+00
        6.300000e+01	        0.000000e+00
        1.600000e+02	        6.932555e-14
        4.000000e+02	        7.762553e-15
        1.000000e+03	        4.123799e-16

# -------------------------------------------------------------------------------
# Curve 65: Diff flux - SAPPHIRE-ions, Z=66
# Params: 2 5 #169ced 1 1
#	Energy (MeV/nuc)		flux (ion..cm^{-2}.s^{-1}.(MeV/nuc)^{-1})
# -------------------------------------------------------------------------------
        1.000000e-01	        0.000000e+00
        2.500000e-01	        0.000000e+00
        6.300000e-01	        0.000000e+00
        1.600000e+00	        0.000000e+00
        4.000000e+00	        0.000000e+00
        1.000000e+01	        0.000000e+00
        2.500000e+01	        0.000000e+00
        6.300000e+01	        0.000000e+00
        1.600000e+02	        4.377789e-13
        4.000000e+02	        4.899843e-14
        1.000000e+03	        2.603006e-15

# -------------------------------------------------------------------------------
# Curve 66: Diff flux - SAPPHIRE-ions, Z=67
# Params: 2 5 #c967d0 1 1
#	Energy (MeV/nuc)		flux (ion..cm^{-2}.s^{-1}.(MeV/nuc)^{-1})
# -------------------------------------------------------------------------------
        1.000000e-01	        0.000000e+00
        2.500000e-01	        0.000000e+00
        6.300000e-01	        0.000000e+00
        1.600000e+00	        0.000000e+00
        4.000000e+00	        0.000000e+00
        1.000000e+01	        0.000000e+00
        2.500000e+01	        0.000000e+00
        6.300000e+01	        0.000000e+00
        1.600000e+02	        1.050370e-13
        4.000000e+02	        1.179393e-14
        1.000000e+03	        6.265441e-16

# -------------------------------------------------------------------------------
# Curve 67: Diff flux - SAPPHIRE-ions, Z=68
# Params: 2 5 #7def21 1 1
#	Energy (MeV/nuc)		flux (ion..cm^{-2}.s^{-1}.(MeV/nuc)^{-1})
# -------------------------------------------------------------------------------
        1.000000e-01	        0.000000e+00
        2.500000e-01	        0.000000e+00
        6.300000e-01	        0.000000e+00
        1.600000e+00	        0.000000e+00
        4.000000e+00	        0.000000e+00
        1.000000e+01	        0.000000e+00
        2.500000e+01	        0.000000e+00
        6.300000e+01	        0.000000e+00
        1.600000e+02	        2.893558e-13
        4.000000e+02	        3.237971e-14
        1.000000e+03	        1.720148e-15

# -------------------------------------------------------------------------------
# Curve 68: Diff flux - SAPPHIRE-ions, Z=69
# Params: 2 5 #ff963e 1 1
#	Energy (MeV/nuc)		flux (ion..cm^{-2}.s^{-1}.(MeV/nuc)^{-1})
# -------------------------------------------------------------------------------
        1.000000e-01	        0.000000e+00
        2.500000e-01	        0.000000e+00
        6.300000e-01	        0.000000e+00
        1.600000e+00	        0.000000e+00
        4.000000e+00	        0.000000e+00
        1.000000e+01	        0.000000e+00
        2.500000e+01	        0.000000e+00
        6.300000e+01	        0.000000e+00
        1.600000e+02	        4.377789e-14
        4.000000e+02	        4.899843e-15
        1.000000e+03	        2.603006e-16

# -------------------------------------------------------------------------------
# Curve 69: Diff flux - SAPPHIRE-ions, Z=70
# Params: 2 5 #1bcdff 1 1
#	Energy (MeV/nuc)		flux (ion..cm^{-2}.s^{-1}.(MeV/nuc)^{-1})
# -------------------------------------------------------------------------------
        1.000000e-01	        0.000000e+00
        2.500000e-01	        0.000000e+00
        6.300000e-01	        0.000000e+00
        1.600000e+00	        0.000000e+00
        4.000000e+00	        0.000000e+00
        1.000000e+01	        0.000000e+00
        2.500000e+01	        0.000000e+00
        6.300000e+01	        0.000000e+00
        1.600000e+02	        2.406113e-13
        4.000000e+02	        2.691161e-14
        1.000000e+03	        1.429660e-15

# -------------------------------------------------------------------------------
# Curve 70: Diff flux - SAPPHIRE-ions, Z=71
# Params: 2 5 #c314fe 1 1
#	Energy (MeV/nuc)		flux (ion..cm^{-2}.s^{-1}.(MeV/nuc)^{-1})
# -------------------------------------------------------------------------------
        1.000000e-01	        0.000000e+00
        2.500000e-01	        0.000000e+00
        6.300000e-01	        0.000000e+00
        1.600000e+00	        0.000000e+00
        4.000000e+00	        0.000000e+00
        1.000000e+01	        0.000000e+00
        2.500000e+01	        0.000000e+00
        6.300000e+01	        0.000000e+00
        1.600000e+02	        4.377789e-14
        4.000000e+02	        4.899843e-15
        1.000000e+03	        2.603006e-16

# -------------------------------------------------------------------------------
# Curve 71: Diff flux - SAPPHIRE-ions, Z=72
# Params: 2 5 #14ce57 1 1
#	Energy (MeV/nuc)		flux (ion..cm^{-2}.s^{-1}.(MeV/nuc)^{-1})
# -------------------------------------------------------------------------------
        1.000000e-01	        0.000000e+00
        2.500000e-01	        0.000000e+00
        6.300000e-01	        0.000000e+00
        1.600000e+00	        0.000000e+00
        4.000000e+00	        0.000000e+00
        1.000000e+01	        0.000000e+00
        2.500000e+01	        0.000000e+00
        6.300000e+01	        0.000000e+00
        1.600000e+02	        2.461426e-13
        4.000000e+02	        2.755492e-14
        1.000000e+03	        1.463835e-15

# -------------------------------------------------------------------------------
# Curve 72: Diff flux - SAPPHIRE-ions, Z=73
# Params: 2 5 #ff5b17 1 1
#	Energy (MeV/nuc)		flux (ion..cm^{-2}.s^{-1}.(MeV/nuc)^{-1})
# -------------------------------------------------------------------------------
        1.000000e-01	        0.000000e+00
        2.500000e-01	        0.000000e+00
        6.300000e-01	        0.000000e+00
        1.600000e+00	        0.000000e+00
        4.000000e+00	        0.000000e+00
        1.000000e+01	        0.000000e+00
        2.500000e+01	        0.000000e+00
        6.300000e+01	        0.000000e+00
        1.600000e+02	        9.359410e-14
        4.000000e+02	        1.046444e-14
        1.000000e+03	        5.559155e-16

# -------------------------------------------------------------------------------
# Curve 73: Diff flux - SAPPHIRE-ions, Z=74
# Params: 2 5 #3690cb 1 1
#	Energy (MeV/nuc)		flux (ion..cm^{-2}.s^{-1}.(MeV/nuc)^{-1})
# -------------------------------------------------------------------------------
        1.000000e-01	        0.000000e+00
        2.500000e-01	        0.000000e+00
        6.300000e-01	        0.000000e+00
        1.600000e+00	        0.000000e+00
        4.000000e+00	        0.000000e+00
        1.000000e+01	        0.000000e+00
        2.500000e+01	        0.000000e+00
        6.300000e+01	        0.000000e+00
        1.600000e+02	        2.461426e-13
        4.000000e+02	        2.755492e-14
        1.000000e+03	        1.463835e-15

# -------------------------------------------------------------------------------
# Curve 74: Diff flux - SAPPHIRE-ions, Z=75
# Params: 2 5 #e086ff 1 1
#	Energy (MeV/nuc)		flux (ion..cm^{-2}.s^{-1}.(MeV/nuc)^{-1})
# -------------------------------------------------------------------------------
        1.000000e-01	        0.000000e+00
        2.500000e-01	        0.000000e+00
        6.300000e-01	        0.000000e+00
        1.600000e+00	        0.000000e+00
        4.000000e+00	        0.000000e+00
        1.000000e+01	        0.000000e+00
        2.500000e+01	        0.000000e+00
        6.300000e+01	        0.000000e+00
        1.600000e+02	        2.245936e-13
        4.000000e+02	        2.508891e-14
        1.000000e+03	        1.332830e-15

# -------------------------------------------------------------------------------
# Curve 75: Diff flux - SAPPHIRE-ions, Z=76
# Params: 2 5 #14bf4c 1 1
#	Energy (MeV/nuc)		flux (ion..cm^{-2}.s^{-1}.(MeV/nuc)^{-1})
# -------------------------------------------------------------------------------
        1.000000e-01	        0.000000e+00
        2.500000e-01	        0.000000e+00
        6.300000e-01	        0.000000e+00
        1.600000e+00	        0.000000e+00
        4.000000e+00	        0.000000e+00
        1.000000e+01	        0.000000e+00
        2.500000e+01	        0.000000e+00
        6.300000e+01	        0.000000e+00
        1.600000e+02	        8.734835e-13
        4.000000e+02	        9.767521e-14
        1.000000e+03	        5.188924e-15

# -------------------------------------------------------------------------------
# Curve 76: Diff flux - SAPPHIRE-ions, Z=77
# Params: 2 5 #fe1448 1 1
#	Energy (MeV/nuc)		flux (ion..cm^{-2}.s^{-1}.(MeV/nuc)^{-1})
# -------------------------------------------------------------------------------
        1.000000e-01	        0.000000e+00
        2.500000e-01	        0.000000e+00
        6.300000e-01	        0.000000e+00
        1.600000e+00	        0.000000e+00
        4.000000e+00	        0.000000e+00
        1.000000e+01	        0.000000e+00
        2.500000e+01	        0.000000e+00
        6.300000e+01	        0.000000e+00
        1.600000e+02	        8.338425e-13
        4.000000e+02	        9.327929e-14
        1.000000e+03	        4.955394e-15

# -------------------------------------------------------------------------------
# Curve 77: Diff flux - SAPPHIRE-ions, Z=78
# Params: 2 5 #169ced 1 1
#	Energy (MeV/nuc)		flux (ion..cm^{-2}.s^{-1}.(MeV/nuc)^{-1})
# -------------------------------------------------------------------------------
        1.000000e-01	        0.000000e+00
        2.500000e-01	        0.000000e+00
        6.300000e-01	        0.000000e+00
        1.600000e+00	        0.000000e+00
        4.000000e+00	        0.000000e+00
        1.000000e+01	        0.000000e+00
        2.500000e+01	        0.000000e+00
        6.300000e+01	        0.000000e+00
        1.600000e+02	        5.138341e-12
        4.000000e+02	        5.746862e-13
        1.000000e+03	        3.052978e-14

# -------------------------------------------------------------------------------
# Curve 78: Diff flux - SAPPHIRE-ions, Z=79
# Params: 2 5 #c967d0 1 1
#	Energy (MeV/nuc)		flux (ion..cm^{-2}.s^{-1}.(MeV/nuc)^{-1})
# -------------------------------------------------------------------------------
        1.000000e-01	        0.000000e+00
        2.500000e-01	        0.000000e+00
        6.300000e-01	        0.000000e+00
        1.600000e+00	        0.000000e+00
        4.000000e+00	        0.000000e+00
        1.000000e+01	        0.000000e+00
        2.500000e+01	        0.000000e+00
        6.300000e+01	        0.000000e+00
        1.600000e+02	        2.893558e-13
        4.000000e+02	        3.237971e-14
        1.000000e+03	        1.720148e-15

# -------------------------------------------------------------------------------
# Curve 79: Diff flux - SAPPHIRE-ions, Z=80
# Params: 2 5 #7def21 1 1
#	Energy (MeV/nuc)		flux (ion..cm^{-2}.s^{-1}.(MeV/nuc)^{-1})
# -------------------------------------------------------------------------------
        1.000000e-01	        0.000000e+00
        2.500000e-01	        0.000000e+00
        6.300000e-01	        0.000000e+00
        1.600000e+00	        0.000000e+00
        4.000000e+00	        0.000000e+00
        1.000000e+01	        0.000000e+00
        2.500000e+01	        0.000000e+00
        6.300000e+01	        0.000000e+00
        1.600000e+02	        6.080966e-13
        4.000000e+02	        6.797594e-14
        1.000000e+03	        3.611172e-15

# -------------------------------------------------------------------------------
# Curve 80: Diff flux - SAPPHIRE-ions, Z=81
# Params: 2 5 #ff963e 1 1
#	Energy (MeV/nuc)		flux (ion..cm^{-2}.s^{-1}.(MeV/nuc)^{-1})
# -------------------------------------------------------------------------------
        1.000000e-01	        0.000000e+00
        2.500000e-01	        0.000000e+00
        6.300000e-01	        0.000000e+00
        1.600000e+00	        0.000000e+00
        4.000000e+00	        0.000000e+00
        1.000000e+01	        0.000000e+00
        2.500000e+01	        0.000000e+00
        6.300000e+01	        0.000000e+00
        1.600000e+02	        2.757580e-13
        4.000000e+02	        3.087866e-14
        1.000000e+03	        1.640406e-15

# -------------------------------------------------------------------------------
# Curve 81: Diff flux - SAPPHIRE-ions, Z=82
# Params: 2 5 #1bcdff 1 1
#	Energy (MeV/nuc)		flux (ion..cm^{-2}.s^{-1}.(MeV/nuc)^{-1})
# -------------------------------------------------------------------------------
        1.000000e-01	        0.000000e+00
        2.500000e-01	        0.000000e+00
        6.300000e-01	        0.000000e+00
        1.600000e+00	        0.000000e+00
        4.000000e+00	        0.000000e+00
        1.000000e+01	        0.000000e+00
        2.500000e+01	        0.000000e+00
        6.300000e+01	        0.000000e+00
        1.600000e+02	        6.513098e-13
        4.000000e+02	        7.290795e-14
        1.000000e+03	        3.873182e-15

# -------------------------------------------------------------------------------
# Curve 82: Diff flux - SAPPHIRE-ions, Z=83
# Params: 2 5 #c314fe 1 1
#	Energy (MeV/nuc)		flux (ion..cm^{-2}.s^{-1}.(MeV/nuc)^{-1})
# -------------------------------------------------------------------------------
        1.000000e-01	        0.000000e+00
        2.500000e-01	        0.000000e+00
        6.300000e-01	        0.000000e+00
        1.600000e+00	        0.000000e+00
        4.000000e+00	        0.000000e+00
        1.000000e+01	        0.000000e+00
        2.500000e+01	        0.000000e+00
        6.300000e+01	        0.000000e+00
        1.600000e+02	        5.512856e-13
        4.000000e+02	        6.165011e-14
        1.000000e+03	        3.275117e-15

# -------------------------------------------------------------------------------
# Curve 83: Diff flux - SAPPHIRE-ions, Z=84
# Params: 2 5 #14ce57 1 1
#	Energy (MeV/nuc)		flux (ion..cm^{-2}.s^{-1}.(MeV/nuc)^{-1})
# -------------------------------------------------------------------------------
        1.000000e-01	        0.000000e+00
        2.500000e-01	        0.000000e+00
        6.300000e-01	        0.000000e+00
        1.600000e+00	        0.000000e+00
        4.000000e+00	        0.000000e+00
        1.000000e+01	        0.000000e+00
        2.500000e+01	        0.000000e+00
        6.300000e+01	        0.000000e+00
        1.600000e+02	        0.000000e+00
        4.000000e+02	        0.000000e+00
        1.000000e+03	        0.000000e+00

# -------------------------------------------------------------------------------
# Curve 84: Diff flux - SAPPHIRE-ions, Z=85
# Params: 2 5 #ff5b17 1 1
#	Energy (MeV/nuc)		flux (ion..cm^{-2}.s^{-1}.(MeV/nuc)^{-1})
# -------------------------------------------------------------------------------
        1.000000e-01	        0.000000e+00
        2.500000e-01	        0.000000e+00
        6.300000e-01	        0.000000e+00
        1.600000e+00	        0.000000e+00
        4.000000e+00	        0.000000e+00
        1.000000e+01	        0.000000e+00
        2.500000e+01	        0.000000e+00
        6.300000e+01	        0.000000e+00
        1.600000e+02	        0.000000e+00
        4.000000e+02	        0.000000e+00
        1.000000e+03	        0.000000e+00

# -------------------------------------------------------------------------------
# Curve 85: Diff flux - SAPPHIRE-ions, Z=86
# Params: 2 5 #3690cb 1 1
#	Energy (MeV/nuc)		flux (ion..cm^{-2}.s^{-1}.(MeV/nuc)^{-1})
# -------------------------------------------------------------------------------
        1.000000e-01	        0.000000e+00
        2.500000e-01	        0.000000e+00
        6.300000e-01	        0.000000e+00
        1.600000e+00	        0.000000e+00
        4.000000e+00	        0.000000e+00
        1.000000e+01	        0.000000e+00
        2.500000e+01	        0.000000e+00
        6.300000e+01	        0.000000e+00
        1.600000e+02	        0.000000e+00
        4.000000e+02	        0.000000e+00
        1.000000e+03	        0.000000e+00

# -------------------------------------------------------------------------------
# Curve 86: Diff flux - SAPPHIRE-ions, Z=87
# Params: 2 5 #e086ff 1 1
#	Energy (MeV/nuc)		flux (ion..cm^{-2}.s^{-1}.(MeV/nuc)^{-1})
# -------------------------------------------------------------------------------
        1.000000e-01	        0.000000e+00
        2.500000e-01	        0.000000e+00
        6.300000e-01	        0.000000e+00
        1.600000e+00	        0.000000e+00
        4.000000e+00	        0.000000e+00
        1.000000e+01	        0.000000e+00
        2.500000e+01	        0.000000e+00
        6.300000e+01	        0.000000e+00
        1.600000e+02	        0.000000e+00
        4.000000e+02	        0.000000e+00
        1.000000e+03	        0.000000e+00

# -------------------------------------------------------------------------------
# Curve 87: Diff flux - SAPPHIRE-ions, Z=88
# Params: 2 5 #14bf4c 1 1
#	Energy (MeV/nuc)		flux (ion..cm^{-2}.s^{-1}.(MeV/nuc)^{-1})
# -------------------------------------------------------------------------------
        1.000000e-01	        0.000000e+00
        2.500000e-01	        0.000000e+00
        6.300000e-01	        0.000000e+00
        1.600000e+00	        0.000000e+00
        4.000000e+00	        0.000000e+00
        1.000000e+01	        0.000000e+00
        2.500000e+01	        0.000000e+00
        6.300000e+01	        0.000000e+00
        1.600000e+02	        0.000000e+00
        4.000000e+02	        0.000000e+00
        1.000000e+03	        0.000000e+00

# -------------------------------------------------------------------------------
# Curve 88: Diff flux - SAPPHIRE-ions, Z=89
# Params: 2 5 #fe1448 1 1
#	Energy (MeV/nuc)		flux (ion..cm^{-2}.s^{-1}.(MeV/nuc)^{-1})
# -------------------------------------------------------------------------------
        1.000000e-01	        0.000000e+00
        2.500000e-01	        0.000000e+00
        6.300000e-01	        0.000000e+00
        1.600000e+00	        0.000000e+00
        4.000000e+00	        0.000000e+00
        1.000000e+01	        0.000000e+00
        2.500000e+01	        0.000000e+00
        6.300000e+01	        0.000000e+00
        1.600000e+02	        0.000000e+00
        4.000000e+02	        0.000000e+00
        1.000000e+03	        0.000000e+00

# -------------------------------------------------------------------------------
# Curve 89: Diff flux - SAPPHIRE-ions, Z=90
# Params: 2 5 #169ced 1 1
#	Energy (MeV/nuc)		flux (ion..cm^{-2}.s^{-1}.(MeV/nuc)^{-1})
# -------------------------------------------------------------------------------
        1.000000e-01	        0.000000e+00
        2.500000e-01	        0.000000e+00
        6.300000e-01	        0.000000e+00
        1.600000e+00	        0.000000e+00
        4.000000e+00	        0.000000e+00
        1.000000e+01	        0.000000e+00
        2.500000e+01	        0.000000e+00
        6.300000e+01	        0.000000e+00
        1.600000e+02	        3.641435e-14
        4.000000e+02	        4.074268e-15
        1.000000e+03	        2.164425e-16

# -------------------------------------------------------------------------------
# Curve 90: Diff flux - SAPPHIRE-ions, Z=91
# Params: 2 5 #c967d0 1 1
#	Energy (MeV/nuc)		flux (ion..cm^{-2}.s^{-1}.(MeV/nuc)^{-1})
# -------------------------------------------------------------------------------
        1.000000e-01	        0.000000e+00
        2.500000e-01	        0.000000e+00
        6.300000e-01	        0.000000e+00
        1.600000e+00	        0.000000e+00
        4.000000e+00	        0.000000e+00
        1.000000e+01	        0.000000e+00
        2.500000e+01	        0.000000e+00
        6.300000e+01	        0.000000e+00
        1.600000e+02	        0.000000e+00
        4.000000e+02	        0.000000e+00
        1.000000e+03	        0.000000e+00

# -------------------------------------------------------------------------------
# Curve 91: Diff flux - SAPPHIRE-ions, Z=92
# Params: 2 5 #7def21 1 1
#	Energy (MeV/nuc)		flux (ion..cm^{-2}.s^{-1}.(MeV/nuc)^{-1})
# -------------------------------------------------------------------------------
        1.000000e-01	        0.000000e+00
        2.500000e-01	        0.000000e+00
        6.300000e-01	        0.000000e+00
        1.600000e+00	        0.000000e+00
        4.000000e+00	        0.000000e+00
        1.000000e+01	        0.000000e+00
        2.500000e+01	        0.000000e+00
        6.300000e+01	        0.000000e+00
        1.600000e+02	        3.561923e-14
        4.000000e+02	        3.977772e-15
        1.000000e+03	        2.113162e-16

# -------------------------------------------------------------------------------
# Curve 92: Diff flux - SAPPHIRE-protons
# Params: 2 5 #ff963e 1 1
#	Energy (MeV/nuc)		flux (ion..cm^{-2}.s^{-1}.(MeV/nuc)^{-1})
# -------------------------------------------------------------------------------
        1.000000e-01	        0.000000e+00
        2.500000e-01	        0.000000e+00
        6.300000e-01	        0.000000e+00
        1.600000e+00	        0.000000e+00
        4.000000e+00	        0.000000e+00
        1.000000e+01	        0.000000e+00
        2.500000e+01	        0.000000e+00
        6.300000e+01	        0.000000e+00
        1.600000e+02	        4.758480e-02
        4.000000e+02	        1.022679e-02
        1.000000e+03	        1.072058e-03

