# -------------------------------------------------------------------------------
#		C:/Users/Michael Chadolias/Documents/CubeSat/Radiation Analysis (Viyas Da Best)/Scenarios/CDR/SSO_500km/Dose Muscle.txt
# -------------------------------------------------------------------------------
# ID: 1 2 1

# Graph: Dose Muscle 
# min: -4.9895 0.01 max: 104.999 754064
# X-axis: Thickness  (mm Al)
# Y-axis L: Dose (rad)
# -------------------------------------------------------------------------------
# Curve 0: Trapped electrons
# Params: 2 5 #169ced 1 1
#	Thickness  (mm Al)		Dose (rad)
# -------------------------------------------------------------------------------
            0.010000	        5.635789e+05
            0.100000	        1.309662e+05
            0.200000	        5.982603e+04
            0.300000	        3.443055e+04
            0.400000	        2.279482e+04
            0.500000	        1.649300e+04
            0.600000	        1.267399e+04
            0.700000	        1.015777e+04
            0.800000	        8.395036e+03
            0.900000	        7.101111e+03
            1.000000	        6.114193e+03
            1.100000	        5.337250e+03
            1.200000	        4.710390e+03
            1.300000	        4.193784e+03
            1.400000	        3.758121e+03
            1.500000	        3.383961e+03
            1.600000	        3.058944e+03
            1.700000	        2.773332e+03
            1.800000	        2.519687e+03
            1.900000	        2.292872e+03
            2.000000	        2.089097e+03
            2.250000	        1.662416e+03
            2.500000	        1.329474e+03
            2.750000	        1.067863e+03
            3.000000	        8.607998e+02
            3.250000	        6.956987e+02
            3.500000	        5.628461e+02
            3.750000	        4.550320e+02
            4.000000	        3.671237e+02
            4.250000	        2.953705e+02
            4.500000	        2.369058e+02
            4.750000	        1.894231e+02
            5.000000	        1.510061e+02
            5.250000	        1.200386e+02
            5.500000	        9.515713e+01
            5.750000	        7.521902e+01
            6.000000	        5.927716e+01
            6.250000	        4.655627e+01
            6.500000	        3.642778e+01
            6.750000	        2.838445e+01
            7.000000	        2.201742e+01
            7.250000	        1.699673e+01
            7.500000	        1.305517e+01
            7.750000	        9.975945e+00
            8.000000	        7.583099e+00
            8.250000	        5.733918e+00
            8.500000	        4.312794e+00
            8.750000	        3.226611e+00
            9.000000	        2.400711e+00
            9.500000	        1.306069e+00
           10.000000	        6.917847e-01
           10.500000	        3.548357e-01
           11.000000	        1.752297e-01
           11.500000	        8.293084e-02
           12.000000	        3.748807e-02
           12.500000	        1.613600e-02
           13.000000	        6.573541e-03
           13.500000	        2.501147e-03
           14.000000	        8.684059e-04
           14.500000	        2.693331e-04
           15.000000	        7.339985e-05
           16.000000	        5.718942e-06
           17.000000	        5.941263e-07
           18.000000	        3.250235e-08
           19.000000	        8.885291e-10
           20.000000	        0.000000e+00
           30.000000	        0.000000e+00
           40.000000	        0.000000e+00
           50.000000	        0.000000e+00
          100.000000	        0.000000e+00

# -------------------------------------------------------------------------------
# Curve 1: Trapped protons
# Params: 2 5 #c967d0 1 1
#	Thickness  (mm Al)		Dose (rad)
# -------------------------------------------------------------------------------
            0.010000	        2.269687e+04
            0.100000	        2.080680e+03
            0.200000	        9.887310e+02
            0.300000	        6.474987e+02
            0.400000	        4.875383e+02
            0.500000	        3.967779e+02
            0.600000	        3.396063e+02
            0.700000	        3.038544e+02
            0.800000	        2.772473e+02
            0.900000	        2.581991e+02
            1.000000	        2.412633e+02
            1.100000	        2.299774e+02
            1.200000	        2.177380e+02
            1.300000	        2.085078e+02
            1.400000	        1.999794e+02
            1.500000	        1.926898e+02
            1.600000	        1.867444e+02
            1.700000	        1.796193e+02
            1.800000	        1.750388e+02
            1.900000	        1.706614e+02
            2.000000	        1.660847e+02
            2.250000	        1.569378e+02
            2.500000	        1.496958e+02
            2.750000	        1.435508e+02
            3.000000	        1.397279e+02
            3.250000	        1.351636e+02
            3.500000	        1.318786e+02
            3.750000	        1.292455e+02
            4.000000	        1.258480e+02
            4.250000	        1.231818e+02
            4.500000	        1.212494e+02
            4.750000	        1.184393e+02
            5.000000	        1.169699e+02
            5.250000	        1.144070e+02
            5.500000	        1.123221e+02
            5.750000	        1.107194e+02
            6.000000	        1.090990e+02
            6.250000	        1.079316e+02
            6.500000	        1.047822e+02
            6.750000	        1.046471e+02
            7.000000	        1.029648e+02
            7.250000	        1.010554e+02
            7.500000	        1.002758e+02
            7.750000	        9.775201e+01
            8.000000	        9.870983e+01
            8.250000	        9.737362e+01
            8.500000	        9.459311e+01
            8.750000	        9.430253e+01
            9.000000	        9.252864e+01
            9.500000	        9.077048e+01
           10.000000	        8.942830e+01
           10.500000	        8.807315e+01
           11.000000	        8.590360e+01
           11.500000	        8.400910e+01
           12.000000	        8.296934e+01
           12.500000	        8.004248e+01
           13.000000	        7.956069e+01
           13.500000	        7.883160e+01
           14.000000	        7.621420e+01
           14.500000	        7.448597e+01
           15.000000	        7.390662e+01
           16.000000	        7.154442e+01
           17.000000	        6.859813e+01
           18.000000	        6.667499e+01
           19.000000	        6.472984e+01
           20.000000	        6.274819e+01
           30.000000	        4.704545e+01
           40.000000	        3.638865e+01
           50.000000	        2.943481e+01
          100.000000	        9.770212e+00

# -------------------------------------------------------------------------------
# Curve 2: Solar protons
# Params: 2 5 #7def21 1 1
#	Thickness  (mm Al)		Dose (rad)
# -------------------------------------------------------------------------------
            0.010000	        1.666153e+05
            0.100000	        3.634230e+04
            0.200000	        1.962317e+04
            0.300000	        1.333451e+04
            0.400000	        1.010083e+04
            0.500000	        8.110824e+03
            0.600000	        6.713056e+03
            0.700000	        5.749602e+03
            0.800000	        4.973313e+03
            0.900000	        4.404507e+03
            1.000000	        3.890315e+03
            1.100000	        3.550129e+03
            1.200000	        3.187220e+03
            1.300000	        2.924680e+03
            1.400000	        2.681272e+03
            1.500000	        2.484689e+03
            1.600000	        2.320620e+03
            1.700000	        2.138730e+03
            1.800000	        2.016710e+03
            1.900000	        1.902623e+03
            2.000000	        1.784478e+03
            2.250000	        1.549765e+03
            2.500000	        1.360451e+03
            2.750000	        1.204227e+03
            3.000000	        1.098409e+03
            3.250000	        9.850645e+02
            3.500000	        9.018263e+02
            3.750000	        8.338975e+02
            4.000000	        7.601370e+02
            4.250000	        7.028793e+02
            4.500000	        6.594044e+02
            4.750000	        6.083069e+02
            5.000000	        5.768374e+02
            5.250000	        5.351050e+02
            5.500000	        5.019320e+02
            5.750000	        4.755605e+02
            6.000000	        4.507703e+02
            6.250000	        4.313483e+02
            6.500000	        3.958296e+02
            6.750000	        3.881884e+02
            7.000000	        3.676999e+02
            7.250000	        3.468420e+02
            7.500000	        3.354183e+02
            7.750000	        3.118296e+02
            8.000000	        3.139775e+02
            8.250000	        2.995360e+02
            8.500000	        2.764943e+02
            8.750000	        2.705484e+02
            9.000000	        2.555443e+02
            9.500000	        2.382026e+02
           10.000000	        2.243446e+02
           10.500000	        2.112222e+02
           11.000000	        1.953961e+02
           11.500000	        1.822379e+02
           12.000000	        1.737693e+02
           12.500000	        1.583334e+02
           13.000000	        1.535986e+02
           13.500000	        1.479785e+02
           14.000000	        1.360920e+02
           14.500000	        1.281794e+02
           15.000000	        1.243824e+02
           16.000000	        1.135395e+02
           17.000000	        1.021690e+02
           18.000000	        9.455950e+01
           19.000000	        8.740166e+01
           20.000000	        8.075630e+01
           30.000000	        4.144060e+01
           40.000000	        2.526283e+01
           50.000000	        1.723004e+01
          100.000000	        4.057084e+00

# -------------------------------------------------------------------------------
# Curve 3: Secondary photons
# Params: 2 5 #ff963e 1 1
#	Thickness  (mm Al)		Dose (rad)
# -------------------------------------------------------------------------------
            0.010000	        1.172812e+03
            0.100000	        2.589846e+02
            0.200000	        1.350958e+02
            0.300000	        8.495754e+01
            0.400000	        6.104482e+01
            0.500000	        4.527203e+01
            0.600000	        3.488267e+01
            0.700000	        2.838191e+01
            0.800000	        2.392630e+01
            0.900000	        2.074809e+01
            1.000000	        1.822910e+01
            1.100000	        1.631493e+01
            1.200000	        1.474519e+01
            1.300000	        1.334454e+01
            1.400000	        1.215156e+01
            1.500000	        1.102679e+01
            1.600000	        1.008881e+01
            1.700000	        9.353521e+00
            1.800000	        8.620622e+00
            1.900000	        7.896079e+00
            2.000000	        7.348419e+00
            2.250000	        6.148450e+00
            2.500000	        5.253983e+00
            2.750000	        4.678088e+00
            3.000000	        4.038573e+00
            3.250000	        3.571543e+00
            3.500000	        3.286543e+00
            3.750000	        2.908937e+00
            4.000000	        2.634117e+00
            4.250000	        2.480040e+00
            4.500000	        2.323458e+00
            4.750000	        2.191789e+00
            5.000000	        2.069398e+00
            5.250000	        1.976268e+00
            5.500000	        1.839302e+00
            5.750000	        1.706890e+00
            6.000000	        1.639466e+00
            6.250000	        1.580055e+00
            6.500000	        1.525993e+00
            6.750000	        1.477046e+00
            7.000000	        1.432454e+00
            7.250000	        1.391775e+00
            7.500000	        1.355522e+00
            7.750000	        1.322373e+00
            8.000000	        1.291213e+00
            8.250000	        1.262420e+00
            8.500000	        1.235644e+00
            8.750000	        1.210753e+00
            9.000000	        1.187679e+00
            9.500000	        1.145944e+00
           10.000000	        1.110580e+00
           10.500000	        1.076400e+00
           11.000000	        1.057718e+00
           11.500000	        1.043464e+00
           12.000000	        1.019357e+00
           12.500000	        9.971574e-01
           13.000000	        9.769418e-01
           13.500000	        9.584329e-01
           14.000000	        9.408819e-01
           14.500000	        9.260441e-01
           15.000000	        9.149768e-01
           16.000000	        8.903501e-01
           17.000000	        8.638286e-01
           18.000000	        8.412710e-01
           19.000000	        8.214802e-01
           20.000000	        8.009693e-01
           30.000000	        6.440492e-01
           40.000000	        5.299622e-01
           50.000000	        4.642977e-01
          100.000000	        1.693125e-01

# -------------------------------------------------------------------------------
# Curve 4: Total dose
# Params: 2 5 #1bcdff 1 1
#	Thickness  (mm Al)		Dose (rad)
# -------------------------------------------------------------------------------
            0.010000	        7.540639e+05
            0.100000	        1.696482e+05
            0.200000	        8.057303e+04
            0.300000	        4.849751e+04
            0.400000	        3.344424e+04
            0.500000	        2.504588e+04
            0.600000	        1.976154e+04
            0.700000	        1.623960e+04
            0.800000	        1.366952e+04
            0.900000	        1.178456e+04
            1.000000	        1.026400e+04
            1.100000	        9.133672e+03
            1.200000	        8.130093e+03
            1.300000	        7.340316e+03
            1.400000	        6.651524e+03
            1.500000	        6.072366e+03
            1.600000	        5.576398e+03
            1.700000	        5.101035e+03
            1.800000	        4.720056e+03
            1.900000	        4.374052e+03
            2.000000	        4.047008e+03
            2.250000	        3.375267e+03
            2.500000	        2.844875e+03
            2.750000	        2.420319e+03
            3.000000	        2.102975e+03
            3.250000	        1.819498e+03
            3.500000	        1.599838e+03
            3.750000	        1.421084e+03
            4.000000	        1.255743e+03
            4.250000	        1.123912e+03
            4.500000	        1.019883e+03
            4.750000	        9.183611e+02
            5.000000	        8.468828e+02
            5.250000	        7.715269e+02
            5.500000	        7.112505e+02
            5.750000	        6.632058e+02
            6.000000	        6.207860e+02
            6.250000	        5.874162e+02
            6.500000	        5.385656e+02
            6.750000	        5.226970e+02
            7.000000	        4.941146e+02
            7.250000	        4.662859e+02
            7.500000	        4.501048e+02
            7.750000	        4.208799e+02
            8.000000	        4.215616e+02
            8.250000	        4.039059e+02
            8.500000	        3.766358e+02
            8.750000	        3.692883e+02
            9.000000	        3.516614e+02
            9.500000	        3.314251e+02
           10.000000	        3.155752e+02
           10.500000	        3.007265e+02
           11.000000	        2.825327e+02
           11.500000	        2.673734e+02
           12.000000	        2.577955e+02
           12.500000	        2.393892e+02
           13.000000	        2.341428e+02
           13.500000	        2.277711e+02
           14.000000	        2.132479e+02
           14.500000	        2.035916e+02
           15.000000	        1.992041e+02
           16.000000	        1.859742e+02
           17.000000	        1.716309e+02
           18.000000	        1.620758e+02
           19.000000	        1.529530e+02
           20.000000	        1.443055e+02
           30.000000	        8.913010e+01
           40.000000	        6.218144e+01
           50.000000	        4.712915e+01
          100.000000	        1.399661e+01

