# -------------------------------------------------------------------------------
#		C:/Users/ASAT 02/Documents/OMERE 5.4/CDR CLOSE-OUT/SSO 550/dose/silicon/Dose  Silicon.txt
# -------------------------------------------------------------------------------
# ID: 1 2 1

# Graph: Dose - Silicon 
# min: -0.869117 0.01 max: 40.7552 572135
# X-axis: Thickness  (mm Al)
# Y-axis L: Dose (rad)
# -------------------------------------------------------------------------------
# Curve 0: Trapped electrons
# Params: 2 5 #1bcdff 1 1
#	Thickness  (mm Al)		Dose (rad)
# -------------------------------------------------------------------------------
            0.010000	        5.433867e+05
            0.100000	        1.292113e+05
            0.200000	        5.806853e+04
            0.300000	        3.282417e+04
            0.400000	        2.142112e+04
            0.500000	        1.534302e+04
            0.600000	        1.170672e+04
            0.700000	        9.335173e+03
            0.800000	        7.687188e+03
            0.900000	        6.485158e+03
            1.000000	        5.572980e+03
            1.100000	        4.857875e+03
            1.200000	        4.282878e+03
            1.300000	        3.810306e+03
            1.400000	        3.412593e+03
            1.500000	        3.071533e+03
            1.600000	        2.775610e+03
            1.700000	        2.515769e+03
            1.800000	        2.285139e+03
            1.900000	        2.079043e+03
            2.000000	        1.893974e+03
            2.250000	        1.506803e+03
            2.500000	        1.205000e+03
            2.750000	        9.679668e+02
            3.000000	        7.804299e+02
            3.250000	        6.308919e+02
            3.500000	        5.104768e+02
            3.750000	        4.126797e+02
            4.000000	        3.328905e+02
            4.250000	        2.677159e+02
            4.500000	        2.145865e+02
            4.750000	        1.714420e+02
            5.000000	        1.365534e+02
            5.250000	        1.084539e+02
            5.500000	        8.590101e+01
            5.750000	        6.785083e+01
            6.000000	        5.343697e+01
            6.250000	        4.194929e+01
            6.500000	        3.281229e+01
            6.750000	        2.556253e+01
            7.000000	        1.982735e+01
            7.250000	        1.530694e+01
            7.500000	        1.175921e+01
            7.750000	        8.988075e+00
            8.000000	        6.834613e+00
            8.250000	        5.170157e+00
            8.500000	        3.890613e+00
            8.750000	        2.912287e+00
            9.000000	        2.168049e+00
            9.500000	        1.180846e+00
           10.000000	        6.261784e-01
           10.500000	        3.215202e-01
           11.000000	        1.589216e-01
           11.500000	        7.527409e-02
           12.000000	        3.405186e-02
           12.500000	        1.466210e-02
           13.000000	        5.970759e-03
           13.500000	        2.268938e-03
           14.000000	        7.860944e-04
           14.500000	        2.444062e-04
           15.000000	        6.654332e-05
           16.000000	        5.596983e-06
           17.000000	        5.706908e-07
           18.000000	        8.481527e-08
           19.000000	        3.632909e-09
           20.000000	        0.000000e+00
           30.000000	        0.000000e+00
           40.000000	        0.000000e+00
           50.000000	        0.000000e+00
          100.000000	        0.000000e+00

# -------------------------------------------------------------------------------
# Curve 1: Trapped protons
# Params: 2 5 #c314fe 1 1
#	Thickness  (mm Al)		Dose (rad)
# -------------------------------------------------------------------------------
            0.010000	        2.018167e+04
            0.100000	        1.979147e+03
            0.200000	        9.806706e+02
            0.300000	        6.633492e+02
            0.400000	        5.122682e+02
            0.500000	        4.247152e+02
            0.600000	        3.686114e+02
            0.700000	        3.327499e+02
            0.800000	        3.058092e+02
            0.900000	        2.862092e+02
            1.000000	        2.687986e+02
            1.100000	        2.568506e+02
            1.200000	        2.441115e+02
            1.300000	        2.343276e+02
            1.400000	        2.252919e+02
            1.500000	        2.175372e+02
            1.600000	        2.111354e+02
            1.700000	        2.036710e+02
            1.800000	        1.987061e+02
            1.900000	        1.939854e+02
            2.000000	        1.891018e+02
            2.250000	        1.792507e+02
            2.500000	        1.713970e+02
            2.750000	        1.647329e+02
            3.000000	        1.604534e+02
            3.250000	        1.555062e+02
            3.500000	        1.518768e+02
            3.750000	        1.489221e+02
            4.000000	        1.452150e+02
            4.250000	        1.422471e+02
            4.500000	        1.400252e+02
            4.750000	        1.369231e+02
            5.000000	        1.351913e+02
            5.250000	        1.323496e+02
            5.500000	        1.300068e+02
            5.750000	        1.281591e+02
            6.000000	        1.263060e+02
            6.250000	        1.249216e+02
            6.500000	        1.215110e+02
            6.750000	        1.212075e+02
            7.000000	        1.193110e+02
            7.250000	        1.171901e+02
            7.500000	        1.162400e+02
            7.750000	        1.134860e+02
            8.000000	        1.143428e+02
            8.250000	        1.128246e+02
            8.500000	        1.098047e+02
            8.750000	        1.093723e+02
            9.000000	        1.073981e+02
            9.500000	        1.053192e+02
           10.000000	        1.036888e+02
           10.500000	        1.020569e+02
           11.000000	        9.959292e+01
           11.500000	        9.743091e+01
           12.000000	        9.616963e+01
           12.500000	        9.295535e+01
           13.000000	        9.229722e+01
           13.500000	        9.138431e+01
           14.000000	        8.851654e+01
           14.500000	        8.658063e+01
           15.000000	        8.584530e+01
           16.000000	        8.313717e+01
           17.000000	        7.983201e+01
           18.000000	        7.760974e+01
           19.000000	        7.537447e+01
           20.000000	        7.311089e+01
           30.000000	        5.515185e+01
           40.000000	        4.289989e+01
           50.000000	        3.494034e+01
          100.000000	        1.191214e+01

# -------------------------------------------------------------------------------
# Curve 2: Solar protons
# Params: 2 5 #14ce57 1 1
#	Thickness  (mm Al)		Dose (rad)
# -------------------------------------------------------------------------------
            0.010000	        1.148813e+05
            0.100000	        2.598775e+04
            0.200000	        1.427413e+04
            0.300000	        9.800966e+03
            0.400000	        7.474717e+03
            0.500000	        6.029968e+03
            0.600000	        5.013735e+03
            0.700000	        4.306127e+03
            0.800000	        3.737495e+03
            0.900000	        3.316210e+03
            1.000000	        2.939055e+03
            1.100000	        2.683091e+03
            1.200000	        2.416461e+03
            1.300000	        2.220096e+03
            1.400000	        2.039119e+03
            1.500000	        1.891794e+03
            1.600000	        1.767922e+03
            1.700000	        1.633549e+03
            1.800000	        1.540774e+03
            1.900000	        1.454412e+03
            2.000000	        1.366102e+03
            2.250000	        1.189485e+03
            2.500000	        1.046887e+03
            2.750000	        9.291108e+02
            3.000000	        8.477043e+02
            3.250000	        7.623281e+02
            3.500000	        6.987518e+02
            3.750000	        6.465313e+02
            4.000000	        5.908007e+02
            4.250000	        5.470356e+02
            4.500000	        5.132974e+02
            4.750000	        4.745226e+02
            5.000000	        4.498440e+02
            5.250000	        4.181072e+02
            5.500000	        3.926359e+02
            5.750000	        3.721206e+02
            6.000000	        3.528961e+02
            6.250000	        3.376025e+02
            6.500000	        3.109564e+02
            6.750000	        3.043002e+02
            7.000000	        2.885319e+02
            7.250000	        2.725869e+02
            7.500000	        2.634738e+02
            7.750000	        2.456884e+02
            8.000000	        2.464183e+02
            8.250000	        2.353079e+02
            8.500000	        2.180419e+02
            8.750000	        2.131067e+02
            9.000000	        2.016814e+02
            9.500000	        1.880585e+02
           10.000000	        1.770633e+02
           10.500000	        1.667104e+02
           11.000000	        1.544570e+02
           11.500000	        1.442176e+02
           12.000000	        1.374375e+02
           12.500000	        1.256335e+02
           13.000000	        1.216822e+02
           13.500000	        1.171154e+02
           14.000000	        1.080144e+02
           14.500000	        1.018452e+02
           15.000000	        9.871180e+01
           16.000000	        9.014350e+01
           17.000000	        8.126134e+01
           18.000000	        7.520645e+01
           19.000000	        6.953637e+01
           20.000000	        6.428731e+01
           30.000000	        3.321596e+01
           40.000000	        2.034993e+01
           50.000000	        1.392335e+01
          100.000000	        3.316062e+00

# -------------------------------------------------------------------------------
# Curve 3: Secondary photons
# Params: 2 5 #ff5b17 1 1
#	Thickness  (mm Al)		Dose (rad)
# -------------------------------------------------------------------------------
            0.010000	        6.705980e+02
            0.100000	        2.717263e+02
            0.200000	        1.475673e+02
            0.300000	        9.573018e+01
            0.400000	        6.919696e+01
            0.500000	        5.390791e+01
            0.600000	        4.416021e+01
            0.700000	        3.754125e+01
            0.800000	        3.277269e+01
            0.900000	        2.905127e+01
            1.000000	        2.606274e+01
            1.100000	        2.381906e+01
            1.200000	        2.192482e+01
            1.300000	        2.019221e+01
            1.400000	        1.872224e+01
            1.500000	        1.749263e+01
            1.600000	        1.639485e+01
            1.700000	        1.538415e+01
            1.800000	        1.449390e+01
            1.900000	        1.369417e+01
            2.000000	        1.296713e+01
            2.250000	        1.143310e+01
            2.500000	        1.020143e+01
            2.750000	        9.184904e+00
            3.000000	        8.378074e+00
            3.250000	        7.692612e+00
            3.500000	        7.090178e+00
            3.750000	        6.611277e+00
            4.000000	        6.186732e+00
            4.250000	        5.796018e+00
            4.500000	        5.459696e+00
            4.750000	        5.161576e+00
            5.000000	        4.897619e+00
            5.250000	        4.660472e+00
            5.500000	        4.452768e+00
            5.750000	        4.266607e+00
            6.000000	        4.093612e+00
            6.250000	        3.936397e+00
            6.500000	        3.793272e+00
            6.750000	        3.662197e+00
            7.000000	        3.542334e+00
            7.250000	        3.429914e+00
            7.500000	        3.319410e+00
            7.750000	        3.220678e+00
            8.000000	        3.133958e+00
            8.250000	        3.051836e+00
            8.500000	        2.975566e+00
            8.750000	        2.904212e+00
            9.000000	        2.837454e+00
            9.500000	        2.716322e+00
           10.000000	        2.608850e+00
           10.500000	        2.514604e+00
           11.000000	        2.424612e+00
           11.500000	        2.342062e+00
           12.000000	        2.271914e+00
           12.500000	        2.207894e+00
           13.000000	        2.148860e+00
           13.500000	        2.094177e+00
           14.000000	        2.043129e+00
           14.500000	        1.995791e+00
           15.000000	        1.952145e+00
           16.000000	        1.870374e+00
           17.000000	        1.795625e+00
           18.000000	        1.726484e+00
           19.000000	        1.661557e+00
           20.000000	        1.601638e+00
           30.000000	        1.193748e+00
           40.000000	        9.321685e-01
           50.000000	        7.874083e-01
          100.000000	        2.630804e-01

# -------------------------------------------------------------------------------
# Curve 4: Total dose
# Params: 2 5 #3690cb 1 1
#	Thickness  (mm Al)		Dose (rad)
# -------------------------------------------------------------------------------
            0.010000	        6.791203e+05
            0.100000	        1.574499e+05
            0.200000	        7.347090e+04
            0.300000	        4.338422e+04
            0.400000	        2.947730e+04
            0.500000	        2.185161e+04
            0.600000	        1.713323e+04
            0.700000	        1.401159e+04
            0.800000	        1.176326e+04
            0.900000	        1.011663e+04
            1.000000	        8.806896e+03
            1.100000	        7.821635e+03
            1.200000	        6.965375e+03
            1.300000	        6.284922e+03
            1.400000	        5.695726e+03
            1.500000	        5.198357e+03
            1.600000	        4.771062e+03
            1.700000	        4.368373e+03
            1.800000	        4.039114e+03
            1.900000	        3.741135e+03
            2.000000	        3.462145e+03
            2.250000	        2.886972e+03
            2.500000	        2.433486e+03
            2.750000	        2.070995e+03
            3.000000	        1.796966e+03
            3.250000	        1.556419e+03
            3.500000	        1.368196e+03
            3.750000	        1.214744e+03
            4.000000	        1.075093e+03
            4.250000	        9.627947e+02
            4.500000	        8.733688e+02
            4.750000	        7.880492e+02
            5.000000	        7.264863e+02
            5.250000	        6.635712e+02
            5.500000	        6.129965e+02
            5.750000	        5.723972e+02
            6.000000	        5.367327e+02
            6.250000	        5.084098e+02
            6.500000	        4.690730e+02
            6.750000	        4.547324e+02
            7.000000	        4.312126e+02
            7.250000	        4.085139e+02
            7.500000	        3.947924e+02
            7.750000	        3.713832e+02
            8.000000	        3.707297e+02
            8.250000	        3.563545e+02
            8.500000	        3.347128e+02
            8.750000	        3.282956e+02
            9.000000	        3.140850e+02
            9.500000	        2.972748e+02
           10.000000	        2.839871e+02
           10.500000	        2.716035e+02
           11.000000	        2.566335e+02
           11.500000	        2.440659e+02
           12.000000	        2.359131e+02
           12.500000	        2.208115e+02
           13.000000	        2.161342e+02
           13.500000	        2.105961e+02
           14.000000	        1.985749e+02
           14.500000	        1.904218e+02
           15.000000	        1.865093e+02
           16.000000	        1.751510e+02
           17.000000	        1.628890e+02
           18.000000	        1.545427e+02
           19.000000	        1.465724e+02
           20.000000	        1.389998e+02
           30.000000	        8.956156e+01
           40.000000	        6.418199e+01
           50.000000	        4.965109e+01
          100.000000	        1.549128e+01

