# -------------------------------------------------------------------------------
#		C:/Users/ACUBESAT-01/Documents/OMERE 5.3/SSO_450km/Orbit average flux.txt
# -------------------------------------------------------------------------------
# ID: 1 2 1

# Graph: Orbit average flux 
# min: 0.04 0.01 max: 300 939063
# X-axis L: Energy(MeV)
# Y-axis L: Flux (cm^{-2}.s^{-1}.MeV^{-1}) or (cm^{-2}.s^{-1})
# -------------------------------------------------------------------------------
# Curve 0: Diff flux - AP8 min
# Params: 2 5 #fe1448 1 1
#	Energy(MeV)		Flux (cm^{-2}.s^{-1}.MeV^{-1}) or (cm^{-2}.s^{-1})
# -------------------------------------------------------------------------------
        1.000000e-01	        3.872984e+03
        2.500000e-01	        1.336612e+03
        5.000000e-01	        3.956686e+02
        7.500000e-01	        1.691973e+02
        1.000000e+00	        8.271033e+01
        2.000000e+00	        2.112216e+01
        3.000000e+00	        1.031427e+01
        4.000000e+00	        5.583511e+00
        5.000000e+00	        3.491612e+00
        6.000000e+00	        2.273449e+00
        8.000000e+00	        1.188095e+00
        1.000000e+01	        6.831608e-01
        1.200000e+01	        4.705123e-01
        1.500000e+01	        3.303843e-01
        1.700000e+01	        2.719701e-01
        2.000000e+01	        2.092607e-01
        2.500000e+01	        1.572884e-01
        3.000000e+01	        1.387609e-01
        3.500000e+01	        1.281744e-01
        4.000000e+01	        1.187687e-01
        4.500000e+01	        1.105413e-01
        5.000000e+01	        1.085693e-01
        6.000000e+01	        1.031507e-01
        7.000000e+01	        9.310412e-02
        8.000000e+01	        8.511204e-02
        9.000000e+01	        7.728218e-02
        1.000000e+02	        7.064784e-02
        1.250000e+02	        5.246517e-02
        1.500000e+02	        3.796809e-02
        1.750000e+02	        2.776054e-02
        2.000000e+02	        2.052065e-02
        3.000000e+02	        6.476803e-03

# -------------------------------------------------------------------------------
# Curve 1: Integ flux - AP8 min
# Params: 2 5 #169ced 1 1
#	Energy(MeV)		Flux (cm^{-2}.s^{-1}.MeV^{-1}) or (cm^{-2}.s^{-1})
# -------------------------------------------------------------------------------
        1.000000e-01	        7.394203e+02
        2.500000e-01	        3.816430e+02
        5.000000e-01	        1.907410e+02
        7.500000e-01	        1.255556e+02
        1.000000e+00	        9.514245e+01
        2.000000e+00	        5.214705e+01
        3.000000e+00	        3.832457e+01
        4.000000e+00	        3.028018e+01
        5.000000e+00	        2.609074e+01
        6.000000e+00	        2.312927e+01
        8.000000e+00	        1.985065e+01
        1.000000e+01	        1.800596e+01
        1.200000e+01	        1.695949e+01
        1.500000e+01	        1.572835e+01
        1.700000e+01	        1.515391e+01
        2.000000e+01	        1.439368e+01
        2.500000e+01	        1.354472e+01
        3.000000e+01	        1.280642e+01
        3.500000e+01	        1.213782e+01
        4.000000e+01	        1.151928e+01
        4.500000e+01	        1.094542e+01
        5.000000e+01	        1.041098e+01
        6.000000e+01	        9.343458e+00
        7.000000e+01	        8.344980e+00
        8.000000e+01	        7.471442e+00
        9.000000e+01	        6.642627e+00
        1.000000e+02	        5.917919e+00
        1.250000e+02	        4.356732e+00
        1.500000e+02	        3.234293e+00
        1.750000e+02	        2.416492e+00
        2.000000e+02	        1.815069e+00
        3.000000e+02	        5.968858e-01

# -------------------------------------------------------------------------------
# Curve 2: Diff flux - AE8 max
# Params: 2 5 #c967d0 1 1
#	Energy(MeV)		Flux (cm^{-2}.s^{-1}.MeV^{-1}) or (cm^{-2}.s^{-1})
# -------------------------------------------------------------------------------
        4.000000e-02	        9.390634e+05
        1.000000e-01	        5.697136e+05
        2.500000e-01	        1.392375e+05
        5.000000e-01	        2.319443e+04
        7.500000e-01	        7.769697e+03
        1.000000e+00	        3.785446e+03
        1.500000e+00	        1.520678e+03
        2.000000e+00	        6.481491e+02
        2.500000e+00	        3.093247e+02
        3.000000e+00	        1.320108e+02
        3.500000e+00	        5.540919e+01
        4.000000e+00	        2.112829e+01
        4.500000e+00	        6.864128e+00
        5.000000e+00	        2.015242e+00
        5.500000e+00	        4.545960e-01
        6.000000e+00	        7.180318e-02
        6.500000e+00	        1.066498e-02
        7.000000e+00	        6.647181e-04

# -------------------------------------------------------------------------------
# Curve 3: Integ flux - AE8 max
# Params: 2 5 #7def21 1 1
#	Energy(MeV)		Flux (cm^{-2}.s^{-1}.MeV^{-1}) or (cm^{-2}.s^{-1})
# -------------------------------------------------------------------------------
        4.000000e-02	        1.132404e+05
        1.000000e-01	        6.932537e+04
        2.500000e-01	        2.174295e+04
        5.000000e-01	        6.727281e+03
        7.500000e-01	        3.405371e+03
        1.000000e+00	        2.101745e+03
        1.500000e+00	        9.155065e+02
        2.000000e+00	        3.959334e+02
        2.500000e+00	        1.783489e+02
        3.000000e+00	        7.037388e+01
        3.500000e+00	        2.730206e+01
        4.000000e+00	        9.246067e+00
        4.500000e+00	        2.751875e+00
        5.000000e+00	        7.563982e-01
        5.500000e+00	        1.597373e-01
        6.000000e+00	        2.106859e-02
        6.500000e+00	        0.000000e+00
        7.000000e+00	        0.000000e+00

