# -------------------------------------------------------------------------------
#		C:/Users/ASAT 02/Documents/OMERE 5.4/CDR CLOSE-OUT/SSO 550 - 1.5 years/LET/Satellite/Integral LET spectrum.txt
# -------------------------------------------------------------------------------
# ID: 1 2 1

# Graph: Integral LET spectrum 
# min: 0.000160896 1e-06 max: 1.09391e+09 2.04126e+08
# X-axis L: LET (MeV.cm^2.g^{-1})
# Y-axis L: Flux (cm^{-2}.s^{-1})
# -------------------------------------------------------------------------------
# Curve 0: LET spectrum without Flares 
# Params: 0 5 #1bcdff 2 1
#	LET (MeV.cm^2.g^{-1})		Flux (cm^{-2}.s^{-1})
# -------------------------------------------------------------------------------
        1.608960e+00	        1.556207e+02
        1.626982e+00	        1.556207e+02
        1.645205e+00	        1.556207e+02
        1.663632e+00	        1.556207e+02
        1.682265e+00	        1.555098e+02
        1.701107e+00	        1.553710e+02
        1.720161e+00	        1.552816e+02
        1.739427e+00	        1.552196e+02
        1.758910e+00	        1.551649e+02
        1.778610e+00	        1.551207e+02
        1.798532e+00	        1.550832e+02
        1.818676e+00	        1.550500e+02
        1.839046e+00	        1.550195e+02
        1.859644e+00	        1.549907e+02
        1.880473e+00	        1.549648e+02
        1.901536e+00	        1.549406e+02
        1.922834e+00	        1.549191e+02
        1.944370e+00	        1.549028e+02
        1.966148e+00	        1.548911e+02
        1.988170e+00	        1.548834e+02
        2.010439e+00	        1.548763e+02
        2.032956e+00	        1.548691e+02
        2.055727e+00	        1.548624e+02
        2.078752e+00	        1.548566e+02
        2.102035e+00	        1.548508e+02
        2.125579e+00	        1.548450e+02
        2.149386e+00	        1.548399e+02
        2.173460e+00	        1.548353e+02
        2.197804e+00	        1.548306e+02
        2.222421e+00	        1.548259e+02
        2.247313e+00	        1.548219e+02
        2.272484e+00	        1.548186e+02
        2.297937e+00	        1.548152e+02
        2.323675e+00	        1.548118e+02
        2.349701e+00	        1.548084e+02
        2.376019e+00	        1.548051e+02
        2.402632e+00	        1.548020e+02
        2.429542e+00	        1.547988e+02
        2.456754e+00	        1.547956e+02
        2.484271e+00	        1.547925e+02
        2.512096e+00	        1.547906e+02
        2.540233e+00	        1.547886e+02
        2.568685e+00	        1.547867e+02
        2.597455e+00	        1.547847e+02
        2.626548e+00	        1.547826e+02
        2.655967e+00	        1.547806e+02
        2.685715e+00	        1.547787e+02
        2.715796e+00	        1.547767e+02
        2.746214e+00	        1.547747e+02
        2.776973e+00	        1.547727e+02
        2.808077e+00	        1.547707e+02
        2.839529e+00	        1.547175e+02
        2.871333e+00	        1.546449e+02
        2.903493e+00	        1.545715e+02
        2.936014e+00	        1.544973e+02
        2.968899e+00	        1.544223e+02
        3.002152e+00	        1.543464e+02
        3.035777e+00	        1.542089e+02
        3.069779e+00	        1.540602e+02
        3.104162e+00	        1.539099e+02
        3.138931e+00	        1.537580e+02
        3.174088e+00	        1.536043e+02
        3.209640e+00	        1.534489e+02
        3.245589e+00	        1.532936e+02
        3.281941e+00	        1.531370e+02
        3.318701e+00	        1.529786e+02
        3.355872e+00	        1.528185e+02
        3.393459e+00	        1.526565e+02
        3.431468e+00	        1.524928e+02
        3.469902e+00	        1.523272e+02
        3.508766e+00	        1.521348e+02
        3.548066e+00	        1.519326e+02
        3.587806e+00	        1.517282e+02
        3.627992e+00	        1.515214e+02
        3.668627e+00	        1.513124e+02
        3.709717e+00	        1.511010e+02
        3.751268e+00	        1.508874e+02
        3.793284e+00	        1.506792e+02
        3.835771e+00	        1.504686e+02
        3.878733e+00	        1.502556e+02
        3.922177e+00	        1.500403e+02
        3.966107e+00	        1.498225e+02
        4.010530e+00	        1.496023e+02
        4.055449e+00	        1.493797e+02
        4.100872e+00	        1.491329e+02
        4.146804e+00	        1.488320e+02
        4.193250e+00	        1.485277e+02
        4.240217e+00	        1.482199e+02
        4.287709e+00	        1.479088e+02
        4.335734e+00	        1.475941e+02
        4.384296e+00	        1.472760e+02
        4.433403e+00	        1.470081e+02
        4.483059e+00	        1.467388e+02
        4.533271e+00	        1.464665e+02
        4.584046e+00	        1.461912e+02
        4.635390e+00	        1.459127e+02
        4.687308e+00	        1.456312e+02
        4.739809e+00	        1.453465e+02
        4.792897e+00	        1.450586e+02
        4.846580e+00	        1.447196e+02
        4.900864e+00	        1.443695e+02
        4.955756e+00	        1.440155e+02
        5.011263e+00	        1.436575e+02
        5.067391e+00	        1.432956e+02
        5.124149e+00	        1.429295e+02
        5.181542e+00	        1.425594e+02
        5.239577e+00	        1.422144e+02
        5.298263e+00	        1.418738e+02
        5.357606e+00	        1.415294e+02
        5.417614e+00	        1.411811e+02
        5.478294e+00	        1.408290e+02
        5.539654e+00	        1.404728e+02
        5.601701e+00	        1.401127e+02
        5.664442e+00	        1.397486e+02
        5.727887e+00	        1.393818e+02
        5.792042e+00	        1.390116e+02
        5.856916e+00	        1.386372e+02
        5.922516e+00	        1.382587e+02
        5.988851e+00	        1.378760e+02
        6.055929e+00	        1.374889e+02
        6.123759e+00	        1.370975e+02
        6.192348e+00	        1.367018e+02
        6.261705e+00	        1.362892e+02
        6.331839e+00	        1.358497e+02
        6.402759e+00	        1.354053e+02
        6.474473e+00	        1.349559e+02
        6.546991e+00	        1.345015e+02
        6.620320e+00	        1.340420e+02
        6.694471e+00	        1.335773e+02
        6.769452e+00	        1.330878e+02
        6.845274e+00	        1.326135e+02
        6.921944e+00	        1.321449e+02
        6.999473e+00	        1.316726e+02
        7.077871e+00	        1.311956e+02
        7.157146e+00	        1.307150e+02
        7.237310e+00	        1.302293e+02
        7.318371e+00	        1.297386e+02
        7.400341e+00	        1.292425e+02
        7.483228e+00	        1.287508e+02
        7.567044e+00	        1.282647e+02
        7.651799e+00	        1.277734e+02
        7.737503e+00	        1.272770e+02
        7.824166e+00	        1.267756e+02
        7.911801e+00	        1.262690e+02
        8.000417e+00	        1.257570e+02
        8.090026e+00	        1.252392e+02
        8.180638e+00	        1.247157e+02
        8.272265e+00	        1.241908e+02
        8.364918e+00	        1.236601e+02
        8.458610e+00	        1.231234e+02
        8.553350e+00	        1.225807e+02
        8.649152e+00	        1.220321e+02
        8.746027e+00	        1.214774e+02
        8.843987e+00	        1.209165e+02
        8.943044e+00	        1.203493e+02
        9.043210e+00	        1.197645e+02
        9.144499e+00	        1.191638e+02
        9.246921e+00	        1.185564e+02
        9.350492e+00	        1.179422e+02
        9.455222e+00	        1.173211e+02
        9.561125e+00	        1.166931e+02
        9.668214e+00	        1.160581e+02
        9.776503e+00	        1.154159e+02
        9.886005e+00	        1.148034e+02
        9.996733e+00	        1.142368e+02
        1.010870e+01	        1.136640e+02
        1.022192e+01	        1.130847e+02
        1.033641e+01	        1.124990e+02
        1.045219e+01	        1.119067e+02
        1.056926e+01	        1.113078e+02
        1.068764e+01	        1.107021e+02
        1.080734e+01	        1.100897e+02
        1.092839e+01	        1.094508e+02
        1.105080e+01	        1.087406e+02
        1.117457e+01	        1.080226e+02
        1.129973e+01	        1.072965e+02
        1.142629e+01	        1.065623e+02
        1.155427e+01	        1.058200e+02
        1.168369e+01	        1.050693e+02
        1.181455e+01	        1.043102e+02
        1.194688e+01	        1.035876e+02
        1.208069e+01	        1.029756e+02
        1.221600e+01	        1.023568e+02
        1.235282e+01	        1.017311e+02
        1.249118e+01	        1.010983e+02
        1.263109e+01	        1.004585e+02
        1.277256e+01	        9.981154e+01
        1.291562e+01	        9.915733e+01
        1.306028e+01	        9.849587e+01
        1.320657e+01	        9.782700e+01
        1.335449e+01	        9.707213e+01
        1.350406e+01	        9.625134e+01
        1.365531e+01	        9.542136e+01
        1.380826e+01	        9.458208e+01
        1.396292e+01	        9.373341e+01
        1.411931e+01	        9.287526e+01
        1.427746e+01	        9.200750e+01
        1.443737e+01	        9.113002e+01
        1.459908e+01	        9.032942e+01
        1.476259e+01	        8.954288e+01
        1.492794e+01	        8.874752e+01
        1.509514e+01	        8.794329e+01
        1.526421e+01	        8.712999e+01
        1.543518e+01	        8.630762e+01
        1.560806e+01	        8.547606e+01
        1.578288e+01	        8.463519e+01
        1.595966e+01	        8.379033e+01
        1.613841e+01	        8.296733e+01
        1.631917e+01	        8.213511e+01
        1.650195e+01	        8.129356e+01
        1.668678e+01	        8.044259e+01
        1.687368e+01	        7.958209e+01
        1.706268e+01	        7.871196e+01
        1.725379e+01	        7.783208e+01
        1.744704e+01	        7.694234e+01
        1.764245e+01	        7.612379e+01
        1.784006e+01	        7.532592e+01
        1.803988e+01	        7.451912e+01
        1.824193e+01	        7.370329e+01
        1.844625e+01	        7.287831e+01
        1.865286e+01	        7.204410e+01
        1.886178e+01	        7.120054e+01
        1.907304e+01	        7.034754e+01
        1.928667e+01	        6.948497e+01
        1.950269e+01	        6.868781e+01
        1.972113e+01	        6.788289e+01
        1.994201e+01	        6.706896e+01
        2.016537e+01	        6.624592e+01
        2.039124e+01	        6.541365e+01
        2.061963e+01	        6.457206e+01
        2.085058e+01	        6.372105e+01
        2.108411e+01	        6.286051e+01
        2.132027e+01	        6.203924e+01
        2.155906e+01	        6.128596e+01
        2.180054e+01	        6.052424e+01
        2.204471e+01	        5.975399e+01
        2.229162e+01	        5.897512e+01
        2.254130e+01	        5.818752e+01
        2.279378e+01	        5.739109e+01
        2.304908e+01	        5.658571e+01
        2.330724e+01	        5.577131e+01
        2.356829e+01	        5.492195e+01
        2.383227e+01	        5.404096e+01
        2.409920e+01	        5.315009e+01
        2.436912e+01	        5.224925e+01
        2.464207e+01	        5.133833e+01
        2.491807e+01	        5.041719e+01
        2.519717e+01	        4.948565e+01
        2.547939e+01	        4.859790e+01
        2.576477e+01	        4.794681e+01
        2.605335e+01	        4.728843e+01
        2.634516e+01	        4.662267e+01
        2.664024e+01	        4.594945e+01
        2.693862e+01	        4.526869e+01
        2.724035e+01	        4.458025e+01
        2.754545e+01	        4.388402e+01
        2.785397e+01	        4.318000e+01
        2.816595e+01	        4.246810e+01
        2.848142e+01	        4.178819e+01
        2.880043e+01	        4.110157e+01
        2.912301e+01	        4.040725e+01
        2.944920e+01	        3.970516e+01
        2.977905e+01	        3.899521e+01
        3.011259e+01	        3.827715e+01
        3.044986e+01	        3.755105e+01
        3.079092e+01	        3.681681e+01
        3.113579e+01	        3.621819e+01
        3.148453e+01	        3.563158e+01
        3.183717e+01	        3.503839e+01
        3.219376e+01	        3.443857e+01
        3.255435e+01	        3.383203e+01
        3.291897e+01	        3.321857e+01
        3.328768e+01	        3.259812e+01
        3.366052e+01	        3.197073e+01
        3.403753e+01	        3.137574e+01
        3.441877e+01	        3.087948e+01
        3.480428e+01	        3.037767e+01
        3.519410e+01	        2.987024e+01
        3.558829e+01	        2.935713e+01
        3.598690e+01	        2.883825e+01
        3.638997e+01	        2.831319e+01
        3.679756e+01	        2.778225e+01
        3.720971e+01	        2.724536e+01
        3.762647e+01	        2.671484e+01
        3.804791e+01	        2.621902e+01
        3.847406e+01	        2.571764e+01
        3.890499e+01	        2.521065e+01
        3.934075e+01	        2.469798e+01
        3.978138e+01	        2.417944e+01
        4.022696e+01	        2.365508e+01
        4.067752e+01	        2.312485e+01
        4.113313e+01	        2.262723e+01
        4.159384e+01	        2.222516e+01
        4.205971e+01	        2.181860e+01
        4.253080e+01	        2.140730e+01
        4.300716e+01	        2.099148e+01
        4.348887e+01	        2.057104e+01
        4.397596e+01	        2.014534e+01
        4.446851e+01	        1.971463e+01
        4.496658e+01	        1.927911e+01
        4.547023e+01	        1.891590e+01
        4.597952e+01	        1.857161e+01
        4.649451e+01	        1.822346e+01
        4.701528e+01	        1.787143e+01
        4.754187e+01	        1.751545e+01
        4.807436e+01	        1.715561e+01
        4.861282e+01	        1.679179e+01
        4.915731e+01	        1.642391e+01
        4.970789e+01	        1.606542e+01
        5.026464e+01	        1.577144e+01
        5.082763e+01	        1.547415e+01
        5.139693e+01	        1.517354e+01
        5.197260e+01	        1.486957e+01
        5.255472e+01	        1.456218e+01
        5.314336e+01	        1.425131e+01
        5.373859e+01	        1.393569e+01
        5.434049e+01	        1.361653e+01
        5.494913e+01	        1.332943e+01
        5.556458e+01	        1.305727e+01
        5.618694e+01	        1.278207e+01
        5.681626e+01	        1.250379e+01
        5.745263e+01	        1.222239e+01
        5.809612e+01	        1.193782e+01
        5.874683e+01	        1.164999e+01
        5.940482e+01	        1.135894e+01
        6.007019e+01	        1.112288e+01
        6.074300e+01	        1.090021e+01
        6.142335e+01	        1.067485e+01
        6.211133e+01	        1.044714e+01
        6.280700e+01	        1.021697e+01
        6.351047e+01	        9.984246e+00
        6.422182e+01	        9.748605e+00
        6.494114e+01	        9.510202e+00
        6.566851e+01	        9.297746e+00
        6.640403e+01	        9.097259e+00
        6.714779e+01	        8.894533e+00
        6.789988e+01	        8.689551e+00
        6.866039e+01	        8.482280e+00
        6.942942e+01	        8.272698e+00
        7.020706e+01	        8.060810e+00
        7.099342e+01	        7.856763e+00
        7.178858e+01	        7.716601e+00
        7.259264e+01	        7.574872e+00
        7.340572e+01	        7.431555e+00
        7.422790e+01	        7.286635e+00
        7.505929e+01	        7.140096e+00
        7.589999e+01	        6.991917e+00
        7.675011e+01	        6.842078e+00
        7.760974e+01	        6.690498e+00
        7.847901e+01	        6.539012e+00
        7.935802e+01	        6.393618e+00
        8.024686e+01	        6.246596e+00
        8.114567e+01	        6.097930e+00
        8.205454e+01	        5.947603e+00
        8.297359e+01	        5.795480e+00
        8.390294e+01	        5.641671e+00
        8.484269e+01	        5.486526e+00
        8.579297e+01	        5.375598e+00
        8.675389e+01	        5.265783e+00
        8.772558e+01	        5.154748e+00
        8.870815e+01	        5.042477e+00
        8.970173e+01	        4.928952e+00
        9.070643e+01	        4.814163e+00
        9.172239e+01	        4.698090e+00
        9.274972e+01	        4.580419e+00
        9.378856e+01	        4.481390e+00
        9.483904e+01	        4.384416e+00
        9.590129e+01	        4.286360e+00
        9.697543e+01	        4.187208e+00
        9.806160e+01	        4.086949e+00
        9.915994e+01	        3.985567e+00
        1.002706e+02	        3.883756e+00
        1.013937e+02	        3.785715e+00
        1.025293e+02	        3.705883e+00
        1.036777e+02	        3.625158e+00
        1.048389e+02	        3.543528e+00
        1.060132e+02	        3.460985e+00
        1.072006e+02	        3.377519e+00
        1.084013e+02	        3.292709e+00
        1.096154e+02	        3.207033e+00
        1.108432e+02	        3.131052e+00
        1.120847e+02	        3.063918e+00
        1.133401e+02	        2.996051e+00
        1.146095e+02	        2.927463e+00
        1.158932e+02	        2.858127e+00
        1.171913e+02	        2.788029e+00
        1.185039e+02	        2.717147e+00
        1.198312e+02	        2.645480e+00
        1.211734e+02	        2.585406e+00
        1.225306e+02	        2.527440e+00
        1.239030e+02	        2.468837e+00
        1.252907e+02	        2.409593e+00
        1.266941e+02	        2.349699e+00
        1.281131e+02	        2.289145e+00
        1.295480e+02	        2.227913e+00
        1.309990e+02	        2.170156e+00
        1.324663e+02	        2.115499e+00
        1.339500e+02	        2.061770e+00
        1.354503e+02	        2.007438e+00
        1.369674e+02	        1.952493e+00
        1.385015e+02	        1.896932e+00
        1.400528e+02	        1.841249e+00
        1.416214e+02	        1.800355e+00
        1.432077e+02	        1.759003e+00
        1.448117e+02	        1.717193e+00
        1.464336e+02	        1.674917e+00
        1.480737e+02	        1.632661e+00
        1.497322e+02	        1.589937e+00
        1.514093e+02	        1.546734e+00
        1.531052e+02	        1.508258e+00
        1.548200e+02	        1.470418e+00
        1.565541e+02	        1.432155e+00
        1.583076e+02	        1.393463e+00
        1.600807e+02	        1.354385e+00
        1.618737e+02	        1.316440e+00
        1.636867e+02	        1.280057e+00
        1.655201e+02	        1.248787e+00
        1.673740e+02	        1.217166e+00
        1.692487e+02	        1.185132e+00
        1.711444e+02	        1.152740e+00
        1.730613e+02	        1.120004e+00
        1.749996e+02	        1.086912e+00
        1.769597e+02	        1.060404e+00
        1.789418e+02	        1.035627e+00
        1.809460e+02	        1.010576e+00
        1.829727e+02	        9.852490e-01
        1.850221e+02	        9.596392e-01
        1.870944e+02	        9.337443e-01
        1.891900e+02	        9.075867e-01
        1.913090e+02	        8.835173e-01
        1.934517e+02	        8.591802e-01
        1.956185e+02	        8.353582e-01
        1.978095e+02	        8.114836e-01
        2.000251e+02	        7.873434e-01
        2.022655e+02	        7.636340e-01
        2.045309e+02	        7.443200e-01
        2.068218e+02	        7.247850e-01
        2.091383e+02	        7.050393e-01
        2.114807e+02	        6.850755e-01
        2.138494e+02	        6.650058e-01
        2.162446e+02	        6.452612e-01
        2.186667e+02	        6.290440e-01
        2.211159e+02	        6.126456e-01
        2.235925e+02	        5.960638e-01
        2.260968e+02	        5.792974e-01
        2.286292e+02	        5.623436e-01
        2.311900e+02	        5.452001e-01
        2.337794e+02	        5.304972e-01
        2.363979e+02	        5.168102e-01
        2.390456e+02	        5.029703e-01
        2.417231e+02	        4.889763e-01
        2.444305e+02	        4.747233e-01
        2.471682e+02	        4.603491e-01
        2.499366e+02	        4.475128e-01
        2.527360e+02	        4.348479e-01
        2.555668e+02	        4.220457e-01
        2.584293e+02	        4.095499e-01
        2.613238e+02	        3.970052e-01
        2.642508e+02	        3.847650e-01
        2.672105e+02	        3.745062e-01
        2.702034e+02	        3.641346e-01
        2.732298e+02	        3.536487e-01
        2.762901e+02	        3.430471e-01
        2.793847e+02	        3.324412e-01
        2.825139e+02	        3.229228e-01
        2.856782e+02	        3.143938e-01
        2.888780e+02	        3.057660e-01
        2.921136e+02	        2.970476e-01
        2.953854e+02	        2.882344e-01
        2.986938e+02	        2.793228e-01
        3.020393e+02	        2.713056e-01
        3.054223e+02	        2.639357e-01
        3.088432e+02	        2.564846e-01
        3.123024e+02	        2.490619e-01
        3.158004e+02	        2.415563e-01
        3.193375e+02	        2.339672e-01
        3.229142e+02	        2.264922e-01
        3.265310e+02	        2.190208e-01
        3.301883e+02	        2.114656e-01
        3.338866e+02	        2.037851e-01
        3.376263e+02	        1.964104e-01
        3.414079e+02	        1.906757e-01
        3.452318e+02	        1.852738e-01
        3.490986e+02	        1.798143e-01
        3.530086e+02	        1.742991e-01
        3.569625e+02	        1.687274e-01
        3.609607e+02	        1.631369e-01
        3.650036e+02	        1.581313e-01
        3.690918e+02	        1.531909e-01
        3.732258e+02	        1.483890e-01
        3.774062e+02	        1.435346e-01
        3.816333e+02	        1.386277e-01
        3.859078e+02	        1.340060e-01
        3.902301e+02	        1.295611e-01
        3.946009e+02	        1.250679e-01
        3.990206e+02	        1.205228e-01
        4.034898e+02	        1.160634e-01
        4.080091e+02	        1.119901e-01
        4.125790e+02	        1.082010e-01
        4.172001e+02	        1.043695e-01
        4.218730e+02	        1.004952e-01
        4.265982e+02	        9.657831e-02
        4.313763e+02	        9.274553e-02
        4.362079e+02	        8.904170e-02
        4.410936e+02	        8.548348e-02
        4.460341e+02	        8.196654e-02
        4.510299e+02	        7.841360e-02
        4.560817e+02	        7.495751e-02
        4.611900e+02	        7.148574e-02
        4.663556e+02	        6.797620e-02
        4.715790e+02	        6.442822e-02
        4.768609e+02	        6.104193e-02
        4.822020e+02	        5.778460e-02
        4.876029e+02	        5.451534e-02
        4.930643e+02	        5.115954e-02
        4.985868e+02	        4.769935e-02
        5.041712e+02	        4.420182e-02
        5.098182e+02	        4.055857e-02
        5.155284e+02	        3.681145e-02
        5.213026e+02	        3.436931e-02
        5.271414e+02	        3.368837e-02
        5.330457e+02	        3.299905e-02
        5.390161e+02	        3.230082e-02
        5.450533e+02	        3.159458e-02
        5.511582e+02	        3.087878e-02
        5.573314e+02	        3.014985e-02
        5.635738e+02	        2.956524e-02
        5.698861e+02	        2.903681e-02
        5.762691e+02	        2.850325e-02
        5.827236e+02	        2.796216e-02
        5.892504e+02	        2.741721e-02
        5.958503e+02	        2.686655e-02
        6.025241e+02	        2.631015e-02
        6.092727e+02	        2.578160e-02
        6.160968e+02	        2.529351e-02
        6.229974e+02	        2.480024e-02
        6.299753e+02	        2.430379e-02
        6.370313e+02	        2.380514e-02
        6.441664e+02	        2.330172e-02
        6.513814e+02	        2.279273e-02
        6.586772e+02	        2.235363e-02
        6.660547e+02	        2.193443e-02
        6.735148e+02	        2.151058e-02
        6.810585e+02	        2.107748e-02
        6.886867e+02	        2.063449e-02
        6.964003e+02	        2.019272e-02
        7.042004e+02	        1.976926e-02
        7.120878e+02	        1.941835e-02
        7.200635e+02	        1.906483e-02
        7.281286e+02	        1.870818e-02
        7.362840e+02	        1.834797e-02
        7.445307e+02	        1.798401e-02
        7.528698e+02	        1.761431e-02
        7.613023e+02	        1.725687e-02
        7.698293e+02	        1.691857e-02
        7.784518e+02	        1.657755e-02
        7.871708e+02	        1.623375e-02
        7.959875e+02	        1.588655e-02
        8.049030e+02	        1.553579e-02
        8.139183e+02	        1.522885e-02
        8.230346e+02	        1.494286e-02
        8.322529e+02	        1.464745e-02
        8.415746e+02	        1.434979e-02
        8.510006e+02	        1.404825e-02
        8.605323e+02	        1.374293e-02
        8.701706e+02	        1.346668e-02
        8.799170e+02	        1.320325e-02
        8.897725e+02	        1.293718e-02
        8.997384e+02	        1.266837e-02
        9.098159e+02	        1.239293e-02
        9.200063e+02	        1.212348e-02
        9.303108e+02	        1.188536e-02
        9.407307e+02	        1.165227e-02
        9.512674e+02	        1.141756e-02
        9.619221e+02	        1.118069e-02
        9.726961e+02	        1.094143e-02
        9.835907e+02	        1.070761e-02
        9.946074e+02	        1.048096e-02
        1.005748e+03	        1.025574e-02
        1.017012e+03	        1.003154e-02
        1.028403e+03	        9.806756e-03
        1.039922e+03	        9.587713e-03
        1.051570e+03	        9.393847e-03
        1.063348e+03	        9.198098e-03
        1.075258e+03	        8.995765e-03
        1.087301e+03	        8.792234e-03
        1.099480e+03	        8.588009e-03
        1.111794e+03	        8.402209e-03
        1.124247e+03	        8.219252e-03
        1.136839e+03	        8.034963e-03
        1.149572e+03	        7.849319e-03
        1.162448e+03	        7.623498e-03
        1.175468e+03	        7.417066e-03
        1.188634e+03	        7.219405e-03
        1.201947e+03	        7.028383e-03
        1.215409e+03	        6.838579e-03
        1.229023e+03	        6.659050e-03
        1.242788e+03	        6.484230e-03
        1.256708e+03	        6.309666e-03
        1.270784e+03	        6.134106e-03
        1.285017e+03	        5.977183e-03
        1.299410e+03	        5.821868e-03
        1.313964e+03	        5.665646e-03
        1.328681e+03	        5.508766e-03
        1.343563e+03	        5.357262e-03
        1.358612e+03	        5.209794e-03
        1.373829e+03	        5.063871e-03
        1.389216e+03	        4.919310e-03
        1.404776e+03	        4.776949e-03
        1.420510e+03	        4.633693e-03
        1.436421e+03	        4.489310e-03
        1.452509e+03	        4.341906e-03
        1.468778e+03	        4.196274e-03
        1.485229e+03	        4.049506e-03
        1.501865e+03	        3.901951e-03
        1.518686e+03	        3.749832e-03
        1.535696e+03	        3.584582e-03
        1.552897e+03	        3.379574e-03
        1.570290e+03	        2.999731e-03
        1.587878e+03	        2.944217e-03
        1.605663e+03	        2.890335e-03
        1.623647e+03	        2.845562e-03
        1.641833e+03	        2.801056e-03
        1.660222e+03	        2.757082e-03
        1.678818e+03	        2.712660e-03
        1.697621e+03	        2.667760e-03
        1.716635e+03	        2.622988e-03
        1.735863e+03	        2.578791e-03
        1.755305e+03	        2.536281e-03
        1.774965e+03	        2.493667e-03
        1.794846e+03	        2.452581e-03
        1.814949e+03	        2.411653e-03
        1.835277e+03	        2.370390e-03
        1.855833e+03	        2.328683e-03
        1.876620e+03	        2.286521e-03
        1.897639e+03	        2.244013e-03
        1.918893e+03	        2.202337e-03
        1.940386e+03	        2.160996e-03
        1.962119e+03	        2.124039e-03
        1.984096e+03	        2.087543e-03
        2.006319e+03	        2.050664e-03
        2.028790e+03	        2.013432e-03
        2.051514e+03	        1.975839e-03
        2.074492e+03	        1.939455e-03
        2.097727e+03	        1.903748e-03
        2.121223e+03	        1.868149e-03
        2.144981e+03	        1.836090e-03
        2.169006e+03	        1.804471e-03
        2.193300e+03	        1.772522e-03
        2.217866e+03	        1.740447e-03
        2.242707e+03	        1.708658e-03
        2.267827e+03	        1.676688e-03
        2.293228e+03	        1.644787e-03
        2.318913e+03	        1.612773e-03
        2.344886e+03	        1.581872e-03
        2.371150e+03	        1.551473e-03
        2.397708e+03	        1.521225e-03
        2.424563e+03	        1.491689e-03
        2.451720e+03	        1.461848e-03
        2.479180e+03	        1.431700e-03
        2.506948e+03	        1.402777e-03
        2.535027e+03	        1.374769e-03
        2.563421e+03	        1.349508e-03
        2.592132e+03	        1.324125e-03
        2.621165e+03	        1.298653e-03
        2.650524e+03	        1.272897e-03
        2.680211e+03	        1.246854e-03
        2.710231e+03	        1.220524e-03
        2.740587e+03	        1.195248e-03
        2.771282e+03	        1.172023e-03
        2.802322e+03	        1.150170e-03
        2.833710e+03	        1.128062e-03
        2.865449e+03	        1.105707e-03
        2.897543e+03	        1.083101e-03
        2.929997e+03	        1.060289e-03
        2.962814e+03	        1.037538e-03
        2.995999e+03	        1.015708e-03
        3.029556e+03	        9.964497e-04
        3.063488e+03	        9.769792e-04
        3.097801e+03	        9.572908e-04
        3.132498e+03	        9.373834e-04
        3.167583e+03	        9.177283e-04
        3.203062e+03	        8.983947e-04
        3.238938e+03	        8.788630e-04
        3.275216e+03	        8.604760e-04
        3.311900e+03	        8.426759e-04
        3.348994e+03	        8.247181e-04
        3.386505e+03	        8.069115e-04
        3.424435e+03	        7.889949e-04
        3.462791e+03	        7.709092e-04
        3.501576e+03	        7.532881e-04
        3.540795e+03	        7.366302e-04
        3.580454e+03	        7.209934e-04
        3.620557e+03	        7.057844e-04
        3.661109e+03	        6.907860e-04
        3.702115e+03	        6.756198e-04
        3.743580e+03	        6.603212e-04
        3.785510e+03	        6.456219e-04
        3.827910e+03	        6.309402e-04
        3.870784e+03	        6.162666e-04
        3.914139e+03	        6.020170e-04
        3.957979e+03	        5.882938e-04
        4.002311e+03	        5.745063e-04
        4.047138e+03	        5.619253e-04
        4.092468e+03	        5.494484e-04
        4.138306e+03	        5.371088e-04
        4.184657e+03	        5.247039e-04
        4.231527e+03	        5.124347e-04
        4.278923e+03	        5.005348e-04
        4.326849e+03	        4.887226e-04
        4.375311e+03	        4.770654e-04
        4.424317e+03	        4.653447e-04
        4.473872e+03	        4.535506e-04
        4.523981e+03	        4.416143e-04
        4.574652e+03	        4.299799e-04
        4.625890e+03	        4.193577e-04
        4.677703e+03	        4.091418e-04
        4.730095e+03	        3.990518e-04
        4.783075e+03	        3.888489e-04
        4.836647e+03	        3.784504e-04
        4.890820e+03	        3.682958e-04
        4.945600e+03	        3.581389e-04
        5.000993e+03	        3.478116e-04
        5.057007e+03	        3.371870e-04
        5.113648e+03	        3.250055e-04
        5.170923e+03	        3.140559e-04
        5.228840e+03	        3.062688e-04
        5.287405e+03	        2.985875e-04
        5.346627e+03	        2.908224e-04
        5.406512e+03	        2.830128e-04
        5.467067e+03	        2.758865e-04
        5.528301e+03	        2.688266e-04
        5.590221e+03	        2.618394e-04
        5.652834e+03	        2.548626e-04
        5.716149e+03	        2.478938e-04
        5.780172e+03	        2.409144e-04
        5.844913e+03	        2.338888e-04
        5.910379e+03	        2.269533e-04
        5.976578e+03	        2.202310e-04
        6.043519e+03	        2.136342e-04
        6.111209e+03	        2.067759e-04
        6.179658e+03	        1.996227e-04
        6.248873e+03	        1.910124e-04
        6.318863e+03	        1.854927e-04
        6.389638e+03	        1.800287e-04
        6.461205e+03	        1.747027e-04
        6.533574e+03	        1.693903e-04
        6.606753e+03	        1.639847e-04
        6.680752e+03	        1.586765e-04
        6.755579e+03	        1.533582e-04
        6.831245e+03	        1.480356e-04
        6.907759e+03	        1.425992e-04
        6.985129e+03	        1.371864e-04
        7.063366e+03	        1.315789e-04
        7.142479e+03	        1.255182e-04
        7.222478e+03	        1.189647e-04
        7.303374e+03	        1.103702e-04
        7.385175e+03	        9.991555e-05
        7.467893e+03	        9.742649e-05
        7.551537e+03	        9.507468e-05
        7.636118e+03	        9.281452e-05
        7.721646e+03	        9.059698e-05
        7.808132e+03	        8.840755e-05
        7.895587e+03	        8.619726e-05
        7.984022e+03	        8.396249e-05
        8.073446e+03	        8.184816e-05
        8.163873e+03	        7.984547e-05
        8.255312e+03	        7.782532e-05
        8.347776e+03	        7.577077e-05
        8.441275e+03	        7.369459e-05
        8.535822e+03	        7.159490e-05
        8.631427e+03	        6.953036e-05
        8.728103e+03	        6.747153e-05
        8.825862e+03	        6.540445e-05
        8.924716e+03	        6.338249e-05
        9.024678e+03	        6.147119e-05
        9.125758e+03	        5.960221e-05
        9.227971e+03	        5.773507e-05
        9.331329e+03	        5.580069e-05
        9.435845e+03	        5.378284e-05
        9.541531e+03	        5.166990e-05
        9.648401e+03	        4.868069e-05
        9.756468e+03	        4.734122e-05
        9.865745e+03	        4.601991e-05
        9.976246e+03	        4.469571e-05
        1.008798e+04	        4.335823e-05
        1.020098e+04	        4.205193e-05
        1.031523e+04	        4.078781e-05
        1.043077e+04	        3.952418e-05
        1.054760e+04	        3.831768e-05
        1.066573e+04	        3.711024e-05
        1.078520e+04	        3.588190e-05
        1.090600e+04	        3.464513e-05
        1.102815e+04	        3.343892e-05
        1.115167e+04	        3.222038e-05
        1.127657e+04	        3.103145e-05
        1.140288e+04	        2.987300e-05
        1.153059e+04	        2.867361e-05
        1.165974e+04	        2.743785e-05
        1.179034e+04	        2.613227e-05
        1.192240e+04	        2.461841e-05
        1.205593e+04	        2.256743e-05
        1.219096e+04	        2.185716e-05
        1.232751e+04	        2.120743e-05
        1.246558e+04	        2.055480e-05
        1.260520e+04	        1.989375e-05
        1.274639e+04	        1.922409e-05
        1.288915e+04	        1.854514e-05
        1.303352e+04	        1.786104e-05
        1.317950e+04	        1.714218e-05
        1.332712e+04	        1.643761e-05
        1.347639e+04	        1.577886e-05
        1.362733e+04	        1.509302e-05
        1.377996e+04	        1.435279e-05
        1.393431e+04	        1.355974e-05
        1.409038e+04	        1.262201e-05
        1.424820e+04	        1.171373e-05
        1.440778e+04	        1.142566e-05
        1.456916e+04	        1.113577e-05
        1.473234e+04	        1.084308e-05
        1.489735e+04	        1.054862e-05
        1.506421e+04	        1.025123e-05
        1.523293e+04	        9.961760e-06
        1.540355e+04	        9.677367e-06
        1.557608e+04	        9.392396e-06
        1.575054e+04	        9.103119e-06
        1.592695e+04	        8.808131e-06
        1.610534e+04	        8.511311e-06
        1.628573e+04	        8.238080e-06
        1.646814e+04	        7.954284e-06
        1.665259e+04	        7.619880e-06
        1.683910e+04	        7.406573e-06
        1.702771e+04	        7.191494e-06
        1.721843e+04	        6.977771e-06
        1.741128e+04	        6.791824e-06
        1.760630e+04	        6.604722e-06
        1.780350e+04	        6.415647e-06
        1.800291e+04	        6.224640e-06
        1.820455e+04	        6.032297e-06
        1.840845e+04	        5.847359e-06
        1.861463e+04	        5.666233e-06
        1.882312e+04	        5.481794e-06
        1.903395e+04	        5.290067e-06
        1.924714e+04	        5.103412e-06
        1.946272e+04	        4.939411e-06
        1.968071e+04	        4.784019e-06
        1.990114e+04	        4.626542e-06
        2.012405e+04	        4.467152e-06
        2.034945e+04	        4.304448e-06
        2.057737e+04	        4.157068e-06
        2.080785e+04	        4.010189e-06
        2.104091e+04	        3.860449e-06
        2.127657e+04	        3.705443e-06
        2.151488e+04	        3.545606e-06
        2.175586e+04	        3.399578e-06
        2.199954e+04	        3.272940e-06
        2.224594e+04	        3.144969e-06
        2.249511e+04	        3.018517e-06
        2.274706e+04	        2.897541e-06
        2.300184e+04	        2.774971e-06
        2.325947e+04	        2.651287e-06
        2.351999e+04	        2.531736e-06
        2.378343e+04	        2.417288e-06
        2.404981e+04	        2.301860e-06
        2.431918e+04	        2.185647e-06
        2.459157e+04	        2.070004e-06
        2.486701e+04	        1.953006e-06
        2.514553e+04	        1.836084e-06
        2.542717e+04	        1.724447e-06
        2.571197e+04	        1.610423e-06
        2.599996e+04	        1.490031e-06
        2.629117e+04	        1.377880e-06
        2.658564e+04	        1.261541e-06
        2.688341e+04	        1.139733e-06
        2.718452e+04	        1.008080e-06
        2.748900e+04	        8.672346e-07
        2.779689e+04	        7.169206e-07
        2.810823e+04	        5.278440e-07
        2.842306e+04	        1.872929e-07
        2.874141e+04	        5.812929e-08
        2.906333e+04	        5.287966e-08
        2.938885e+04	        4.710949e-08
        2.971802e+04	        4.055327e-08
        3.005088e+04	        3.451384e-08
        3.038746e+04	        2.769480e-08
        3.072782e+04	        1.835396e-08
        3.107198e+04	        2.635168e-09
        3.142000e+04	        2.431586e-09
        3.177192e+04	        2.207818e-09
        3.212779e+04	        1.930597e-09
        3.248763e+04	        1.667384e-09
        3.285151e+04	        1.498462e-09
        3.321946e+04	        1.294492e-09
        3.359154e+04	        9.501602e-10
        3.396778e+04	        8.968559e-10
        3.434823e+04	        8.527435e-10
        3.473295e+04	        8.055455e-10
        3.512198e+04	        7.320428e-10
        3.551536e+04	        7.042245e-10
        3.591315e+04	        6.756299e-10
        3.631540e+04	        6.459984e-10
        3.672215e+04	        6.169331e-10
        3.713345e+04	        5.866085e-10
        3.754937e+04	        5.488320e-10
        3.796994e+04	        5.186664e-10
        3.839522e+04	        4.977454e-10
        3.882526e+04	        4.750104e-10
        3.926013e+04	        4.537891e-10
        3.969986e+04	        4.328685e-10
        4.014452e+04	        4.062058e-10
        4.059416e+04	        3.889518e-10
        4.104883e+04	        3.711574e-10
        4.150860e+04	        3.507984e-10
        4.197351e+04	        3.355197e-10
        4.244364e+04	        3.167652e-10
        4.291903e+04	        2.972726e-10
        4.339974e+04	        2.867470e-10
        4.388584e+04	        2.753789e-10
        4.437738e+04	        2.651678e-10
        4.487443e+04	        2.547496e-10
        4.537705e+04	        2.430153e-10
        4.588529e+04	        2.356037e-10
        4.639923e+04	        2.280640e-10
        4.691893e+04	        2.208183e-10
        4.744444e+04	        2.135671e-10
        4.797584e+04	        2.061459e-10
        4.851319e+04	        1.995537e-10
        4.905657e+04	        1.929071e-10
        4.960602e+04	        1.861744e-10
        5.016164e+04	        1.790298e-10
        5.072347e+04	        1.725061e-10
        5.129160e+04	        1.659141e-10
        5.186609e+04	        1.601868e-10
        5.244702e+04	        1.543326e-10
        5.303445e+04	        1.484962e-10
        5.362846e+04	        1.424361e-10
        5.422913e+04	        1.365825e-10
        5.483652e+04	        1.307527e-10
        5.545071e+04	        1.250166e-10
        5.607179e+04	        1.189690e-10
        5.669982e+04	        1.134857e-10
        5.733489e+04	        1.086145e-10
        5.797707e+04	        1.036300e-10
        5.862644e+04	        9.785904e-11
        5.928308e+04	        9.339027e-11
        5.994708e+04	        8.932061e-11
        6.061852e+04	        8.539186e-11
        6.129748e+04	        8.101437e-11
        6.198404e+04	        7.743482e-11
        6.267829e+04	        7.359848e-11
        6.338032e+04	        6.929889e-11
        6.409021e+04	        6.530995e-11
        6.480805e+04	        6.256823e-11
        6.553393e+04	        5.995055e-11
        6.626795e+04	        5.711145e-11
        6.701018e+04	        5.486549e-11
        6.776073e+04	        5.255215e-11
        6.851968e+04	        5.004350e-11
        6.928713e+04	        4.797258e-11
        7.006318e+04	        4.594751e-11
        7.084793e+04	        4.386482e-11
        7.164146e+04	        4.180612e-11
        7.244388e+04	        3.984918e-11
        7.325529e+04	        3.789037e-11
        7.407578e+04	        3.593487e-11
        7.490547e+04	        3.408160e-11
        7.574444e+04	        3.218122e-11
        7.659282e+04	        3.028697e-11
        7.745070e+04	        2.848159e-11
        7.831818e+04	        2.667131e-11
        7.919539e+04	        2.490783e-11
        8.008241e+04	        2.314775e-11
        8.097938e+04	        2.120404e-11
        8.188638e+04	        1.929995e-11
        8.280355e+04	        1.745003e-11
        8.373099e+04	        1.553631e-11
        8.466882e+04	        1.380047e-11
        8.561715e+04	        1.171350e-11
        8.657611e+04	        1.004579e-11
        8.754580e+04	        8.192065e-12
        8.852636e+04	        6.499606e-12
        8.951790e+04	        5.387205e-12
        9.052054e+04	        4.231301e-12
        9.153442e+04	        2.907383e-12
        9.255965e+04	        1.279263e-12
        9.359636e+04	        2.457581e-13
        9.464469e+04	        1.586514e-13
        9.570475e+04	        1.451603e-13
        9.677669e+04	        1.314137e-13
        9.786064e+04	        1.167611e-13
        9.895673e+04	        1.015382e-13
        1.000651e+05	        8.394506e-14
        1.011859e+05	        6.162227e-14
        1.023192e+05	        2.650047e-14
        1.034652e+05	        1.334823e-14
        1.046241e+05	        3.970412e-15
        1.057959e+05	        0.000000e+00
        1.069809e+05	        0.000000e+00
        1.081791e+05	        0.000000e+00
        1.093908e+05	        0.000000e+00

# -------------------------------------------------------------------------------
# Curve 1: LET spectrum with Flares 
# Params: 0 5 #ff963e 2 1
#	LET (MeV.cm^2.g^{-1})		Flux (cm^{-2}.s^{-1})
# -------------------------------------------------------------------------------
        1.608960e+00	        2.041257e+04
        1.626982e+00	        2.041257e+04
        1.645205e+00	        2.041257e+04
        1.663632e+00	        2.041257e+04
        1.682265e+00	        2.041245e+04
        1.701107e+00	        2.041232e+04
        1.720161e+00	        2.041223e+04
        1.739427e+00	        2.041216e+04
        1.758910e+00	        2.041211e+04
        1.778610e+00	        2.041207e+04
        1.798532e+00	        2.041203e+04
        1.818676e+00	        2.041189e+04
        1.839046e+00	        2.041167e+04
        1.859644e+00	        2.041141e+04
        1.880473e+00	        2.041101e+04
        1.901536e+00	        2.041060e+04
        1.922834e+00	        2.041015e+04
        1.944370e+00	        2.040966e+04
        1.966148e+00	        2.040918e+04
        1.988170e+00	        2.040867e+04
        2.010439e+00	        2.040814e+04
        2.032956e+00	        2.040760e+04
        2.055727e+00	        2.040703e+04
        2.078752e+00	        2.040640e+04
        2.102035e+00	        2.040576e+04
        2.125579e+00	        2.040512e+04
        2.149386e+00	        2.040441e+04
        2.173460e+00	        2.040366e+04
        2.197804e+00	        2.040290e+04
        2.222421e+00	        2.040213e+04
        2.247313e+00	        2.040134e+04
        2.272484e+00	        2.040053e+04
        2.297937e+00	        2.039971e+04
        2.323675e+00	        2.039888e+04
        2.349701e+00	        2.039804e+04
        2.376019e+00	        2.039701e+04
        2.402632e+00	        2.039585e+04
        2.429542e+00	        2.039469e+04
        2.456754e+00	        2.039351e+04
        2.484271e+00	        2.039234e+04
        2.512096e+00	        2.039127e+04
        2.540233e+00	        2.039019e+04
        2.568685e+00	        2.038909e+04
        2.597455e+00	        2.038799e+04
        2.626548e+00	        2.038687e+04
        2.655967e+00	        2.038574e+04
        2.685715e+00	        2.038411e+04
        2.715796e+00	        2.038246e+04
        2.746214e+00	        2.038078e+04
        2.776973e+00	        2.037909e+04
        2.808077e+00	        2.037738e+04
        2.839529e+00	        2.037549e+04
        2.871333e+00	        2.037352e+04
        2.903493e+00	        2.037153e+04
        2.936014e+00	        2.036951e+04
        2.968899e+00	        2.036748e+04
        3.002152e+00	        2.036542e+04
        3.035777e+00	        2.036298e+04
        3.069779e+00	        2.036046e+04
        3.104162e+00	        2.035791e+04
        3.138931e+00	        2.035533e+04
        3.174088e+00	        2.035273e+04
        3.209640e+00	        2.035009e+04
        3.245589e+00	        2.034745e+04
        3.281941e+00	        2.034479e+04
        3.318701e+00	        2.034210e+04
        3.355872e+00	        2.033938e+04
        3.393459e+00	        2.033662e+04
        3.431468e+00	        2.033384e+04
        3.469902e+00	        2.033103e+04
        3.508766e+00	        2.032782e+04
        3.548066e+00	        2.032446e+04
        3.587806e+00	        2.032107e+04
        3.627992e+00	        2.031763e+04
        3.668627e+00	        2.031416e+04
        3.709717e+00	        2.031065e+04
        3.751268e+00	        2.030711e+04
        3.793284e+00	        2.030365e+04
        3.835771e+00	        2.030016e+04
        3.878733e+00	        2.029662e+04
        3.922177e+00	        2.029305e+04
        3.966107e+00	        2.028943e+04
        4.010530e+00	        2.028578e+04
        4.055449e+00	        2.028208e+04
        4.100872e+00	        2.027790e+04
        4.146804e+00	        2.027263e+04
        4.193250e+00	        2.026729e+04
        4.240217e+00	        2.026190e+04
        4.287709e+00	        2.025644e+04
        4.335734e+00	        2.025093e+04
        4.384296e+00	        2.024535e+04
        4.433403e+00	        2.024010e+04
        4.483059e+00	        2.023480e+04
        4.533271e+00	        2.022944e+04
        4.584046e+00	        2.022403e+04
        4.635390e+00	        2.021855e+04
        4.687308e+00	        2.021301e+04
        4.739809e+00	        2.020741e+04
        4.792897e+00	        2.020175e+04
        4.846580e+00	        2.019412e+04
        4.900864e+00	        2.018612e+04
        4.955756e+00	        2.017803e+04
        5.011263e+00	        2.016985e+04
        5.067391e+00	        2.016158e+04
        5.124149e+00	        2.015322e+04
        5.181542e+00	        2.014476e+04
        5.239577e+00	        2.013586e+04
        5.298263e+00	        2.012677e+04
        5.357606e+00	        2.011757e+04
        5.417614e+00	        2.010828e+04
        5.478294e+00	        2.009888e+04
        5.539654e+00	        2.008937e+04
        5.601701e+00	        2.007975e+04
        5.664442e+00	        2.007003e+04
        5.727887e+00	        2.005912e+04
        5.792042e+00	        2.004751e+04
        5.856916e+00	        2.003578e+04
        5.922516e+00	        2.002392e+04
        5.988851e+00	        2.001192e+04
        6.055929e+00	        1.999979e+04
        6.123759e+00	        1.998752e+04
        6.192348e+00	        1.997512e+04
        6.261705e+00	        1.996129e+04
        6.331839e+00	        1.994498e+04
        6.402759e+00	        1.992849e+04
        6.474473e+00	        1.991181e+04
        6.546991e+00	        1.989495e+04
        6.620320e+00	        1.987789e+04
        6.694471e+00	        1.986065e+04
        6.769452e+00	        1.984319e+04
        6.845274e+00	        1.982385e+04
        6.921944e+00	        1.980320e+04
        6.999473e+00	        1.978231e+04
        7.077871e+00	        1.976120e+04
        7.157146e+00	        1.973985e+04
        7.237310e+00	        1.971826e+04
        7.318371e+00	        1.969643e+04
        7.400341e+00	        1.967435e+04
        7.483228e+00	        1.965007e+04
        7.567044e+00	        1.962330e+04
        7.651799e+00	        1.959623e+04
        7.737503e+00	        1.956885e+04
        7.824166e+00	        1.954117e+04
        7.911801e+00	        1.951318e+04
        8.000417e+00	        1.948488e+04
        8.090026e+00	        1.945626e+04
        8.180638e+00	        1.942725e+04
        8.272265e+00	        1.939116e+04
        8.364918e+00	        1.935467e+04
        8.458610e+00	        1.931777e+04
        8.553350e+00	        1.928046e+04
        8.649152e+00	        1.924273e+04
        8.746027e+00	        1.920458e+04
        8.843987e+00	        1.916600e+04
        8.943044e+00	        1.912698e+04
        9.043210e+00	        1.908119e+04
        9.144499e+00	        1.902971e+04
        9.246921e+00	        1.897766e+04
        9.350492e+00	        1.892502e+04
        9.455222e+00	        1.887180e+04
        9.561125e+00	        1.881797e+04
        9.668214e+00	        1.876355e+04
        9.776503e+00	        1.870851e+04
        9.886005e+00	        1.865258e+04
        9.996733e+00	        1.859560e+04
        1.010870e+01	        1.853799e+04
        1.022192e+01	        1.847973e+04
        1.033641e+01	        1.842083e+04
        1.045219e+01	        1.836126e+04
        1.056926e+01	        1.830102e+04
        1.068764e+01	        1.824011e+04
        1.080734e+01	        1.817852e+04
        1.092839e+01	        1.811207e+04
        1.105080e+01	        1.803131e+04
        1.117457e+01	        1.794964e+04
        1.129973e+01	        1.786706e+04
        1.142629e+01	        1.778355e+04
        1.155427e+01	        1.769911e+04
        1.168369e+01	        1.761373e+04
        1.181455e+01	        1.752739e+04
        1.194688e+01	        1.744312e+04
        1.208069e+01	        1.736595e+04
        1.221600e+01	        1.728792e+04
        1.235282e+01	        1.720902e+04
        1.249118e+01	        1.712923e+04
        1.263109e+01	        1.704855e+04
        1.277256e+01	        1.696697e+04
        1.291562e+01	        1.688447e+04
        1.306028e+01	        1.680105e+04
        1.320657e+01	        1.671669e+04
        1.335449e+01	        1.661695e+04
        1.350406e+01	        1.650552e+04
        1.365531e+01	        1.639284e+04
        1.380826e+01	        1.627890e+04
        1.396292e+01	        1.616368e+04
        1.411931e+01	        1.604717e+04
        1.427746e+01	        1.592936e+04
        1.443737e+01	        1.581023e+04
        1.459908e+01	        1.569628e+04
        1.476259e+01	        1.558278e+04
        1.492794e+01	        1.546801e+04
        1.509514e+01	        1.535195e+04
        1.526421e+01	        1.523460e+04
        1.543518e+01	        1.511593e+04
        1.560806e+01	        1.499593e+04
        1.578288e+01	        1.487459e+04
        1.595966e+01	        1.475186e+04
        1.613841e+01	        1.462760e+04
        1.631917e+01	        1.450196e+04
        1.650195e+01	        1.437490e+04
        1.668678e+01	        1.424642e+04
        1.687368e+01	        1.411650e+04
        1.706268e+01	        1.398513e+04
        1.725379e+01	        1.385229e+04
        1.744704e+01	        1.371795e+04
        1.764245e+01	        1.359230e+04
        1.784006e+01	        1.346897e+04
        1.803988e+01	        1.334427e+04
        1.824193e+01	        1.321817e+04
        1.844625e+01	        1.309066e+04
        1.865286e+01	        1.296172e+04
        1.886178e+01	        1.283133e+04
        1.907304e+01	        1.269949e+04
        1.928667e+01	        1.256617e+04
        1.950269e+01	        1.243898e+04
        1.972113e+01	        1.231048e+04
        1.994201e+01	        1.218055e+04
        2.016537e+01	        1.204916e+04
        2.039124e+01	        1.191629e+04
        2.061963e+01	        1.178194e+04
        2.085058e+01	        1.164609e+04
        2.108411e+01	        1.150871e+04
        2.132027e+01	        1.137611e+04
        2.155906e+01	        1.125199e+04
        2.180054e+01	        1.112648e+04
        2.204471e+01	        1.099957e+04
        2.229162e+01	        1.087123e+04
        2.254130e+01	        1.074145e+04
        2.279378e+01	        1.061022e+04
        2.304908e+01	        1.047752e+04
        2.330724e+01	        1.034334e+04
        2.356829e+01	        1.020154e+04
        2.383227e+01	        1.005292e+04
        2.409920e+01	        9.902639e+03
        2.436912e+01	        9.750673e+03
        2.464207e+01	        9.597005e+03
        2.491807e+01	        9.441616e+03
        2.519717e+01	        9.284486e+03
        2.547939e+01	        9.133851e+03
        2.576477e+01	        9.019063e+03
        2.605335e+01	        8.902989e+03
        2.634516e+01	        8.785614e+03
        2.664024e+01	        8.666925e+03
        2.693862e+01	        8.546907e+03
        2.724035e+01	        8.425545e+03
        2.754545e+01	        8.302822e+03
        2.785397e+01	        8.178726e+03
        2.816595e+01	        8.053239e+03
        2.848142e+01	        7.927659e+03
        2.880043e+01	        7.800701e+03
        2.912301e+01	        7.672322e+03
        2.944920e+01	        7.542505e+03
        2.977905e+01	        7.411234e+03
        3.011259e+01	        7.278492e+03
        3.044986e+01	        7.144263e+03
        3.079092e+01	        7.008531e+03
        3.113579e+01	        6.896372e+03
        3.148453e+01	        6.786222e+03
        3.183717e+01	        6.674838e+03
        3.219376e+01	        6.562207e+03
        3.255435e+01	        6.448315e+03
        3.291897e+01	        6.333146e+03
        3.328768e+01	        6.216687e+03
        3.366052e+01	        6.098924e+03
        3.403753e+01	        5.987209e+03
        3.441877e+01	        5.893931e+03
        3.480428e+01	        5.799608e+03
        3.519410e+01	        5.704230e+03
        3.558829e+01	        5.607782e+03
        3.598690e+01	        5.510255e+03
        3.638997e+01	        5.411634e+03
        3.679756e+01	        5.311909e+03
        3.720971e+01	        5.211067e+03
        3.762647e+01	        5.111097e+03
        3.804791e+01	        5.016571e+03
        3.847406e+01	        4.920987e+03
        3.890499e+01	        4.824332e+03
        3.934075e+01	        4.726595e+03
        3.978138e+01	        4.627764e+03
        4.022696e+01	        4.527825e+03
        4.067752e+01	        4.426768e+03
        4.113313e+01	        4.331564e+03
        4.159384e+01	        4.253620e+03
        4.205971e+01	        4.174804e+03
        4.253080e+01	        4.095104e+03
        4.300716e+01	        4.014512e+03
        4.348887e+01	        3.933017e+03
        4.397596e+01	        3.850609e+03
        4.446851e+01	        3.767277e+03
        4.496658e+01	        3.683011e+03
        4.547023e+01	        3.612188e+03
        4.597952e+01	        3.544857e+03
        4.649451e+01	        3.476772e+03
        4.701528e+01	        3.407925e+03
        4.754187e+01	        3.338306e+03
        4.807436e+01	        3.267910e+03
        4.861282e+01	        3.196725e+03
        4.915731e+01	        3.124743e+03
        4.970789e+01	        3.054521e+03
        5.026464e+01	        2.996513e+03
        5.082763e+01	        2.937855e+03
        5.139693e+01	        2.878540e+03
        5.197260e+01	        2.818561e+03
        5.255472e+01	        2.757910e+03
        5.314336e+01	        2.696580e+03
        5.373859e+01	        2.634560e+03
        5.434049e+01	        2.571846e+03
        5.494913e+01	        2.515271e+03
        5.556458e+01	        2.461553e+03
        5.618694e+01	        2.407233e+03
        5.681626e+01	        2.352305e+03
        5.745263e+01	        2.296762e+03
        5.809612e+01	        2.240596e+03
        5.874683e+01	        2.183803e+03
        5.940482e+01	        2.126373e+03
        6.007019e+01	        2.079676e+03
        6.074300e+01	        2.035637e+03
        6.142335e+01	        1.991104e+03
        6.211133e+01	        1.946073e+03
        6.280700e+01	        1.900537e+03
        6.351047e+01	        1.854491e+03
        6.422182e+01	        1.807930e+03
        6.494114e+01	        1.760847e+03
        6.566851e+01	        1.718721e+03
        6.640403e+01	        1.678874e+03
        6.714779e+01	        1.638581e+03
        6.789988e+01	        1.597837e+03
        6.866039e+01	        1.556636e+03
        6.942942e+01	        1.514974e+03
        7.020706e+01	        1.472845e+03
        7.099342e+01	        1.432332e+03
        7.178858e+01	        1.404952e+03
        7.259264e+01	        1.377265e+03
        7.340572e+01	        1.349267e+03
        7.422790e+01	        1.320957e+03
        7.505929e+01	        1.292329e+03
        7.589999e+01	        1.263380e+03
        7.675011e+01	        1.234107e+03
        7.760974e+01	        1.204507e+03
        7.847901e+01	        1.174988e+03
        7.935802e+01	        1.146935e+03
        8.024686e+01	        1.118566e+03
        8.114567e+01	        1.089881e+03
        8.205454e+01	        1.060873e+03
        8.297359e+01	        1.031541e+03
        8.390294e+01	        1.001881e+03
        8.484269e+01	        9.718887e+02
        8.579297e+01	        9.508485e+02
        8.675389e+01	        9.300492e+02
        8.772558e+01	        9.090169e+02
        8.870815e+01	        8.877490e+02
        8.970173e+01	        8.662430e+02
        9.070643e+01	        8.444960e+02
        9.172239e+01	        8.225055e+02
        9.274972e+01	        8.002681e+02
        9.378856e+01	        7.819601e+02
        9.483904e+01	        7.640848e+02
        9.590129e+01	        7.460093e+02
        9.697543e+01	        7.277314e+02
        9.806160e+01	        7.092487e+02
        9.915994e+01	        6.905590e+02
        1.002706e+02	        6.716614e+02
        1.013937e+02	        6.531236e+02
        1.025293e+02	        6.383219e+02
        1.036777e+02	        6.233545e+02
        1.048389e+02	        6.082195e+02
        1.060132e+02	        5.929149e+02
        1.072006e+02	        5.774389e+02
        1.084013e+02	        5.617891e+02
        1.096154e+02	        5.459642e+02
        1.108432e+02	        5.321181e+02
        1.120847e+02	        5.200729e+02
        1.133401e+02	        5.078929e+02
        1.146095e+02	        4.955765e+02
        1.158932e+02	        4.831221e+02
        1.171913e+02	        4.705282e+02
        1.185039e+02	        4.577933e+02
        1.198312e+02	        4.449158e+02
        1.211734e+02	        4.342738e+02
        1.225306e+02	        4.239128e+02
        1.239030e+02	        4.134357e+02
        1.252907e+02	        4.028413e+02
        1.266941e+02	        3.921282e+02
        1.281131e+02	        3.812951e+02
        1.295480e+02	        3.703407e+02
        1.309990e+02	        3.601067e+02
        1.324663e+02	        3.505148e+02
        1.339500e+02	        3.408187e+02
        1.354503e+02	        3.310140e+02
        1.369674e+02	        3.210995e+02
        1.385015e+02	        3.110740e+02
        1.400528e+02	        3.010354e+02
        1.416214e+02	        2.939840e+02
        1.432077e+02	        2.868536e+02
        1.448117e+02	        2.796434e+02
        1.464336e+02	        2.723524e+02
        1.480737e+02	        2.649807e+02
        1.497322e+02	        2.575265e+02
        1.514093e+02	        2.499887e+02
        1.531052e+02	        2.434068e+02
        1.548200e+02	        2.369641e+02
        1.565541e+02	        2.304492e+02
        1.583076e+02	        2.238614e+02
        1.600807e+02	        2.171999e+02
        1.618737e+02	        2.104671e+02
        1.636867e+02	        2.040584e+02
        1.655201e+02	        1.986880e+02
        1.673740e+02	        1.932574e+02
        1.692487e+02	        1.877660e+02
        1.711444e+02	        1.822131e+02
        1.730613e+02	        1.765980e+02
        1.749996e+02	        1.709200e+02
        1.769597e+02	        1.664866e+02
        1.789418e+02	        1.622905e+02
        1.809460e+02	        1.580473e+02
        1.829727e+02	        1.537567e+02
        1.850221e+02	        1.494180e+02
        1.870944e+02	        1.450307e+02
        1.891900e+02	        1.405993e+02
        1.913090e+02	        1.366024e+02
        1.934517e+02	        1.325607e+02
        1.956185e+02	        1.284755e+02
        1.978095e+02	        1.243450e+02
        2.000251e+02	        1.201682e+02
        2.022655e+02	        1.160870e+02
        2.045309e+02	        1.129088e+02
        2.068218e+02	        1.096949e+02
        2.091383e+02	        1.064451e+02
        2.114807e+02	        1.031589e+02
        2.138494e+02	        9.983613e+01
        2.162446e+02	        9.648029e+01
        2.186667e+02	        9.385668e+01
        2.211159e+02	        9.120369e+01
        2.235925e+02	        8.852099e+01
        2.260968e+02	        8.580823e+01
        2.286292e+02	        8.306508e+01
        2.311900e+02	        8.029121e+01
        2.337794e+02	        7.799174e+01
        2.363979e+02	        7.574752e+01
        2.390456e+02	        7.347817e+01
        2.417231e+02	        7.118339e+01
        2.444305e+02	        6.886281e+01
        2.471682e+02	        6.651627e+01
        2.499366e+02	        6.448842e+01
        2.527360e+02	        6.250030e+01
        2.555668e+02	        6.048991e+01
        2.584293e+02	        5.845799e+01
        2.613238e+02	        5.640351e+01
        2.642508e+02	        5.441667e+01
        2.672105e+02	        5.284183e+01
        2.702034e+02	        5.124936e+01
        2.732298e+02	        4.963905e+01
        2.762901e+02	        4.801070e+01
        2.793847e+02	        4.636438e+01
        2.825139e+02	        4.477296e+01
        2.856782e+02	        4.339015e+01
        2.888780e+02	        4.199185e+01
        2.921136e+02	        4.057789e+01
        2.953854e+02	        3.914810e+01
        2.986938e+02	        3.770230e+01
        3.020393e+02	        3.644370e+01
        3.054223e+02	        3.532177e+01
        3.088432e+02	        3.418727e+01
        3.123024e+02	        3.304032e+01
        3.158004e+02	        3.188052e+01
        3.193375e+02	        3.070773e+01
        3.229142e+02	        2.956237e+01
        3.265310e+02	        2.842194e+01
        3.301883e+02	        2.726873e+01
        3.338866e+02	        2.610257e+01
        3.376263e+02	        2.492429e+01
        3.414079e+02	        2.403493e+01
        3.452318e+02	        2.321372e+01
        3.490986e+02	        2.238331e+01
        3.530086e+02	        2.154361e+01
        3.569625e+02	        2.069452e+01
        3.609607e+02	        1.984433e+01
        3.650036e+02	        1.911726e+01
        3.690918e+02	        1.838232e+01
        3.732258e+02	        1.763960e+01
        3.774062e+02	        1.688856e+01
        3.816333e+02	        1.612911e+01
        3.859078e+02	        1.543152e+01
        3.902301e+02	        1.477216e+01
        3.946009e+02	        1.410542e+01
        3.990206e+02	        1.343121e+01
        4.034898e+02	        1.274976e+01
        4.080091e+02	        1.211927e+01
        4.125790e+02	        1.154934e+01
        4.172001e+02	        1.097303e+01
        4.218730e+02	        1.039026e+01
        4.265982e+02	        9.800960e+00
        4.313763e+02	        9.230907e+00
        4.362079e+02	        8.691106e+00
        4.410936e+02	        8.145701e+00
        4.460341e+02	        7.594371e+00
        4.510299e+02	        7.036869e+00
        4.560817e+02	        6.500699e+00
        4.611900e+02	        5.962961e+00
        4.663556e+02	        5.419201e+00
        4.715790e+02	        4.869351e+00
        4.768609e+02	        4.354256e+00
        4.822020e+02	        3.836947e+00
        4.876029e+02	        3.313901e+00
        4.930643e+02	        2.775141e+00
        4.985868e+02	        2.216393e+00
        5.041712e+02	        1.651389e+00
        5.098182e+02	        1.057919e+00
        5.155284e+02	        4.446958e-01
        5.213026e+02	        9.375058e-02
        5.271414e+02	        9.201864e-02
        5.330457e+02	        9.026716e-02
        5.390161e+02	        8.849426e-02
        5.450533e+02	        8.670094e-02
        5.511582e+02	        8.488563e-02
        5.573314e+02	        8.304487e-02
        5.635738e+02	        8.153539e-02
        5.698861e+02	        8.015371e-02
        5.762691e+02	        7.876160e-02
        5.827236e+02	        7.735542e-02
        5.892504e+02	        7.593969e-02
        5.958503e+02	        7.450793e-02
        6.025241e+02	        7.306014e-02
        6.092727e+02	        7.167588e-02
        6.160968e+02	        7.038947e-02
        6.229974e+02	        6.908895e-02
        6.299753e+02	        6.777926e-02
        6.370313e+02	        6.649035e-02
        6.441664e+02	        6.518808e-02
        6.513814e+02	        6.387102e-02
        6.586772e+02	        6.271615e-02
        6.660547e+02	        6.160600e-02
        6.735148e+02	        6.048346e-02
        6.810585e+02	        5.934385e-02
        6.886867e+02	        5.818576e-02
        6.964003e+02	        5.702672e-02
        7.042004e+02	        5.590847e-02
        7.120878e+02	        5.496065e-02
        7.200635e+02	        5.400478e-02
        7.281286e+02	        5.303902e-02
        7.362840e+02	        5.206288e-02
        7.445307e+02	        5.107587e-02
        7.528698e+02	        5.007587e-02
        7.613023e+02	        4.910304e-02
        7.698293e+02	        4.820709e-02
        7.784518e+02	        4.730686e-02
        7.871708e+02	        4.639901e-02
        7.959875e+02	        4.548145e-02
        8.049030e+02	        4.455395e-02
        8.139183e+02	        4.372694e-02
        8.230346e+02	        4.294756e-02
        8.322529e+02	        4.215235e-02
        8.415746e+02	        4.134964e-02
        8.510006e+02	        4.053636e-02
        8.605323e+02	        3.971221e-02
        8.701706e+02	        3.895491e-02
        8.799170e+02	        3.822571e-02
        8.897725e+02	        3.748862e-02
        8.997384e+02	        3.674350e-02
        9.098159e+02	        3.598435e-02
        9.200063e+02	        3.524102e-02
        9.303108e+02	        3.458641e-02
        9.407307e+02	        3.394957e-02
        9.512674e+02	        3.330628e-02
        9.619221e+02	        3.265566e-02
        9.726961e+02	        3.199794e-02
        9.835907e+02	        3.135144e-02
        9.946074e+02	        3.073459e-02
        1.005748e+03	        3.011515e-02
        1.017012e+03	        2.949988e-02
        1.028403e+03	        2.889107e-02
        1.039922e+03	        2.829379e-02
        1.051570e+03	        2.775464e-02
        1.063348e+03	        2.720951e-02
        1.075258e+03	        2.665385e-02
        1.087301e+03	        2.609322e-02
        1.099480e+03	        2.552874e-02
        1.111794e+03	        2.500982e-02
        1.124247e+03	        2.451012e-02
        1.136839e+03	        2.400542e-02
        1.149572e+03	        2.349625e-02
        1.162448e+03	        2.295383e-02
        1.175468e+03	        2.244642e-02
        1.188634e+03	        2.194481e-02
        1.201947e+03	        2.145106e-02
        1.215409e+03	        2.095798e-02
        1.229023e+03	        2.048850e-02
        1.242788e+03	        2.003017e-02
        1.256708e+03	        1.956970e-02
        1.270784e+03	        1.910503e-02
        1.285017e+03	        1.868295e-02
        1.299410e+03	        1.826245e-02
        1.313964e+03	        1.783834e-02
        1.328681e+03	        1.741035e-02
        1.343563e+03	        1.699599e-02
        1.358612e+03	        1.660149e-02
        1.373829e+03	        1.620623e-02
        1.389216e+03	        1.581307e-02
        1.404776e+03	        1.542510e-02
        1.420510e+03	        1.503411e-02
        1.436421e+03	        1.464220e-02
        1.452509e+03	        1.424501e-02
        1.468778e+03	        1.385306e-02
        1.485229e+03	        1.345821e-02
        1.501865e+03	        1.306280e-02
        1.518686e+03	        1.265575e-02
        1.535696e+03	        1.221728e-02
        1.552897e+03	        1.168419e-02
        1.570290e+03	        1.073590e-02
        1.587878e+03	        1.054906e-02
        1.605663e+03	        1.036737e-02
        1.623647e+03	        1.021760e-02
        1.641833e+03	        1.006778e-02
        1.660222e+03	        9.918067e-03
        1.678818e+03	        9.766885e-03
        1.697621e+03	        9.614053e-03
        1.716635e+03	        9.460592e-03
        1.735863e+03	        9.311850e-03
        1.755305e+03	        9.169007e-03
        1.774965e+03	        9.025651e-03
        1.794846e+03	        8.888353e-03
        1.814949e+03	        8.750703e-03
        1.835277e+03	        8.611719e-03
        1.855833e+03	        8.471155e-03
        1.876620e+03	        8.329005e-03
        1.897639e+03	        8.185510e-03
        1.918893e+03	        8.046403e-03
        1.940386e+03	        7.908982e-03
        1.962119e+03	        7.785407e-03
        1.984096e+03	        7.661987e-03
        2.006319e+03	        7.537208e-03
        2.028790e+03	        7.411259e-03
        2.051514e+03	        7.283989e-03
        2.074492e+03	        7.159121e-03
        2.097727e+03	        7.038611e-03
        2.121223e+03	        6.919206e-03
        2.144981e+03	        6.810835e-03
        2.169006e+03	        6.703237e-03
        2.193300e+03	        6.594461e-03
        2.217866e+03	        6.484630e-03
        2.242707e+03	        6.375093e-03
        2.267827e+03	        6.264753e-03
        2.293228e+03	        6.157477e-03
        2.318913e+03	        6.051376e-03
        2.344886e+03	        5.948101e-03
        2.371150e+03	        5.846319e-03
        2.397708e+03	        5.744312e-03
        2.424563e+03	        5.643746e-03
        2.451720e+03	        5.542187e-03
        2.479180e+03	        5.439625e-03
        2.506948e+03	        5.342991e-03
        2.535027e+03	        5.249094e-03
        2.563421e+03	        5.162983e-03
        2.592132e+03	        5.075983e-03
        2.621165e+03	        4.988508e-03
        2.650524e+03	        4.900080e-03
        2.680211e+03	        4.810676e-03
        2.710231e+03	        4.720316e-03
        2.740587e+03	        4.636624e-03
        2.771282e+03	        4.559495e-03
        2.802322e+03	        4.485722e-03
        2.833710e+03	        4.410993e-03
        2.865449e+03	        4.335427e-03
        2.897543e+03	        4.259029e-03
        2.929997e+03	        4.181991e-03
        2.962814e+03	        4.104736e-03
        2.995999e+03	        4.030158e-03
        3.029556e+03	        3.964905e-03
        3.063488e+03	        3.898930e-03
        3.097801e+03	        3.832217e-03
        3.132498e+03	        3.764768e-03
        3.167583e+03	        3.697645e-03
        3.203062e+03	        3.630972e-03
        3.238938e+03	        3.563619e-03
        3.275216e+03	        3.499126e-03
        3.311900e+03	        3.438080e-03
        3.348994e+03	        3.376534e-03
        3.386505e+03	        3.315178e-03
        3.424435e+03	        3.253290e-03
        3.462791e+03	        3.190763e-03
        3.501576e+03	        3.129476e-03
        3.540795e+03	        3.070481e-03
        3.580454e+03	        3.015388e-03
        3.620557e+03	        2.962737e-03
        3.661109e+03	        2.910461e-03
        3.702115e+03	        2.857599e-03
        3.743580e+03	        2.804234e-03
        3.785510e+03	        2.752584e-03
        3.827910e+03	        2.700868e-03
        3.870784e+03	        2.648625e-03
        3.914139e+03	        2.597661e-03
        3.957979e+03	        2.549213e-03
        4.002311e+03	        2.500824e-03
        4.047138e+03	        2.455811e-03
        4.092468e+03	        2.410979e-03
        4.138306e+03	        2.366193e-03
        4.184657e+03	        2.320962e-03
        4.231527e+03	        2.275584e-03
        4.278923e+03	        2.231802e-03
        4.326849e+03	        2.188444e-03
        4.375311e+03	        2.145497e-03
        4.424317e+03	        2.102212e-03
        4.473872e+03	        2.058560e-03
        4.523981e+03	        2.014528e-03
        4.574652e+03	        1.971211e-03
        4.625890e+03	        1.930653e-03
        4.677703e+03	        1.892424e-03
        4.730095e+03	        1.855129e-03
        4.783075e+03	        1.817417e-03
        4.836647e+03	        1.779058e-03
        4.890820e+03	        1.741310e-03
        4.945600e+03	        1.703700e-03
        5.000993e+03	        1.665691e-03
        5.057007e+03	        1.626899e-03
        5.113648e+03	        1.584643e-03
        5.170923e+03	        1.545615e-03
        5.228840e+03	        1.514248e-03
        5.287405e+03	        1.483074e-03
        5.346627e+03	        1.451607e-03
        5.406512e+03	        1.420034e-03
        5.467067e+03	        1.390621e-03
        5.528301e+03	        1.361714e-03
        5.590221e+03	        1.333371e-03
        5.652834e+03	        1.304972e-03
        5.716149e+03	        1.276534e-03
        5.780172e+03	        1.247975e-03
        5.844913e+03	        1.219254e-03
        5.910379e+03	        1.191012e-03
        5.976578e+03	        1.163510e-03
        6.043519e+03	        1.136952e-03
        6.111209e+03	        1.109797e-03
        6.179658e+03	        1.082021e-03
        6.248873e+03	        1.051876e-03
        6.318863e+03	        1.027003e-03
        6.389638e+03	        1.002549e-03
        6.461205e+03	        9.791045e-04
        6.533574e+03	        9.559081e-04
        6.606753e+03	        9.324395e-04
        6.680752e+03	        9.091176e-04
        6.755579e+03	        8.857339e-04
        6.831245e+03	        8.623090e-04
        6.907759e+03	        8.384596e-04
        6.985129e+03	        8.148578e-04
        7.063366e+03	        7.908221e-04
        7.142479e+03	        7.655095e-04
        7.222478e+03	        7.388481e-04
        7.303374e+03	        7.064610e-04
        7.385175e+03	        6.688584e-04
        7.467893e+03	        6.534277e-04
        7.551537e+03	        6.392486e-04
        7.636118e+03	        6.261546e-04
        7.721646e+03	        6.131975e-04
        7.808132e+03	        6.003070e-04
        7.895587e+03	        5.872874e-04
        7.984022e+03	        5.741246e-04
        8.073446e+03	        5.614888e-04
        8.163873e+03	        5.492273e-04
        8.255312e+03	        5.368428e-04
        8.347776e+03	        5.242302e-04
        8.441275e+03	        5.114856e-04
        8.535822e+03	        4.986105e-04
        8.631427e+03	        4.858906e-04
        8.728103e+03	        4.731833e-04
        8.825862e+03	        4.604527e-04
        8.924716e+03	        4.485038e-04
        9.024678e+03	        4.372936e-04
        9.125758e+03	        4.263233e-04
        9.227971e+03	        4.153606e-04
        9.331329e+03	        4.041323e-04
        9.435845e+03	        3.926579e-04
        9.541531e+03	        3.808778e-04
        9.648401e+03	        3.666448e-04
        9.756468e+03	        3.577629e-04
        9.865745e+03	        3.489279e-04
        9.976246e+03	        3.400409e-04
        1.008798e+04	        3.310742e-04
        1.020098e+04	        3.222553e-04
        1.031523e+04	        3.136338e-04
        1.043077e+04	        3.051493e-04
        1.054760e+04	        2.973778e-04
        1.066573e+04	        2.895856e-04
        1.078520e+04	        2.817383e-04
        1.090600e+04	        2.738450e-04
        1.102815e+04	        2.659986e-04
        1.115167e+04	        2.580920e-04
        1.127657e+04	        2.502923e-04
        1.140288e+04	        2.430094e-04
        1.153059e+04	        2.355950e-04
        1.165974e+04	        2.280152e-04
        1.179034e+04	        2.201729e-04
        1.192240e+04	        2.115469e-04
        1.205593e+04	        2.009800e-04
        1.219096e+04	        1.952419e-04
        1.232751e+04	        1.901904e-04
        1.246558e+04	        1.851371e-04
        1.260520e+04	        1.800216e-04
        1.274639e+04	        1.748488e-04
        1.288915e+04	        1.696109e-04
        1.303352e+04	        1.643679e-04
        1.317950e+04	        1.589734e-04
        1.332712e+04	        1.537121e-04
        1.347639e+04	        1.485598e-04
        1.362733e+04	        1.432532e-04
        1.377996e+04	        1.376656e-04
        1.393431e+04	        1.317854e-04
        1.409038e+04	        1.252325e-04
        1.424820e+04	        1.192227e-04
        1.440778e+04	        1.163621e-04
        1.456916e+04	        1.134824e-04
        1.473234e+04	        1.105732e-04
        1.489735e+04	        1.076396e-04
        1.506421e+04	        1.046834e-04
        1.523293e+04	        1.018302e-04
        1.540355e+04	        9.904543e-05
        1.557608e+04	        9.624563e-05
        1.575054e+04	        9.340955e-05
        1.592695e+04	        9.052881e-05
        1.610534e+04	        8.764477e-05
        1.628573e+04	        8.507034e-05
        1.646814e+04	        8.248474e-05
        1.665259e+04	        7.963083e-05
        1.683910e+04	        7.736580e-05
        1.702771e+04	        7.508101e-05
        1.721843e+04	        7.280990e-05
        1.741128e+04	        7.084601e-05
        1.760630e+04	        6.886642e-05
        1.780350e+04	        6.686256e-05
        1.800291e+04	        6.483689e-05
        1.820455e+04	        6.279549e-05
        1.840845e+04	        6.083614e-05
        1.861463e+04	        5.891740e-05
        1.882312e+04	        5.695627e-05
        1.903395e+04	        5.487790e-05
        1.924714e+04	        5.289299e-05
        1.946272e+04	        5.119674e-05
        1.968071e+04	        4.959550e-05
        1.990114e+04	        4.797388e-05
        2.012405e+04	        4.633387e-05
        2.034945e+04	        4.466649e-05
        2.057737e+04	        4.315392e-05
        2.080785e+04	        4.165243e-05
        2.104091e+04	        4.012512e-05
        2.127657e+04	        3.855198e-05
        2.151488e+04	        3.696255e-05
        2.175586e+04	        3.549786e-05
        2.199954e+04	        3.416730e-05
        2.224594e+04	        3.282280e-05
        2.249511e+04	        3.149516e-05
        2.274706e+04	        3.022639e-05
        2.300184e+04	        2.894313e-05
        2.325947e+04	        2.764776e-05
        2.351999e+04	        2.640251e-05
        2.378343e+04	        2.520081e-05
        2.404981e+04	        2.399001e-05
        2.431918e+04	        2.277284e-05
        2.459157e+04	        2.156680e-05
        2.486701e+04	        2.034720e-05
        2.514553e+04	        1.912479e-05
        2.542717e+04	        1.795988e-05
        2.571197e+04	        1.677374e-05
        2.599996e+04	        1.553313e-05
        2.629117e+04	        1.435158e-05
        2.658564e+04	        1.312670e-05
        2.688341e+04	        1.184834e-05
        2.718452e+04	        1.046922e-05
        2.748900e+04	        9.004269e-06
        2.779689e+04	        7.446690e-06
        2.810823e+04	        5.499802e-06
        2.842306e+04	        2.023993e-06
        2.874141e+04	        7.036086e-07
        2.906333e+04	        6.400651e-07
        2.938885e+04	        5.705781e-07
        2.971802e+04	        4.929462e-07
        3.005088e+04	        4.198242e-07
        3.038746e+04	        3.374434e-07
        3.072782e+04	        2.256920e-07
        3.107198e+04	        3.946876e-08
        3.142000e+04	        3.644783e-08
        3.177192e+04	        3.319136e-08
        3.212779e+04	        2.936645e-08
        3.248763e+04	        2.565796e-08
        3.285151e+04	        2.269057e-08
        3.321946e+04	        1.909336e-08
        3.359154e+04	        1.295897e-08
        3.396778e+04	        1.213213e-08
        3.434823e+04	        1.149560e-08
        3.473295e+04	        1.081099e-08
        3.512198e+04	        9.730621e-09
        3.551536e+04	        9.337972e-09
        3.591315e+04	        8.931062e-09
        3.631540e+04	        8.505629e-09
        3.672215e+04	        8.087789e-09
        3.713345e+04	        7.648626e-09
        3.754937e+04	        7.082006e-09
        3.796994e+04	        6.645574e-09
        3.839522e+04	        6.365045e-09
        3.882526e+04	        6.058177e-09
        3.926013e+04	        5.769190e-09
        3.969986e+04	        5.471254e-09
        4.014452e+04	        5.045060e-09
        4.059416e+04	        4.840972e-09
        4.104883e+04	        4.646888e-09
        4.150860e+04	        4.434034e-09
        4.197351e+04	        4.256533e-09
        4.244364e+04	        4.047337e-09
        4.291903e+04	        3.831200e-09
        4.339974e+04	        3.698275e-09
        4.388584e+04	        3.556320e-09
        4.437738e+04	        3.426600e-09
        4.487443e+04	        3.294433e-09
        4.537705e+04	        3.147748e-09
        4.588529e+04	        3.047754e-09
        4.639923e+04	        2.946414e-09
        4.691893e+04	        2.847853e-09
        4.744444e+04	        2.747659e-09
        4.797584e+04	        2.644252e-09
        4.851319e+04	        2.556660e-09
        4.905657e+04	        2.468932e-09
        4.960602e+04	        2.379582e-09
        5.016164e+04	        2.285404e-09
        5.072347e+04	        2.198543e-09
        5.129160e+04	        2.110853e-09
        5.186609e+04	        2.032213e-09
        5.244702e+04	        1.951714e-09
        5.303445e+04	        1.871905e-09
        5.362846e+04	        1.789115e-09
        5.422913e+04	        1.709015e-09
        5.483652e+04	        1.631076e-09
        5.545071e+04	        1.551075e-09
        5.607179e+04	        1.460845e-09
        5.669982e+04	        1.379334e-09
        5.733489e+04	        1.307605e-09
        5.797707e+04	        1.232307e-09
        5.862644e+04	        1.139180e-09
        5.928308e+04	        1.071451e-09
        5.994708e+04	        1.008783e-09
        6.061852e+04	        9.509877e-10
        6.129748e+04	        8.746230e-10
        6.198404e+04	        8.352254e-10
        6.267829e+04	        7.925452e-10
        6.338032e+04	        7.440765e-10
        6.409021e+04	        6.994200e-10
        6.480805e+04	        6.705960e-10
        6.553393e+04	        6.431959e-10
        6.626795e+04	        6.133433e-10
        6.701018e+04	        5.900954e-10
        6.776073e+04	        5.661331e-10
        6.851968e+04	        5.401505e-10
        6.928713e+04	        5.187965e-10
        7.006318e+04	        4.980520e-10
        7.084793e+04	        4.768646e-10
        7.164146e+04	        4.556966e-10
        7.244388e+04	        4.351238e-10
        7.325529e+04	        4.144339e-10
        7.407578e+04	        3.937856e-10
        7.490547e+04	        3.742413e-10
        7.574444e+04	        3.542796e-10
        7.659282e+04	        3.343836e-10
        7.745070e+04	        3.154509e-10
        7.831818e+04	        2.966343e-10
        7.919539e+04	        2.782154e-10
        8.008241e+04	        2.598313e-10
        8.097938e+04	        2.402846e-10
        8.188638e+04	        2.211223e-10
        8.280355e+04	        2.010645e-10
        8.373099e+04	        1.802160e-10
        8.466882e+04	        1.597987e-10
        8.561715e+04	        1.349696e-10
        8.657611e+04	        1.142843e-10
        8.754580e+04	        9.198202e-11
        8.852636e+04	        7.237060e-11
        8.951790e+04	        5.975132e-11
        9.052054e+04	        4.679930e-11
        9.153442e+04	        3.242954e-11
        9.255965e+04	        1.468578e-11
        9.359636e+04	        3.392187e-12
        9.464469e+04	        2.375937e-12
        9.570475e+04	        2.181709e-12
        9.677669e+04	        1.983492e-12
        9.786064e+04	        1.772071e-12
        9.895673e+04	        1.551722e-12
        1.000651e+05	        1.298922e-12
        1.011859e+05	        9.837739e-13
        1.023192e+05	        5.007856e-13
        1.034652e+05	        2.826795e-13
        1.046241e+05	        8.422252e-14
        1.057959e+05	        0.000000e+00
        1.069809e+05	        0.000000e+00
        1.081791e+05	        0.000000e+00
        1.093908e+05	        0.000000e+00

