# -------------------------------------------------------------------------------
#		C:/Users/ASAT 02/Documents/OMERE 5.4/CDR CLOSE-OUT/SSO 500 - 1.5 years/dose/silicon/Dose  Silicon.txt
# -------------------------------------------------------------------------------
# ID: 1 2 1

# Graph: Dose - Silicon 
# min: -0.384124 0.0107296 max: 24.5902 459157
# X-axis: Thickness  (mm Al)
# Y-axis L: Dose (rad)
# -------------------------------------------------------------------------------
# Curve 0: Trapped electrons
# Params: 2 5 #14ce57 1 1
#	Thickness  (mm Al)		Dose (rad)
# -------------------------------------------------------------------------------
            0.010000	        4.323030e+05
            0.100000	        1.015433e+05
            0.200000	        4.646733e+04
            0.300000	        2.675619e+04
            0.400000	        1.772199e+04
            0.500000	        1.282945e+04
            0.600000	        9.863348e+03
            0.700000	        7.907892e+03
            0.800000	        6.537415e+03
            0.900000	        5.531087e+03
            1.000000	        4.763400e+03
            1.100000	        4.159081e+03
            1.200000	        3.671598e+03
            1.300000	        3.269931e+03
            1.400000	        2.931192e+03
            1.500000	        2.640209e+03
            1.600000	        2.387371e+03
            1.700000	        2.165088e+03
            1.800000	        1.967579e+03
            1.900000	        1.790908e+03
            2.000000	        1.632122e+03
            2.250000	        1.299491e+03
            2.500000	        1.039775e+03
            2.750000	        8.355344e+02
            3.000000	        6.738083e+02
            3.250000	        5.448065e+02
            3.500000	        4.409334e+02
            3.750000	        3.565931e+02
            4.000000	        2.878015e+02
            4.250000	        2.316165e+02
            4.500000	        1.858089e+02
            4.750000	        1.485935e+02
            5.000000	        1.184765e+02
            5.250000	        9.419493e+01
            5.500000	        7.468232e+01
            5.750000	        5.904465e+01
            6.000000	        4.654052e+01
            6.250000	        3.656212e+01
            6.500000	        2.861628e+01
            6.750000	        2.230513e+01
            7.000000	        1.730801e+01
            7.250000	        1.336638e+01
            7.500000	        1.027100e+01
            7.750000	        7.851999e+00
            8.000000	        5.971471e+00
            8.250000	        4.517563e+00
            8.500000	        3.399662e+00
            8.750000	        2.544828e+00
            9.000000	        1.894498e+00
            9.500000	        1.031867e+00
           10.000000	        5.472234e-01
           10.500000	        2.810311e-01
           11.000000	        1.389402e-01
           11.500000	        6.582036e-02
           12.000000	        2.977640e-02
           12.500000	        1.282170e-02
           13.000000	        5.222905e-03
           13.500000	        1.986224e-03
           14.000000	        6.888590e-04
           14.500000	        2.143908e-04
           15.000000	        5.838734e-05
           16.000000	        4.908060e-06
           17.000000	        5.002337e-07
           18.000000	        7.446975e-08
           19.000000	        3.205029e-09
           20.000000	        0.000000e+00
           30.000000	        0.000000e+00
           40.000000	        0.000000e+00
           50.000000	        0.000000e+00
          100.000000	        0.000000e+00

# -------------------------------------------------------------------------------
# Curve 1: Trapped protons
# Params: 2 5 #ff5b17 1 1
#	Thickness  (mm Al)		Dose (rad)
# -------------------------------------------------------------------------------
            0.010000	        1.503989e+04
            0.100000	        1.481511e+03
            0.200000	        7.252864e+02
            0.300000	        4.849120e+02
            0.400000	        3.708816e+02
            0.500000	        3.054242e+02
            0.600000	        2.639757e+02
            0.700000	        2.377109e+02
            0.800000	        2.181458e+02
            0.900000	        2.039853e+02
            1.000000	        1.914946e+02
            1.100000	        1.829528e+02
            1.200000	        1.738902e+02
            1.300000	        1.669456e+02
            1.400000	        1.605326e+02
            1.500000	        1.550231e+02
            1.600000	        1.504630e+02
            1.700000	        1.451387e+02
            1.800000	        1.415928e+02
            1.900000	        1.382217e+02
            2.000000	        1.347374e+02
            2.250000	        1.277174e+02
            2.500000	        1.221280e+02
            2.750000	        1.173854e+02
            3.000000	        1.143385e+02
            3.250000	        1.108159e+02
            3.500000	        1.082315e+02
            3.750000	        1.061295e+02
            4.000000	        1.034948e+02
            4.250000	        1.013878e+02
            4.500000	        9.981231e+01
            4.750000	        9.761098e+01
            5.000000	        9.638314e+01
            5.250000	        9.436425e+01
            5.500000	        9.269875e+01
            5.750000	        9.138419e+01
            6.000000	        9.006487e+01
            6.250000	        8.907855e+01
            6.500000	        8.665182e+01
            6.750000	        8.643450e+01
            7.000000	        8.508654e+01
            7.250000	        8.357939e+01
            7.500000	        8.290643e+01
            7.750000	        8.095529e+01
            8.000000	        8.156680e+01
            8.250000	        8.049664e+01
            8.500000	        7.836423e+01
            8.750000	        7.806803e+01
            9.000000	        7.667939e+01
            9.500000	        7.522934e+01
           10.000000	        7.409333e+01
           10.500000	        7.295673e+01
           11.000000	        7.121641e+01
           11.500000	        6.968761e+01
           12.000000	        6.879601e+01
           12.500000	        6.650171e+01
           13.000000	        6.603628e+01
           13.500000	        6.538608e+01
           14.000000	        6.333041e+01
           14.500000	        6.194114e+01
           15.000000	        6.141404e+01
           16.000000	        5.946754e+01
           17.000000	        5.709067e+01
           18.000000	        5.549190e+01
           19.000000	        5.388503e+01
           20.000000	        5.225600e+01
           30.000000	        3.935319e+01
           40.000000	        3.053888e+01
           50.000000	        2.477414e+01
          100.000000	        8.327745e+00

# -------------------------------------------------------------------------------
# Curve 2: Solar protons
# Params: 2 5 #3690cb 1 1
#	Thickness  (mm Al)		Dose (rad)
# -------------------------------------------------------------------------------
            0.010000	        1.134777e+05
            0.100000	        2.566899e+04
            0.200000	        1.409745e+04
            0.300000	        9.678630e+03
            0.400000	        7.380731e+03
            0.500000	        5.953674e+03
            0.600000	        4.949941e+03
            0.700000	        4.251068e+03
            0.800000	        3.689483e+03
            0.900000	        3.273435e+03
            1.000000	        2.900986e+03
            1.100000	        2.648221e+03
            1.200000	        2.384938e+03
            1.300000	        2.191044e+03
            1.400000	        2.012351e+03
            1.500000	        1.866890e+03
            1.600000	        1.744589e+03
            1.700000	        1.611928e+03
            1.800000	        1.520335e+03
            1.900000	        1.435076e+03
            2.000000	        1.347899e+03
            2.250000	        1.173555e+03
            2.500000	        1.032803e+03
            2.750000	        9.165592e+02
            3.000000	        8.362133e+02
            3.250000	        7.519573e+02
            3.500000	        6.892169e+02
            3.750000	        6.376846e+02
            4.000000	        5.826932e+02
            4.250000	        5.395100e+02
            4.500000	        5.062206e+02
            4.750000	        4.679657e+02
            5.000000	        4.436168e+02
            5.250000	        4.123087e+02
            5.500000	        3.871815e+02
            5.750000	        3.669444e+02
            6.000000	        3.479808e+02
            6.250000	        3.328949e+02
            6.500000	        3.066152e+02
            6.750000	        3.000482e+02
            7.000000	        2.844973e+02
            7.250000	        2.687722e+02
            7.500000	        2.597848e+02
            7.750000	        2.422477e+02
            8.000000	        2.429654e+02
            8.250000	        2.320110e+02
            8.500000	        2.149887e+02
            8.750000	        2.101234e+02
            9.000000	        1.988608e+02
            9.500000	        1.854327e+02
           10.000000	        1.745962e+02
           10.500000	        1.643929e+02
           11.000000	        1.523164e+02
           11.500000	        1.422247e+02
           12.000000	        1.355428e+02
           12.500000	        1.239074e+02
           13.000000	        1.200133e+02
           13.500000	        1.155123e+02
           14.000000	        1.065400e+02
           14.500000	        1.004579e+02
           15.000000	        9.736929e+01
           16.000000	        8.892174e+01
           17.000000	        8.016380e+01
           18.000000	        7.419345e+01
           19.000000	        6.860217e+01
           20.000000	        6.342560e+01
           30.000000	        3.276751e+01
           40.000000	        2.007036e+01
           50.000000	        1.372845e+01
          100.000000	        3.268856e+00

# -------------------------------------------------------------------------------
# Curve 3: Secondary photons
# Params: 2 5 #e086ff 1 1
#	Thickness  (mm Al)		Dose (rad)
# -------------------------------------------------------------------------------
            0.010000	        5.306828e+02
            0.100000	        2.146673e+02
            0.200000	        1.181189e+02
            0.300000	        7.752243e+01
            0.400000	        5.654070e+01
            0.500000	        4.434225e+01
            0.600000	        3.650350e+01
            0.700000	        3.114258e+01
            0.800000	        2.725730e+01
            0.900000	        2.420955e+01
            1.000000	        2.175275e+01
            1.100000	        1.989810e+01
            1.200000	        1.832747e+01
            1.300000	        1.688995e+01
            1.400000	        1.566739e+01
            1.500000	        1.464153e+01
            1.600000	        1.372451e+01
            1.700000	        1.288004e+01
            1.800000	        1.213526e+01
            1.900000	        1.146593e+01
            2.000000	        1.085658e+01
            2.250000	        9.570157e+00
            2.500000	        8.536129e+00
            2.750000	        7.681619e+00
            3.000000	        7.004170e+00
            3.250000	        6.428382e+00
            3.500000	        5.921946e+00
            3.750000	        5.520149e+00
            4.000000	        5.163916e+00
            4.250000	        4.835873e+00
            4.500000	        4.553757e+00
            4.750000	        4.303794e+00
            5.000000	        4.082609e+00
            5.250000	        3.883950e+00
            5.500000	        3.710201e+00
            5.750000	        3.554593e+00
            6.000000	        3.409914e+00
            6.250000	        3.278499e+00
            6.500000	        3.158936e+00
            6.750000	        3.049495e+00
            7.000000	        2.949481e+00
            7.250000	        2.855698e+00
            7.500000	        2.763443e+00
            7.750000	        2.681120e+00
            8.000000	        2.608944e+00
            8.250000	        2.540610e+00
            8.500000	        2.477186e+00
            8.750000	        2.417879e+00
            9.000000	        2.362423e+00
            9.500000	        2.261883e+00
           10.000000	        2.172765e+00
           10.500000	        2.094740e+00
           11.000000	        2.020149e+00
           11.500000	        1.951745e+00
           12.000000	        1.893802e+00
           12.500000	        1.840958e+00
           13.000000	        1.792260e+00
           13.500000	        1.747174e+00
           14.000000	        1.705099e+00
           14.500000	        1.666102e+00
           15.000000	        1.630167e+00
           16.000000	        1.562824e+00
           17.000000	        1.501243e+00
           18.000000	        1.444234e+00
           19.000000	        1.390636e+00
           20.000000	        1.341143e+00
           30.000000	        1.003594e+00
           40.000000	        7.861447e-01
           50.000000	        6.658989e-01
          100.000000	        2.243657e-01

# -------------------------------------------------------------------------------
# Curve 4: Total dose
# Params: 2 5 #14bf4c 1 1
#	Thickness  (mm Al)		Dose (rad)
# -------------------------------------------------------------------------------
            0.010000	        5.613513e+05
            0.100000	        1.289085e+05
            0.200000	        6.140819e+04
            0.300000	        3.699725e+04
            0.400000	        2.553014e+04
            0.500000	        1.913289e+04
            0.600000	        1.511377e+04
            0.700000	        1.242781e+04
            0.800000	        1.047230e+04
            0.900000	        9.032716e+03
            1.000000	        7.877634e+03
            1.100000	        7.010153e+03
            1.200000	        6.248753e+03
            1.300000	        5.644810e+03
            1.400000	        5.119743e+03
            1.500000	        4.676764e+03
            1.600000	        4.296147e+03
            1.700000	        3.935035e+03
            1.800000	        3.641643e+03
            1.900000	        3.375671e+03
            2.000000	        3.125615e+03
            2.250000	        2.610334e+03
            2.500000	        2.203242e+03
            2.750000	        1.877161e+03
            3.000000	        1.631364e+03
            3.250000	        1.414008e+03
            3.500000	        1.244304e+03
            3.750000	        1.105927e+03
            4.000000	        9.791533e+02
            4.250000	        8.773502e+02
            4.500000	        7.963956e+02
            4.750000	        7.184740e+02
            5.000000	        6.625590e+02
            5.250000	        6.047518e+02
            5.500000	        5.582728e+02
            5.750000	        5.209278e+02
            6.000000	        4.879961e+02
            6.250000	        4.618141e+02
            6.500000	        4.250422e+02
            6.750000	        4.118373e+02
            7.000000	        3.898413e+02
            7.250000	        3.685736e+02
            7.500000	        3.557257e+02
            7.750000	        3.337362e+02
            8.000000	        3.331126e+02
            8.250000	        3.195658e+02
            8.500000	        2.992298e+02
            8.750000	        2.931542e+02
            9.000000	        2.797971e+02
            9.500000	        2.639558e+02
           10.000000	        2.514095e+02
           10.500000	        2.397254e+02
           11.000000	        2.256919e+02
           11.500000	        2.139299e+02
           12.000000	        2.062624e+02
           12.500000	        1.922629e+02
           13.000000	        1.878471e+02
           13.500000	        1.826475e+02
           14.000000	        1.715762e+02
           14.500000	        1.640654e+02
           15.000000	        1.604136e+02
           16.000000	        1.499521e+02
           17.000000	        1.387557e+02
           18.000000	        1.311296e+02
           19.000000	        1.238778e+02
           20.000000	        1.170227e+02
           30.000000	        7.312430e+01
           40.000000	        5.139539e+01
           50.000000	        3.916849e+01
          100.000000	        1.182097e+01

