# -------------------------------------------------------------------------------
#		C:/Users/ACUBESAT-01/Documents/OMERE 5.3/D-M-450/Dose Muscle Shieldose2.txt
# -------------------------------------------------------------------------------
# ID: 1 2 1

# Graph: Dose Muscle- Shieldose2 
# min: -4.9895 0.01 max: 104.999 545125
# X-axis: Thickness  (mm Al)
# Y-axis L: Dose (rad)
# -------------------------------------------------------------------------------
# Curve 0: Trapped electrons
# Params: 2 5 #e086ff 1 1
#	Thickness  (mm Al)		Dose (rad)
# -------------------------------------------------------------------------------
            0.010000	        4.239566e+05
            0.100000	        9.796022e+04
            0.200000	        4.591089e+04
            0.300000	        2.705886e+04
            0.400000	        1.824523e+04
            0.500000	        1.337225e+04
            0.600000	        1.036887e+04
            0.700000	        8.363151e+03
            0.800000	        6.943224e+03
            0.900000	        5.892437e+03
            1.000000	        5.085926e+03
            1.100000	        4.447925e+03
            1.200000	        3.931255e+03
            1.300000	        3.504238e+03
            1.400000	        3.143304e+03
            1.500000	        2.832746e+03
            1.600000	        2.562562e+03
            1.700000	        2.324818e+03
            1.800000	        2.113440e+03
            1.900000	        1.924221e+03
            2.000000	        1.754062e+03
            2.250000	        1.397244e+03
            2.500000	        1.118291e+03
            2.750000	        8.987604e+02
            3.000000	        7.247997e+02
            3.250000	        5.859945e+02
            3.500000	        4.742676e+02
            3.750000	        3.835931e+02
            4.000000	        3.096622e+02
            4.250000	        2.493160e+02
            4.500000	        2.001361e+02
            4.750000	        1.601768e+02
            5.000000	        1.278240e+02
            5.250000	        1.017202e+02
            5.500000	        8.072289e+01
            5.750000	        6.387670e+01
            6.000000	        5.039014e+01
            6.250000	        3.961514e+01
            6.500000	        3.102571e+01
            6.750000	        2.419676e+01
            7.000000	        1.878511e+01
            7.250000	        1.451337e+01
            7.500000	        1.115656e+01
            7.750000	        8.531820e+00
            8.000000	        6.490499e+00
            8.250000	        4.911787e+00
            8.500000	        3.697638e+00
            8.750000	        2.768958e+00
            9.000000	        2.062247e+00
            9.500000	        1.124327e+00
           10.000000	        5.967891e-01
           10.500000	        3.066733e-01
           11.000000	        1.516519e-01
           11.500000	        7.183330e-02
           12.000000	        3.248329e-02
           12.500000	        1.397899e-02
           13.000000	        5.689675e-03
           13.500000	        2.161404e-03
           14.000000	        7.490155e-04
           14.500000	        2.319196e-04
           15.000000	        6.318006e-05
           16.000000	        4.928326e-06
           17.000000	        5.105396e-07
           18.000000	        2.784399e-08
           19.000000	        7.575495e-10
           20.000000	        0.000000e+00
           30.000000	        0.000000e+00
           40.000000	        0.000000e+00
           50.000000	        0.000000e+00
          100.000000	        0.000000e+00

# -------------------------------------------------------------------------------
# Curve 1: Trapped protons
# Params: 2 5 #14bf4c 1 1
#	Thickness  (mm Al)		Dose (rad)
# -------------------------------------------------------------------------------
            0.010000	        1.552972e+04
            0.100000	        1.429500e+03
            0.200000	        6.700265e+02
            0.300000	        4.346326e+02
            0.400000	        3.254099e+02
            0.500000	        2.636965e+02
            0.600000	        2.249191e+02
            0.700000	        2.007167e+02
            0.800000	        1.827955e+02
            0.900000	        1.700092e+02
            1.000000	        1.587111e+02
            1.100000	        1.511726e+02
            1.200000	        1.430618e+02
            1.300000	        1.369454e+02
            1.400000	        1.313506e+02
            1.500000	        1.265917e+02
            1.600000	        1.227530e+02
            1.700000	        1.181665e+02
            1.800000	        1.152381e+02
            1.900000	        1.124406e+02
            2.000000	        1.095049e+02
            2.250000	        1.036187e+02
            2.500000	        9.891829e+01
            2.750000	        9.490034e+01
            3.000000	        9.238531e+01
            3.250000	        8.936637e+01
            3.500000	        8.718512e+01
            3.750000	        8.543408e+01
            4.000000	        8.318082e+01
            4.250000	        8.141464e+01
            4.500000	        8.013522e+01
            4.750000	        7.828166e+01
            5.000000	        7.731141e+01
            5.250000	        7.562463e+01
            5.500000	        7.425219e+01
            5.750000	        7.319841e+01
            6.000000	        7.213273e+01
            6.250000	        7.136533e+01
            6.500000	        6.929755e+01
            6.750000	        6.920818e+01
            7.000000	        6.810520e+01
            7.250000	        6.685295e+01
            7.500000	        6.634365e+01
            7.750000	        6.469264e+01
            8.000000	        6.532296e+01
            8.250000	        6.445324e+01
            8.500000	        6.263954e+01
            8.750000	        6.245743e+01
            9.000000	        6.130509e+01
            9.500000	        6.017357e+01
           10.000000	        5.931299e+01
           10.500000	        5.844498e+01
           11.000000	        5.703521e+01
           11.500000	        5.580378e+01
           12.000000	        5.513128e+01
           12.500000	        5.320883e+01
           13.000000	        5.290016e+01
           13.500000	        5.242639e+01
           14.000000	        5.069914e+01
           14.500000	        4.955788e+01
           15.000000	        4.917843e+01
           16.000000	        4.761652e+01
           17.000000	        4.566300e+01
           18.000000	        4.438722e+01
           19.000000	        4.309698e+01
           20.000000	        4.177803e+01
           30.000000	        3.135734e+01
           40.000000	        2.424073e+01
           50.000000	        1.953531e+01
          100.000000	        6.385811e+00

# -------------------------------------------------------------------------------
# Curve 2: Solar protons
# Params: 2 5 #fe1448 1 1
#	Thickness  (mm Al)		Dose (rad)
# -------------------------------------------------------------------------------
            0.010000	        1.047623e+05
            0.100000	        1.574530e+04
            0.200000	        7.428332e+03
            0.300000	        4.678650e+03
            0.400000	        3.367153e+03
            0.500000	        2.600091e+03
            0.600000	        2.083718e+03
            0.700000	        1.738486e+03
            0.800000	        1.468853e+03
            0.900000	        1.275457e+03
            1.000000	        1.105466e+03
            1.100000	        9.939171e+02
            1.200000	        8.783254e+02
            1.300000	        7.956031e+02
            1.400000	        7.202201e+02
            1.500000	        6.600560e+02
            1.600000	        6.102362e+02
            1.700000	        5.563417e+02
            1.800000	        5.201310e+02
            1.900000	        4.866375e+02
            2.000000	        4.525377e+02
            2.250000	        3.857494e+02
            2.500000	        3.330074e+02
            2.750000	        2.903823e+02
            3.000000	        2.616856e+02
            3.250000	        2.316994e+02
            3.500000	        2.098768e+02
            3.750000	        1.922120e+02
            4.000000	        1.734358e+02
            4.250000	        1.589770e+02
            4.500000	        1.480272e+02
            4.750000	        1.354179e+02
            5.000000	        1.276053e+02
            5.250000	        1.174775e+02
            5.500000	        1.094744e+02
            5.750000	        1.031211e+02
            6.000000	        9.719804e+01
            6.250000	        9.254826e+01
            6.500000	        8.430525e+01
            6.750000	        8.242460e+01
            7.000000	        7.766605e+01
            7.250000	        7.287466e+01
            7.500000	        7.021132e+01
            7.750000	        6.488864e+01
            8.000000	        6.525664e+01
            8.250000	        6.197922e+01
            8.500000	        5.686554e+01
            8.750000	        5.549494e+01
            9.000000	        5.217700e+01
            9.500000	        4.832566e+01
           10.000000	        4.525154e+01
           10.500000	        4.236238e+01
           11.000000	        3.893555e+01
           11.500000	        3.610456e+01
           12.000000	        3.427152e+01
           12.500000	        3.102075e+01
           13.000000	        2.999656e+01
           13.500000	        2.879343e+01
           14.000000	        2.632816e+01
           14.500000	        2.468938e+01
           15.000000	        2.388916e+01
           16.000000	        2.165093e+01
           17.000000	        1.933809e+01
           18.000000	        1.779324e+01
           19.000000	        1.635067e+01
           20.000000	        1.502557e+01
           30.000000	        7.392159e+00
           40.000000	        4.395316e+00
           50.000000	        2.970889e+00
          100.000000	        6.982364e-01

# -------------------------------------------------------------------------------
# Curve 3: Secondary photons
# Params: 2 5 #169ced 1 1
#	Thickness  (mm Al)		Dose (rad)
# -------------------------------------------------------------------------------
            0.010000	        8.760915e+02
            0.100000	        1.956755e+02
            0.200000	        1.049536e+02
            0.300000	        6.717431e+01
            0.400000	        4.885480e+01
            0.500000	        3.657547e+01
            0.600000	        2.838276e+01
            0.700000	        2.322633e+01
            0.800000	        1.966523e+01
            0.900000	        1.709812e+01
            1.000000	        1.504104e+01
            1.100000	        1.349503e+01
            1.200000	        1.222012e+01
            1.300000	        1.106461e+01
            1.400000	        1.008008e+01
            1.500000	        9.155997e+00
            1.600000	        8.382574e+00
            1.700000	        7.771304e+00
            1.800000	        7.163712e+00
            1.900000	        6.563580e+00
            2.000000	        6.108715e+00
            2.250000	        5.110186e+00
            2.500000	        4.365335e+00
            2.750000	        3.884475e+00
            3.000000	        3.350614e+00
            3.250000	        2.960712e+00
            3.500000	        2.722811e+00
            3.750000	        2.406739e+00
            4.000000	        2.177002e+00
            4.250000	        2.048770e+00
            4.500000	        1.918279e+00
            4.750000	        1.808638e+00
            5.000000	        1.706671e+00
            5.250000	        1.629324e+00
            5.500000	        1.514713e+00
            5.750000	        1.403853e+00
            6.000000	        1.347910e+00
            6.250000	        1.298659e+00
            6.500000	        1.253859e+00
            6.750000	        1.213305e+00
            7.000000	        1.176420e+00
            7.250000	        1.142638e+00
            7.500000	        1.112091e+00
            7.750000	        1.084465e+00
            8.000000	        1.058880e+00
            8.250000	        1.035160e+00
            8.500000	        1.013137e+00
            8.750000	        9.926716e-01
            9.000000	        9.737131e-01
            9.500000	        9.394559e-01
           10.000000	        9.104709e-01
           10.500000	        8.824933e-01
           11.000000	        8.672553e-01
           11.500000	        8.556722e-01
           12.000000	        8.360135e-01
           12.500000	        8.179301e-01
           13.000000	        8.014806e-01
           13.500000	        7.864430e-01
           14.000000	        7.721736e-01
           14.500000	        7.602079e-01
           15.000000	        7.514637e-01
           16.000000	        7.316735e-01
           17.000000	        7.101042e-01
           18.000000	        6.918643e-01
           19.000000	        6.759161e-01
           20.000000	        6.592933e-01
           30.000000	        5.314334e-01
           40.000000	        4.382607e-01
           50.000000	        3.847286e-01
          100.000000	        1.411998e-01

# -------------------------------------------------------------------------------
# Curve 4: Total dose
# Params: 2 5 #c967d0 1 1
#	Thickness  (mm Al)		Dose (rad)
# -------------------------------------------------------------------------------
            0.010000	        5.451247e+05
            0.100000	        1.153307e+05
            0.200000	        5.411420e+04
            0.300000	        3.223931e+04
            0.400000	        2.198665e+04
            0.500000	        1.627261e+04
            0.600000	        1.270589e+04
            0.700000	        1.032558e+04
            0.800000	        8.614538e+03
            0.900000	        7.355002e+03
            1.000000	        6.365144e+03
            1.100000	        5.606509e+03
            1.200000	        4.964863e+03
            1.300000	        4.447851e+03
            1.400000	        4.004955e+03
            1.500000	        3.628550e+03
            1.600000	        3.303933e+03
            1.700000	        3.007098e+03
            1.800000	        2.755972e+03
            1.900000	        2.529862e+03
            2.000000	        2.322213e+03
            2.250000	        1.891722e+03
            2.500000	        1.554582e+03
            2.750000	        1.287928e+03
            3.000000	        1.082221e+03
            3.250000	        9.100210e+02
            3.500000	        7.740523e+02
            3.750000	        6.636460e+02
            4.000000	        5.684559e+02
            4.250000	        4.917564e+02
            4.500000	        4.302169e+02
            4.750000	        3.756850e+02
            5.000000	        3.344474e+02
            5.250000	        2.964516e+02
            5.500000	        2.659642e+02
            5.750000	        2.416000e+02
            6.000000	        2.210688e+02
            6.250000	        2.048274e+02
            6.500000	        1.858824e+02
            6.750000	        1.770428e+02
            7.000000	        1.657328e+02
            7.250000	        1.553836e+02
            7.500000	        1.488236e+02
            7.750000	        1.391976e+02
            8.000000	        1.381290e+02
            8.250000	        1.323794e+02
            8.500000	        1.242159e+02
            8.750000	        1.217140e+02
            9.000000	        1.165180e+02
            9.500000	        1.105630e+02
           10.000000	        1.060718e+02
           10.500000	        1.019965e+02
           11.000000	        9.698966e+01
           11.500000	        9.283585e+01
           12.000000	        9.027129e+01
           12.500000	        8.506148e+01
           13.000000	        8.370389e+01
           13.500000	        8.200842e+01
           14.000000	        7.780022e+01
           14.500000	        7.500769e+01
           15.000000	        7.381912e+01
           16.000000	        6.999913e+01
           17.000000	        6.571120e+01
           18.000000	        6.287233e+01
           19.000000	        6.012356e+01
           20.000000	        5.746289e+01
           30.000000	        3.928094e+01
           40.000000	        2.907431e+01
           50.000000	        2.289093e+01
          100.000000	        7.225247e+00

