# -------------------------------------------------------------------------------
#		C:/Users/ASAT 02/Documents/OMERE 5.4/CDR CLOSE-OUT/SSO 550/Trapped Particles .txt
# -------------------------------------------------------------------------------
# ID: 1 2 1

# Graph: Trapped Particles  
# min: 0.04 0.01 max: 300 1.55674e+06
# X-axis L: Energy(MeV)
# Y-axis L: Flux (cm^{-2}.s^{-1}.MeV^{-1}) or (cm^{-2}.s^{-1})
# -------------------------------------------------------------------------------
# Curve 0: Diff flux - AP8 min
# Params: 2 5 #fe1448 1 1
#	Energy(MeV)		Flux (cm^{-2}.s^{-1}.MeV^{-1}) or (cm^{-2}.s^{-1})
# -------------------------------------------------------------------------------
        1.000000e-01	        9.425572e+03
        2.500000e-01	        3.071787e+03
        5.000000e-01	        8.535869e+02
        7.500000e-01	        3.520733e+02
        1.000000e+00	        1.680997e+02
        2.000000e+00	        4.124495e+01
        3.000000e+00	        1.993648e+01
        4.000000e+00	        1.079007e+01
        5.000000e+00	        6.822846e+00
        6.000000e+00	        4.492609e+00
        8.000000e+00	        2.426707e+00
        1.000000e+01	        1.440014e+00
        1.200000e+01	        1.014264e+00
        1.500000e+01	        7.309995e-01
        1.700000e+01	        6.084148e-01
        2.000000e+01	        4.665750e-01
        2.500000e+01	        3.474688e-01
        3.000000e+01	        3.088079e-01
        3.500000e+01	        2.861649e-01
        4.000000e+01	        2.665233e-01
        4.500000e+01	        2.490299e-01
        5.000000e+01	        2.413945e-01
        6.000000e+01	        2.253755e-01
        7.000000e+01	        2.030537e-01
        8.000000e+01	        1.856183e-01
        9.000000e+01	        1.686776e-01
        1.000000e+02	        1.528118e-01
        1.250000e+02	        1.146194e-01
        1.500000e+02	        8.476034e-02
        1.750000e+02	        6.324552e-02
        2.000000e+02	        4.752930e-02
        3.000000e+02	        1.601380e-02

# -------------------------------------------------------------------------------
# Curve 1: Integ flux - AP8 min
# Params: 2 5 #169ced 1 1
#	Energy(MeV)		Flux (cm^{-2}.s^{-1}.MeV^{-1}) or (cm^{-2}.s^{-1})
# -------------------------------------------------------------------------------
        1.000000e-01	        1.668456e+03
        2.500000e-01	        8.197852e+02
        5.000000e-01	        3.931877e+02
        7.500000e-01	        2.550568e+02
        1.000000e+00	        1.923867e+02
        2.000000e+00	        1.068139e+02
        3.000000e+00	        7.994992e+01
        4.000000e+00	        6.444979e+01
        5.000000e+00	        5.628745e+01
        6.000000e+00	        5.048344e+01
        8.000000e+00	        4.392266e+01
        1.000000e+01	        4.008095e+01
        1.200000e+01	        3.784656e+01
        1.500000e+01	        3.516023e+01
        1.700000e+01	        3.388309e+01
        2.000000e+01	        3.217166e+01
        2.500000e+01	        3.031181e+01
        3.000000e+01	        2.867296e+01
        3.500000e+01	        2.718616e+01
        4.000000e+01	        2.580402e+01
        4.500000e+01	        2.451517e+01
        5.000000e+01	        2.330968e+01
        6.000000e+01	        2.096499e+01
        7.000000e+01	        1.879630e+01
        8.000000e+01	        1.688647e+01
        9.000000e+01	        1.508509e+01
        1.000000e+02	        1.349922e+01
        1.250000e+02	        1.013278e+01
        1.500000e+02	        7.657370e+00
        1.750000e+02	        5.818033e+00
        2.000000e+02	        4.440275e+00
        3.000000e+02	        1.546423e+00

# -------------------------------------------------------------------------------
# Curve 2: Diff flux - AE8 max
# Params: 2 5 #c967d0 1 1
#	Energy(MeV)		Flux (cm^{-2}.s^{-1}.MeV^{-1}) or (cm^{-2}.s^{-1})
# -------------------------------------------------------------------------------
        4.000000e-02	        1.556736e+06
        1.000000e-01	        9.766296e+05
        2.500000e-01	        2.448281e+05
        5.000000e-01	        3.574207e+04
        7.500000e-01	        1.124711e+04
        1.000000e+00	        5.364341e+03
        1.500000e+00	        2.121417e+03
        2.000000e+00	        8.988013e+02
        2.500000e+00	        4.313589e+02
        3.000000e+00	        1.817646e+02
        3.500000e+00	        7.525021e+01
        4.000000e+00	        2.852845e+01
        4.500000e+00	        9.259391e+00
        5.000000e+00	        2.703799e+00
        5.500000e+00	        6.069814e-01
        6.000000e+00	        9.613395e-02
        6.500000e+00	        1.412173e-02
        7.000000e+00	        9.829866e-04

# -------------------------------------------------------------------------------
# Curve 3: Integ flux - AE8 max
# Params: 2 5 #7def21 1 1
#	Energy(MeV)		Flux (cm^{-2}.s^{-1}.MeV^{-1}) or (cm^{-2}.s^{-1})
# -------------------------------------------------------------------------------
        4.000000e-02	        1.913028e+05
        1.000000e-01	        1.182495e+05
        2.500000e-01	        3.556837e+04
        5.000000e-01	        9.747414e+03
        7.500000e-01	        4.804556e+03
        1.000000e+00	        2.938024e+03
        1.500000e+00	        1.268900e+03
        2.000000e+00	        5.472794e+02
        2.500000e+00	        2.459328e+02
        3.000000e+00	        9.581218e+01
        3.500000e+00	        3.689586e+01
        4.000000e+00	        1.244649e+01
        4.500000e+00	        3.696244e+00
        5.000000e+00	        1.011491e+00
        5.500000e+00	        2.115223e-01
        6.000000e+00	        2.794661e-02
        6.500000e+00	        0.000000e+00
        7.000000e+00	        0.000000e+00

