# -------------------------------------------------------------------------------
#		C:/Users/ASAT 02/Documents/OMERE 5.4/CDR CLOSE-OUT/SSO 600/1.5 years/LET/Satellite/Integral LET spectrum.txt
# -------------------------------------------------------------------------------
# ID: 1 2 1

# Graph: Integral LET spectrum 
# min: 0.000160896 1e-06 max: 1.09391e+09 2.0722e+08
# X-axis L: LET (MeV.cm^2.g^{-1})
# Y-axis L: Flux (cm^{-2}.s^{-1})
# -------------------------------------------------------------------------------
# Curve 0: LET spectrum without Flares
# Params: 0 5 #fe1448 2 1
#	LET (MeV.cm^2.g^{-1})		Flux (cm^{-2}.s^{-1})
# -------------------------------------------------------------------------------
        1.608960e+00	        1.694339e+02
        1.626982e+00	        1.694339e+02
        1.645205e+00	        1.694339e+02
        1.663632e+00	        1.694339e+02
        1.682265e+00	        1.693209e+02
        1.701107e+00	        1.691796e+02
        1.720161e+00	        1.690885e+02
        1.739427e+00	        1.690254e+02
        1.758910e+00	        1.689698e+02
        1.778610e+00	        1.689248e+02
        1.798532e+00	        1.688865e+02
        1.818676e+00	        1.688527e+02
        1.839046e+00	        1.688216e+02
        1.859644e+00	        1.687921e+02
        1.880473e+00	        1.687657e+02
        1.901536e+00	        1.687410e+02
        1.922834e+00	        1.687192e+02
        1.944370e+00	        1.687027e+02
        1.966148e+00	        1.686908e+02
        1.988170e+00	        1.686829e+02
        2.010439e+00	        1.686757e+02
        2.032956e+00	        1.686684e+02
        2.055727e+00	        1.686615e+02
        2.078752e+00	        1.686557e+02
        2.102035e+00	        1.686498e+02
        2.125579e+00	        1.686439e+02
        2.149386e+00	        1.686387e+02
        2.173460e+00	        1.686340e+02
        2.197804e+00	        1.686292e+02
        2.222421e+00	        1.686244e+02
        2.247313e+00	        1.686204e+02
        2.272484e+00	        1.686170e+02
        2.297937e+00	        1.686135e+02
        2.323675e+00	        1.686101e+02
        2.349701e+00	        1.686066e+02
        2.376019e+00	        1.686033e+02
        2.402632e+00	        1.686000e+02
        2.429542e+00	        1.685968e+02
        2.456754e+00	        1.685935e+02
        2.484271e+00	        1.685904e+02
        2.512096e+00	        1.685885e+02
        2.540233e+00	        1.685865e+02
        2.568685e+00	        1.685845e+02
        2.597455e+00	        1.685824e+02
        2.626548e+00	        1.685804e+02
        2.655967e+00	        1.685783e+02
        2.685715e+00	        1.685763e+02
        2.715796e+00	        1.685743e+02
        2.746214e+00	        1.685723e+02
        2.776973e+00	        1.685703e+02
        2.808077e+00	        1.685682e+02
        2.839529e+00	        1.684964e+02
        2.871333e+00	        1.683983e+02
        2.903493e+00	        1.682990e+02
        2.936014e+00	        1.681987e+02
        2.968899e+00	        1.680972e+02
        3.002152e+00	        1.679946e+02
        3.035777e+00	        1.678091e+02
        3.069779e+00	        1.676087e+02
        3.104162e+00	        1.674061e+02
        3.138931e+00	        1.672011e+02
        3.174088e+00	        1.669939e+02
        3.209640e+00	        1.667844e+02
        3.245589e+00	        1.665766e+02
        3.281941e+00	        1.663673e+02
        3.318701e+00	        1.661557e+02
        3.355872e+00	        1.659417e+02
        3.393459e+00	        1.657253e+02
        3.431468e+00	        1.655065e+02
        3.469902e+00	        1.652853e+02
        3.508766e+00	        1.650301e+02
        3.548066e+00	        1.647625e+02
        3.587806e+00	        1.644919e+02
        3.627992e+00	        1.642183e+02
        3.668627e+00	        1.639416e+02
        3.709717e+00	        1.636618e+02
        3.751268e+00	        1.633793e+02
        3.793284e+00	        1.631067e+02
        3.835771e+00	        1.628311e+02
        3.878733e+00	        1.625524e+02
        3.922177e+00	        1.622706e+02
        3.966107e+00	        1.619856e+02
        4.010530e+00	        1.616974e+02
        4.055449e+00	        1.614060e+02
        4.100872e+00	        1.610846e+02
        4.146804e+00	        1.606959e+02
        4.193250e+00	        1.603028e+02
        4.240217e+00	        1.599054e+02
        4.287709e+00	        1.595035e+02
        4.335734e+00	        1.590971e+02
        4.384296e+00	        1.586861e+02
        4.433403e+00	        1.583449e+02
        4.483059e+00	        1.580020e+02
        4.533271e+00	        1.576553e+02
        4.584046e+00	        1.573047e+02
        4.635390e+00	        1.569502e+02
        4.687308e+00	        1.565918e+02
        4.739809e+00	        1.562293e+02
        4.792897e+00	        1.558627e+02
        4.846580e+00	        1.554370e+02
        4.900864e+00	        1.549980e+02
        4.955756e+00	        1.545541e+02
        5.011263e+00	        1.541053e+02
        5.067391e+00	        1.536514e+02
        5.124149e+00	        1.531925e+02
        5.181542e+00	        1.527284e+02
        5.239577e+00	        1.523013e+02
        5.298263e+00	        1.518812e+02
        5.357606e+00	        1.514564e+02
        5.417614e+00	        1.510268e+02
        5.478294e+00	        1.505925e+02
        5.539654e+00	        1.501532e+02
        5.601701e+00	        1.497091e+02
        5.664442e+00	        1.492600e+02
        5.727887e+00	        1.488126e+02
        5.792042e+00	        1.483639e+02
        5.856916e+00	        1.479100e+02
        5.922516e+00	        1.474512e+02
        5.988851e+00	        1.469871e+02
        6.055929e+00	        1.465179e+02
        6.123759e+00	        1.460434e+02
        6.192348e+00	        1.455636e+02
        6.261705e+00	        1.450668e+02
        6.331839e+00	        1.445435e+02
        6.402759e+00	        1.440143e+02
        6.474473e+00	        1.434791e+02
        6.546991e+00	        1.429380e+02
        6.620320e+00	        1.423908e+02
        6.694471e+00	        1.418375e+02
        6.769452e+00	        1.412579e+02
        6.845274e+00	        1.407009e+02
        6.921944e+00	        1.401540e+02
        6.999473e+00	        1.396024e+02
        7.077871e+00	        1.390454e+02
        7.157146e+00	        1.384838e+02
        7.237310e+00	        1.379163e+02
        7.318371e+00	        1.373429e+02
        7.400341e+00	        1.367631e+02
        7.483228e+00	        1.361930e+02
        7.567044e+00	        1.356346e+02
        7.651799e+00	        1.350702e+02
        7.737503e+00	        1.344999e+02
        7.824166e+00	        1.339237e+02
        7.911801e+00	        1.333415e+02
        8.000417e+00	        1.327530e+02
        8.090026e+00	        1.321580e+02
        8.180638e+00	        1.315564e+02
        8.272265e+00	        1.309629e+02
        8.364918e+00	        1.303628e+02
        8.458610e+00	        1.297560e+02
        8.553350e+00	        1.291424e+02
        8.649152e+00	        1.285221e+02
        8.746027e+00	        1.278948e+02
        8.843987e+00	        1.272606e+02
        8.943044e+00	        1.266192e+02
        9.043210e+00	        1.259638e+02
        9.144499e+00	        1.252953e+02
        9.246921e+00	        1.246193e+02
        9.350492e+00	        1.239358e+02
        9.455222e+00	        1.232446e+02
        9.561125e+00	        1.225456e+02
        9.668214e+00	        1.218389e+02
        9.776503e+00	        1.211242e+02
        9.886005e+00	        1.204462e+02
        9.996733e+00	        1.198244e+02
        1.010870e+01	        1.191957e+02
        1.022192e+01	        1.185600e+02
        1.033641e+01	        1.179172e+02
        1.045219e+01	        1.172671e+02
        1.056926e+01	        1.166098e+02
        1.068764e+01	        1.159452e+02
        1.080734e+01	        1.152731e+02
        1.092839e+01	        1.145741e+02
        1.105080e+01	        1.138044e+02
        1.117457e+01	        1.130261e+02
        1.129973e+01	        1.122391e+02
        1.142629e+01	        1.114434e+02
        1.155427e+01	        1.106388e+02
        1.168369e+01	        1.098252e+02
        1.181455e+01	        1.090025e+02
        1.194688e+01	        1.082209e+02
        1.208069e+01	        1.075640e+02
        1.221600e+01	        1.068997e+02
        1.235282e+01	        1.062281e+02
        1.249118e+01	        1.055489e+02
        1.263109e+01	        1.048621e+02
        1.277256e+01	        1.041676e+02
        1.291562e+01	        1.034653e+02
        1.306028e+01	        1.027553e+02
        1.320657e+01	        1.020373e+02
        1.335449e+01	        1.012311e+02
        1.350406e+01	        1.003573e+02
        1.365531e+01	        9.947377e+01
        1.380826e+01	        9.858029e+01
        1.396292e+01	        9.767682e+01
        1.411931e+01	        9.676325e+01
        1.427746e+01	        9.583946e+01
        1.443737e+01	        9.490531e+01
        1.459908e+01	        9.405743e+01
        1.476259e+01	        9.322572e+01
        1.492794e+01	        9.238470e+01
        1.509514e+01	        9.153429e+01
        1.526421e+01	        9.067429e+01
        1.543518e+01	        8.980471e+01
        1.560806e+01	        8.892540e+01
        1.578288e+01	        8.803625e+01
        1.595966e+01	        8.714352e+01
        1.613841e+01	        8.627762e+01
        1.631917e+01	        8.540203e+01
        1.650195e+01	        8.451662e+01
        1.668678e+01	        8.362130e+01
        1.687368e+01	        8.271595e+01
        1.706268e+01	        8.180047e+01
        1.725379e+01	        8.087473e+01
        1.744704e+01	        7.993862e+01
        1.764245e+01	        7.907978e+01
        1.784006e+01	        7.824362e+01
        1.803988e+01	        7.739808e+01
        1.824193e+01	        7.654308e+01
        1.844625e+01	        7.567850e+01
        1.865286e+01	        7.480424e+01
        1.886178e+01	        7.392019e+01
        1.907304e+01	        7.302623e+01
        1.928667e+01	        7.212226e+01
        1.950269e+01	        7.128948e+01
        1.972113e+01	        7.044864e+01
        1.994201e+01	        6.959839e+01
        2.016537e+01	        6.873862e+01
        2.039124e+01	        6.786921e+01
        2.061963e+01	        6.699007e+01
        2.085058e+01	        6.610108e+01
        2.108411e+01	        6.520214e+01
        2.132027e+01	        6.434505e+01
        2.155906e+01	        6.356033e+01
        2.180054e+01	        6.276681e+01
        2.204471e+01	        6.196441e+01
        2.229162e+01	        6.115302e+01
        2.254130e+01	        6.033254e+01
        2.279378e+01	        5.950286e+01
        2.304908e+01	        5.866386e+01
        2.330724e+01	        5.781546e+01
        2.356829e+01	        5.693154e+01
        2.383227e+01	        5.601543e+01
        2.409920e+01	        5.508906e+01
        2.436912e+01	        5.415231e+01
        2.464207e+01	        5.320508e+01
        2.491807e+01	        5.224723e+01
        2.519717e+01	        5.127856e+01
        2.547939e+01	        5.035553e+01
        2.576477e+01	        4.967902e+01
        2.605335e+01	        4.899494e+01
        2.634516e+01	        4.830319e+01
        2.664024e+01	        4.760370e+01
        2.693862e+01	        4.689637e+01
        2.724035e+01	        4.618106e+01
        2.754545e+01	        4.545765e+01
        2.785397e+01	        4.472616e+01
        2.816595e+01	        4.398647e+01
        2.848142e+01	        4.328040e+01
        2.880043e+01	        4.256736e+01
        2.912301e+01	        4.184634e+01
        2.944920e+01	        4.111724e+01
        2.977905e+01	        4.037997e+01
        3.011259e+01	        3.963430e+01
        3.044986e+01	        3.888026e+01
        3.079092e+01	        3.811778e+01
        3.113579e+01	        3.749661e+01
        3.148453e+01	        3.688798e+01
        3.183717e+01	        3.627254e+01
        3.219376e+01	        3.565020e+01
        3.255435e+01	        3.502089e+01
        3.291897e+01	        3.438441e+01
        3.328768e+01	        3.374068e+01
        3.366052e+01	        3.308974e+01
        3.403753e+01	        3.247254e+01
        3.441877e+01	        3.195811e+01
        3.480428e+01	        3.143792e+01
        3.519410e+01	        3.091190e+01
        3.558829e+01	        3.038000e+01
        3.598690e+01	        2.984211e+01
        3.638997e+01	        2.929782e+01
        3.679756e+01	        2.874744e+01
        3.720971e+01	        2.819089e+01
        3.762647e+01	        2.764101e+01
        3.804791e+01	        2.712727e+01
        3.847406e+01	        2.660777e+01
        3.890499e+01	        2.608246e+01
        3.934075e+01	        2.555126e+01
        3.978138e+01	        2.501399e+01
        4.022696e+01	        2.447069e+01
        4.067752e+01	        2.392130e+01
        4.113313e+01	        2.340575e+01
        4.159384e+01	        2.298933e+01
        4.205971e+01	        2.256825e+01
        4.253080e+01	        2.214227e+01
        4.300716e+01	        2.171162e+01
        4.348887e+01	        2.127617e+01
        4.397596e+01	        2.083529e+01
        4.446851e+01	        2.038922e+01
        4.496658e+01	        1.993817e+01
        4.547023e+01	        1.956208e+01
        4.597952e+01	        1.920560e+01
        4.649451e+01	        1.884514e+01
        4.701528e+01	        1.848064e+01
        4.754187e+01	        1.811207e+01
        4.807436e+01	        1.773949e+01
        4.861282e+01	        1.736280e+01
        4.915731e+01	        1.698189e+01
        4.970789e+01	        1.661072e+01
        5.026464e+01	        1.630634e+01
        5.082763e+01	        1.599856e+01
        5.139693e+01	        1.568733e+01
        5.197260e+01	        1.537261e+01
        5.255472e+01	        1.505437e+01
        5.314336e+01	        1.473252e+01
        5.373859e+01	        1.440578e+01
        5.434049e+01	        1.407538e+01
        5.494913e+01	        1.377819e+01
        5.556458e+01	        1.349650e+01
        5.618694e+01	        1.321166e+01
        5.681626e+01	        1.292363e+01
        5.745263e+01	        1.263238e+01
        5.809612e+01	        1.233784e+01
        5.874683e+01	        1.203993e+01
        5.940482e+01	        1.173868e+01
        6.007019e+01	        1.149439e+01
        6.074300e+01	        1.126396e+01
        6.142335e+01	        1.103076e+01
        6.211133e+01	        1.079512e+01
        6.280700e+01	        1.055693e+01
        6.351047e+01	        1.031610e+01
        6.422182e+01	        1.007226e+01
        6.494114e+01	        9.825558e+00
        6.566851e+01	        9.605713e+00
        6.640403e+01	        9.398255e+00
        6.714779e+01	        9.188480e+00
        6.789988e+01	        8.976371e+00
        6.866039e+01	        8.761893e+00
        6.942942e+01	        8.545022e+00
        7.020706e+01	        8.325766e+00
        7.099342e+01	        8.114629e+00
        7.178858e+01	        7.969650e+00
        7.259264e+01	        7.823051e+00
        7.340572e+01	        7.674810e+00
        7.422790e+01	        7.524910e+00
        7.505929e+01	        7.373336e+00
        7.589999e+01	        7.220064e+00
        7.675011e+01	        7.065076e+00
        7.760974e+01	        6.908289e+00
        7.847901e+01	        6.751607e+00
        7.935802e+01	        6.601259e+00
        8.024686e+01	        6.449227e+00
        8.114567e+01	        6.295495e+00
        8.205454e+01	        6.140046e+00
        8.297359e+01	        5.982741e+00
        8.390294e+01	        5.823692e+00
        8.484269e+01	        5.663255e+00
        8.579297e+01	        5.548600e+00
        8.675389e+01	        5.435100e+00
        8.772558e+01	        5.320339e+00
        8.870815e+01	        5.204300e+00
        8.970173e+01	        5.086965e+00
        9.070643e+01	        4.968324e+00
        9.172239e+01	        4.848356e+00
        9.274972e+01	        4.726741e+00
        9.378856e+01	        4.624442e+00
        9.483904e+01	        4.524273e+00
        9.590129e+01	        4.422986e+00
        9.697543e+01	        4.320567e+00
        9.806160e+01	        4.217004e+00
        9.915994e+01	        4.112282e+00
        1.002706e+02	        4.007104e+00
        1.013937e+02	        3.905787e+00
        1.025293e+02	        3.823318e+00
        1.036777e+02	        3.739927e+00
        1.048389e+02	        3.655602e+00
        1.060132e+02	        3.570334e+00
        1.072006e+02	        3.484111e+00
        1.084013e+02	        3.396508e+00
        1.096154e+02	        3.308008e+00
        1.108432e+02	        3.229541e+00
        1.120847e+02	        3.160228e+00
        1.133401e+02	        3.090158e+00
        1.146095e+02	        3.019344e+00
        1.158932e+02	        2.947758e+00
        1.171913e+02	        2.875384e+00
        1.185039e+02	        2.802202e+00
        1.198312e+02	        2.728209e+00
        1.211734e+02	        2.666198e+00
        1.225306e+02	        2.606354e+00
        1.239030e+02	        2.545852e+00
        1.252907e+02	        2.484688e+00
        1.266941e+02	        2.422851e+00
        1.281131e+02	        2.360333e+00
        1.295480e+02	        2.297116e+00
        1.309990e+02	        2.237496e+00
        1.324663e+02	        2.181084e+00
        1.339500e+02	        2.125604e+00
        1.354503e+02	        2.069502e+00
        1.369674e+02	        2.012766e+00
        1.385015e+02	        1.955395e+00
        1.400528e+02	        1.897899e+00
        1.416214e+02	        1.855706e+00
        1.432077e+02	        1.813042e+00
        1.448117e+02	        1.769905e+00
        1.464336e+02	        1.726287e+00
        1.480737e+02	        1.682681e+00
        1.497322e+02	        1.638593e+00
        1.514093e+02	        1.594011e+00
        1.531052e+02	        1.554321e+00
        1.548200e+02	        1.515290e+00
        1.565541e+02	        1.475823e+00
        1.583076e+02	        1.435914e+00
        1.600807e+02	        1.395605e+00
        1.618737e+02	        1.356439e+00
        1.636867e+02	        1.318891e+00
        1.655201e+02	        1.286634e+00
        1.673740e+02	        1.254016e+00
        1.692487e+02	        1.220971e+00
        1.711444e+02	        1.187558e+00
        1.730613e+02	        1.153790e+00
        1.749996e+02	        1.119655e+00
        1.769597e+02	        1.092322e+00
        1.789418e+02	        1.066769e+00
        1.809460e+02	        1.040934e+00
        1.829727e+02	        1.014814e+00
        1.850221e+02	        9.884024e-01
        1.870944e+02	        9.616967e-01
        1.891900e+02	        9.347202e-01
        1.913090e+02	        9.099056e-01
        1.934517e+02	        8.848149e-01
        1.956185e+02	        8.602425e-01
        1.978095e+02	        8.356123e-01
        2.000251e+02	        8.107081e-01
        2.022655e+02	        7.862504e-01
        2.045309e+02	        7.663420e-01
        2.068218e+02	        7.462059e-01
        2.091383e+02	        7.258525e-01
        2.114807e+02	        7.052742e-01
        2.138494e+02	        6.845849e-01
        2.162446e+02	        6.642223e-01
        2.186667e+02	        6.475099e-01
        2.211159e+02	        6.306109e-01
        2.235925e+02	        6.135227e-01
        2.260968e+02	        5.962445e-01
        2.286292e+02	        5.787730e-01
        2.311900e+02	        5.611061e-01
        2.337794e+02	        5.459618e-01
        2.363979e+02	        5.318536e-01
        2.390456e+02	        5.175879e-01
        2.417231e+02	        5.031632e-01
        2.444305e+02	        4.884729e-01
        2.471682e+02	        4.736571e-01
        2.499366e+02	        4.604334e-01
        2.527360e+02	        4.473876e-01
        2.555668e+02	        4.342004e-01
        2.584293e+02	        4.213221e-01
        2.613238e+02	        4.083919e-01
        2.642508e+02	        3.957773e-01
        2.672105e+02	        3.852134e-01
        2.702034e+02	        3.745334e-01
        2.732298e+02	        3.637355e-01
        2.762901e+02	        3.528186e-01
        2.793847e+02	        3.418954e-01
        2.825139e+02	        3.320808e-01
        2.856782e+02	        3.232900e-01
        2.888780e+02	        3.143975e-01
        2.921136e+02	        3.054113e-01
        2.953854e+02	        2.963276e-01
        2.986938e+02	        2.871424e-01
        3.020393e+02	        2.788831e-01
        3.054223e+02	        2.712940e-01
        3.088432e+02	        2.636212e-01
        3.123024e+02	        2.559761e-01
        3.158004e+02	        2.482456e-01
        3.193375e+02	        2.404290e-01
        3.229142e+02	        2.327310e-01
        3.265310e+02	        2.250371e-01
        3.301883e+02	        2.172571e-01
        3.338866e+02	        2.093484e-01
        3.376263e+02	        2.017487e-01
        3.414079e+02	        1.958421e-01
        3.452318e+02	        1.902800e-01
        3.490986e+02	        1.846586e-01
        3.530086e+02	        1.789799e-01
        3.569625e+02	        1.732429e-01
        3.609607e+02	        1.674868e-01
        3.650036e+02	        1.623366e-01
        3.690918e+02	        1.572518e-01
        3.732258e+02	        1.523066e-01
        3.774062e+02	        1.473074e-01
        3.816333e+02	        1.422541e-01
        3.859078e+02	        1.374961e-01
        3.902301e+02	        1.329211e-01
        3.946009e+02	        1.282964e-01
        3.990206e+02	        1.236182e-01
        4.034898e+02	        1.190263e-01
        4.080091e+02	        1.148310e-01
        4.125790e+02	        1.109299e-01
        4.172001e+02	        1.069851e-01
        4.218730e+02	        1.029962e-01
        4.265982e+02	        9.896357e-02
        4.313763e+02	        9.501804e-02
        4.362079e+02	        9.120620e-02
        4.410936e+02	        8.754153e-02
        4.460341e+02	        8.391815e-02
        4.510299e+02	        8.025763e-02
        4.560817e+02	        7.669751e-02
        4.611900e+02	        7.312134e-02
        4.663556e+02	        6.950624e-02
        4.715790e+02	        6.585153e-02
        4.768609e+02	        6.236447e-02
        4.822020e+02	        5.900805e-02
        4.876029e+02	        5.563895e-02
        4.930643e+02	        5.218059e-02
        4.985868e+02	        4.861445e-02
        5.041712e+02	        4.500980e-02
        5.098182e+02	        4.125476e-02
        5.155284e+02	        3.739254e-02
        5.213026e+02	        3.488018e-02
        5.271414e+02	        3.418912e-02
        5.330457e+02	        3.348958e-02
        5.390161e+02	        3.278099e-02
        5.450533e+02	        3.206427e-02
        5.511582e+02	        3.133785e-02
        5.573314e+02	        3.059808e-02
        5.635738e+02	        3.000478e-02
        5.698861e+02	        2.946851e-02
        5.762691e+02	        2.892703e-02
        5.827236e+02	        2.837791e-02
        5.892504e+02	        2.782487e-02
        5.958503e+02	        2.726605e-02
        6.025241e+02	        2.670140e-02
        6.092727e+02	        2.616502e-02
        6.160968e+02	        2.566968e-02
        6.229974e+02	        2.516908e-02
        6.299753e+02	        2.466525e-02
        6.370313e+02	        2.415920e-02
        6.441664e+02	        2.364830e-02
        6.513814e+02	        2.313176e-02
        6.586772e+02	        2.268615e-02
        6.660547e+02	        2.226073e-02
        6.735148e+02	        2.183060e-02
        6.810585e+02	        2.139106e-02
        6.886867e+02	        2.094147e-02
        6.964003e+02	        2.049313e-02
        7.042004e+02	        2.006337e-02
        7.120878e+02	        1.970725e-02
        7.200635e+02	        1.934848e-02
        7.281286e+02	        1.898653e-02
        7.362840e+02	        1.862098e-02
        7.445307e+02	        1.825163e-02
        7.528698e+02	        1.787646e-02
        7.613023e+02	        1.751372e-02
        7.698293e+02	        1.717039e-02
        7.784518e+02	        1.682432e-02
        7.871708e+02	        1.647542e-02
        7.959875e+02	        1.612307e-02
        8.049030e+02	        1.576711e-02
        8.139183e+02	        1.545561e-02
        8.230346e+02	        1.516538e-02
        8.322529e+02	        1.486556e-02
        8.415746e+02	        1.456346e-02
        8.510006e+02	        1.425744e-02
        8.605323e+02	        1.394758e-02
        8.701706e+02	        1.366723e-02
        8.799170e+02	        1.339988e-02
        8.897725e+02	        1.312988e-02
        8.997384e+02	        1.285708e-02
        9.098159e+02	        1.257755e-02
        9.200063e+02	        1.230410e-02
        9.303108e+02	        1.206244e-02
        9.407307e+02	        1.182589e-02
        9.512674e+02	        1.158770e-02
        9.619221e+02	        1.134731e-02
        9.726961e+02	        1.110450e-02
        9.835907e+02	        1.086722e-02
        9.946074e+02	        1.063718e-02
        1.005748e+03	        1.040860e-02
        1.017012e+03	        1.018106e-02
        1.028403e+03	        9.952929e-03
        1.039922e+03	        9.730633e-03
        1.051570e+03	        9.533891e-03
        1.063348e+03	        9.335241e-03
        1.075258e+03	        9.129896e-03
        1.087301e+03	        8.923334e-03
        1.099480e+03	        8.716070e-03
        1.111794e+03	        8.527510e-03
        1.124247e+03	        8.341838e-03
        1.136839e+03	        8.154816e-03
        1.149572e+03	        7.966422e-03
        1.162448e+03	        7.737136e-03
        1.175468e+03	        7.527461e-03
        1.188634e+03	        7.326696e-03
        1.201947e+03	        7.132742e-03
        1.215409e+03	        6.940089e-03
        1.229023e+03	        6.757904e-03
        1.242788e+03	        6.580534e-03
        1.256708e+03	        6.403445e-03
        1.270784e+03	        6.225343e-03
        1.285017e+03	        6.066148e-03
        1.299410e+03	        5.908578e-03
        1.313964e+03	        5.750075e-03
        1.328681e+03	        5.590907e-03
        1.343563e+03	        5.437171e-03
        1.358612e+03	        5.287502e-03
        1.373829e+03	        5.139393e-03
        1.389216e+03	        4.992669e-03
        1.404776e+03	        4.848181e-03
        1.420510e+03	        4.702785e-03
        1.436421e+03	        4.556246e-03
        1.452509e+03	        4.406640e-03
        1.468778e+03	        4.258836e-03
        1.485229e+03	        4.109883e-03
        1.501865e+03	        3.960131e-03
        1.518686e+03	        3.805747e-03
        1.535696e+03	        3.638037e-03
        1.552897e+03	        3.429984e-03
        1.570290e+03	        3.044506e-03
        1.587878e+03	        2.988160e-03
        1.605663e+03	        2.933470e-03
        1.623647e+03	        2.888024e-03
        1.641833e+03	        2.842852e-03
        1.660222e+03	        2.798218e-03
        1.678818e+03	        2.753130e-03
        1.697621e+03	        2.707557e-03
        1.716635e+03	        2.662116e-03
        1.735863e+03	        2.617258e-03
        1.755305e+03	        2.574113e-03
        1.774965e+03	        2.530861e-03
        1.794846e+03	        2.489161e-03
        1.814949e+03	        2.447621e-03
        1.835277e+03	        2.405740e-03
        1.855833e+03	        2.363408e-03
        1.876620e+03	        2.320614e-03
        1.897639e+03	        2.277470e-03
        1.918893e+03	        2.235170e-03
        1.940386e+03	        2.193210e-03
        1.962119e+03	        2.155699e-03
        1.984096e+03	        2.118656e-03
        2.006319e+03	        2.081225e-03
        2.028790e+03	        2.043436e-03
        2.051514e+03	        2.005280e-03
        2.074492e+03	        1.968351e-03
        2.097727e+03	        1.932110e-03
        2.121223e+03	        1.895978e-03
        2.144981e+03	        1.863439e-03
        2.169006e+03	        1.831346e-03
        2.193300e+03	        1.798918e-03
        2.217866e+03	        1.766363e-03
        2.242707e+03	        1.734099e-03
        2.267827e+03	        1.701652e-03
        2.293228e+03	        1.669273e-03
        2.318913e+03	        1.636781e-03
        2.344886e+03	        1.605418e-03
        2.371150e+03	        1.574564e-03
        2.397708e+03	        1.543865e-03
        2.424563e+03	        1.513889e-03
        2.451720e+03	        1.483602e-03
        2.479180e+03	        1.453004e-03
        2.506948e+03	        1.423649e-03
        2.535027e+03	        1.395224e-03
        2.563421e+03	        1.369586e-03
        2.592132e+03	        1.343825e-03
        2.621165e+03	        1.317973e-03
        2.650524e+03	        1.291834e-03
        2.680211e+03	        1.265403e-03
        2.710231e+03	        1.238681e-03
        2.740587e+03	        1.213028e-03
        2.771282e+03	        1.189458e-03
        2.802322e+03	        1.167280e-03
        2.833710e+03	        1.144843e-03
        2.865449e+03	        1.122155e-03
        2.897543e+03	        1.099212e-03
        2.929997e+03	        1.076060e-03
        2.962814e+03	        1.052971e-03
        2.995999e+03	        1.030816e-03
        3.029556e+03	        1.011271e-03
        3.063488e+03	        9.915107e-04
        3.097801e+03	        9.715292e-04
        3.132498e+03	        9.513256e-04
        3.167583e+03	        9.313779e-04
        3.203062e+03	        9.117566e-04
        3.238938e+03	        8.919342e-04
        3.275216e+03	        8.732734e-04
        3.311900e+03	        8.552082e-04
        3.348994e+03	        8.369830e-04
        3.386505e+03	        8.189112e-04
        3.424435e+03	        8.007277e-04
        3.462791e+03	        7.823727e-04
        3.501576e+03	        7.644891e-04
        3.540795e+03	        7.475833e-04
        3.580454e+03	        7.317138e-04
        3.620557e+03	        7.162783e-04
        3.661109e+03	        7.010567e-04
        3.702115e+03	        6.856647e-04
        3.743580e+03	        6.701384e-04
        3.785510e+03	        6.552203e-04
        3.827910e+03	        6.403199e-04
        3.870784e+03	        6.254281e-04
        3.914139e+03	        6.109665e-04
        3.957979e+03	        5.970392e-04
        4.002311e+03	        5.830466e-04
        4.047138e+03	        5.702784e-04
        4.092468e+03	        5.576158e-04
        4.138306e+03	        5.450925e-04
        4.184657e+03	        5.325030e-04
        4.231527e+03	        5.200514e-04
        4.278923e+03	        5.079745e-04
        4.326849e+03	        4.959866e-04
        4.375311e+03	        4.841562e-04
        4.424317e+03	        4.722611e-04
        4.473872e+03	        4.602916e-04
        4.523981e+03	        4.481778e-04
        4.574652e+03	        4.363705e-04
        4.625890e+03	        4.255904e-04
        4.677703e+03	        4.152227e-04
        4.730095e+03	        4.049827e-04
        4.783075e+03	        3.946282e-04
        4.836647e+03	        3.840751e-04
        4.890820e+03	        3.737695e-04
        4.945600e+03	        3.634616e-04
        5.000993e+03	        3.529810e-04
        5.057007e+03	        3.421985e-04
        5.113648e+03	        3.298361e-04
        5.170923e+03	        3.187239e-04
        5.228840e+03	        3.108210e-04
        5.287405e+03	        3.030255e-04
        5.346627e+03	        2.951449e-04
        5.406512e+03	        2.872193e-04
        5.467067e+03	        2.799870e-04
        5.528301e+03	        2.728221e-04
        5.590221e+03	        2.657311e-04
        5.652834e+03	        2.586505e-04
        5.716149e+03	        2.515782e-04
        5.780172e+03	        2.444950e-04
        5.844913e+03	        2.373649e-04
        5.910379e+03	        2.303263e-04
        5.976578e+03	        2.235041e-04
        6.043519e+03	        2.168093e-04
        6.111209e+03	        2.098491e-04
        6.179658e+03	        2.025895e-04
        6.248873e+03	        1.938514e-04
        6.318863e+03	        1.882496e-04
        6.389638e+03	        1.827043e-04
        6.461205e+03	        1.772992e-04
        6.533574e+03	        1.719078e-04
        6.606753e+03	        1.664219e-04
        6.680752e+03	        1.610348e-04
        6.755579e+03	        1.556375e-04
        6.831245e+03	        1.502358e-04
        6.907759e+03	        1.447187e-04
        6.985129e+03	        1.392254e-04
        7.063366e+03	        1.335346e-04
        7.142479e+03	        1.273839e-04
        7.222478e+03	        1.207332e-04
        7.303374e+03	        1.120111e-04
        7.385175e+03	        1.014014e-04
        7.467893e+03	        9.887529e-05
        7.551537e+03	        9.648845e-05
        7.636118e+03	        9.419466e-05
        7.721646e+03	        9.194413e-05
        7.808132e+03	        8.972213e-05
        7.895587e+03	        8.747895e-05
        7.984022e+03	        8.521093e-05
        8.073446e+03	        8.306514e-05
        8.163873e+03	        8.103264e-05
        8.255312e+03	        7.898243e-05
        8.347776e+03	        7.689731e-05
        8.441275e+03	        7.479026e-05
        8.535822e+03	        7.265933e-05
        8.631427e+03	        7.056408e-05
        8.728103e+03	        6.847463e-05
        8.825862e+03	        6.637681e-05
        8.924716e+03	        6.432478e-05
        9.024678e+03	        6.238507e-05
        9.125758e+03	        6.048831e-05
        9.227971e+03	        5.859343e-05
        9.331329e+03	        5.663030e-05
        9.435845e+03	        5.458247e-05
        9.541531e+03	        5.243813e-05
        9.648401e+03	        4.940455e-05
        9.756468e+03	        4.804516e-05
        9.865745e+03	        4.670420e-05
        9.976246e+03	        4.536031e-05
        1.008798e+04	        4.400295e-05
        1.020098e+04	        4.267722e-05
        1.031523e+04	        4.139431e-05
        1.043077e+04	        4.011188e-05
        1.054760e+04	        3.888745e-05
        1.066573e+04	        3.766206e-05
        1.078520e+04	        3.641547e-05
        1.090600e+04	        3.516032e-05
        1.102815e+04	        3.393619e-05
        1.115167e+04	        3.269954e-05
        1.127657e+04	        3.149294e-05
        1.140288e+04	        3.031728e-05
        1.153059e+04	        2.910007e-05
        1.165974e+04	        2.784596e-05
        1.179034e+04	        2.652099e-05
        1.192240e+04	        2.498466e-05
        1.205593e+04	        2.290324e-05
        1.219096e+04	        2.218240e-05
        1.232751e+04	        2.152301e-05
        1.246558e+04	        2.086067e-05
        1.260520e+04	        2.018980e-05
        1.274639e+04	        1.951017e-05
        1.288915e+04	        1.882113e-05
        1.303352e+04	        1.812685e-05
        1.317950e+04	        1.739730e-05
        1.332712e+04	        1.668226e-05
        1.347639e+04	        1.601371e-05
        1.362733e+04	        1.531768e-05
        1.377996e+04	        1.456645e-05
        1.393431e+04	        1.376161e-05
        1.409038e+04	        1.280996e-05
        1.424820e+04	        1.188818e-05
        1.440778e+04	        1.159582e-05
        1.456916e+04	        1.130162e-05
        1.473234e+04	        1.100456e-05
        1.489735e+04	        1.070572e-05
        1.506421e+04	        1.040390e-05
        1.523293e+04	        1.011012e-05
        1.540355e+04	        9.821489e-06
        1.557608e+04	        9.532274e-06
        1.575054e+04	        9.238689e-06
        1.592695e+04	        8.939308e-06
        1.610534e+04	        8.638069e-06
        1.628573e+04	        8.360771e-06
        1.646814e+04	        8.072750e-06
        1.665259e+04	        7.733371e-06
        1.683910e+04	        7.516885e-06
        1.702771e+04	        7.298602e-06
        1.721843e+04	        7.081694e-06
        1.741128e+04	        6.892976e-06
        1.760630e+04	        6.703087e-06
        1.780350e+04	        6.511194e-06
        1.800291e+04	        6.317341e-06
        1.820455e+04	        6.122132e-06
        1.840845e+04	        5.934439e-06
        1.861463e+04	        5.750615e-06
        1.882312e+04	        5.563428e-06
        1.903395e+04	        5.368844e-06
        1.924714e+04	        5.179409e-06
        1.946272e+04	        5.012964e-06
        1.968071e+04	        4.855258e-06
        1.990114e+04	        4.695433e-06
        2.012405e+04	        4.533668e-06
        2.034945e+04	        4.368540e-06
        2.057737e+04	        4.218965e-06
        2.080785e+04	        4.069897e-06
        2.104091e+04	        3.917925e-06
        2.127657e+04	        3.760610e-06
        2.151488e+04	        3.598391e-06
        2.175586e+04	        3.450186e-06
        2.199954e+04	        3.321662e-06
        2.224594e+04	        3.191785e-06
        2.249511e+04	        3.063449e-06
        2.274706e+04	        2.940671e-06
        2.300184e+04	        2.816274e-06
        2.325947e+04	        2.690748e-06
        2.351999e+04	        2.569414e-06
        2.378343e+04	        2.453261e-06
        2.404981e+04	        2.336114e-06
        2.431918e+04	        2.218171e-06
        2.459157e+04	        2.100806e-06
        2.486701e+04	        1.982065e-06
        2.514553e+04	        1.863402e-06
        2.542717e+04	        1.750103e-06
        2.571197e+04	        1.634380e-06
        2.599996e+04	        1.512194e-06
        2.629117e+04	        1.398375e-06
        2.658564e+04	        1.280305e-06
        2.688341e+04	        1.156684e-06
        2.718452e+04	        1.023072e-06
        2.748900e+04	        8.801312e-07
        2.779689e+04	        7.275818e-07
        2.810823e+04	        5.356934e-07
        2.842306e+04	        1.900782e-07
        2.874141e+04	        5.899391e-08
        2.906333e+04	        5.366622e-08
        2.938885e+04	        4.781026e-08
        2.971802e+04	        4.115657e-08
        3.005088e+04	        3.502735e-08
        3.038746e+04	        2.810696e-08
        3.072782e+04	        1.862729e-08
        3.107198e+04	        2.674900e-09
        3.142000e+04	        2.468268e-09
        3.177192e+04	        2.241150e-09
        3.212779e+04	        1.959781e-09
        3.248763e+04	        1.692631e-09
        3.285151e+04	        1.521177e-09
        3.321946e+04	        1.314154e-09
        3.359154e+04	        9.646770e-10
        3.396778e+04	        9.105646e-10
        3.434823e+04	        8.657825e-10
        3.473295e+04	        8.178688e-10
        3.512198e+04	        7.432568e-10
        3.551536e+04	        7.150134e-10
        3.591315e+04	        6.859822e-10
        3.631540e+04	        6.558987e-10
        3.672215e+04	        6.263898e-10
        3.713345e+04	        5.956030e-10
        3.754937e+04	        5.572530e-10
        3.796994e+04	        5.266277e-10
        3.839522e+04	        5.053850e-10
        3.882526e+04	        4.822992e-10
        3.926013e+04	        4.607522e-10
        3.969986e+04	        4.395128e-10
        4.014452e+04	        4.124451e-10
        4.059416e+04	        3.949276e-10
        4.104883e+04	        3.768617e-10
        4.150860e+04	        3.561929e-10
        4.197351e+04	        3.406805e-10
        4.244364e+04	        3.216402e-10
        4.291903e+04	        3.018508e-10
        4.339974e+04	        2.911630e-10
        4.388584e+04	        2.796201e-10
        4.437738e+04	        2.692518e-10
        4.487443e+04	        2.586732e-10
        4.537705e+04	        2.467587e-10
        4.588529e+04	        2.392322e-10
        4.639923e+04	        2.315757e-10
        4.691893e+04	        2.242177e-10
        4.744444e+04	        2.168542e-10
        4.797584e+04	        2.093182e-10
        4.851319e+04	        2.026240e-10
        4.905657e+04	        1.958746e-10
        4.960602e+04	        1.890380e-10
        5.016164e+04	        1.817831e-10
        5.072347e+04	        1.751587e-10
        5.129160e+04	        1.684649e-10
        5.186609e+04	        1.626492e-10
        5.244702e+04	        1.567046e-10
        5.303445e+04	        1.507783e-10
        5.362846e+04	        1.446248e-10
        5.422913e+04	        1.386812e-10
        5.483652e+04	        1.327618e-10
        5.545071e+04	        1.269376e-10
        5.607179e+04	        1.207971e-10
        5.669982e+04	        1.152296e-10
        5.733489e+04	        1.102833e-10
        5.797707e+04	        1.052222e-10
        5.862644e+04	        9.936271e-11
        5.928308e+04	        9.482516e-11
        5.994708e+04	        9.069274e-11
        6.061852e+04	        8.670342e-11
        6.129748e+04	        8.225858e-11
        6.198404e+04	        7.862385e-11
        6.267829e+04	        7.472843e-11
        6.338032e+04	        7.036272e-11
        6.409021e+04	        6.631241e-11
        6.480805e+04	        6.352833e-11
        6.553393e+04	        6.087019e-11
        6.626795e+04	        5.798724e-11
        6.701018e+04	        5.570650e-11
        6.776073e+04	        5.335736e-11
        6.851968e+04	        5.080992e-11
        6.928713e+04	        4.870693e-11
        7.006318e+04	        4.665046e-11
        7.084793e+04	        4.453547e-11
        7.164146e+04	        4.244488e-11
        7.244388e+04	        4.045770e-11
        7.325529e+04	        3.846860e-11
        7.407578e+04	        3.648288e-11
        7.490547e+04	        3.460103e-11
        7.574444e+04	        3.267134e-11
        7.659282e+04	        3.074790e-11
        7.745070e+04	        2.891476e-11
        7.831818e+04	        2.707669e-11
        7.919539e+04	        2.528618e-11
        8.008241e+04	        2.349918e-11
        8.097938e+04	        2.152569e-11
        8.188638e+04	        1.959262e-11
        8.280355e+04	        1.771444e-11
        8.373099e+04	        1.577146e-11
        8.466882e+04	        1.400924e-11
        8.561715e+04	        1.189055e-11
        8.657611e+04	        1.019755e-11
        8.754580e+04	        8.315743e-12
        8.852636e+04	        6.597671e-12
        8.951790e+04	        5.468447e-12
        9.052054e+04	        4.295062e-12
        9.153442e+04	        2.951240e-12
        9.255965e+04	        1.298652e-12
        9.359636e+04	        2.496140e-13
        9.464469e+04	        1.611874e-13
        9.570475e+04	        1.474806e-13
        9.677669e+04	        1.335145e-13
        9.786064e+04	        1.186280e-13
        9.895673e+04	        1.031623e-13
        1.000651e+05	        8.528882e-14
        1.011859e+05	        6.261128e-14
        1.023192e+05	        2.693291e-14
        1.034652e+05	        1.356881e-14
        1.046241e+05	        4.036012e-15
        1.057959e+05	        0.000000e+00
        1.069809e+05	        0.000000e+00
        1.081791e+05	        0.000000e+00
        1.093908e+05	        0.000000e+00

# -------------------------------------------------------------------------------
# Curve 1: LET spectrum with Flares
# Params: 0 5 #14bf4c 2 1
#	LET (MeV.cm^2.g^{-1})		Flux (cm^{-2}.s^{-1})
# -------------------------------------------------------------------------------
        1.608960e+00	        2.072195e+04
        1.626982e+00	        2.072195e+04
        1.645205e+00	        2.072195e+04
        1.663632e+00	        2.072195e+04
        1.682265e+00	        2.072184e+04
        1.701107e+00	        2.072170e+04
        1.720161e+00	        2.072161e+04
        1.739427e+00	        2.072154e+04
        1.758910e+00	        2.072149e+04
        1.778610e+00	        2.072144e+04
        1.798532e+00	        2.072140e+04
        1.818676e+00	        2.072126e+04
        1.839046e+00	        2.072104e+04
        1.859644e+00	        2.072078e+04
        1.880473e+00	        2.072036e+04
        1.901536e+00	        2.071995e+04
        1.922834e+00	        2.071949e+04
        1.944370e+00	        2.071899e+04
        1.966148e+00	        2.071850e+04
        1.988170e+00	        2.071798e+04
        2.010439e+00	        2.071744e+04
        2.032956e+00	        2.071689e+04
        2.055727e+00	        2.071631e+04
        2.078752e+00	        2.071567e+04
        2.102035e+00	        2.071502e+04
        2.125579e+00	        2.071437e+04
        2.149386e+00	        2.071365e+04
        2.173460e+00	        2.071288e+04
        2.197804e+00	        2.071211e+04
        2.222421e+00	        2.071132e+04
        2.247313e+00	        2.071052e+04
        2.272484e+00	        2.070969e+04
        2.297937e+00	        2.070886e+04
        2.323675e+00	        2.070801e+04
        2.349701e+00	        2.070716e+04
        2.376019e+00	        2.070611e+04
        2.402632e+00	        2.070493e+04
        2.429542e+00	        2.070375e+04
        2.456754e+00	        2.070255e+04
        2.484271e+00	        2.070135e+04
        2.512096e+00	        2.070026e+04
        2.540233e+00	        2.069916e+04
        2.568685e+00	        2.069805e+04
        2.597455e+00	        2.069692e+04
        2.626548e+00	        2.069578e+04
        2.655967e+00	        2.069463e+04
        2.685715e+00	        2.069298e+04
        2.715796e+00	        2.069129e+04
        2.746214e+00	        2.068959e+04
        2.776973e+00	        2.068786e+04
        2.808077e+00	        2.068612e+04
        2.839529e+00	        2.068418e+04
        2.871333e+00	        2.068215e+04
        2.903493e+00	        2.068010e+04
        2.936014e+00	        2.067803e+04
        2.968899e+00	        2.067593e+04
        3.002152e+00	        2.067381e+04
        3.035777e+00	        2.067129e+04
        3.069779e+00	        2.066868e+04
        3.104162e+00	        2.066603e+04
        3.138931e+00	        2.066336e+04
        3.174088e+00	        2.066066e+04
        3.209640e+00	        2.065793e+04
        3.245589e+00	        2.065519e+04
        3.281941e+00	        2.065243e+04
        3.318701e+00	        2.064964e+04
        3.355872e+00	        2.064682e+04
        3.393459e+00	        2.064397e+04
        3.431468e+00	        2.064108e+04
        3.469902e+00	        2.063817e+04
        3.508766e+00	        2.063484e+04
        3.548066e+00	        2.063136e+04
        3.587806e+00	        2.062784e+04
        3.627992e+00	        2.062429e+04
        3.668627e+00	        2.062069e+04
        3.709717e+00	        2.061705e+04
        3.751268e+00	        2.061338e+04
        3.793284e+00	        2.060980e+04
        3.835771e+00	        2.060618e+04
        3.878733e+00	        2.060252e+04
        3.922177e+00	        2.059881e+04
        3.966107e+00	        2.059507e+04
        4.010530e+00	        2.059129e+04
        4.055449e+00	        2.058746e+04
        4.100872e+00	        2.058314e+04
        4.146804e+00	        2.057769e+04
        4.193250e+00	        2.057217e+04
        4.240217e+00	        2.056660e+04
        4.287709e+00	        2.056097e+04
        4.335734e+00	        2.055527e+04
        4.384296e+00	        2.054951e+04
        4.433403e+00	        2.054410e+04
        4.483059e+00	        2.053865e+04
        4.533271e+00	        2.053314e+04
        4.584046e+00	        2.052757e+04
        4.635390e+00	        2.052193e+04
        4.687308e+00	        2.051623e+04
        4.739809e+00	        2.051047e+04
        4.792897e+00	        2.050464e+04
        4.846580e+00	        2.049682e+04
        4.900864e+00	        2.048861e+04
        4.955756e+00	        2.048032e+04
        5.011263e+00	        2.047193e+04
        5.067391e+00	        2.046344e+04
        5.124149e+00	        2.045486e+04
        5.181542e+00	        2.044619e+04
        5.239577e+00	        2.043708e+04
        5.298263e+00	        2.042777e+04
        5.357606e+00	        2.041836e+04
        5.417614e+00	        2.040885e+04
        5.478294e+00	        2.039922e+04
        5.539654e+00	        2.038949e+04
        5.601701e+00	        2.037965e+04
        5.664442e+00	        2.036970e+04
        5.727887e+00	        2.035854e+04
        5.792042e+00	        2.034668e+04
        5.856916e+00	        2.033468e+04
        5.922516e+00	        2.032255e+04
        5.988851e+00	        2.031029e+04
        6.055929e+00	        2.029789e+04
        6.123759e+00	        2.028534e+04
        6.192348e+00	        2.027266e+04
        6.261705e+00	        2.025853e+04
        6.331839e+00	        2.024187e+04
        6.402759e+00	        2.022502e+04
        6.474473e+00	        2.020799e+04
        6.546991e+00	        2.019076e+04
        6.620320e+00	        2.017334e+04
        6.694471e+00	        2.015573e+04
        6.769452e+00	        2.013790e+04
        6.845274e+00	        2.011816e+04
        6.921944e+00	        2.009709e+04
        6.999473e+00	        2.007579e+04
        7.077871e+00	        2.005425e+04
        7.157146e+00	        2.003247e+04
        7.237310e+00	        2.001044e+04
        7.318371e+00	        1.998817e+04
        7.400341e+00	        1.996565e+04
        7.483228e+00	        1.994090e+04
        7.567044e+00	        1.991364e+04
        7.651799e+00	        1.988607e+04
        7.737503e+00	        1.985819e+04
        7.824166e+00	        1.983000e+04
        7.911801e+00	        1.980149e+04
        8.000417e+00	        1.977267e+04
        8.090026e+00	        1.974352e+04
        8.180638e+00	        1.971397e+04
        8.272265e+00	        1.967728e+04
        8.364918e+00	        1.964018e+04
        8.458610e+00	        1.960266e+04
        8.553350e+00	        1.956472e+04
        8.649152e+00	        1.952636e+04
        8.746027e+00	        1.948756e+04
        8.843987e+00	        1.944833e+04
        8.943044e+00	        1.940867e+04
        9.043210e+00	        1.936214e+04
        9.144499e+00	        1.930987e+04
        9.246921e+00	        1.925701e+04
        9.350492e+00	        1.920357e+04
        9.455222e+00	        1.914952e+04
        9.561125e+00	        1.909487e+04
        9.668214e+00	        1.903960e+04
        9.776503e+00	        1.898372e+04
        9.886005e+00	        1.892694e+04
        9.996733e+00	        1.886915e+04
        1.010870e+01	        1.881071e+04
        1.022192e+01	        1.875161e+04
        1.033641e+01	        1.869185e+04
        1.045219e+01	        1.863142e+04
        1.056926e+01	        1.857032e+04
        1.068764e+01	        1.850853e+04
        1.080734e+01	        1.844605e+04
        1.092839e+01	        1.837865e+04
        1.105080e+01	        1.829677e+04
        1.117457e+01	        1.821397e+04
        1.129973e+01	        1.813024e+04
        1.142629e+01	        1.804558e+04
        1.155427e+01	        1.795997e+04
        1.168369e+01	        1.787340e+04
        1.181455e+01	        1.778586e+04
        1.194688e+01	        1.770043e+04
        1.208069e+01	        1.762219e+04
        1.221600e+01	        1.754309e+04
        1.235282e+01	        1.746309e+04
        1.249118e+01	        1.738220e+04
        1.263109e+01	        1.730041e+04
        1.277256e+01	        1.721770e+04
        1.291562e+01	        1.713406e+04
        1.306028e+01	        1.704948e+04
        1.320657e+01	        1.696396e+04
        1.335449e+01	        1.686283e+04
        1.350406e+01	        1.674984e+04
        1.365531e+01	        1.663558e+04
        1.380826e+01	        1.652004e+04
        1.396292e+01	        1.640321e+04
        1.411931e+01	        1.628507e+04
        1.427746e+01	        1.616561e+04
        1.443737e+01	        1.604481e+04
        1.459908e+01	        1.592925e+04
        1.476259e+01	        1.581414e+04
        1.492794e+01	        1.569774e+04
        1.509514e+01	        1.558004e+04
        1.526421e+01	        1.546102e+04
        1.543518e+01	        1.534066e+04
        1.560806e+01	        1.521896e+04
        1.578288e+01	        1.509590e+04
        1.595966e+01	        1.497142e+04
        1.613841e+01	        1.484538e+04
        1.631917e+01	        1.471793e+04
        1.650195e+01	        1.458905e+04
        1.668678e+01	        1.445873e+04
        1.687368e+01	        1.432694e+04
        1.706268e+01	        1.419368e+04
        1.725379e+01	        1.405893e+04
        1.744704e+01	        1.392267e+04
        1.764245e+01	        1.379519e+04
        1.784006e+01	        1.367008e+04
        1.803988e+01	        1.354357e+04
        1.824193e+01	        1.341564e+04
        1.844625e+01	        1.328628e+04
        1.865286e+01	        1.315547e+04
        1.886178e+01	        1.302319e+04
        1.907304e+01	        1.288943e+04
        1.928667e+01	        1.275417e+04
        1.950269e+01	        1.262512e+04
        1.972113e+01	        1.249475e+04
        1.994201e+01	        1.236291e+04
        2.016537e+01	        1.222960e+04
        2.039124e+01	        1.209479e+04
        2.061963e+01	        1.195847e+04
        2.085058e+01	        1.182063e+04
        2.108411e+01	        1.168124e+04
        2.132027e+01	        1.154670e+04
        2.155906e+01	        1.142074e+04
        2.180054e+01	        1.129338e+04
        2.204471e+01	        1.116459e+04
        2.229162e+01	        1.103436e+04
        2.254130e+01	        1.090267e+04
        2.279378e+01	        1.076951e+04
        2.304908e+01	        1.063485e+04
        2.330724e+01	        1.049868e+04
        2.356829e+01	        1.035479e+04
        2.383227e+01	        1.020396e+04
        2.409920e+01	        1.005145e+04
        2.436912e+01	        9.897222e+03
        2.464207e+01	        9.741272e+03
        2.491807e+01	        9.583575e+03
        2.519717e+01	        9.424110e+03
        2.547939e+01	        9.271236e+03
        2.576477e+01	        9.154732e+03
        2.605335e+01	        9.036923e+03
        2.634516e+01	        8.917794e+03
        2.664024e+01	        8.797331e+03
        2.693862e+01	        8.675519e+03
        2.724035e+01	        8.552343e+03
        2.754545e+01	        8.427786e+03
        2.785397e+01	        8.301834e+03
        2.816595e+01	        8.174472e+03
        2.848142e+01	        8.047006e+03
        2.880043e+01	        7.918142e+03
        2.912301e+01	        7.787834e+03
        2.944920e+01	        7.656067e+03
        2.977905e+01	        7.522824e+03
        3.011259e+01	        7.388088e+03
        3.044986e+01	        7.251843e+03
        3.079092e+01	        7.114072e+03
        3.113579e+01	        7.000225e+03
        3.148453e+01	        6.888416e+03
        3.183717e+01	        6.775356e+03
        3.219376e+01	        6.661028e+03
        3.255435e+01	        6.545421e+03
        3.291897e+01	        6.428518e+03
        3.328768e+01	        6.310306e+03
        3.366052e+01	        6.190770e+03
        3.403753e+01	        6.077371e+03
        3.441877e+01	        5.982688e+03
        3.480428e+01	        5.886944e+03
        3.519410e+01	        5.790128e+03
        3.558829e+01	        5.692228e+03
        3.598690e+01	        5.593231e+03
        3.638997e+01	        5.493124e+03
        3.679756e+01	        5.391896e+03
        3.720971e+01	        5.289534e+03
        3.762647e+01	        5.188058e+03
        3.804791e+01	        5.092107e+03
        3.847406e+01	        4.995082e+03
        3.890499e+01	        4.896970e+03
        3.934075e+01	        4.797759e+03
        3.978138e+01	        4.697438e+03
        4.022696e+01	        4.595993e+03
        4.067752e+01	        4.493412e+03
        4.113313e+01	        4.396773e+03
        4.159384e+01	        4.317655e+03
        4.205971e+01	        4.237650e+03
        4.253080e+01	        4.156750e+03
        4.300716e+01	        4.074943e+03
        4.348887e+01	        3.992220e+03
        4.397596e+01	        3.908569e+03
        4.446851e+01	        3.823981e+03
        4.496658e+01	        3.738446e+03
        4.547023e+01	        3.666556e+03
        4.597952e+01	        3.598210e+03
        4.649451e+01	        3.529100e+03
        4.701528e+01	        3.459215e+03
        4.754187e+01	        3.388548e+03
        4.807436e+01	        3.317090e+03
        4.861282e+01	        3.244833e+03
        4.915731e+01	        3.171767e+03
        4.970789e+01	        3.100487e+03
        5.026464e+01	        3.041605e+03
        5.082763e+01	        2.982064e+03
        5.139693e+01	        2.921856e+03
        5.197260e+01	        2.860974e+03
        5.255472e+01	        2.799409e+03
        5.314336e+01	        2.737156e+03
        5.373859e+01	        2.674202e+03
        5.434049e+01	        2.610543e+03
        5.494913e+01	        2.553117e+03
        5.556458e+01	        2.498590e+03
        5.618694e+01	        2.443452e+03
        5.681626e+01	        2.387697e+03
        5.745263e+01	        2.331317e+03
        5.809612e+01	        2.274306e+03
        5.874683e+01	        2.216658e+03
        5.940482e+01	        2.158364e+03
        6.007019e+01	        2.110964e+03
        6.074300e+01	        2.066262e+03
        6.142335e+01	        2.021059e+03
        6.211133e+01	        1.975350e+03
        6.280700e+01	        1.929129e+03
        6.351047e+01	        1.882390e+03
        6.422182e+01	        1.835127e+03
        6.494114e+01	        1.787336e+03
        6.566851e+01	        1.744576e+03
        6.640403e+01	        1.704130e+03
        6.714779e+01	        1.663230e+03
        6.789988e+01	        1.621873e+03
        6.866039e+01	        1.580052e+03
        6.942942e+01	        1.537763e+03
        7.020706e+01	        1.495001e+03
        7.099342e+01	        1.453878e+03
        7.178858e+01	        1.426085e+03
        7.259264e+01	        1.397982e+03
        7.340572e+01	        1.369563e+03
        7.422790e+01	        1.340826e+03
        7.505929e+01	        1.311768e+03
        7.589999e+01	        1.282384e+03
        7.675011e+01	        1.252671e+03
        7.760974e+01	        1.222625e+03
        7.847901e+01	        1.192662e+03
        7.935802e+01	        1.164186e+03
        8.024686e+01	        1.135391e+03
        8.114567e+01	        1.106274e+03
        8.205454e+01	        1.076830e+03
        8.297359e+01	        1.047057e+03
        8.390294e+01	        1.016950e+03
        8.484269e+01	        9.865068e+02
        8.579297e+01	        9.651501e+02
        8.675389e+01	        9.440379e+02
        8.772558e+01	        9.226892e+02
        8.870815e+01	        9.011014e+02
        8.970173e+01	        8.792718e+02
        9.070643e+01	        8.571978e+02
        9.172239e+01	        8.348765e+02
        9.274972e+01	        8.123045e+02
        9.378856e+01	        7.937211e+02
        9.483904e+01	        7.755769e+02
        9.590129e+01	        7.572296e+02
        9.697543e+01	        7.386767e+02
        9.806160e+01	        7.199160e+02
        9.915994e+01	        7.009452e+02
        1.002706e+02	        6.817634e+02
        1.013937e+02	        6.629467e+02
        1.025293e+02	        6.479224e+02
        1.036777e+02	        6.327299e+02
        1.048389e+02	        6.173672e+02
        1.060132e+02	        6.018324e+02
        1.072006e+02	        5.861236e+02
        1.084013e+02	        5.702385e+02
        1.096154e+02	        5.541755e+02
        1.108432e+02	        5.401211e+02
        1.120847e+02	        5.278948e+02
        1.133401e+02	        5.155316e+02
        1.146095e+02	        5.030299e+02
        1.158932e+02	        4.903882e+02
        1.171913e+02	        4.776049e+02
        1.185039e+02	        4.646785e+02
        1.198312e+02	        4.516072e+02
        1.211734e+02	        4.408052e+02
        1.225306e+02	        4.302883e+02
        1.239030e+02	        4.196536e+02
        1.252907e+02	        4.088998e+02
        1.266941e+02	        3.980256e+02
        1.281131e+02	        3.870296e+02
        1.295480e+02	        3.759105e+02
        1.309990e+02	        3.655225e+02
        1.324663e+02	        3.557863e+02
        1.339500e+02	        3.459444e+02
        1.354503e+02	        3.359922e+02
        1.369674e+02	        3.259286e+02
        1.385015e+02	        3.157523e+02
        1.400528e+02	        3.055627e+02
        1.416214e+02	        2.984053e+02
        1.432077e+02	        2.911677e+02
        1.448117e+02	        2.838490e+02
        1.464336e+02	        2.764484e+02
        1.480737e+02	        2.689658e+02
        1.497322e+02	        2.613994e+02
        1.514093e+02	        2.537483e+02
        1.531052e+02	        2.470674e+02
        1.548200e+02	        2.405278e+02
        1.565541e+02	        2.339149e+02
        1.583076e+02	        2.272280e+02
        1.600807e+02	        2.204663e+02
        1.618737e+02	        2.136323e+02
        1.636867e+02	        2.071272e+02
        1.655201e+02	        2.016760e+02
        1.673740e+02	        1.961638e+02
        1.692487e+02	        1.905898e+02
        1.711444e+02	        1.849533e+02
        1.730613e+02	        1.792538e+02
        1.749996e+02	        1.734904e+02
        1.769597e+02	        1.689904e+02
        1.789418e+02	        1.647311e+02
        1.809460e+02	        1.604242e+02
        1.829727e+02	        1.560690e+02
        1.850221e+02	        1.516650e+02
        1.870944e+02	        1.472118e+02
        1.891900e+02	        1.427138e+02
        1.913090e+02	        1.386568e+02
        1.934517e+02	        1.345543e+02
        1.956185e+02	        1.304076e+02
        1.978095e+02	        1.262150e+02
        2.000251e+02	        1.219754e+02
        2.022655e+02	        1.178328e+02
        2.045309e+02	        1.146068e+02
        2.068218e+02	        1.113446e+02
        2.091383e+02	        1.080459e+02
        2.114807e+02	        1.047103e+02
        2.138494e+02	        1.013376e+02
        2.162446e+02	        9.793127e+01
        2.186667e+02	        9.526821e+01
        2.211159e+02	        9.257532e+01
        2.235925e+02	        8.985227e+01
        2.260968e+02	        8.709872e+01
        2.286292e+02	        8.431432e+01
        2.311900e+02	        8.149874e+01
        2.337794e+02	        7.916469e+01
        2.363979e+02	        7.688672e+01
        2.390456e+02	        7.458324e+01
        2.417231e+02	        7.225395e+01
        2.444305e+02	        6.989847e+01
        2.471682e+02	        6.751665e+01
        2.499366e+02	        6.545830e+01
        2.527360e+02	        6.344028e+01
        2.555668e+02	        6.139966e+01
        2.584293e+02	        5.933718e+01
        2.613238e+02	        5.725181e+01
        2.642508e+02	        5.523509e+01
        2.672105e+02	        5.363657e+01
        2.702034e+02	        5.202015e+01
        2.732298e+02	        5.038562e+01
        2.762901e+02	        4.873279e+01
        2.793847e+02	        4.706171e+01
        2.825139e+02	        4.544635e+01
        2.856782e+02	        4.404275e+01
        2.888780e+02	        4.262342e+01
        2.921136e+02	        4.118820e+01
        2.953854e+02	        3.973691e+01
        2.986938e+02	        3.826937e+01
        3.020393e+02	        3.699184e+01
        3.054223e+02	        3.585303e+01
        3.088432e+02	        3.470147e+01
        3.123024e+02	        3.353727e+01
        3.158004e+02	        3.236003e+01
        3.193375e+02	        3.116961e+01
        3.229142e+02	        3.000702e+01
        3.265310e+02	        2.884944e+01
        3.301883e+02	        2.767889e+01
        3.338866e+02	        2.649519e+01
        3.376263e+02	        2.529919e+01
        3.414079e+02	        2.439645e+01
        3.452318e+02	        2.356289e+01
        3.490986e+02	        2.272000e+01
        3.530086e+02	        2.186767e+01
        3.569625e+02	        2.100581e+01
        3.609607e+02	        2.014284e+01
        3.650036e+02	        1.940483e+01
        3.690918e+02	        1.865884e+01
        3.732258e+02	        1.790495e+01
        3.774062e+02	        1.714262e+01
        3.816333e+02	        1.637175e+01
        3.859078e+02	        1.566366e+01
        3.902301e+02	        1.499439e+01
        3.946009e+02	        1.431763e+01
        3.990206e+02	        1.363328e+01
        4.034898e+02	        1.294157e+01
        4.080091e+02	        1.230161e+01
        4.125790e+02	        1.172310e+01
        4.172001e+02	        1.113812e+01
        4.218730e+02	        1.054659e+01
        4.265982e+02	        9.948428e+00
        4.313763e+02	        9.369802e+00
        4.362079e+02	        8.821882e+00
        4.410936e+02	        8.268275e+00
        4.460341e+02	        7.708653e+00
        4.510299e+02	        7.142767e+00
        4.560817e+02	        6.598532e+00
        4.611900e+02	        6.052707e+00
        4.663556e+02	        5.500770e+00
        4.715790e+02	        4.942651e+00
        4.768609e+02	        4.419809e+00
        4.822020e+02	        3.894719e+00
        4.876029e+02	        3.363808e+00
        4.930643e+02	        2.816945e+00
        4.985868e+02	        2.249795e+00
        5.041712e+02	        1.676294e+00
        5.098182e+02	        1.073899e+00
        5.155284e+02	        4.514544e-01
        5.213026e+02	        9.523144e-02
        5.271414e+02	        9.347264e-02
        5.330457e+02	        9.169399e-02
        5.390161e+02	        8.989360e-02
        5.450533e+02	        8.807246e-02
        5.511582e+02	        8.622898e-02
        5.573314e+02	        8.435965e-02
        5.635738e+02	        8.282666e-02
        5.698861e+02	        8.142343e-02
        5.762691e+02	        8.000964e-02
        5.827236e+02	        7.858155e-02
        5.892504e+02	        7.714378e-02
        5.958503e+02	        7.568973e-02
        6.025241e+02	        7.421939e-02
        6.092727e+02	        7.281355e-02
        6.160968e+02	        7.150704e-02
        6.229974e+02	        7.018620e-02
        6.299753e+02	        6.885605e-02
        6.370313e+02	        6.754705e-02
        6.441664e+02	        6.622450e-02
        6.513814e+02	        6.488692e-02
        6.586772e+02	        6.371400e-02
        6.660547e+02	        6.258649e-02
        6.735148e+02	        6.144640e-02
        6.810585e+02	        6.028894e-02
        6.886867e+02	        5.911273e-02
        6.964003e+02	        5.793557e-02
        7.042004e+02	        5.679979e-02
        7.120878e+02	        5.583705e-02
        7.200635e+02	        5.486614e-02
        7.281286e+02	        5.388518e-02
        7.362840e+02	        5.289369e-02
        7.445307e+02	        5.189116e-02
        7.528698e+02	        5.087544e-02
        7.613023e+02	        4.988731e-02
        7.698293e+02	        4.897730e-02
        7.784518e+02	        4.806297e-02
        7.871708e+02	        4.714090e-02
        7.959875e+02	        4.620897e-02
        8.049030e+02	        4.526693e-02
        8.139183e+02	        4.442692e-02
        8.230346e+02	        4.363524e-02
        8.322529e+02	        4.282749e-02
        8.415746e+02	        4.201211e-02
        8.510006e+02	        4.118599e-02
        8.605323e+02	        4.034884e-02
        8.701706e+02	        3.957956e-02
        8.799170e+02	        3.883880e-02
        8.897725e+02	        3.809003e-02
        8.997384e+02	        3.733311e-02
        9.098159e+02	        3.656191e-02
        9.200063e+02	        3.580678e-02
        9.303108e+02	        3.514176e-02
        9.407307e+02	        3.449482e-02
        9.512674e+02	        3.384132e-02
        9.619221e+02	        3.318037e-02
        9.726961e+02	        3.251221e-02
        9.835907e+02	        3.185544e-02
        9.946074e+02	        3.122875e-02
        1.005748e+03	        3.059942e-02
        1.017012e+03	        2.997436e-02
        1.028403e+03	        2.935588e-02
        1.039922e+03	        2.874912e-02
        1.051570e+03	        2.820137e-02
        1.063348e+03	        2.764754e-02
        1.075258e+03	        2.708301e-02
        1.087301e+03	        2.651344e-02
        1.099480e+03	        2.593995e-02
        1.111794e+03	        2.541273e-02
        1.124247e+03	        2.490510e-02
        1.136839e+03	        2.439238e-02
        1.149572e+03	        2.387513e-02
        1.162448e+03	        2.332402e-02
        1.175468e+03	        2.280838e-02
        1.188634e+03	        2.229864e-02
        1.201947e+03	        2.179695e-02
        1.215409e+03	        2.129600e-02
        1.229023e+03	        2.081909e-02
        1.242788e+03	        2.035356e-02
        1.256708e+03	        1.988587e-02
        1.270784e+03	        1.941393e-02
        1.285017e+03	        1.898521e-02
        1.299410e+03	        1.855807e-02
        1.313964e+03	        1.812727e-02
        1.328681e+03	        1.769252e-02
        1.343563e+03	        1.727158e-02
        1.358612e+03	        1.687084e-02
        1.373829e+03	        1.646931e-02
        1.389216e+03	        1.606993e-02
        1.404776e+03	        1.567580e-02
        1.420510e+03	        1.527862e-02
        1.436421e+03	        1.488050e-02
        1.452509e+03	        1.447701e-02
        1.468778e+03	        1.407887e-02
        1.485229e+03	        1.367778e-02
        1.501865e+03	        1.327615e-02
        1.518686e+03	        1.286269e-02
        1.535696e+03	        1.241734e-02
        1.552897e+03	        1.187592e-02
        1.570290e+03	        1.091298e-02
        1.587878e+03	        1.072308e-02
        1.605663e+03	        1.053841e-02
        1.623647e+03	        1.038619e-02
        1.641833e+03	        1.023392e-02
        1.660222e+03	        1.008176e-02
        1.678818e+03	        9.928110e-03
        1.697621e+03	        9.772780e-03
        1.716635e+03	        9.616813e-03
        1.735863e+03	        9.465643e-03
        1.755305e+03	        9.320467e-03
        1.774965e+03	        9.174769e-03
        1.794846e+03	        9.035237e-03
        1.814949e+03	        8.895347e-03
        1.835277e+03	        8.754099e-03
        1.855833e+03	        8.611245e-03
        1.876620e+03	        8.466779e-03
        1.897639e+03	        8.320946e-03
        1.918893e+03	        8.179568e-03
        1.940386e+03	        8.039903e-03
        1.962119e+03	        7.914313e-03
        1.984096e+03	        7.788878e-03
        2.006319e+03	        7.662063e-03
        2.028790e+03	        7.534057e-03
        2.051514e+03	        7.404711e-03
        2.074492e+03	        7.277798e-03
        2.097727e+03	        7.155319e-03
        2.121223e+03	        7.033963e-03
        2.144981e+03	        6.923821e-03
        2.169006e+03	        6.814463e-03
        2.193300e+03	        6.703907e-03
        2.217866e+03	        6.592281e-03
        2.242707e+03	        6.480950e-03
        2.267827e+03	        6.368803e-03
        2.293228e+03	        6.259772e-03
        2.318913e+03	        6.151935e-03
        2.344886e+03	        6.046971e-03
        2.371150e+03	        5.943523e-03
        2.397708e+03	        5.839846e-03
        2.424563e+03	        5.737629e-03
        2.451720e+03	        5.634403e-03
        2.479180e+03	        5.530157e-03
        2.506948e+03	        5.431943e-03
        2.535027e+03	        5.336509e-03
        2.563421e+03	        5.248986e-03
        2.592132e+03	        5.160561e-03
        2.621165e+03	        5.071651e-03
        2.650524e+03	        4.981773e-03
        2.680211e+03	        4.890901e-03
        2.710231e+03	        4.799060e-03
        2.740587e+03	        4.713998e-03
        2.771282e+03	        4.635608e-03
        2.802322e+03	        4.560624e-03
        2.833710e+03	        4.484669e-03
        2.865449e+03	        4.407863e-03
        2.897543e+03	        4.330211e-03
        2.929997e+03	        4.251910e-03
        2.962814e+03	        4.173386e-03
        2.995999e+03	        4.097582e-03
        3.029556e+03	        4.031257e-03
        3.063488e+03	        3.964199e-03
        3.097801e+03	        3.896390e-03
        3.132498e+03	        3.827833e-03
        3.167583e+03	        3.759607e-03
        3.203062e+03	        3.691835e-03
        3.238938e+03	        3.623373e-03
        3.275216e+03	        3.557814e-03
        3.311900e+03	        3.495762e-03
        3.348994e+03	        3.433201e-03
        3.386505e+03	        3.370831e-03
        3.424435e+03	        3.307921e-03
        3.462791e+03	        3.244360e-03
        3.501576e+03	        3.182060e-03
        3.540795e+03	        3.122086e-03
        3.580454e+03	        3.066080e-03
        3.620557e+03	        3.012559e-03
        3.661109e+03	        2.959418e-03
        3.702115e+03	        2.905682e-03
        3.743580e+03	        2.851435e-03
        3.785510e+03	        2.798929e-03
        3.827910e+03	        2.746355e-03
        3.870784e+03	        2.693247e-03
        3.914139e+03	        2.641438e-03
        3.957979e+03	        2.592188e-03
        4.002311e+03	        2.542998e-03
        4.047138e+03	        2.497237e-03
        4.092468e+03	        2.451659e-03
        4.138306e+03	        2.406127e-03
        4.184657e+03	        2.360142e-03
        4.231527e+03	        2.314010e-03
        4.278923e+03	        2.269501e-03
        4.326849e+03	        2.225423e-03
        4.375311e+03	        2.181763e-03
        4.424317e+03	        2.137759e-03
        4.473872e+03	        2.093381e-03
        4.523981e+03	        2.048618e-03
        4.574652e+03	        2.004581e-03
        4.625890e+03	        1.963348e-03
        4.677703e+03	        1.924484e-03
        4.730095e+03	        1.886570e-03
        4.783075e+03	        1.848233e-03
        4.836647e+03	        1.809238e-03
        4.890820e+03	        1.770863e-03
        4.945600e+03	        1.732630e-03
        5.000993e+03	        1.693991e-03
        5.057007e+03	        1.654558e-03
        5.113648e+03	        1.611610e-03
        5.170923e+03	        1.571941e-03
        5.228840e+03	        1.540044e-03
        5.287405e+03	        1.508343e-03
        5.346627e+03	        1.476345e-03
        5.406512e+03	        1.444238e-03
        5.467067e+03	        1.414326e-03
        5.528301e+03	        1.384929e-03
        5.590221e+03	        1.356105e-03
        5.652834e+03	        1.327226e-03
        5.716149e+03	        1.298306e-03
        5.780172e+03	        1.269262e-03
        5.844913e+03	        1.240054e-03
        5.910379e+03	        1.211333e-03
        5.976578e+03	        1.183364e-03
        6.043519e+03	        1.156356e-03
        6.111209e+03	        1.128740e-03
        6.179658e+03	        1.100495e-03
        6.248873e+03	        1.069845e-03
        6.318863e+03	        1.044545e-03
        6.389638e+03	        1.019672e-03
        6.461205e+03	        9.958274e-04
        6.533574e+03	        9.722354e-04
        6.606753e+03	        9.483668e-04
        6.680752e+03	        9.246469e-04
        6.755579e+03	        9.008645e-04
        6.831245e+03	        8.770404e-04
        6.907759e+03	        8.527847e-04
        6.985129e+03	        8.287820e-04
        7.063366e+03	        8.043406e-04
        7.142479e+03	        7.786026e-04
        7.222478e+03	        7.514954e-04
        7.303374e+03	        7.185743e-04
        7.385175e+03	        6.803569e-04
        7.467893e+03	        6.646539e-04
        7.551537e+03	        6.502254e-04
        7.636118e+03	        6.369024e-04
        7.721646e+03	        6.237186e-04
        7.808132e+03	        6.106025e-04
        7.895587e+03	        5.973550e-04
        7.984022e+03	        5.839617e-04
        8.073446e+03	        5.711049e-04
        8.163873e+03	        5.586289e-04
        8.255312e+03	        5.460281e-04
        8.347776e+03	        5.331961e-04
        8.441275e+03	        5.202299e-04
        8.535822e+03	        5.071310e-04
        8.631427e+03	        4.941899e-04
        8.728103e+03	        4.812617e-04
        8.825862e+03	        4.683098e-04
        8.924716e+03	        4.561541e-04
        9.024678e+03	        4.447501e-04
        9.125758e+03	        4.335904e-04
        9.227971e+03	        4.224386e-04
        9.331329e+03	        4.110165e-04
        9.435845e+03	        3.993445e-04
        9.541531e+03	        3.873616e-04
        9.648401e+03	        3.728855e-04
        9.756468e+03	        3.638504e-04
        9.865745e+03	        3.548630e-04
        9.976246e+03	        3.458226e-04
        1.008798e+04	        3.367012e-04
        1.020098e+04	        3.277302e-04
        1.031523e+04	        3.189601e-04
        1.043077e+04	        3.103295e-04
        1.054760e+04	        3.024245e-04
        1.066573e+04	        2.944983e-04
        1.078520e+04	        2.865161e-04
        1.090600e+04	        2.784871e-04
        1.102815e+04	        2.705060e-04
        1.115167e+04	        2.624635e-04
        1.127657e+04	        2.545299e-04
        1.140288e+04	        2.471221e-04
        1.153059e+04	        2.395805e-04
        1.165974e+04	        2.318707e-04
        1.179034e+04	        2.238938e-04
        1.192240e+04	        2.151196e-04
        1.205593e+04	        2.043705e-04
        1.219096e+04	        1.985347e-04
        1.232751e+04	        1.933972e-04
        1.246558e+04	        1.882581e-04
        1.260520e+04	        1.830555e-04
        1.274639e+04	        1.777947e-04
        1.288915e+04	        1.724678e-04
        1.303352e+04	        1.671356e-04
        1.317950e+04	        1.616494e-04
        1.332712e+04	        1.562986e-04
        1.347639e+04	        1.510588e-04
        1.362733e+04	        1.456619e-04
        1.377996e+04	        1.399792e-04
        1.393431e+04	        1.339986e-04
        1.409038e+04	        1.273333e-04
        1.424820e+04	        1.212198e-04
        1.440778e+04	        1.183114e-04
        1.456916e+04	        1.153834e-04
        1.473234e+04	        1.124256e-04
        1.489735e+04	        1.094430e-04
        1.506421e+04	        1.064374e-04
        1.523293e+04	        1.035363e-04
        1.540355e+04	        1.007049e-04
        1.557608e+04	        9.785826e-05
        1.575054e+04	        9.497468e-05
        1.592695e+04	        9.204569e-05
        1.610534e+04	        8.911333e-05
        1.628573e+04	        8.649567e-05
        1.646814e+04	        8.386657e-05
        1.665259e+04	        8.096449e-05
        1.683910e+04	        7.866161e-05
        1.702771e+04	        7.633864e-05
        1.721843e+04	        7.402958e-05
        1.741128e+04	        7.203283e-05
        1.760630e+04	        7.002011e-05
        1.780350e+04	        6.798271e-05
        1.800291e+04	        6.592315e-05
        1.820455e+04	        6.384760e-05
        1.840845e+04	        6.185544e-05
        1.861463e+04	        5.990455e-05
        1.882312e+04	        5.791055e-05
        1.903395e+04	        5.579729e-05
        1.924714e+04	        5.377912e-05
        1.946272e+04	        5.205449e-05
        1.968071e+04	        5.042645e-05
        1.990114e+04	        4.877769e-05
        2.012405e+04	        4.711022e-05
        2.034945e+04	        4.541493e-05
        2.057737e+04	        4.387702e-05
        2.080785e+04	        4.235037e-05
        2.104091e+04	        4.079747e-05
        2.127657e+04	        3.919795e-05
        2.151488e+04	        3.758183e-05
        2.175586e+04	        3.609256e-05
        2.199954e+04	        3.473974e-05
        2.224594e+04	        3.337274e-05
        2.249511e+04	        3.202288e-05
        2.274706e+04	        3.073287e-05
        2.300184e+04	        2.942813e-05
        2.325947e+04	        2.811109e-05
        2.351999e+04	        2.684498e-05
        2.378343e+04	        2.562316e-05
        2.404981e+04	        2.439209e-05
        2.431918e+04	        2.315453e-05
        2.459157e+04	        2.192829e-05
        2.486701e+04	        2.068825e-05
        2.514553e+04	        1.944538e-05
        2.542717e+04	        1.826094e-05
        2.571197e+04	        1.705493e-05
        2.599996e+04	        1.579353e-05
        2.629117e+04	        1.459217e-05
        2.658564e+04	        1.334676e-05
        2.688341e+04	        1.204698e-05
        2.718452e+04	        1.064474e-05
        2.748900e+04	        9.155233e-06
        2.779689e+04	        7.571546e-06
        2.810823e+04	        5.592021e-06
        2.842306e+04	        2.057942e-06
        2.874141e+04	        7.154217e-07
        2.906333e+04	        6.508137e-07
        2.938885e+04	        5.801629e-07
        2.971802e+04	        5.012314e-07
        3.005088e+04	        4.268840e-07
        3.038746e+04	        3.431227e-07
        3.072782e+04	        2.294990e-07
        3.107198e+04	        4.015663e-08
        3.142000e+04	        3.708385e-08
        3.177192e+04	        3.377159e-08
        3.212779e+04	        2.988133e-08
        3.248763e+04	        2.610943e-08
        3.285151e+04	        2.309101e-08
        3.321946e+04	        1.943209e-08
        3.359154e+04	        1.319286e-08
        3.396778e+04	        1.235140e-08
        3.434823e+04	        1.170351e-08
        3.473295e+04	        1.100670e-08
        3.512198e+04	        9.907263e-09
        3.551536e+04	        9.507502e-09
        3.591315e+04	        9.093223e-09
        3.631540e+04	        8.660095e-09
        3.672215e+04	        8.234690e-09
        3.713345e+04	        7.787572e-09
        3.754937e+04	        7.210705e-09
        3.796994e+04	        6.766365e-09
        3.839522e+04	        6.480728e-09
        3.882526e+04	        6.168277e-09
        3.926013e+04	        5.874026e-09
        3.969986e+04	        5.570654e-09
        4.014452e+04	        5.136672e-09
        4.059416e+04	        4.928869e-09
        4.104883e+04	        4.731256e-09
        4.150860e+04	        4.514534e-09
        4.197351e+04	        4.333804e-09
        4.244364e+04	        4.120798e-09
        4.291903e+04	        3.900725e-09
        4.339974e+04	        3.765385e-09
        4.388584e+04	        3.620845e-09
        4.437738e+04	        3.488766e-09
        4.487443e+04	        3.354194e-09
        4.537705e+04	        3.204839e-09
        4.588529e+04	        3.103031e-09
        4.639923e+04	        2.999852e-09
        4.691893e+04	        2.899503e-09
        4.744444e+04	        2.797491e-09
        4.797584e+04	        2.692206e-09
        4.851319e+04	        2.603026e-09
        4.905657e+04	        2.513708e-09
        4.960602e+04	        2.422739e-09
        5.016164e+04	        2.326856e-09
        5.072347e+04	        2.238421e-09
        5.129160e+04	        2.149142e-09
        5.186609e+04	        2.069080e-09
        5.244702e+04	        1.987124e-09
        5.303445e+04	        1.905872e-09
        5.362846e+04	        1.821585e-09
        5.422913e+04	        1.740038e-09
        5.483652e+04	        1.660693e-09
        5.545071e+04	        1.579247e-09
        5.607179e+04	        1.487389e-09
        5.669982e+04	        1.404407e-09
        5.733489e+04	        1.331384e-09
        5.797707e+04	        1.254729e-09
        5.862644e+04	        1.159929e-09
        5.928308e+04	        1.090978e-09
        5.994708e+04	        1.027179e-09
        6.061852e+04	        9.683379e-10
        6.129748e+04	        8.905975e-10
        6.198404e+04	        8.504836e-10
        6.267829e+04	        8.070290e-10
        6.338032e+04	        7.576824e-10
        6.409021e+04	        7.122164e-10
        6.480805e+04	        6.828655e-10
        6.553393e+04	        6.549642e-10
        6.626795e+04	        6.245669e-10
        6.701018e+04	        6.008923e-10
        6.776073e+04	        5.764907e-10
        6.851968e+04	        5.500328e-10
        6.928713e+04	        5.282865e-10
        7.006318e+04	        5.071607e-10
        7.084793e+04	        4.855842e-10
        7.164146e+04	        4.640275e-10
        7.244388e+04	        4.430769e-10
        7.325529e+04	        4.220071e-10
        7.407578e+04	        4.009798e-10
        7.490547e+04	        3.810768e-10
        7.574444e+04	        3.607489e-10
        7.659282e+04	        3.404880e-10
        7.745070e+04	        3.212084e-10
        7.831818e+04	        3.020474e-10
        7.919539e+04	        2.832916e-10
        8.008241e+04	        2.645715e-10
        8.097938e+04	        2.446680e-10
        8.188638e+04	        2.251568e-10
        8.280355e+04	        2.047335e-10
        8.373099e+04	        1.835053e-10
        8.466882e+04	        1.627161e-10
        8.561715e+04	        1.374356e-10
        8.657611e+04	        1.163734e-10
        8.754580e+04	        9.366507e-11
        8.852636e+04	        7.369640e-11
        8.951790e+04	        6.084614e-11
        9.052054e+04	        4.765690e-11
        9.153442e+04	        3.302410e-11
        9.255965e+04	        1.495555e-11
        9.359636e+04	        3.455252e-12
        9.464469e+04	        2.420315e-12
        9.570475e+04	        2.222459e-12
        9.677669e+04	        2.020541e-12
        9.786064e+04	        1.805174e-12
        9.895673e+04	        1.580711e-12
        1.000651e+05	        1.323192e-12
        1.011859e+05	        1.002164e-12
        1.023192e+05	        5.101685e-13
        1.034652e+05	        2.879829e-13
        1.046241e+05	        8.580264e-14
        1.057959e+05	        0.000000e+00
        1.069809e+05	        0.000000e+00
        1.081791e+05	        0.000000e+00
        1.093908e+05	        0.000000e+00

