# -------------------------------------------------------------------------------
#		C:/Users/ASAT 02/Documents/OMERE 5.4/CDR CLOSE-OUT/SSO 600/1 year/Trapped Particles.txt
# -------------------------------------------------------------------------------
# ID: 1 2 1

# Graph: Trapped Particles 
# min: 0.04 0.01 max: 300 1.94706e+06
# X-axis L: Energy(MeV)
# Y-axis L: Flux (cm^{-2}.s^{-1}.MeV^{-1}) or (cm^{-2}.s^{-1})
# -------------------------------------------------------------------------------
# Curve 0: Diff flux - AP8 min
# Params: 2 5 #fe1448 1 1
#	Energy(MeV)		Flux (cm^{-2}.s^{-1}.MeV^{-1}) or (cm^{-2}.s^{-1})
# -------------------------------------------------------------------------------
        1.000000e-01	        1.413043e+04
        2.500000e-01	        4.435039e+03
        5.000000e-01	        1.187304e+03
        7.500000e-01	        4.811860e+02
        1.000000e+00	        2.267580e+02
        2.000000e+00	        5.466930e+01
        3.000000e+00	        2.635355e+01
        4.000000e+00	        1.423291e+01
        5.000000e+00	        9.024612e+00
        6.000000e+00	        5.988506e+00
        8.000000e+00	        3.273348e+00
        1.000000e+01	        1.954445e+00
        1.200000e+01	        1.386096e+00
        1.500000e+01	        1.008851e+00
        1.700000e+01	        8.457938e-01
        2.000000e+01	        6.480300e-01
        2.500000e+01	        4.815043e-01
        3.000000e+01	        4.262559e-01
        3.500000e+01	        3.922174e-01
        4.000000e+01	        3.661283e-01
        4.500000e+01	        3.427656e-01
        5.000000e+01	        3.312326e-01
        6.000000e+01	        3.086556e-01
        7.000000e+01	        2.786926e-01
        8.000000e+01	        2.543494e-01
        9.000000e+01	        2.311266e-01
        1.000000e+02	        2.094262e-01
        1.250000e+02	        1.580966e-01
        1.500000e+02	        1.178863e-01
        1.750000e+02	        8.861427e-02
        2.000000e+02	        6.704040e-02
        3.000000e+02	        2.311668e-02

# -------------------------------------------------------------------------------
# Curve 1: Integ flux - AP8 min
# Params: 2 5 #169ced 1 1
#	Energy(MeV)		Flux (cm^{-2}.s^{-1}.MeV^{-1}) or (cm^{-2}.s^{-1})
# -------------------------------------------------------------------------------
        1.000000e-01	        2.392931e+03
        2.500000e-01	        1.140335e+03
        5.000000e-01	        5.339599e+02
        7.500000e-01	        3.434055e+02
        1.000000e+00	        2.582204e+02
        2.000000e+00	        1.440239e+02
        3.000000e+00	        1.084162e+02
        4.000000e+00	        8.795764e+01
        5.000000e+00	        7.717568e+01
        6.000000e+00	        6.948862e+01
        8.000000e+00	        6.066876e+01
        1.000000e+01	        5.547628e+01
        1.200000e+01	        5.243224e+01
        1.500000e+01	        4.874801e+01
        1.700000e+01	        4.697664e+01
        2.000000e+01	        4.459080e+01
        2.500000e+01	        4.202307e+01
        3.000000e+01	        3.974602e+01
        3.500000e+01	        3.771112e+01
        4.000000e+01	        3.581530e+01
        4.500000e+01	        3.404300e+01
        5.000000e+01	        3.238243e+01
        6.000000e+01	        2.917430e+01
        7.000000e+01	        2.620331e+01
        8.000000e+01	        2.357849e+01
        9.000000e+01	        2.111574e+01
        1.000000e+02	        1.893938e+01
        1.250000e+02	        1.432098e+01
        1.500000e+02	        1.089458e+01
        1.750000e+02	        8.328367e+00
        2.000000e+02	        6.391942e+00
        3.000000e+02	        2.274280e+00

# -------------------------------------------------------------------------------
# Curve 2: Diff flux - AE8 max
# Params: 2 5 #c967d0 1 1
#	Energy(MeV)		Flux (cm^{-2}.s^{-1}.MeV^{-1}) or (cm^{-2}.s^{-1})
# -------------------------------------------------------------------------------
        4.000000e-02	        1.947059e+06
        1.000000e-01	        1.237342e+06
        2.500000e-01	        3.154551e+05
        5.000000e-01	        4.352444e+04
        7.500000e-01	        1.329218e+04
        1.000000e+00	        6.268357e+03
        1.500000e+00	        2.460667e+03
        2.000000e+00	        1.040153e+03
        2.500000e+00	        5.006727e+02
        3.000000e+00	        2.099221e+02
        3.500000e+00	        8.634639e+01
        4.000000e+00	        3.260129e+01
        4.500000e+00	        1.056993e+01
        5.000000e+00	        3.084693e+00
        5.500000e+00	        6.941951e-01
        6.000000e+00	        1.108888e-01
        6.500000e+00	        1.609899e-02
        7.000000e+00	        1.175091e-03

# -------------------------------------------------------------------------------
# Curve 3: Integ flux - AE8 max
# Params: 2 5 #7def21 1 1
#	Energy(MeV)		Flux (cm^{-2}.s^{-1}.MeV^{-1}) or (cm^{-2}.s^{-1})
# -------------------------------------------------------------------------------
        4.000000e-02	        2.415118e+05
        1.000000e-01	        1.499858e+05
        2.500000e-01	        4.455483e+04
        5.000000e-01	        1.152343e+04
        7.500000e-01	        5.605146e+03
        1.000000e+00	        3.410738e+03
        1.500000e+00	        1.468057e+03
        2.000000e+00	        6.325397e+02
        2.500000e+00	        2.839241e+02
        3.000000e+00	        1.100206e+02
        3.500000e+00	        4.222028e+01
        4.000000e+00	        1.420034e+01
        4.500000e+00	        4.210165e+00
        5.000000e+00	        1.152431e+00
        5.500000e+00	        2.437683e-01
        6.000000e+00	        3.231077e-02
        6.500000e+00	        0.000000e+00
        7.000000e+00	        0.000000e+00

