Program Time [s];data 1;data 3
1539,18;26,5;26,75
1539,28;26,5;26,75
1539,38;26,5;26,75
1539,48;26,5;26,75
1539,58;26,5;26,75
1539,68;26,5;26,75
1539,78;26,5;26,75
1539,88;26,5;26,75
1539,98;26,75;26,75
1540,08;26,5;26,75
1540,18;26,5;26,75
1540,28;26,5;26,75
1540,37;26,5;26,75
1540,47;26,5;26,75
1540,57;26,5;26,75
1540,67;26,5;26,75
1540,77;26,5;26,75
1540,87;26,5;26,75
1540,97;26,5;26,75
1541,07;26,5;26,75
1541,17;26,5;26,75
1541,27;26,5;26,75
1541,37;26,5;26,75
1541,47;26,5;26,75
1541,57;26,5;26,75
1541,67;26,5;26,75
1541,77;26,5;26,75
1541,87;26,75;26,75
1541,97;26,5;26,75
1542,07;26,5;26,75
1542,17;26,5;26,75
1542,27;26,5;26,75
1542,37;26,75;26,75
1542,47;26,5;26,75
1542,57;26,5;26,75
1542,67;26,5;26,75
1542,77;26,5;26,75
1542,87;26,5;26,75
1542,97;26,5;26,75
1543,07;26,5;26,75
1543,17;26,5;26,75
1543,27;26,5;26,75
1543,37;26,5;26,75
1543,47;26,5;26,75
1543,57;26,5;26,75
1543,67;26,5;26,75
1543,77;26,5;26,75
1543,87;26,5;26,75
1543,97;26,75;26,75
1544,07;26,75;26,75
1544,17;26,5;26,75
1544,27;26,5;26,75
1544,37;26,5;26,75
1544,47;26,5;26,75
1544,57;26,5;26,75
1544,67;26,5;26,75
1544,77;26,75;27
1544,87;26,75;26,75
1544,96;26,5;27
1545,06;26,5;27
1545,16;26,75;27
1545,26;26,75;27
1545,36;26,5;27
1545,46;26,5;27
1545,56;26,75;26,75
1545,66;26,5;26,75
1545,76;26,5;26,75
1545,86;26,5;26,75
1545,96;26,5;26,75
1546,06;26,5;26,75
1546,16;26,5;26,75
1546,26;26,5;26,75
1546,36;26,5;27
1546,46;26,75;27
1546,56;26,75;27
1546,66;26,5;27
1546,76;26,75;27,25
1546,86;26,75;27
1546,96;26,75;27
1547,06;26,75;27
1547,16;26,75;27
1547,26;26,5;27
1547,36;26,75;27
1547,46;26,75;27
1547,56;26,75;27,25
1547,66;26,75;27,25
1547,76;26,75;27,25
1547,86;26,75;27,25
1547,96;26,75;27,25
1548,06;26,75;27,25
1548,16;26,75;27,25
1548,26;26,75;27,25
1548,36;26,75;27,25
1548,46;26,75;27,25
1548,56;26,75;27,25
1548,66;26,75;27,25
1548,76;26,75;27,25
1548,86;26,75;27,25
1548,96;26,75;27,25
1549,06;26,75;27,25
1549,16;26,75;27,25
1549,26;26,75;27,25
1549,36;26,75;27,25
1549,46;26,75;27,25
1549,56;26,75;27,25
1549,66;26,75;27,25
1549,75;26,75;27,25
1549,85;26,75;27,25
1549,95;26,75;27,25
1550,05;26,75;27,5
1550,15;26,75;27,5
1550,25;26,75;27,5
1550,35;26,75;27,5
1550,45;26,75;27,5
1550,55;26,75;27,5
1550,65;26,75;27,5
1550,75;26,75;27,5
1550,85;27;27,5
1550,95;26,75;27,5
1551,05;26,75;27,5
1551,15;27;27,5
1551,25;26,75;27,5
1551,35;26,75;27,5
1551,45;26,75;27,5
1551,55;26,75;27,5
1551,65;26,75;27,5
1551,75;26,75;27,5
1551,85;26,75;27,5
1551,95;26,75;27,5
1552,05;27;27,75
1552,15;27;27,75
1552,25;27;27,75
1552,35;27;27,75
1552,45;27;27,5
1552,55;27;27,5
1552,65;26,75;27,75
1552,75;27;27,75
1552,85;26,75;27,5
1552,95;27;27,75
1553,05;27;27,75
1553,15;27;27,75
1553,25;27;28
1553,35;27;27,75
1553,45;27;28
1553,55;27;27,75
1553,65;27,25;28
1553,75;27,25;28
1553,85;27,25;28
1553,95;27;28
1554,05;27;27,75
1554,15;27;28
1554,25;27;27,75
1554,35;27;28
1554,45;27,25;28
1554,55;27;28
1554,64;27,25;28
1554,74;27,25;28
1554,84;27,25;28,25
1554,94;27,25;28,25
1555,04;27,25;28,25
1555,14;27,25;28,25
1555,24;27,25;28
1555,34;27,25;28,25
1555,44;27,25;28,25
1555,54;27,25;28,25
1555,64;27,25;28,25
1555,74;27,5;28,25
1555,84;27,25;28,25
1555,94;27,25;28,25
1556,04;27,25;28,25
1556,14;27,5;28,25
1556,24;27,25;28,25
1556,34;27,25;28,25
1556,44;27,5;28,5
1556,54;27,5;28,5
1556,64;27,25;28,5
1556,74;27,5;28,5
1556,84;27,5;28,5
1556,94;27,5;28,5
1557,04;27,5;28,5
1557,14;27,5;28,5
1557,24;27,5;28,5
1557,34;27,5;28,75
1557,44;27,5;28,5
1557,54;27,5;28,75
1557,64;27,5;28,75
1557,74;27,5;28,75
1557,84;27,5;28,75
1557,94;27,5;28,75
1558,04;27,5;28,75
1558,14;27,5;28,5
1558,24;27,25;28,75
1558,34;27,25;28,75
1558,44;27,5;28,75
1558,54;27,5;28,75
1558,64;27,5;28,75
1558,74;27,5;29
1558,84;27,5;29
1558,94;27,5;28,75
1559,04;27,75;29
1559,14;27,75;29
1559,23;27,5;28,75
1559,33;27,5;28,75
1559,43;27,5;28,75
1559,53;27,5;28,75
1559,63;27,5;28,75
1559,73;27,75;28,75
1559,83;27,75;29
1559,93;27,75;29
1560,03;27,75;29,25
1560,13;27,75;29,25
1560,23;27,75;29,25
1560,33;27,75;29,25
1560,43;27,75;29,25
1560,53;27,75;29,25
1560,63;28;29,25
1560,73;28;29,25
1560,83;28;29,25
1560,93;27,75;29,25
1561,03;28;29,5
1561,13;28;29,25
1561,23;28;29,5
1561,33;28;29,5
1561,43;28;29,5
1561,53;28;29,5
1561,63;28;29,5
1561,73;28;29,5
1561,83;28;29,5
1561,93;27,75;29,5
1562,03;28;29,5
1562,13;28;29,5
1562,23;28;29,5
1562,33;28;29,5
1562,43;27,75;29,5
1562,53;28;29,5
1562,63;28;29,5
1562,73;28;29,5
1562,83;28;29,5
1562,93;28;29,5
1563,03;28;29,5
1563,13;28;29,75
1563,23;28;29,75
1563,33;28;29,5
1563,43;27,75;29,5
1563,53;28;29,5
1563,63;27,75;29,5
1563,73;28;29,5
1563,82;28;29,5
1563,92;28;29,75
1564,02;28;29,75
1564,12;28;29,75
1564,22;28;29,75
1564,32;28;29,75
1564,42;28;29,75
1564,52;28;29,75
1564,62;28;29,75
1564,72;28;29,75
1564,82;28,25;30
1564,92;28;30
1565,02;28,25;30
1565,12;28,25;30
1565,22;28,25;30
1565,32;28,25;30
1565,42;28,25;30
1565,52;28,25;30
1565,62;28;29,75
1565,72;28;30
1565,82;28;29,75
1565,92;28;30
1566,02;28,25;30
1566,12;28,25;30
1566,22;28;30
1566,32;28,25;30
1566,42;28,5;30
1566,52;28,25;30,25
1566,62;28,25;30
1566,72;28,25;30,25
1566,82;28,25;30,25
1566,92;28,5;30,25
1567,02;28,25;30,25
1567,12;28,5;30,25
1567,22;28,5;30,25
1567,32;28,5;30,5
1567,42;28,25;30,25
1567,52;28,25;30,25
1567,62;28,25;30,25
1567,72;28,5;30,5
1567,82;28,25;30,25
1567,92;28,25;30,5
1568,02;28,5;30,5
1568,12;28,5;30,5
1568,22;28,5;30,5
1568,32;28,5;30,25
1568,42;28,5;30,5
1568,52;28,5;30,5
1568,62;28,5;30,5
1568,71;28,5;30,5
1568,82;28,5;30,5
1568,91;28,5;30,5
1569,01;28,5;30,75
1569,11;28,5;30,75
1569,21;28,5;30,75
1569,31;28,5;30,75
1569,41;28,5;30,75
1569,51;28,5;30,75
1569,61;28,75;30,75
1569,71;28,5;30,5
1569,81;28,5;30,5
1569,91;28,5;30,75
1570,01;28,5;30,5
1570,11;28,5;30,5
1570,21;28,5;30,75
1570,31;28,5;30,75
1570,41;28,75;30,75
1570,51;28,75;31
1570,61;28,75;31
1570,71;28,75;31
1570,81;28,75;31
1570,91;28,75;31
1571,01;28,75;31
1571,11;28,75;31
1571,21;28,75;31
1571,31;28,75;31
1571,41;28,75;31
1571,51;28,75;31
1571,61;28,75;31
1571,71;29;31
1571,81;28,75;31
1571,91;28,75;31,25
1572,01;29;31,25
1572,11;28,75;31,25
1572,21;28,75;31,25
1572,31;29;31,25
1572,41;29;31,25
1572,51;29;31,25
1572,61;28,75;31,25
1572,71;28,75;31,25
1572,81;29;31,25
1572,91;28,75;31,25
1573,01;28,75;31,25
1573,11;29;31,25
1573,21;29;31,5
1573,31;29;31,5
1573,41;29;31,25
1573,5;28,75;31,25
1573,6;28,75;31,25
1573,7;28,75;31,25
1573,8;28,75;31,25
1573,9;28,75;31,25
1574,01;28,75;31,25
1574,1;28,75;31,5
1574,2;29;31,5
1574,3;29;31,5
1574,4;29;31,5
1574,5;29;31,75
1574,6;29;31,75
1574,7;28,75;31,75
1574,8;28,75;31,5
1574,9;28,75;31,75
1575;29;31,75
1575,1;28,75;31,75
1575,2;29;31,75
1575,3;29;31,75
1575,4;28,75;31,5
1575,5;28,75;31,75
1575,6;28,75;31,5
1575,7;29;31,75
1575,8;28,75;31,75
1575,9;28,75;31,75
1576;28,75;32
1576,1;29;32
1576,2;29;32
1576,3;29;32
1576,4;29;32
1576,5;29;32
1576,6;29;32
1576,7;29;32
1576,8;29;32
1576,9;29;32
1577;29;32
1577,1;29;32
1577,2;29;32
1577,3;29;32
1577,4;29;32
1577,5;29;32,25
1577,6;29;32
1577,7;29;32,25
1577,8;29;32,25
1577,9;29;32,25
1578;29;32,25
1578,1;29;32,25
1578,2;29;32,25
1578,3;29;32,25
1578,4;29,25;32,25
1578,49;29,25;32,25
1578,6;29;32
1578,69;29;32
1578,79;29;32
1578,89;29;32,25
1578,99;29;32,25
1579,09;29;32,25
1579,19;29;32,25
1579,29;29,25;32
1579,39;29,25;32
1579,49;29,25;32,25
1579,59;29,25;32
1579,69;29,25;32,25
1579,79;29,25;32,25
1579,89;29,5;32,25
1579,99;29,5;32,5
1580,09;29,5;32,5
1580,19;29,5;32,5
1580,29;29,5;32,5
1580,39;29,5;32,5
1580,49;29,5;32,5
1580,59;29,5;32,5
1580,69;29,25;32,5
1580,79;29,5;32,5
1580,89;29,5;32,5
1580,99;29,5;32,5
1581,09;29,5;32,5
1581,19;29,25;32,5
1581,29;29,5;32,5
1581,39;29,5;32,5
1581,49;29,5;32,5
1581,59;29,25;32,75
1581,69;29,5;32,5
1581,79;29,5;32,75
1581,89;29,5;32,75
1581,99;29,5;32,75
1582,09;29,75;32,75
1582,19;29,75;32,75
1582,29;29,75;32,75
1582,39;29,75;32,75
1582,49;29,5;32,75
1582,59;29,75;32,75
1582,69;29,75;32,75
1582,79;29,75;32,75
1582,89;29,75;33
1582,99;29,75;33
1583,09;29,75;33
1583,19;29,75;33
1583,29;30;33
1583,39;30;33
1583,49;30;33
1583,58;30;33
1583,68;30;33
1583,78;29,75;33
1583,88;30;33,25
1583,98;30;33
1584,08;30;33,25
1584,18;30;33,25
1584,28;30;33,25
1584,38;30;33,25
1584,48;30;33,25
1584,58;30;33,25
1584,68;30;33,25
1584,78;30;33,25
1584,88;30;33,25
1584,98;30;33,25
1585,08;30;33,25
1585,18;30;33,25
1585,28;30;33,25
1585,38;30;33,25
1585,48;30;33,25
1585,58;30;33,25
1585,68;30;33,25
1585,78;30;33,25
1585,88;30;33,25
1585,98;30;33,25
1586,08;30;33,25
1586,18;30;33,25
1586,28;30;33,5
1586,38;30;33,5
1586,48;30;33,5
1586,58;30;33,5
1586,68;30;33,25
1586,78;30;33,5
1586,88;30;33,5
1586,98;30;33,5
1587,08;30;33,5
1587,18;30;33,5
1587,28;30;33,5
1587,38;30;33,5
1587,48;30;33,5
1587,58;30,25;33,5
1587,68;30;33,5
1587,78;30,25;33,5
1587,88;30;33,5
1587,98;30;33,25
1588,08;30;33,5
1588,18;30;33,5
1588,28;30;33,5
1588,38;30,25;33,5
1588,48;30;33,5
1588,58;30,25;33,75
1588,68;30,25;33,75
1588,78;30,25;33,75
1588,87;30,25;33,75
1588,97;30,25;33,75
1589,07;30,25;33,75
1589,17;30,25;33,75
1589,27;30,25;33,75
1589,37;30;33,75
1589,47;30;33,75
1589,57;30;33,75
1589,67;30;33,75
1589,77;30,25;33,75
1589,87;30;33,75
1589,97;30,25;33,75
1590,07;30,5;34
1590,17;30,25;34
1590,27;30,5;34
1590,37;30,5;34
1590,47;30,5;34
1590,57;30,25;34
1590,67;30,25;33,75
1590,77;30,25;34
1590,87;30,25;34
1590,97;30,25;34
1591,07;30,25;34
1591,17;30,25;34
1591,27;30,5;34
1591,37;30,25;34,25
1591,47;30,25;34,25
1591,57;30,25;34,25
1591,67;30,25;34,25
1591,77;30,25;34,25
1591,87;30,25;34,25
1591,97;30,25;34,25
1592,07;30,25;34
1592,17;30;34,25
1592,27;30,25;34,25
1592,37;30,25;34
1592,47;30;34,25
1592,57;30,25;34,25
1592,67;30,25;34,25
1592,77;30,25;34,25
1592,87;30,25;34,5
1592,97;30,25;34,25
1593,07;30,25;34,5
1593,17;30,25;34,5
1593,27;30,25;34,5
1593,37;30,25;34,5
1593,47;30,25;34,5
1593,57;30,25;34,5
1593,67;30,25;34,5
1593,76;30,25;34,5
1593,86;30,25;34,5
1593,96;30,25;34,5
1594,06;30,5;34,5
1594,16;30,5;34,5
1594,26;30,25;34,5
1594,36;30,5;34,75
1594,46;30,5;34,75
1594,56;30,5;34,75
1594,66;30,5;34,75
1594,76;30,5;34,75
1594,86;30,5;34,75
1594,96;30,5;34,75
1595,06;30,5;34,75
1595,16;30,5;34,75
1595,26;30,75;34,75
1595,36;30,75;34,75
1595,46;30,5;34,75
1595,56;30,5;34,75
1595,66;30,5;34,75
1595,76;30,5;34,75
1595,86;30,5;34,75
1595,96;30,75;34,75
1596,06;30,75;34,75
1596,16;30,75;34,75
1596,26;30,75;34,75
1596,36;30,5;34,75
1596,46;30,75;34,75
1596,56;30,75;34,75
1596,66;30,75;34,75
1596,76;30,75;34,75
1596,86;30,75;34,75
1596,96;31;34,75
1597,06;30,75;34,75
1597,16;30,75;34,75
1597,26;30,75;35
1597,36;31;34,75
1597,46;31;35
1597,56;31;35
1597,66;31;35
1597,76;31;35
1597,86;31,25;35
1597,96;31;35
1598,06;31,25;35
1598,16;31,25;35
1598,26;31;35
1598,36;31;35
1598,46;31;35
1598,55;31;35
1598,65;31;35
1598,75;31;35
1598,85;31;35,25
1598,95;31,25;35,25
1599,05;31,25;35,25
1599,15;31,25;35,25
1599,25;31,25;35,25
1599,35;31,25;35,25
1599,45;31,25;35,25
1599,55;31,25;35,5
1599,65;31,25;35,25
1599,75;31,25;35,5
1599,85;31,25;35,5
1599,95;31,25;35,5
1600,05;31,25;35,5
1600,15;31,25;35,5
1600,25;31,25;35,5
1600,35;31,25;35,5
1600,45;31,25;35,25
1600,55;31,25;35,5
1600,65;31,25;35,5
1600,75;31,25;35,5
1600,85;31,25;35,5
1600,95;31,25;35,5
1601,05;31,25;35,75
1601,15;31,25;35,75
1601,25;31,25;35,5
1601,35;31;35,75
1601,45;31;35,5
1601,55;31,25;35,5
1601,65;31,25;35,5
1601,75;31,25;35,75
1601,85;31,25;35,5
1601,95;31,5;35,75
1602,05;31,25;36
1602,15;31,5;36
1602,25;31,5;36
1602,35;31,5;36
1602,45;31,5;36
1602,55;31,5;36
1602,65;31,5;36
1602,75;31,5;36
1602,85;31,5;36
1602,95;31,5;36
1603,05;31,75;36,25
1603,15;31,75;36,25
1603,25;31,5;36
1603,35;31,75;36
1603,45;31,75;36
1603,54;31,75;36
1603,64;31,75;36
1603,74;31,75;36
1603,84;31,75;36
1603,94;31,75;36,25
1604,04;31,75;36,25
1604,14;32;36,25
1604,24;31,75;36,25
1604,34;31,75;36,5
1604,44;31,75;36,5
1604,54;32;36,5
1604,64;31,75;36,5
1604,74;31,75;36,5
1604,84;32;36,5
1604,94;32;36,5
1605,04;32;36,5
1605,14;32;36,5
1605,24;32;36,5
1605,34;32;36,5
1605,44;32;36,5
1605,54;32;36,5
1605,64;32;36,25
1605,74;32;36,5
1605,84;31,75;36,5
1605,94;32;36,5
1606,04;32;36,5
1606,14;32;36,5
1606,24;32;36,75
1606,34;32;36,75
1606,44;31,75;36,5
1606,54;32;36,75
1606,64;32;36,75
1606,74;32;36,75
1606,84;32;36,75
1606,94;32;36,75
1607,04;32;36,75
1607,14;32;36,75
1607,24;32;36,75
1607,34;32;36,75
1607,44;32;36,75
1607,54;32;36,75
1607,64;32;36,75
1607,74;32;36,75
1607,84;32;36,75
1607,94;32;36,75
1608,03;32;36,75
1608,13;32;36,75
1608,23;32;36,75
1608,33;31,75;36,75
1608,43;32;36,75
1608,53;31,75;37
1608,63;31,75;37
1608,73;31,75;36,75
1608,83;32;36,75
1608,93;32;36,75
1609,03;32;36,75
1609,13;32;36,75
1609,23;32;37
1609,33;32;37
1609,43;32;37
1609,53;32;36,75
1609,63;32;37
1609,73;32,25;37
1609,83;32,25;37,25
1609,93;32,25;37
1610,03;32,25;37,25
1610,13;32,25;37,25
1610,23;32,25;37
1610,33;32,25;37,25
1610,43;32,25;37
1610,53;32,25;37
1610,63;32;37
1610,73;32,25;37
1610,83;32,25;37,25
1610,93;32,25;37,25
1611,03;32,25;37,25
1611,13;32,25;37,25
1611,23;32,25;37,25
1611,33;32,25;37,25
1611,43;32,25;37,25
1611,53;32,25;37,25
1611,63;32,25;37,5
1611,73;32,25;37,5
1611,83;32,25;37,75
1611,93;32,25;37,75
1612,03;32,25;37,75
1612,13;32,5;37,75
1612,23;32,5;37,75
1612,33;32,5;37,75
1612,43;32,5;37,75
1612,53;32,5;37,75
1612,63;32,5;37,75
1612,73;32,5;38
1612,82;32,5;38
1612,92;32,5;38
1613,02;32,5;38
1613,12;32,5;38
1613,22;32,5;38
1613,32;32,5;38
1613,42;32,5;37,75
1613,52;32,25;37,75
1613,62;32,5;37,75
1613,72;32,5;38
1613,82;32,5;37,75
1613,92;32,5;38
1614,02;32,5;38
1614,12;32,5;38
1614,22;32,5;38
1614,32;32,5;38
1614,42;32,75;38
1614,52;32,5;38
1614,62;32,5;38
1614,72;32,5;38
1614,82;32,5;38
1614,92;32,75;38
1615,02;32,5;38,25
1615,12;32,5;38
1615,22;32,5;38,25
1615,32;32,5;38
1615,42;32,5;38,25
1615,52;32,5;38,25
1615,62;32,5;38,25
1615,72;32,5;38,25
1615,82;32,5;38,25
1615,92;32,75;38,25
1616,02;32,5;38,25
1616,12;32,75;38,5
1616,22;32,75;38,25
1616,32;32,75;38,25
1616,42;32,75;38,25
1616,52;32,75;38,25
1616,62;32,75;38,25
1616,72;32,5;38
1616,82;32,5;38
1616,92;32,5;38,25
1617,02;32,75;38,25
1617,11;32,75;38,25
1617,21;32,75;38,25
1617,31;32,75;38,25
1617,41;32,75;38,25
1617,51;33;38,25
1617,61;33;38,25
1617,71;33;38,25
1617,81;33;38,25
1617,91;33;38,25
1618,01;33;38,5
1618,11;33;38,25
1618,21;33;38,5
1618,31;33;38,5
1618,41;33;38,5
1618,51;33;38,5
1618,61;33;38,5
1618,71;33;38,5
1618,81;32,75;38,5
1618,91;33;38,75
1619,01;32,75;38,5
1619,11;32,75;38,75
1619,21;32,75;38,75
1619,31;33;38,75
1619,41;33;38,75
1619,51;33;38,75
1619,61;33;38,75
1619,71;33;38,5
1619,81;33;38,5
1619,91;33;38,5
1620,01;33;38,75
1620,11;33;38,5
1620,21;33;38,5
1620,31;33;38,5
1620,41;33,25;38,75
1620,51;33,25;38,75
1620,61;33;38,75
1620,71;33;38,75
1620,81;33,25;38,75
1620,91;33,25;38,75
1621,01;33,25;38,75
1621,11;33,25;38,75
1621,21;33,25;38,75
1621,31;33,25;38,5
1621,41;33,25;38,75
1621,51;33,25;38,5
1621,61;33;38,5
1621,71;33;38,5
1621,8;33;38,5
1621,9;33,25;38,5
1622;33,25;38,75
1622,1;33,25;38,75
1622,2;33,25;38,75
1622,3;33;38,75
1622,4;33,25;38,75
1622,5;33;38,75
1622,6;33,25;38,75
1622,7;33,25;39
1622,8;33;38,75
1622,9;33;38,75
1623;33;38,75
1623,1;33;38,75
1623,2;33;39
1623,3;33;38,75
1623,4;33;38,75
1623,5;33,25;39
1623,6;33;39
1623,7;33,25;39
1623,8;33;39
1623,9;33,25;39,25
1624;33,25;39,25
1624,1;33;39,25
1624,2;33,25;39,25
1624,3;33,25;39
1624,4;33;39
1624,5;33,25;39
1624,6;33;39
1624,7;33,25;39
1624,8;33;39
1624,9;33;39,25
1625;33,25;39,25
1625,1;33,25;39,25
1625,2;33,25;39,25
1625,3;33,25;39,25
1625,4;33,25;39,25
1625,5;33,25;39,5
1625,6;33,25;39,25
1625,7;33,25;39,25
1625,8;33,25;39,25
1625,9;33,25;39,5
1626;33,25;39,5
1626,1;33,25;39,5
1626,2;33,25;39,5
1626,3;33,25;39,5
1626,4;33,25;39,5
1626,49;33;39,5
1626,59;33,25;39,5
1626,69;33,25;39,5
1626,79;33,25;39,5
1626,89;33,25;39,5
1626,99;33,25;39,5
1627,09;33,5;39,5
1627,19;33,25;39,5
1627,29;33,25;39,5
1627,39;33,25;39,5
1627,49;33,5;39,5
1627,59;33,25;39,25
1627,69;33,25;39,25
1627,79;33,25;39,25
1627,89;33,5;39,5
1627,99;33,5;39,5
1628,09;33,5;39,5
1628,19;33,25;39,25
1628,29;33,5;39,25
1628,39;33,5;39,5
1628,49;33,5;39,25
1628,59;33,5;39,5
1628,69;33,5;39,5
1628,79;33,5;39,5
1628,89;33,5;39,5
1628,99;33,5;39,5
1629,09;33,5;39,5
1629,19;33,75;39,5
1629,29;33,75;39,5
1629,39;33,75;39,75
1629,49;33,75;39,5
1629,59;33,75;39,5
1629,69;33,75;39,5
1629,79;33,75;39,5
1629,89;33,75;39,5
1629,99;33,75;39,5
1630,09;33,5;39,5
1630,19;33,75;39,5
1630,29;33,5;39,5
1630,39;33,75;39,5
1630,49;33,75;39,25
1630,59;33,75;39,5
1630,69;34;39,5
1630,79;33,75;39,5
1630,89;33,75;39,5
1630,99;33,75;39,75
1631,09;34;39,75
1631,18;33,75;39,75
1631,28;33,75;39,5
1631,38;34;39,75
1631,48;33,75;39,75
1631,58;33,75;39,5
1631,68;33,75;39,5
1631,78;33,75;39,5
1631,88;34;39,5
1631,98;33,75;39,75
1632,08;34;39,5
1632,18;34;39,75
1632,28;34;39,75
1632,38;34;39,75
1632,48;34;39,5
1632,58;34;39,75
1632,68;34;39,75
1632,78;34;39,75
1632,88;34;39,75
1632,98;34;39,75
1633,08;34,25;39,75
1633,18;34,25;40
1633,28;34,25;40
1633,38;34,5;40
1633,48;34,5;40
1633,58;34,5;40
1633,68;34,5;40
1633,78;34,5;40
1633,88;34,5;40
1633,98;34,5;40,25
1634,08;34,5;40
1634,18;34,75;40
1634,28;34,75;40,25
1634,38;34,75;40,25
1634,48;34,75;40,25
1634,58;34,75;40,25
1634,68;34,75;40,25
1634,78;34,75;40,25
1634,88;34,75;40,25
1634,98;34,75;40,25
1635,08;34,75;40,25
1635,18;34,75;40,25
1635,28;34,75;40,25
1635,38;34,75;40,25
1635,48;34,75;40,25
1635,58;34,75;40,25
1635,68;35;40,5
1635,78;35;40,5
1635,87;35;40,5
1635,97;34,75;40,5
1636,07;35;40,5
1636,17;34,75;40,25
1636,27;34,75;40,25
1636,37;34,75;40,25
1636,47;34,75;40,5
1636,57;34,75;40,25
1636,67;34,75;40,25
1636,77;34,75;40,25
1636,87;34,75;40,5
1636,97;34,75;40,5
1637,07;34,75;40,5
1637,17;35;40,5
1637,27;34,75;40,5
1637,37;34,75;40,75
1637,47;34,75;40,5
1637,57;34,75;40,5
1637,67;35;40,5
1637,77;34,75;40,5
1637,87;34,75;40,5
1637,97;34,75;40,5
1638,07;34,75;40,25
1638,17;34,75;40,5
1638,27;34,75;40,5
1638,37;34,75;40,5
1638,47;34,75;40,5
1638,57;34,75;40,5
1638,67;34,75;40,5
1638,77;34,75;40,5
1638,87;34,75;40,5
1638,97;34,75;40,5
1639,07;34,75;40,5
1639,17;34,75;40,5
1639,27;34,75;40,5
1639,37;34,75;40,5
1639,47;34,75;40,5
1639,57;34,75;40,75
1639,67;34,75;40,75
1639,77;34,75;40,75
1639,87;34,75;40,75
1639,97;34,75;40,75
1640,07;34,75;40,75
1640,17;34,75;40,75
1640,27;34,75;40,75
1640,37;34,75;40,75
1640,47;34,75;40,75
1640,56;34,75;40,75
1640,66;34,75;40,75
1640,76;34,75;40,75
1640,86;34,75;40,75
1640,96;34,75;41
1641,06;34,75;41
1641,16;34,75;41
1641,26;34,75;40,75
1641,36;34,75;41
1641,46;34,75;41
1641,56;34,75;41
1641,66;35;41
1641,76;34,75;41
1641,86;35;41
1641,96;35;41,25
1642,06;35;41,25
1642,16;35;41,25
1642,26;35;41,25
1642,36;35;41,25
1642,46;35;41,25
1642,56;35;41,25
1642,66;34,75;41,25
1642,76;35;41,25
1642,86;35;41,25
1642,96;35;41,5
1643,06;35;41,25
1643,16;35;41,5
1643,26;35;41,25
1643,36;35;41,5
1643,46;35;41,5
1643,56;35;41,5
1643,66;35;41,75
1643,76;35,25;41,5
1643,86;35;41,5
1643,96;35;41,75
1644,06;35,25;41,75
1644,16;35,25;41,75
1644,26;35,25;41,75
1644,36;35,25;41,75
1644,46;35,25;41,75
1644,56;35,25;41,75
1644,66;35,25;42
1644,76;35,25;41,75
1644,86;35,25;41,75
1644,96;35,25;41,75
1645,06;35,25;41,75
1645,15;35,25;42
1645,25;35,25;42
1645,35;35,25;41,75
1645,45;35,25;41,75
1645,55;35,25;41,75
1645,65;35;41,75
1645,75;35,25;41,75
1645,85;35;41,75
1645,95;35,25;42
1646,05;35,25;42
1646,15;35,25;42
1646,25;35,25;42
1646,35;35,25;42
1646,45;35,25;42
1646,55;35;42
1646,65;35,25;42
1646,75;35,25;42
1646,85;35;42
1646,95;35,25;42
1647,05;35;42
1647,15;35,25;42
1647,25;35;42
1647,35;35,25;42
1647,45;35,25;42,25
1647,55;35,25;42,25
1647,65;35,25;42,25
1647,75;35,5;42,25
1647,85;35,5;42,25
1647,95;35,5;42,25
1648,05;35,5;42,25
1648,15;35,75;42,25
1648,25;35,75;42,25
1648,35;35,75;42,25
1648,45;35,75;42,25
1648,55;35,75;42,25
1648,65;35,5;42,25
1648,75;35,75;42,25
1648,85;35,5;42,25
1648,95;35,75;42,25
1649,05;35,75;42,25
1649,15;35,75;42,25
1649,25;35,5;42,25
1649,35;35,5;42,25
1649,45;35,5;42,25
1649,55;35,5;42,25
1649,65;35,5;42,25
1649,74;35,5;42,25
1649,84;35,5;42,25
1649,94;35,5;42,25
1650,04;35,5;42,25
1650,14;35,5;42,25
1650,24;35,5;42,25
1650,34;35,5;42,25
1650,44;35,5;42,25
1650,54;35,5;42,25
1650,64;35,5;42
1650,74;35,25;42
1650,84;35,25;42,25
1650,94;35,5;42
1651,04;35,5;42
1651,14;35,5;42
1651,24;35,75;42,25
1651,34;35,75;42,25
1651,44;35,75;42
1651,54;35,75;42,25
1651,64;35,75;42,25
1651,74;35,75;42,25
1651,84;35,75;42,25
1651,94;35,75;42,25
1652,04;35,5;42,25
1652,14;35,75;42,25
1652,24;35,5;42,5
1652,34;35,75;42,5
1652,44;35,75;42,5
1652,54;35,5;42,5
1652,64;35,5;42,5
1652,74;35,5;42,5
1652,84;35,75;42,5
1652,94;35,5;42,5
1653,04;35,75;42,5
1653,14;35,5;42,5
1653,24;35,5;42,5
1653,34;35,75;42,75
1653,44;35,5;42,5
1653,54;35,75;42,5
1653,64;35,5;42,5
1653,74;35,5;42,5
1653,84;35,75;42,5
1653,94;35,5;42,5
1654,04;35,75;42,75
1654,14;35,75;42,5
1654,24;35,75;42,5
1654,34;35,75;42,5
1654,44;35,75;42,5
1654,54;35,75;42,5
1654,63;35,75;42,5
1654,73;35,75;42,5
1654,83;35,75;42,5
1654,93;35,75;42,5
1655,03;35,75;42,5
1655,13;35,75;42,25
1655,23;35,75;42,5
1655,33;35,75;42,5
1655,43;35,75;42,5
1655,53;36;42,5
1655,63;36;42,75
1655,73;36;42,5
1655,83;36;42,5
1655,93;36;42,5
1656,03;36;42,5
1656,13;36;42,5
1656,23;36;42,5
1656,33;36;42,5
1656,43;36;42,75
1656,53;36,25;42,75
1656,63;36,25;42,75
1656,73;36,25;42,75
1656,83;36,25;42,5
1656,93;36,25;42,75
1657,03;36,5;42,75
1657,13;36,25;42,75
1657,23;36,25;42,75
1657,33;36,25;42,5
1657,43;36,5;42,75
1657,53;36,25;42,75
1657,63;36,5;42,75
1657,73;36,5;42,75
1657,83;36,5;42,75
1657,93;36,5;42,75
1658,03;36,5;42,75
1658,13;36,5;42,75
1658,23;36,5;42,75
1658,33;36,5;42,75
1658,43;36,5;42,75
1658,53;36,5;42,75
1658,63;36,5;42,75
1658,73;36,5;42,75
1658,83;36,5;42,75
1658,93;36,5;42,75
1659,03;36,5;42,75
1659,13;36,5;42,75
1659,23;36,5;42,75
1659,32;36,5;42,75
1659,42;36,5;42,75
1659,52;36,5;42,75
1659,62;36,5;42,75
1659,72;36,5;42,75
1659,82;36,5;42,5
1659,92;36,5;42,5
1660,02;36,5;42,75
1660,12;36,5;42,75
1660,22;36,5;42,75
1660,32;36,5;42,5
1660,42;36,5;42,75
1660,52;36,5;42,75
1660,62;36,5;42,5
1660,72;36,5;42,75
1660,82;36,5;42,75
1660,92;36,5;42,75
1661,02;36,5;42,5
1661,12;36,5;42,5
1661,22;36,5;42,75
1661,32;36,5;42,75
1661,42;36,5;42,75
1661,52;36,5;42,75
1661,62;36,5;42,5
1661,72;36,5;42,75
1661,82;36,5;42,75
1661,92;36,75;42,75
1662,02;36,5;42,75
1662,12;36,75;43
1662,22;36,75;43
1662,32;36,75;43
1662,42;37;43
1662,52;36,75;43
1662,62;36,75;43
1662,72;36,75;43
1662,82;36,5;42,75
1662,92;36,75;42,75
1663,02;36,5;42,75
1663,12;36,75;42,75
1663,22;36,75;43
1663,32;36,75;43
1663,42;36,75;43
1663,52;36,75;43
1663,62;36,75;43
1663,72;36,75;43
1663,82;36,75;43
1663,91;36,75;43
1664,01;37;43
1664,11;36,75;43
1664,21;37;43
1664,31;37;43
1664,41;37;43
1664,51;37;43
1664,61;37;43
1664,71;37;43
1664,81;37;43
1664,91;37;43,25
1665,01;37;43
1665,11;37;43,25
1665,21;37;43,25
1665,31;37;43,25
1665,41;37;43,25
1665,51;37;43,25
1665,61;37;43,5
1665,71;37;43,5
1665,81;37;43,5
1665,91;37;43,5
1666,01;37;43,5
1666,11;37;43,5
1666,21;37;43,75
1666,31;37;43,75
1666,41;37;43,75
1666,51;37;43,75
1666,61;37;43,75
1666,71;37;43,75
1666,81;37;43,75
1666,91;37;44
1667,01;37;44
1667,11;37;44
1667,21;37,25;44
1667,31;37;44
1667,41;37;44,25
1667,51;37;44
1667,61;37;44,25
1667,71;37;44
1667,81;37,25;44
1667,91;37,25;44,25
1668,01;37,25;44,25
1668,11;37,25;44,25
1668,21;37,25;44,25
1668,31;37,25;44,25
1668,41;37,25;44,25
1668,51;37,25;44,25
1668,61;37,25;44
1668,7;37,25;44,25
1668,8;37,25;44
1668,9;37,25;44,25
1669;37,25;44
1669,1;37,25;44
1669,2;37,5;44
1669,3;37,5;44
1669,4;37,5;44
1669,5;37,5;44,25
1669,6;37,5;44,25
1669,7;37,5;44
1669,8;37,5;44
1669,9;37,5;44
1670;37,5;44
1670,1;37,5;44,25
1670,2;37,5;44,25
1670,3;37,5;44,25
1670,4;37,5;44,25
1670,5;37,75;44,25
1670,6;37,75;44,25
1670,7;37,75;44,25
1670,8;37,75;44,25
1670,9;37,75;44,25
1671;37,75;44,25
1671,1;37,75;44,25
1671,2;37,75;44,5
1671,3;37,75;44,25
1671,4;37,75;44,5
1671,5;37,75;44,25
1671,6;37,75;44,25
1671,7;37,75;44,25
1671,8;37,75;44,25
1671,9;37,75;44,25
1672;37,75;44,25
1672,1;37,75;44,5
1672,2;37,75;44,5
1672,3;37,75;44,25
1672,4;37,75;44,25
1672,5;37,75;44,25
1672,6;37,75;44,25
1672,7;37,75;44,25
1672,8;37,75;44,25
1672,9;37,5;44,25
1673;37,5;44,25
1673,1;37,5;44,25
1673,2;37,5;44,25
1673,3;37,5;44,25
1673,4;37,5;44,25
1673,49;37,5;44,25
1673,59;37,5;44,25
1673,69;37,5;44
1673,79;37,5;44
1673,89;37,5;44
1673,99;37,5;44
1674,09;37,5;44
1674,19;37,5;44
1674,29;37,5;44
1674,39;37,75;44
1674,49;37,75;44
1674,59;37,5;44
1674,69;37,5;44
1674,79;37,5;44
1674,89;37,5;44
1674,99;37,5;44
1675,09;37,5;43,75
1675,19;37,5;43,75
1675,29;37,5;44
1675,39;37,75;44
1675,49;37,75;44
1675,59;37,75;44
1675,69;37,75;44
1675,79;37,75;44
1675,89;37,75;44
1675,99;37,5;44
1676,09;37,5;44
1676,19;37,5;44
1676,29;37,5;44
1676,39;37,5;44
1676,49;37,5;44
1676,59;37,5;43,75
1676,69;37,25;43,75
1676,79;37,25;43,75
1676,89;37,25;43,75
1676,99;37,25;43,75
1677,09;37,25;43,75
1677,19;37,25;43,75
1677,29;37,5;44
1677,39;37,25;44
1677,49;37,25;44
1677,59;37,25;44
1677,69;37,5;44
1677,79;37,5;44
1677,89;37,5;44
1677,99;37,5;44
1678,09;37,5;44
1678,19;37,25;44
1678,29;37,5;44
1678,39;37,5;44
1678,49;37,5;44
1678,59;37,25;44
1678,69;37,25;44,25
1678,79;37,25;44
1678,88;37,25;44,25
1678,98;37,25;44,25
1679,08;37,25;44,25
1679,18;37,25;44,25
1679,28;37,5;44,25
1679,38;37,25;44,25
1679,48;37,25;44,25
1679,58;37,25;44,25
1679,68;37,25;44,25
1679,78;37,25;44,25
1679,88;37,25;44,25
1679,98;37,25;44,25
1680,08;37,25;44,25
1680,18;37,25;44,25
1680,28;37,25;44,25
1680,38;37,25;44,5
1680,48;37,5;44,5
1680,58;37,5;44,5
1680,68;37,5;44,5
1680,78;37,5;44,5
1680,88;37,5;44,5
1680,98;37,5;44,5
1681,08;37,5;44,5
1681,18;37,75;44,5
1681,28;37,5;44,5
1681,38;37,5;44,5
1681,48;37,5;44,5
1681,58;37,5;44,5
1681,68;37,5;44,5
1681,78;37,75;44,5
1681,88;37,5;44,5
1681,98;37,75;44,5
1682,08;37,75;44,75
1682,18;37,75;44,75
1682,28;37,75;44,5
1682,38;37,5;44,5
1682,48;37,5;44,5
1682,58;37,75;44,75
1682,68;37,75;44,5
1682,78;37,75;44,75
1682,88;37,75;44,75
1682,98;37,75;44,75
1683,08;38;44,75
1683,18;38;44,75
1683,28;38;44,75
1683,37;38;45
1683,47;38;45
1683,57;38;44,75
1683,67;38;44,75
1683,77;38;44,75
1683,87;38,25;44,75
1683,97;38,25;44,75
1684,07;38;45
1684,17;38,25;45
1684,27;38,25;45
1684,37;38,25;45
1684,47;38,25;45
1684,57;38,25;45
1684,67;38,25;45
1684,77;38,5;45
1684,87;38,25;45
1684,97;38,5;45
1685,07;38,5;45
1685,17;38,5;45
1685,27;38,5;45
1685,37;38,5;45
1685,47;38,5;45
1685,57;38,5;45
1685,67;38,5;45
1685,77;38,5;45
1685,87;38,5;45
1685,97;38,5;45
1686,07;38,5;44,75
1686,17;38,5;45
1686,27;38,5;45
1686,37;38,5;45
1686,47;38,5;44,75
1686,57;38,5;45
1686,67;38,5;45,25
1686,77;38,5;45
1686,87;38,5;45
1686,97;38,5;45,25
1687,07;38,5;45,25
1687,17;38,5;45
1687,27;38,75;45
1687,37;38,5;45
1687,47;38,5;45
1687,57;38,5;45
1687,67;38,5;45
1687,77;38,5;45
1687,87;38,5;45
1687,97;38,5;45
1688,07;38,5;45
1688,17;38,5;45
1688,27;38,5;45
1688,37;38,5;45
1688,46;38,5;45
1688,56;38,5;45
1688,66;38,5;45
1688,76;38,5;45
1688,86;38,5;45
1688,96;38,5;45
1689,06;38,5;44,75
1689,16;38,5;44,75
1689,26;38,5;45
1689,36;38,5;45
1689,46;38,5;45
1689,56;38,5;45
1689,66;38,5;45
1689,76;38,5;45,25
1689,86;38,5;45
1689,96;38,5;45
1690,06;38,5;45
1690,16;38,5;45
1690,26;38,5;45
1690,36;38,5;45
1690,46;38,5;45
1690,56;38,5;45
1690,66;38,5;45
1690,76;38,5;45,25
1690,86;38,5;45,25
1690,96;38,5;45,25
1691,06;38,5;45,25
1691,16;38,5;45,25
1691,26;38,5;45,25
1691,36;38,5;45,25
1691,46;38,5;45,25
1691,56;38,5;45,5
1691,66;38,5;45,25
1691,76;38,75;45,5
1691,86;38,75;45,5
1691,96;38,75;45,5
1692,06;38,75;45,5
1692,16;38,75;45,5
1692,26;38,75;45,5
1692,36;38,5;45,5
1692,46;38,5;45,5
1692,56;38,75;45,75
1692,66;38,5;45,5
1692,76;38,5;45,5
1692,86;38,5;45,75
1692,96;38,5;45,75
1693,06;38,5;45,75
1693,16;38,5;45,75
1693,26;38,5;45,75
1693,36;38,5;45,75
1693,46;38,5;45,75
1693,55;38,5;45,75
1693,65;38,5;45,75
1693,75;38,5;45,75
1693,85;38,5;45,75
1693,95;38,5;45,75
1694,05;38,25;45,75
1694,15;38,25;45,75
1694,25;38,25;45,75
1694,35;38,25;45,75
1694,45;38,25;45,75
1694,55;38,25;45,75
1694,65;38,25;45,75
1694,75;38,25;45,75
1694,85;38,25;45,75
1694,95;38,25;46
1695,05;38,25;46
1695,15;38,25;46
1695,25;38,25;46
1695,35;38;46
1695,45;38,25;46
1695,55;38,25;46
1695,65;38;46
1695,75;38;45,75
1695,85;38;45,75
1695,95;38;45,75
1696,05;38;46
1696,15;38;45,75
1696,25;38;45,75
1696,35;38;45,75
1696,45;38;46
1696,55;38;46
1696,65;38,25;46
1696,75;38,25;46
1696,85;38,25;46
1696,95;38,25;46
1697,05;38;46
1697,15;38;46,25
1697,25;38;46,25
1697,35;38;46
1697,45;38;46
1697,55;38;46
1697,65;38;46,25
1697,75;38;46,25
1697,85;38;46,25
1697,95;38;46
1698,05;38,25;46,25
1698,15;38,25;46,25
1698,25;38,25;46,25
1698,35;38,25;46,25
1698,45;38,25;46,25
1698,55;38,25;46,25
1698,64;38,25;46,25
1698,74;38,5;46,25
1698,84;38,5;46,25
1698,94;38,25;46,25
1699,04;38,5;46
1699,14;38,5;46,25
1699,24;38,5;46,25
1699,34;38,5;46,25
1699,44;38,5;46,25
1699,54;38,5;46,25
1699,64;38,75;46,25
1699,74;38,5;46,25
1699,84;38,5;46,25
1699,94;38,5;46,25
1700,04;38,5;46,25
1700,14;38,5;46,25
1700,24;38,5;46,25
1700,34;38,75;46,25
1700,44;38,5;46,25
1700,54;38,75;46,25
1700,64;38,75;46,25
1700,74;38,5;46,25
1700,84;38,5;46,25
1700,94;38,5;46,5
1701,04;38,5;46,25
1701,14;38,5;46,25
1701,24;38,5;46,25
1701,34;38,5;46
1701,44;38,5;46,25
1701,54;38,25;46,5
1701,64;38,5;46,25
1701,74;38,5;46,25
1701,84;38,5;46,25
1701,94;38,5;46,5
1702,04;38,5;46,5
1702,14;38,5;46,5
1702,24;38,5;46,75
1702,34;38,5;46,75
1702,44;38,5;46,75
1702,54;38,5;46,75
1702,64;38,75;46,75
1702,74;38,5;46,75
1702,84;38,5;46,75
1702,94;38,5;47
1703,04;38,5;47
1703,14;38,5;47
1703,24;38,75;47
1703,34;38,75;47
1703,44;38,75;47,25
1703,54;38,75;47
1703,63;38,75;47
1703,73;38,75;47
1703,83;38,75;47
1703,93;39;47
1704,03;39;47
1704,14;39;47
1704,23;39;47
1704,33;39;47
1704,43;39;47
1704,53;39;47
1704,63;39;47
1704,73;39;47
1704,83;39;47
1704,93;39;46,75
1705,03;38,75;47
1705,13;38,75;46,75
1705,23;39;46,75
1705,33;38,75;46,75
1705,43;39;46,75
1705,53;39;47
1705,63;39;46,75
1705,73;39;47
1705,83;39;46,75
1705,93;39;46,75
1706,03;39;47
1706,13;39;46,75
1706,23;39;46,75
1706,33;39,25;46,75
1706,43;39,25;46,75
1706,53;39,25;46,75
1706,63;39,25;46,75
1706,73;39,25;46,75
1706,83;39,25;46,75
1706,93;39,25;46,75
1707,03;39,25;46,75
1707,13;39;46,75
1707,23;39,25;46,75
1707,33;39,25;46,75
1707,43;39;46,75
1707,53;39,25;46,75
1707,63;39,25;46,75
1707,73;39,25;46,75
1707,83;39;46,75
1707,93;39,25;46,75
1708,03;39;46,75
1708,13;39,25;46,75
1708,23;39;46,75
1708,33;39,25;46,5
1708,42;39,25;46,75
1708,52;39,25;46,5
1708,62;39;46,75
1708,72;39;46,5
1708,82;39;46,5
1708,92;39;46,75
1709,02;39;46,5
1709,12;39;46,25
1709,22;39;46,25
1709,32;38,75;46,25
1709,42;38,75;46,25
1709,52;39;46,25
1709,62;38,75;46,5
1709,72;38,75;46,25
1709,82;38,75;46,25
1709,92;38,75;46,25
1710,02;38,75;46,25
1710,12;38,75;46,5
1710,22;39;46,75
1710,32;38,75;46,75
1710,42;38,75;46,75
1710,52;38,75;47
1710,62;38,75;47
1710,72;38,75;47
1710,82;38,75;47
1710,92;38,75;47
1711,02;38,75;47,25
1711,12;38,75;47
1711,22;39;47,25
1711,32;39;47,25
1711,42;39;47,25
1711,52;39;47,25
1711,62;39;47,5
1711,72;39;47,5
1711,82;39;47,5
1711,92;39,25;47,5
1712,02;39,25;47,5
1712,12;39,25;47,5
1712,22;39,25;47,5
1712,32;39,25;47,5
1712,42;39,25;47,5
1712,52;39,25;47,5
1712,62;39,5;47,5
1712,72;39,5;47,5
1712,82;39,5;47,5
1712,92;39,5;47,5
1713,02;39,5;47,5
1713,12;39,5;47,5
1713,22;39,5;47,5
1713,31;39,5;47,5
1713,41;39,5;47,5
1713,51;39,5;47,5
1713,61;39,5;47,25
1713,71;39,5;47,25
1713,81;39,5;47,25
1713,91;39,75;47,25
1714,01;39,5;47,5
1714,11;39,5;47,25
1714,21;39,75;47,25
1714,31;39,5;47,25
1714,41;39,75;47,5
1714,51;39,75;47,5
1714,61;39,75;47,5
1714,71;39,75;47,5
1714,81;39,75;47,5
1714,91;39,75;47,5
1715,01;39,75;47,5
1715,11;39,75;47,25
1715,21;39,75;47,5
1715,31;39,75;47,5
1715,41;39,75;47,5
1715,51;39,75;47,5
1715,61;39,75;47,5
1715,71;39,75;47,5
1715,81;39,75;47,5
1715,91;39,75;47,5
1716,01;39,75;47,5
1716,11;39,75;47,25
1716,21;39,75;47,5
1716,31;39,75;47,5
1716,41;39,75;47,25
1716,51;39,75;47,5
1716,61;39,75;47,25
1716,71;39,75;47,25
1716,81;39,75;47,25
1716,91;39,75;47,25
1717,01;40;47,25
1717,11;39,75;47,25
1717,21;39,75;47
1717,31;39,75;47,25
1717,41;40;47,25
1717,51;39,75;47,25
1717,61;40;47,25
1717,71;39,75;47
1717,81;39,75;47
1717,91;39,75;47
1718,01;39,75;47
1718,11;40;47
1718,2;38,5;47
1718,3;40;47
1718,4;40;47,25
1718,5;40;47,25
1718,6;40;47,25
1718,7;40;47,25
1718,8;40;47,25
1718,9;39,75;47
1719;39,75;47,25
1719,1;40;47,25
1719,2;39,75;47
1719,3;39,75;47,25
1719,4;39,75;47,25
1719,5;39,75;47,25
1719,6;40;47,25
1719,7;40;47,25
1719,8;40;47,25
1719,9;40;47,5
1720;40;47,5
1720,1;40;47,5
1720,2;39,75;47,25
1720,3;39,75;47,25
1720,4;40;47,5
1720,5;40;47,5
1720,6;40;47,5
1720,7;40;47,5
1720,8;40,25;47,5
1720,9;40;47,5
1721;40;47,5
1721,1;40;47,25
1721,2;40,25;47,25
1721,3;40;47,5
1721,4;40;47,25
1721,5;40;47,25
1721,6;40;47,25
1721,7;40;47,25
1721,8;40;47,25
1721,9;40;47,25
1722;40,25;47,25
1722,1;40;47,25
1722,2;40;47,25
1722,3;40;47,5
1722,4;40;47,5
1722,5;40;47,5
1722,6;40;47,5
1722,7;40;47,5
1722,8;40;47,5
1722,9;40;47,5
1722,99;39,75;47,25
1723,09;39,75;47,5
1723,19;39,75;47,5
1723,29;39,75;47,5
1723,39;39,75;47,5
1723,49;39,75;47,5
1723,59;40;47,5
1723,69;40;47,5
1723,79;40;47,75
1723,89;39,75;47,5
1723,99;39,75;47,5
1724,09;39,75;47,5
1724,19;40;47,75
1724,29;39,75;47,5
1724,39;39,75;47,5
1724,49;39,75;47,5
1724,59;39,75;47,5
1724,69;39,75;47,5
1724,79;39,75;47,5
1724,89;39,75;47,5
1724,99;39,75;47,5
1725,09;39,5;47,5
1725,19;39,75;47,75
1725,29;39,75;47,75
1725,39;39,75;47,5
1725,49;39,75;47,5
1725,59;39,75;47,75
1725,69;39,75;47,5
1725,79;39,75;47,75
1725,89;39,75;47,75
1725,99;39,75;47,75
1726,09;39,75;47,75
1726,19;39,75;47,5
1726,29;39,75;47,75
1726,39;39,75;47,75
1726,49;39,75;47,5
1726,59;39,75;47,5
1726,69;39,75;47,75
1726,79;40;47,5
1726,89;40;47,75
1726,99;40;47,75
1727,09;40;47,75
1727,19;40;47,75
1727,29;40;47,75
1727,39;40;47,5
1727,49;40;47,75
1727,59;40;47,75
1727,68;40;47,75
1727,78;40;47,75
1727,88;40;47,75
1727,98;40;47,75
1728,08;39,75;47,75
1728,18;39,75;47,75
1728,28;40;47,75
1728,38;39,75;47,75
1728,48;39,75;47,75
1728,58;39,75;47,75
1728,68;39,75;47,75
1728,78;39,75;47,75
1728,88;40;47,75
1728,98;39,75;47,75
1729,08;39,75;47,5
1729,18;39,75;47,75
1729,28;39,75;47,75
1729,38;40;47,75
1729,48;40;47,75
1729,58;40;47,75
1729,68;39,75;47,75
1729,78;39,75;47,75
1729,88;40;47,75
1729,98;40;47,75
1730,08;40;47,75
1730,18;40;47,75
1730,28;40;47,75
1730,38;40;47,75
1730,48;40;47,5
1730,58;40;47,75
1730,68;40;47,5
1730,78;40;47,75
1730,88;40;47,5
1730,98;40;47,5
1731,08;40;47,5
1731,18;40;47,75
1731,28;40;47,5
1731,38;40;47,75
1731,48;40,25;47,75
1731,58;40,25;47,75
1731,68;40,25;47,75
1731,78;40;47,75
1731,88;40;47,5
1731,98;40;47,5
1732,08;40;47,5
1732,18;40;47,5
1732,28;40,25;47,5
1732,38;40;47,5
1732,48;40;47,5
1732,58;40,25;47,5
1732,67;40,25;47,5
1732,77;40,25;47,5
1732,87;40,25;47,75
1732,97;40,25;47,5
1733,07;40,25;47,5
1733,17;40,5;47,5
1733,27;40,25;47,75
1733,37;40,5;47,75
1733,47;40,5;47,75
1733,57;40,25;47,75
1733,67;40,25;47,5
1733,77;40,25;47,5
1733,87;40;47,5
1733,97;40;47,5
1734,07;40;47,5
1734,17;40;47,5
1734,27;40;47,5
1734,37;40;47,5
1734,47;40;47,5
1734,57;40;47,75
1734,67;39,75;47,5
1734,77;40;47,5
1734,87;40;47,75
1734,97;40;47,75
1735,07;40;47,75
1735,17;39,75;47,75
1735,27;39,75;47,5
1735,37;39,75;47,5
1735,47;39,75;47,75
1735,57;39,75;47,5
1735,67;39,75;47,5
1735,77;39,75;47,75
1735,87;40;47,75
1735,97;39,75;47,5
1736,07;39,75;47,5
1736,17;39,75;47,5
1736,27;40;47,75
1736,37;40;47,75
1736,47;40;47,75
1736,57;39,75;47,75
1736,67;39,75;47,75
1736,77;39,75;47,75
1736,87;39,75;47,75
1736,97;39,75;47,75
1737,07;39,75;47,75
1737,17;39,75;47,75
1737,26;39,75;47,75
1737,36;39,75;47,75
1737,46;39,75;47,75
1737,56;39,75;47,75
1737,66;39,75;47,75
1737,76;39,75;47,75
1737,86;39,75;47,75
1737,96;39,75;47,75
1738,06;39,75;47,75
1738,16;39,75;47,75
1738,26;39,75;47,75
1738,36;39,75;47,75
1738,46;39,75;47,75
1738,56;39,75;48
1738,66;39,75;47,75
1738,76;39,75;47,75
1738,86;39,75;47,75
1738,96;39,75;47,75
1739,06;39,75;48
1739,16;39,75;48
1739,26;39,75;48
1739,36;39,75;48
1739,46;39,75;47,75
1739,56;39,75;48
1739,66;39,75;48
1739,76;39,75;48
1739,86;39,75;48
1739,96;39,75;48
1740,06;39,75;48
1740,16;39,75;48,25
1740,26;39,75;48,25
1740,36;39,75;48,25
1740,46;39,75;48,25
1740,56;39,75;48,25
1740,66;39,75;48,25
1740,76;39,75;48,25
1740,86;39,75;48,25
1740,96;39,75;48,25
1741,06;40;48,25
1741,16;39,75;48,25
1741,26;39,75;48,25
1741,36;39,75;48,25
1741,46;39,75;48,25
1741,56;39,75;48,25
1741,66;39,75;48,25
1741,76;39,75;48
1741,86;39,75;48,25
1741,95;39,75;48,25
1742,05;39,75;48,25
1742,15;39,5;48
1742,25;39,5;47,75
1742,35;39,75;48
1742,45;39,5;48
1742,55;39,5;48
1742,65;39,5;48
1742,75;39,5;48
1742,85;39,5;48
1742,95;39,5;48
1743,05;39,5;48
1743,15;39,5;48
1743,25;39,5;48
1743,35;39,5;48
1743,45;39,5;48
1743,55;39,5;48
1743,65;39,5;48,25
1743,75;39,5;48
1743,85;39,5;48,25
1743,95;39,5;48,25
1744,05;39,5;48,25
1744,15;39,5;48,25
1744,25;39,5;48,25
1744,35;39,5;48,25
1744,45;39,75;48,25
1744,55;39,75;48,5
1744,65;39,75;48,25
1744,75;39,75;48,25
1744,85;39,75;48,5
1744,95;39,75;48,5
1745,05;39,75;48,5
1745,15;40;48,5
1745,25;40;48,5
1745,35;40;48,25
1745,45;40;48,25
1745,55;40;48,25
1745,65;40;48,25
1745,75;40;48,5
1745,85;40;48,5
1745,95;40;48,5
1746,05;40,25;48,5
1746,15;40,25;48,5
1746,25;40,25;48,5
1746,35;40,25;48,5
1746,45;40,25;48,5
1746,55;40,25;48,5
1746,65;40,25;48,5
1746,74;40,25;48,5
1746,84;40,25;48,75
1746,94;40,25;48,5
1747,04;40;48,5
1747,14;40;48,5
