Id	Description	Qty	Unit	Designators	Manufacturer	MPN
1	Connector, Micro-Lock Plus, Receptacle Housing, 4 pins	1		SU PCB Connector	Molex	5055650401
2	Connector, Pico-Lock, Receptacle Housing, 4 pins	1		Led PCB Connector	Molex	5040510401
3	Micro-Lock Plus Crimp, Socket (Female)	4		SU PCB Connector	Molex	5054311200
4	Pico-Lock Crimp, Socket (Female)	4		Led PCB Connector	Molex	5040520098
5	Wire, PTFE Hook-up Wire, 26 AWG, VT	32	cm	Led PCB Cable	Alpha Wire	2843/1 BK005
