<?xml version="1.0" encoding="UTF-8" standalone="no"?>
<!DOCTYPE svg PUBLIC "-//W3C//DTD SVG 1.1//EN"
 "http://www.w3.org/Graphics/SVG/1.1/DTD/svg11.dtd">
<!-- Generated by graphviz version 2.43.0 (0)
 -->
<!-- Title: %3 Pages: 1 -->
<svg width="2166pt" height="1765pt"
 viewBox="0.00 0.00 2166.00 1764.50" xmlns="http://www.w3.org/2000/svg" xmlns:xlink="http://www.w3.org/1999/xlink">
<g id="graph0" class="graph" transform="scale(1 1) rotate(0) translate(4 1760.5)">
<title>%3</title>
<polygon fill="#ffffff" stroke="transparent" points="-4,4 -4,-1760.5 2162,-1760.5 2162,4 -4,4"/>
<g id="clust1" class="cluster">
<title>cluster1</title>
<polygon fill="#ffffff" stroke="black" stroke-dasharray="1,5" points="579,-8 579,-1656 1563,-1656 1563,-8 579,-8"/>
<text text-anchor="start" x="935" y="-1627" font-family="arial" font-size="14.00"> &#160;&#160;&#160;&#160;&#160;&#160;&#160;&#160;&#160;&#160;&#160;&#160;&#160;&#160;&#160;&#160;&#160;&#160;&#160;&#160;&#160;&#160;&#160;</text>
<text text-anchor="start" x="1026" y="-1627" font-family="arial" font-weight="bold" font-size="20.00">Feedthrough Cable</text>
<text text-anchor="start" x="597" y="-1611.8" font-family="arial" font-size="14.00"> &#160;&#160;&#160;&#160;&#160;&#160;&#160;&#160;&#160;&#160;&#160;&#160;&#160;&#160;&#160;&#160;&#160;&#160;&#160;&#160;&#160;&#160;&#160;</text>
<text text-anchor="start" x="688" y="-1611.8" font-family="arial" font-size="12.00"> &#160;&#160;&#160;&#160;&#160;&#160;&#160;&#160;&#160;&#160;&#160;&#160;&#160;&#160;&#160;&#160;&#160;&#160;&#160;&#160;&#160;&#160;&#160;The cables must be 33cm after the component that hold them still. Before that 90 cm are enough. So as a hole the feedthrough cable must be 123cm.</text>
<text text-anchor="start" x="687.5" y="-1597.8" font-family="arial" font-size="12.00"> &#160;&#160;&#160;&#160;&#160;&#160;&#160;&#160;&#160;&#160;&#160;&#160;&#160;&#160;&#160;&#160;&#160;&#160;&#160;&#160;&#160;&#160;&#160;The nylon braided sleeve ends 90cm after the D&#45;sub end. Shield sleeve terminates on D&#45;sub backshell. &#160;&#160;&#160;&#160;&#160;&#160;&#160;&#160;&#160;&#160;&#160;&#160;&#160;&#160;&#160;&#160;&#160;&#160;&#160;&#160;&#160;&#160;&#160;</text>
<text text-anchor="start" x="1378.5" y="-1597.8" font-family="arial" font-size="14.00"> &#160;&#160;&#160;&#160;&#160;&#160;&#160;&#160;&#160;&#160;&#160;&#160;&#160;&#160;&#160;&#160;&#160;&#160;&#160;</text>
</g>
<!-- Dsub&#45;37 -->
<g id="node1" class="node">
<title>Dsub&#45;37</title>
<polygon fill="#ffffff" stroke="black" points="299,-1411 0,-1411 0,-399 299,-399 299,-1411"/>
<polygon fill="none" stroke="black" points="0.5,-1388 0.5,-1411 299.5,-1411 299.5,-1388 0.5,-1388"/>
<text text-anchor="start" x="124" y="-1395.8" font-family="arial" font-size="14.00">Dsub&#45;37</text>
<polygon fill="none" stroke="black" points="0.5,-1365 0.5,-1388 299.5,-1388 299.5,-1365 0.5,-1365"/>
<text text-anchor="start" x="65.5" y="-1372.8" font-family="arial" font-size="14.00">Amphenol: DC37P064TXLF</text>
<polygon fill="none" stroke="black" points="0.5,-1342 0.5,-1365 103.5,-1365 103.5,-1342 0.5,-1342"/>
<text text-anchor="start" x="24.5" y="-1349.8" font-family="arial" font-size="14.00">D&#45;sub 37</text>
<polygon fill="none" stroke="black" points="103.5,-1342 103.5,-1365 214.5,-1365 214.5,-1342 103.5,-1342"/>
<text text-anchor="start" x="127.5" y="-1349.8" font-family="arial" font-size="14.00">Pin (Male)</text>
<polygon fill="none" stroke="black" points="214.5,-1342 214.5,-1365 299.5,-1365 299.5,-1342 214.5,-1342"/>
<text text-anchor="start" x="238" y="-1349.8" font-family="arial" font-size="14.00">37&#45;pin</text>
<polygon fill="none" stroke="black" points="0.5,-468 0.5,-1342 233.5,-1342 233.5,-468 0.5,-468"/>
<image xlink:href="icons/Dsub-37.png" width="225px" height="173px" preserveAspectRatio="xMinYMin meet" x="4.5" y="-991.5"/>
<polygon fill="none" stroke="black" points="233.5,-1319 233.5,-1342 299.5,-1342 299.5,-1319 233.5,-1319"/>
<text text-anchor="start" x="262.5" y="-1326.8" font-family="arial" font-size="14.00">1</text>
<polygon fill="none" stroke="black" points="233.5,-1296 233.5,-1319 299.5,-1319 299.5,-1296 233.5,-1296"/>
<text text-anchor="start" x="262.5" y="-1303.8" font-family="arial" font-size="14.00">2</text>
<polygon fill="none" stroke="black" points="233.5,-1273 233.5,-1296 299.5,-1296 299.5,-1273 233.5,-1273"/>
<text text-anchor="start" x="262.5" y="-1280.8" font-family="arial" font-size="14.00">3</text>
<polygon fill="none" stroke="black" points="233.5,-1250 233.5,-1273 299.5,-1273 299.5,-1250 233.5,-1250"/>
<text text-anchor="start" x="262.5" y="-1257.8" font-family="arial" font-size="14.00">4</text>
<polygon fill="none" stroke="black" points="233.5,-1227 233.5,-1250 299.5,-1250 299.5,-1227 233.5,-1227"/>
<text text-anchor="start" x="262.5" y="-1234.8" font-family="arial" font-size="14.00">5</text>
<polygon fill="none" stroke="black" points="233.5,-1204 233.5,-1227 299.5,-1227 299.5,-1204 233.5,-1204"/>
<text text-anchor="start" x="262.5" y="-1211.8" font-family="arial" font-size="14.00">6</text>
<polygon fill="none" stroke="black" points="233.5,-1181 233.5,-1204 299.5,-1204 299.5,-1181 233.5,-1181"/>
<text text-anchor="start" x="262.5" y="-1188.8" font-family="arial" font-size="14.00">7</text>
<polygon fill="none" stroke="black" points="233.5,-1158 233.5,-1181 299.5,-1181 299.5,-1158 233.5,-1158"/>
<text text-anchor="start" x="262.5" y="-1165.8" font-family="arial" font-size="14.00">8</text>
<polygon fill="none" stroke="black" points="233.5,-1135 233.5,-1158 299.5,-1158 299.5,-1135 233.5,-1135"/>
<text text-anchor="start" x="262.5" y="-1142.8" font-family="arial" font-size="14.00">9</text>
<polygon fill="none" stroke="black" points="233.5,-1112 233.5,-1135 299.5,-1135 299.5,-1112 233.5,-1112"/>
<text text-anchor="start" x="258.5" y="-1119.8" font-family="arial" font-size="14.00">10</text>
<polygon fill="none" stroke="black" points="233.5,-1089 233.5,-1112 299.5,-1112 299.5,-1089 233.5,-1089"/>
<text text-anchor="start" x="258.5" y="-1096.8" font-family="arial" font-size="14.00">11</text>
<polygon fill="none" stroke="black" points="233.5,-1066 233.5,-1089 299.5,-1089 299.5,-1066 233.5,-1066"/>
<text text-anchor="start" x="258.5" y="-1073.8" font-family="arial" font-size="14.00">12</text>
<polygon fill="none" stroke="black" points="233.5,-1043 233.5,-1066 299.5,-1066 299.5,-1043 233.5,-1043"/>
<text text-anchor="start" x="258.5" y="-1050.8" font-family="arial" font-size="14.00">13</text>
<polygon fill="none" stroke="black" points="233.5,-1020 233.5,-1043 299.5,-1043 299.5,-1020 233.5,-1020"/>
<text text-anchor="start" x="258.5" y="-1027.8" font-family="arial" font-size="14.00">14</text>
<polygon fill="none" stroke="black" points="233.5,-997 233.5,-1020 299.5,-1020 299.5,-997 233.5,-997"/>
<text text-anchor="start" x="258.5" y="-1004.8" font-family="arial" font-size="14.00">15</text>
<polygon fill="none" stroke="black" points="233.5,-974 233.5,-997 299.5,-997 299.5,-974 233.5,-974"/>
<text text-anchor="start" x="258.5" y="-981.8" font-family="arial" font-size="14.00">16</text>
<polygon fill="none" stroke="black" points="233.5,-951 233.5,-974 299.5,-974 299.5,-951 233.5,-951"/>
<text text-anchor="start" x="258.5" y="-958.8" font-family="arial" font-size="14.00">17</text>
<polygon fill="none" stroke="black" points="233.5,-928 233.5,-951 299.5,-951 299.5,-928 233.5,-928"/>
<text text-anchor="start" x="258.5" y="-935.8" font-family="arial" font-size="14.00">18</text>
<polygon fill="none" stroke="black" points="233.5,-905 233.5,-928 299.5,-928 299.5,-905 233.5,-905"/>
<text text-anchor="start" x="258.5" y="-912.8" font-family="arial" font-size="14.00">19</text>
<polygon fill="none" stroke="black" points="233.5,-882 233.5,-905 299.5,-905 299.5,-882 233.5,-882"/>
<text text-anchor="start" x="258.5" y="-889.8" font-family="arial" font-size="14.00">20</text>
<polygon fill="none" stroke="black" points="233.5,-859 233.5,-882 299.5,-882 299.5,-859 233.5,-859"/>
<text text-anchor="start" x="258.5" y="-866.8" font-family="arial" font-size="14.00">21</text>
<polygon fill="none" stroke="black" points="233.5,-836 233.5,-859 299.5,-859 299.5,-836 233.5,-836"/>
<text text-anchor="start" x="258.5" y="-843.8" font-family="arial" font-size="14.00">22</text>
<polygon fill="none" stroke="black" points="233.5,-813 233.5,-836 299.5,-836 299.5,-813 233.5,-813"/>
<text text-anchor="start" x="258.5" y="-820.8" font-family="arial" font-size="14.00">23</text>
<polygon fill="none" stroke="black" points="233.5,-790 233.5,-813 299.5,-813 299.5,-790 233.5,-790"/>
<text text-anchor="start" x="258.5" y="-797.8" font-family="arial" font-size="14.00">24</text>
<polygon fill="none" stroke="black" points="233.5,-767 233.5,-790 299.5,-790 299.5,-767 233.5,-767"/>
<text text-anchor="start" x="258.5" y="-774.8" font-family="arial" font-size="14.00">25</text>
<polygon fill="none" stroke="black" points="233.5,-744 233.5,-767 299.5,-767 299.5,-744 233.5,-744"/>
<text text-anchor="start" x="258.5" y="-751.8" font-family="arial" font-size="14.00">26</text>
<polygon fill="none" stroke="black" points="233.5,-721 233.5,-744 299.5,-744 299.5,-721 233.5,-721"/>
<text text-anchor="start" x="258.5" y="-728.8" font-family="arial" font-size="14.00">27</text>
<polygon fill="none" stroke="black" points="233.5,-698 233.5,-721 299.5,-721 299.5,-698 233.5,-698"/>
<text text-anchor="start" x="258.5" y="-705.8" font-family="arial" font-size="14.00">28</text>
<polygon fill="none" stroke="black" points="233.5,-675 233.5,-698 299.5,-698 299.5,-675 233.5,-675"/>
<text text-anchor="start" x="258.5" y="-682.8" font-family="arial" font-size="14.00">29</text>
<polygon fill="none" stroke="black" points="233.5,-652 233.5,-675 299.5,-675 299.5,-652 233.5,-652"/>
<text text-anchor="start" x="258.5" y="-659.8" font-family="arial" font-size="14.00">30</text>
<polygon fill="none" stroke="black" points="233.5,-629 233.5,-652 299.5,-652 299.5,-629 233.5,-629"/>
<text text-anchor="start" x="258.5" y="-636.8" font-family="arial" font-size="14.00">31</text>
<polygon fill="none" stroke="black" points="233.5,-606 233.5,-629 299.5,-629 299.5,-606 233.5,-606"/>
<text text-anchor="start" x="258.5" y="-613.8" font-family="arial" font-size="14.00">32</text>
<polygon fill="none" stroke="black" points="233.5,-583 233.5,-606 299.5,-606 299.5,-583 233.5,-583"/>
<text text-anchor="start" x="258.5" y="-590.8" font-family="arial" font-size="14.00">33</text>
<polygon fill="none" stroke="black" points="233.5,-560 233.5,-583 299.5,-583 299.5,-560 233.5,-560"/>
<text text-anchor="start" x="258.5" y="-567.8" font-family="arial" font-size="14.00">34</text>
<polygon fill="none" stroke="black" points="233.5,-537 233.5,-560 299.5,-560 299.5,-537 233.5,-537"/>
<text text-anchor="start" x="258.5" y="-544.8" font-family="arial" font-size="14.00">35</text>
<polygon fill="none" stroke="black" points="233.5,-514 233.5,-537 299.5,-537 299.5,-514 233.5,-514"/>
<text text-anchor="start" x="258.5" y="-521.8" font-family="arial" font-size="14.00">36</text>
<polygon fill="none" stroke="black" points="233.5,-491 233.5,-514 299.5,-514 299.5,-491 233.5,-491"/>
<text text-anchor="start" x="258.5" y="-498.8" font-family="arial" font-size="14.00">37</text>
<polygon fill="none" stroke="black" points="233.5,-468 233.5,-491 299.5,-491 299.5,-468 233.5,-468"/>
<text text-anchor="start" x="237.5" y="-475.8" font-family="arial" font-size="14.00">Backshell</text>
<polygon fill="none" stroke="black" points="0.5,-445 0.5,-468 299.5,-468 299.5,-445 0.5,-445"/>
<text text-anchor="start" x="81" y="-452.8" font-family="arial" font-size="14.00">Additional components</text>
<polygon fill="none" stroke="black" points="0.5,-422 0.5,-445 299.5,-445 299.5,-422 0.5,-422"/>
<text text-anchor="start" x="83" y="-429.8" font-family="arial" font-size="14.00">37 x #6 (D&#45;sub Crimp)</text>
<polygon fill="none" stroke="black" points="0.5,-399 0.5,-422 299.5,-422 299.5,-399 0.5,-399"/>
<text text-anchor="start" x="59.5" y="-406.8" font-family="arial" font-size="14.00">1 x #1 (Backshell for Dsub 37)</text>
</g>
<!-- Power Cable -->
<g id="node11" class="node">
<title>Power Cable</title>
<polygon fill="#ffffff" stroke="black" stroke-dasharray="5,2" points="1228,-1571.5 914,-1571.5 914,-1164.5 1228,-1164.5 1228,-1571.5"/>
<polygon fill="none" stroke="black" points="914,-1548 914,-1571 1228,-1571 1228,-1548 914,-1548"/>
<text text-anchor="start" x="1032" y="-1555.8" font-family="arial" font-size="14.00">Power Cable</text>
<polygon fill="none" stroke="black" points="914,-1525 914,-1548 1228,-1548 1228,-1525 914,-1525"/>
<text text-anchor="start" x="991" y="-1532.8" font-family="arial" font-size="14.00">Alpha Wire: 2843/1 BK005</text>
<polygon fill="none" stroke="black" points="914,-1502 914,-1525 1052,-1525 1052,-1502 914,-1502"/>
<text text-anchor="start" x="922" y="-1509.8" font-family="arial" font-size="14.00">PTFE Hook&#45;up Wire</text>
<polygon fill="none" stroke="black" points="1052,-1502 1052,-1525 1089,-1525 1089,-1502 1052,-1502"/>
<text text-anchor="start" x="1059.5" y="-1509.8" font-family="arial" font-size="14.00">12x</text>
<polygon fill="none" stroke="black" points="1089,-1502 1089,-1525 1156,-1525 1156,-1502 1089,-1502"/>
<text text-anchor="start" x="1096.5" y="-1509.8" font-family="arial" font-size="14.00">26 AWG</text>
<polygon fill="none" stroke="black" points="1156,-1502 1156,-1525 1228,-1525 1228,-1502 1156,-1502"/>
<text text-anchor="start" x="1163.5" y="-1509.8" font-family="arial" font-size="14.00">123.0 cm</text>
<text text-anchor="start" x="945.5" y="-1488.8" font-family="arial" font-size="14.00"> </text>
<text text-anchor="start" x="916" y="-1469.8" font-family="arial" font-size="14.00">Dsub&#45;37:1</text>
<text text-anchor="start" x="983.5" y="-1469.8" font-family="arial" font-size="14.00"> &#160;&#160;&#160;&#160;BU &#160;&#160;&#160;</text>
<text text-anchor="start" x="1048" y="-1469.8" font-family="arial" font-size="14.00">Harwin Gecko Power 1:5:5V</text>
<polygon fill="#000000" stroke="transparent" points="914,-1462 914,-1464 1228,-1464 1228,-1462 914,-1462"/>
<polygon fill="#0066ff" stroke="transparent" points="914,-1460 914,-1462 1228,-1462 1228,-1460 914,-1460"/>
<polygon fill="#000000" stroke="transparent" points="914,-1458 914,-1460 1228,-1460 1228,-1458 914,-1458"/>
<text text-anchor="start" x="916" y="-1444.8" font-family="arial" font-size="14.00">Dsub&#45;37:2</text>
<text text-anchor="start" x="983.5" y="-1444.8" font-family="arial" font-size="14.00"> &#160;&#160;&#160;&#160;BU &#160;&#160;&#160;</text>
<text text-anchor="start" x="1041" y="-1444.8" font-family="arial" font-size="14.00">Harwin Gecko Power 1:2:GND</text>
<polygon fill="#000000" stroke="transparent" points="914,-1437 914,-1439 1228,-1439 1228,-1437 914,-1437"/>
<polygon fill="#0066ff" stroke="transparent" points="914,-1435 914,-1437 1228,-1437 1228,-1435 914,-1435"/>
<polygon fill="#000000" stroke="transparent" points="914,-1433 914,-1435 1228,-1435 1228,-1433 914,-1433"/>
<text text-anchor="start" x="916" y="-1419.8" font-family="arial" font-size="14.00">Dsub&#45;37:3</text>
<text text-anchor="start" x="983.5" y="-1419.8" font-family="arial" font-size="14.00"> &#160;&#160;&#160;&#160;BU &#160;&#160;&#160;</text>
<text text-anchor="start" x="1044.5" y="-1419.8" font-family="arial" font-size="14.00">Harwin Gecko Power 1:1:3V3</text>
<polygon fill="#000000" stroke="transparent" points="914,-1412 914,-1414 1228,-1414 1228,-1412 914,-1412"/>
<polygon fill="#0066ff" stroke="transparent" points="914,-1410 914,-1412 1228,-1412 1228,-1410 914,-1410"/>
<polygon fill="#000000" stroke="transparent" points="914,-1408 914,-1410 1228,-1410 1228,-1408 914,-1408"/>
<text text-anchor="start" x="916" y="-1394.8" font-family="arial" font-size="14.00">Dsub&#45;37:4</text>
<text text-anchor="start" x="983.5" y="-1394.8" font-family="arial" font-size="14.00"> &#160;&#160;&#160;&#160;BU &#160;&#160;&#160;</text>
<text text-anchor="start" x="1041" y="-1394.8" font-family="arial" font-size="14.00">Harwin Gecko Power 1:4:GND</text>
<polygon fill="#000000" stroke="transparent" points="914,-1387 914,-1389 1228,-1389 1228,-1387 914,-1387"/>
<polygon fill="#0066ff" stroke="transparent" points="914,-1385 914,-1387 1228,-1387 1228,-1385 914,-1385"/>
<polygon fill="#000000" stroke="transparent" points="914,-1383 914,-1385 1228,-1385 1228,-1383 914,-1383"/>
<text text-anchor="start" x="916" y="-1369.8" font-family="arial" font-size="14.00">Dsub&#45;37:5</text>
<text text-anchor="start" x="983.5" y="-1369.8" font-family="arial" font-size="14.00"> &#160;&#160;&#160;&#160;BU &#160;&#160;&#160;</text>
<text text-anchor="start" x="1044.5" y="-1369.8" font-family="arial" font-size="14.00">Harwin Gecko Power 1:3:12V</text>
<polygon fill="#000000" stroke="transparent" points="914,-1362 914,-1364 1228,-1364 1228,-1362 914,-1362"/>
<polygon fill="#0066ff" stroke="transparent" points="914,-1360 914,-1362 1228,-1362 1228,-1360 914,-1360"/>
<polygon fill="#000000" stroke="transparent" points="914,-1358 914,-1360 1228,-1360 1228,-1358 914,-1358"/>
<text text-anchor="start" x="916" y="-1344.8" font-family="arial" font-size="14.00">Dsub&#45;37:6</text>
<text text-anchor="start" x="983.5" y="-1344.8" font-family="arial" font-size="14.00"> &#160;&#160;&#160;&#160;BU &#160;&#160;&#160;</text>
<text text-anchor="start" x="1041" y="-1344.8" font-family="arial" font-size="14.00">Harwin Gecko Power 1:6:GND</text>
<polygon fill="#000000" stroke="transparent" points="914,-1337 914,-1339 1228,-1339 1228,-1337 914,-1337"/>
<polygon fill="#0066ff" stroke="transparent" points="914,-1335 914,-1337 1228,-1337 1228,-1335 914,-1335"/>
<polygon fill="#000000" stroke="transparent" points="914,-1333 914,-1335 1228,-1335 1228,-1333 914,-1333"/>
<text text-anchor="start" x="916" y="-1319.8" font-family="arial" font-size="14.00">Dsub&#45;37:1</text>
<text text-anchor="start" x="983" y="-1319.8" font-family="arial" font-size="14.00"> &#160;&#160;&#160;&#160;RD &#160;&#160;&#160;</text>
<text text-anchor="start" x="1048" y="-1319.8" font-family="arial" font-size="14.00">Harwin Gecko Power 2:5:5V</text>
<polygon fill="#000000" stroke="transparent" points="914,-1312 914,-1314 1228,-1314 1228,-1312 914,-1312"/>
<polygon fill="#ff0000" stroke="transparent" points="914,-1310 914,-1312 1228,-1312 1228,-1310 914,-1310"/>
<polygon fill="#000000" stroke="transparent" points="914,-1308 914,-1310 1228,-1310 1228,-1308 914,-1308"/>
<text text-anchor="start" x="916" y="-1294.8" font-family="arial" font-size="14.00">Dsub&#45;37:2</text>
<text text-anchor="start" x="983" y="-1294.8" font-family="arial" font-size="14.00"> &#160;&#160;&#160;&#160;RD &#160;&#160;&#160;</text>
<text text-anchor="start" x="1041" y="-1294.8" font-family="arial" font-size="14.00">Harwin Gecko Power 2:2:GND</text>
<polygon fill="#000000" stroke="transparent" points="914,-1287 914,-1289 1228,-1289 1228,-1287 914,-1287"/>
<polygon fill="#ff0000" stroke="transparent" points="914,-1285 914,-1287 1228,-1287 1228,-1285 914,-1285"/>
<polygon fill="#000000" stroke="transparent" points="914,-1283 914,-1285 1228,-1285 1228,-1283 914,-1283"/>
<text text-anchor="start" x="916" y="-1269.8" font-family="arial" font-size="14.00">Dsub&#45;37:3</text>
<text text-anchor="start" x="983" y="-1269.8" font-family="arial" font-size="14.00"> &#160;&#160;&#160;&#160;RD &#160;&#160;&#160;</text>
<text text-anchor="start" x="1044.5" y="-1269.8" font-family="arial" font-size="14.00">Harwin Gecko Power 2:3:3V3</text>
<polygon fill="#000000" stroke="transparent" points="914,-1262 914,-1264 1228,-1264 1228,-1262 914,-1262"/>
<polygon fill="#ff0000" stroke="transparent" points="914,-1260 914,-1262 1228,-1262 1228,-1260 914,-1260"/>
<polygon fill="#000000" stroke="transparent" points="914,-1258 914,-1260 1228,-1260 1228,-1258 914,-1258"/>
<text text-anchor="start" x="916" y="-1244.8" font-family="arial" font-size="14.00">Dsub&#45;37:4</text>
<text text-anchor="start" x="983" y="-1244.8" font-family="arial" font-size="14.00"> &#160;&#160;&#160;&#160;RD &#160;&#160;&#160;</text>
<text text-anchor="start" x="1041" y="-1244.8" font-family="arial" font-size="14.00">Harwin Gecko Power 2:4:GND</text>
<polygon fill="#000000" stroke="transparent" points="914,-1237 914,-1239 1228,-1239 1228,-1237 914,-1237"/>
<polygon fill="#ff0000" stroke="transparent" points="914,-1235 914,-1237 1228,-1237 1228,-1235 914,-1235"/>
<polygon fill="#000000" stroke="transparent" points="914,-1233 914,-1235 1228,-1235 1228,-1233 914,-1233"/>
<text text-anchor="start" x="916" y="-1219.8" font-family="arial" font-size="14.00">Dsub&#45;37:5</text>
<text text-anchor="start" x="983" y="-1219.8" font-family="arial" font-size="14.00"> &#160;&#160;&#160;&#160;RD &#160;&#160;&#160;</text>
<text text-anchor="start" x="1044.5" y="-1219.8" font-family="arial" font-size="14.00">Harwin Gecko Power 2:1:12V</text>
<polygon fill="#000000" stroke="transparent" points="914,-1212 914,-1214 1228,-1214 1228,-1212 914,-1212"/>
<polygon fill="#ff0000" stroke="transparent" points="914,-1210 914,-1212 1228,-1212 1228,-1210 914,-1210"/>
<polygon fill="#000000" stroke="transparent" points="914,-1208 914,-1210 1228,-1210 1228,-1208 914,-1208"/>
<text text-anchor="start" x="916" y="-1194.8" font-family="arial" font-size="14.00">Dsub&#45;37:6</text>
<text text-anchor="start" x="983" y="-1194.8" font-family="arial" font-size="14.00"> &#160;&#160;&#160;&#160;RD &#160;&#160;&#160;</text>
<text text-anchor="start" x="1041" y="-1194.8" font-family="arial" font-size="14.00">Harwin Gecko Power 2:6:GND</text>
<polygon fill="#000000" stroke="transparent" points="914,-1187 914,-1189 1228,-1189 1228,-1187 914,-1187"/>
<polygon fill="#ff0000" stroke="transparent" points="914,-1185 914,-1187 1228,-1187 1228,-1185 914,-1185"/>
<polygon fill="#000000" stroke="transparent" points="914,-1183 914,-1185 1228,-1185 1228,-1183 914,-1183"/>
<text text-anchor="start" x="945.5" y="-1169.8" font-family="arial" font-size="14.00"> </text>
</g>
<!-- Dsub&#45;37&#45;&#45;Power Cable -->
<g id="edge1" class="edge">
<title>Dsub&#45;37:e&#45;&#45;Power Cable:w</title>
<path fill="none" stroke="#000000" stroke-width="2" d="M299,-1329C579.77,-1330.21 635.9,-1460.21 913,-1459"/>
<path fill="none" stroke="#0066ff" stroke-width="2" d="M299,-1331C577.94,-1331 634.06,-1461 913,-1461"/>
<path fill="none" stroke="#000000" stroke-width="2" d="M299,-1333C576.1,-1331.79 632.23,-1461.79 913,-1463"/>
</g>
<!-- Dsub&#45;37&#45;&#45;Power Cable -->
<g id="edge3" class="edge">
<title>Dsub&#45;37:e&#45;&#45;Power Cable:w</title>
<path fill="none" stroke="#000000" stroke-width="2" d="M299,-1306C579.59,-1307.19 636.07,-1435.19 913,-1434"/>
<path fill="none" stroke="#0066ff" stroke-width="2" d="M299,-1308C577.76,-1308 634.24,-1436 913,-1436"/>
<path fill="none" stroke="#000000" stroke-width="2" d="M299,-1310C575.93,-1308.81 632.41,-1436.81 913,-1438"/>
</g>
<!-- Dsub&#45;37&#45;&#45;Power Cable -->
<g id="edge5" class="edge">
<title>Dsub&#45;37:e&#45;&#45;Power Cable:w</title>
<path fill="none" stroke="#000000" stroke-width="2" d="M299,-1283C579.4,-1284.18 636.25,-1410.18 913,-1409"/>
<path fill="none" stroke="#0066ff" stroke-width="2" d="M299,-1285C577.58,-1285 634.42,-1411 913,-1411"/>
<path fill="none" stroke="#000000" stroke-width="2" d="M299,-1287C575.75,-1285.82 632.6,-1411.82 913,-1413"/>
</g>
<!-- Dsub&#45;37&#45;&#45;Power Cable -->
<g id="edge7" class="edge">
<title>Dsub&#45;37:e&#45;&#45;Power Cable:w</title>
<path fill="none" stroke="#000000" stroke-width="2" d="M299,-1260C579.21,-1261.16 636.42,-1385.16 913,-1384"/>
<path fill="none" stroke="#0066ff" stroke-width="2" d="M299,-1262C577.4,-1262 634.6,-1386 913,-1386"/>
<path fill="none" stroke="#000000" stroke-width="2" d="M299,-1264C575.58,-1262.84 632.79,-1386.84 913,-1388"/>
</g>
<!-- Dsub&#45;37&#45;&#45;Power Cable -->
<g id="edge9" class="edge">
<title>Dsub&#45;37:e&#45;&#45;Power Cable:w</title>
<path fill="none" stroke="#000000" stroke-width="2" d="M299,-1237C579.03,-1238.15 636.59,-1360.15 913,-1359"/>
<path fill="none" stroke="#0066ff" stroke-width="2" d="M299,-1239C577.22,-1239 634.78,-1361 913,-1361"/>
<path fill="none" stroke="#000000" stroke-width="2" d="M299,-1241C575.41,-1239.85 632.97,-1361.85 913,-1363"/>
</g>
<!-- Dsub&#45;37&#45;&#45;Power Cable -->
<g id="edge11" class="edge">
<title>Dsub&#45;37:e&#45;&#45;Power Cable:w</title>
<path fill="none" stroke="#000000" stroke-width="2" d="M299,-1214C578.85,-1215.13 636.75,-1335.13 913,-1334"/>
<path fill="none" stroke="#0066ff" stroke-width="2" d="M299,-1216C577.05,-1216 634.95,-1336 913,-1336"/>
<path fill="none" stroke="#000000" stroke-width="2" d="M299,-1218C575.25,-1216.87 633.15,-1336.87 913,-1338"/>
</g>
<!-- Dsub&#45;37&#45;&#45;Power Cable -->
<g id="edge13" class="edge">
<title>Dsub&#45;37:e&#45;&#45;Power Cable:w</title>
<path fill="none" stroke="#000000" stroke-width="2" d="M299,-1329C571.47,-1329.08 639.4,-1309.08 913,-1309"/>
<path fill="none" stroke="#ff0000" stroke-width="2" d="M299,-1331C572.03,-1331 639.97,-1311 913,-1311"/>
<path fill="none" stroke="#000000" stroke-width="2" d="M299,-1333C572.6,-1332.92 640.53,-1312.92 913,-1313"/>
</g>
<!-- Dsub&#45;37&#45;&#45;Power Cable -->
<g id="edge15" class="edge">
<title>Dsub&#45;37:e&#45;&#45;Power Cable:w</title>
<path fill="none" stroke="#000000" stroke-width="2" d="M299,-1306C571.45,-1306.1 639.32,-1284.1 913,-1284"/>
<path fill="none" stroke="#ff0000" stroke-width="2" d="M299,-1308C572.06,-1308 639.94,-1286 913,-1286"/>
<path fill="none" stroke="#000000" stroke-width="2" d="M299,-1310C572.68,-1309.9 640.55,-1287.9 913,-1288"/>
</g>
<!-- Dsub&#45;37&#45;&#45;Power Cable -->
<g id="edge17" class="edge">
<title>Dsub&#45;37:e&#45;&#45;Power Cable:w</title>
<path fill="none" stroke="#000000" stroke-width="2" d="M299,-1283C571.43,-1283.11 639.24,-1259.11 913,-1259"/>
<path fill="none" stroke="#ff0000" stroke-width="2" d="M299,-1285C572.1,-1285 639.9,-1261 913,-1261"/>
<path fill="none" stroke="#000000" stroke-width="2" d="M299,-1287C572.76,-1286.89 640.57,-1262.89 913,-1263"/>
</g>
<!-- Dsub&#45;37&#45;&#45;Power Cable -->
<g id="edge19" class="edge">
<title>Dsub&#45;37:e&#45;&#45;Power Cable:w</title>
<path fill="none" stroke="#000000" stroke-width="2" d="M299,-1260C571.42,-1260.13 639.15,-1234.13 913,-1234"/>
<path fill="none" stroke="#ff0000" stroke-width="2" d="M299,-1262C572.13,-1262 639.87,-1236 913,-1236"/>
<path fill="none" stroke="#000000" stroke-width="2" d="M299,-1264C572.85,-1263.87 640.58,-1237.87 913,-1238"/>
</g>
<!-- Dsub&#45;37&#45;&#45;Power Cable -->
<g id="edge21" class="edge">
<title>Dsub&#45;37:e&#45;&#45;Power Cable:w</title>
<path fill="none" stroke="#000000" stroke-width="2" d="M299,-1237C571.41,-1237.15 639.06,-1209.15 913,-1209"/>
<path fill="none" stroke="#ff0000" stroke-width="2" d="M299,-1239C572.17,-1239 639.83,-1211 913,-1211"/>
<path fill="none" stroke="#000000" stroke-width="2" d="M299,-1241C572.94,-1240.85 640.59,-1212.85 913,-1213"/>
</g>
<!-- Dsub&#45;37&#45;&#45;Power Cable -->
<g id="edge23" class="edge">
<title>Dsub&#45;37:e&#45;&#45;Power Cable:w</title>
<path fill="none" stroke="#000000" stroke-width="2" d="M299,-1214C571.4,-1214.17 638.97,-1184.17 913,-1184"/>
<path fill="none" stroke="#ff0000" stroke-width="2" d="M299,-1216C572.21,-1216 639.79,-1186 913,-1186"/>
<path fill="none" stroke="#000000" stroke-width="2" d="M299,-1218C573.03,-1217.83 640.6,-1187.83 913,-1188"/>
</g>
<!-- Debug Cable -->
<g id="node12" class="node">
<title>Debug Cable</title>
<polygon fill="#ffffff" stroke="black" stroke-dasharray="5,2" points="1250.5,-756 891.5,-756 891.5,-524 1250.5,-524 1250.5,-756"/>
<polygon fill="none" stroke="black" points="892,-733 892,-756 1251,-756 1251,-733 892,-733"/>
<text text-anchor="start" x="1032" y="-740.8" font-family="arial" font-size="14.00">Debug Cable</text>
<polygon fill="none" stroke="black" points="892,-710 892,-733 1251,-733 1251,-710 892,-710"/>
<text text-anchor="start" x="991.5" y="-717.8" font-family="arial" font-size="14.00">Alpha Wire: 2843/1 BK005</text>
<polygon fill="none" stroke="black" points="892,-687 892,-710 1043,-710 1043,-687 892,-687"/>
<text text-anchor="start" x="906.5" y="-694.8" font-family="arial" font-size="14.00">PTFE Hook&#45;up Wire</text>
<polygon fill="none" stroke="black" points="1043,-687 1043,-710 1086,-710 1086,-687 1043,-687"/>
<text text-anchor="start" x="1057" y="-694.8" font-family="arial" font-size="14.00">5x</text>
<polygon fill="none" stroke="black" points="1086,-687 1086,-710 1166,-710 1166,-687 1086,-687"/>
<text text-anchor="start" x="1100" y="-694.8" font-family="arial" font-size="14.00">26 AWG</text>
<polygon fill="none" stroke="black" points="1166,-687 1166,-710 1251,-710 1251,-687 1166,-687"/>
<text text-anchor="start" x="1180" y="-694.8" font-family="arial" font-size="14.00">123.0 cm</text>
<text text-anchor="start" x="927" y="-673.8" font-family="arial" font-size="14.00"> </text>
<text text-anchor="start" x="894" y="-654.8" font-family="arial" font-size="14.00">Dsub&#45;37:30</text>
<text text-anchor="start" x="968" y="-654.8" font-family="arial" font-size="14.00"> &#160;&#160;&#160;&#160;OG &#160;&#160;&#160;</text>
<text text-anchor="start" x="1033.5" y="-654.8" font-family="arial" font-size="14.00">Harwin Gecko Debug:1:SWD_CKL</text>
<polygon fill="#000000" stroke="transparent" points="892,-647 892,-649 1251,-649 1251,-647 892,-647"/>
<polygon fill="#ff8000" stroke="transparent" points="892,-645 892,-647 1251,-647 1251,-645 892,-645"/>
<polygon fill="#000000" stroke="transparent" points="892,-643 892,-645 1251,-645 1251,-643 892,-643"/>
<text text-anchor="start" x="894" y="-629.8" font-family="arial" font-size="14.00">Dsub&#45;37:31</text>
<text text-anchor="start" x="968" y="-629.8" font-family="arial" font-size="14.00"> &#160;&#160;&#160;&#160;OG &#160;&#160;&#160;</text>
<text text-anchor="start" x="1043" y="-629.8" font-family="arial" font-size="14.00">Harwin Gecko Debug:2:SWDIO</text>
<polygon fill="#000000" stroke="transparent" points="892,-622 892,-624 1251,-624 1251,-622 892,-622"/>
<polygon fill="#ff8000" stroke="transparent" points="892,-620 892,-622 1251,-622 1251,-620 892,-620"/>
<polygon fill="#000000" stroke="transparent" points="892,-618 892,-620 1251,-620 1251,-618 892,-618"/>
<text text-anchor="start" x="894" y="-604.8" font-family="arial" font-size="14.00">Dsub&#45;37:33</text>
<text text-anchor="start" x="968" y="-604.8" font-family="arial" font-size="14.00"> &#160;&#160;&#160;&#160;OG &#160;&#160;&#160;</text>
<text text-anchor="start" x="1029" y="-604.8" font-family="arial" font-size="14.00">Harwin Gecko Debug:4:USART2_Tx</text>
<polygon fill="#000000" stroke="transparent" points="892,-597 892,-599 1251,-599 1251,-597 892,-597"/>
<polygon fill="#ff8000" stroke="transparent" points="892,-595 892,-597 1251,-597 1251,-595 892,-595"/>
<polygon fill="#000000" stroke="transparent" points="892,-593 892,-595 1251,-595 1251,-593 892,-593"/>
<text text-anchor="start" x="894" y="-579.8" font-family="arial" font-size="14.00">Dsub&#45;37:34</text>
<text text-anchor="start" x="968" y="-579.8" font-family="arial" font-size="14.00"> &#160;&#160;&#160;&#160;OG &#160;&#160;&#160;</text>
<text text-anchor="start" x="1032.5" y="-579.8" font-family="arial" font-size="14.00">Harwin Gecko Debug:5:UART0_Rx</text>
<polygon fill="#000000" stroke="transparent" points="892,-572 892,-574 1251,-574 1251,-572 892,-572"/>
<polygon fill="#ff8000" stroke="transparent" points="892,-570 892,-572 1251,-572 1251,-570 892,-570"/>
<polygon fill="#000000" stroke="transparent" points="892,-568 892,-570 1251,-570 1251,-568 892,-568"/>
<text text-anchor="start" x="894" y="-554.8" font-family="arial" font-size="14.00">Dsub&#45;37:17</text>
<text text-anchor="start" x="968" y="-554.8" font-family="arial" font-size="14.00"> &#160;&#160;&#160;&#160;OG &#160;&#160;&#160;</text>
<text text-anchor="start" x="1029.5" y="-554.8" font-family="arial" font-size="14.00">Harwin Gecko Debug:10:UART0_Tx</text>
<polygon fill="#000000" stroke="transparent" points="892,-547 892,-549 1251,-549 1251,-547 892,-547"/>
<polygon fill="#ff8000" stroke="transparent" points="892,-545 892,-547 1251,-547 1251,-545 892,-545"/>
<polygon fill="#000000" stroke="transparent" points="892,-543 892,-545 1251,-545 1251,-543 892,-543"/>
<text text-anchor="start" x="927" y="-529.8" font-family="arial" font-size="14.00"> </text>
</g>
<!-- Dsub&#45;37&#45;&#45;Debug Cable -->
<g id="edge25" class="edge">
<title>Dsub&#45;37:e&#45;&#45;Debug Cable:w</title>
<path fill="none" stroke="#000000" stroke-width="2" d="M299,-661C561.72,-661.06 627.28,-644.06 891,-644"/>
<path fill="none" stroke="#ff8000" stroke-width="2" d="M299,-663C562.22,-663 627.78,-646 891,-646"/>
<path fill="none" stroke="#000000" stroke-width="2" d="M299,-665C562.72,-664.94 628.28,-647.94 891,-648"/>
</g>
<!-- Dsub&#45;37&#45;&#45;Debug Cable -->
<g id="edge27" class="edge">
<title>Dsub&#45;37:e&#45;&#45;Debug Cable:w</title>
<path fill="none" stroke="#000000" stroke-width="2" d="M299,-638C561.69,-638.08 627.2,-619.08 891,-619"/>
<path fill="none" stroke="#ff8000" stroke-width="2" d="M299,-640C562.25,-640 627.75,-621 891,-621"/>
<path fill="none" stroke="#000000" stroke-width="2" d="M299,-642C562.8,-641.92 628.31,-622.92 891,-623"/>
</g>
<!-- Dsub&#45;37&#45;&#45;Debug Cable -->
<g id="edge29" class="edge">
<title>Dsub&#45;37:e&#45;&#45;Debug Cable:w</title>
<path fill="none" stroke="#000000" stroke-width="2" d="M299,-592C562.17,-592 627.95,-594 891,-594"/>
<path fill="none" stroke="#ff8000" stroke-width="2" d="M299,-594C562.11,-594 627.89,-596 891,-596"/>
<path fill="none" stroke="#000000" stroke-width="2" d="M299,-596C562.05,-596 627.83,-598 891,-598"/>
</g>
<!-- Dsub&#45;37&#45;&#45;Debug Cable -->
<g id="edge31" class="edge">
<title>Dsub&#45;37:e&#45;&#45;Debug Cable:w</title>
<path fill="none" stroke="#000000" stroke-width="2" d="M299,-569C562.11,-569 627.89,-569 891,-569"/>
<path fill="none" stroke="#ff8000" stroke-width="2" d="M299,-571C562.11,-571 627.89,-571 891,-571"/>
<path fill="none" stroke="#000000" stroke-width="2" d="M299,-573C562.11,-573 627.89,-573 891,-573"/>
</g>
<!-- Dsub&#45;37&#45;&#45;Debug Cable -->
<g id="edge33" class="edge">
<title>Dsub&#45;37:e&#45;&#45;Debug Cable:w</title>
<path fill="none" stroke="#000000" stroke-width="2" d="M299,-961C378.07,-961.56 809.15,-544.56 891,-544"/>
<path fill="none" stroke="#ff8000" stroke-width="2" d="M299,-963C379.46,-963 810.54,-546 891,-546"/>
<path fill="none" stroke="#000000" stroke-width="2" d="M299,-965C380.85,-964.44 811.93,-547.44 891,-548"/>
</g>
<!-- CAN Cable -->
<g id="node13" class="node">
<title>CAN Cable</title>
<polygon fill="#ffffff" stroke="black" stroke-dasharray="5,2" points="1286,-1140 856,-1140 856,-780 1286,-780 1286,-1140"/>
<polygon fill="none" stroke="black" points="856,-1117 856,-1140 1286,-1140 1286,-1117 856,-1117"/>
<text text-anchor="start" x="1037" y="-1124.8" font-family="arial" font-size="14.00">CAN Cable</text>
<polygon fill="none" stroke="black" points="856,-1094 856,-1117 1286,-1117 1286,-1094 856,-1094"/>
<text text-anchor="start" x="991" y="-1101.8" font-family="arial" font-size="14.00">Alpha Wire: 2843/1 BK005</text>
<polygon fill="none" stroke="black" points="856,-1071 856,-1094 1011,-1094 1011,-1071 856,-1071"/>
<text text-anchor="start" x="872.5" y="-1078.8" font-family="arial" font-size="14.00">PTFE Hook&#45;up Wire</text>
<polygon fill="none" stroke="black" points="1011,-1071 1011,-1094 1059,-1094 1059,-1071 1011,-1071"/>
<text text-anchor="start" x="1027.5" y="-1078.8" font-family="arial" font-size="14.00">4x</text>
<polygon fill="none" stroke="black" points="1059,-1071 1059,-1094 1143,-1094 1143,-1071 1059,-1071"/>
<text text-anchor="start" x="1075" y="-1078.8" font-family="arial" font-size="14.00">26 AWG</text>
<polygon fill="none" stroke="black" points="1143,-1071 1143,-1094 1197,-1094 1197,-1071 1143,-1071"/>
<text text-anchor="start" x="1159" y="-1078.8" font-family="arial" font-size="14.00">+ S</text>
<polygon fill="none" stroke="black" points="1197,-1071 1197,-1094 1286,-1094 1286,-1071 1197,-1071"/>
<text text-anchor="start" x="1213" y="-1078.8" font-family="arial" font-size="14.00">123.0 cm</text>
<text text-anchor="start" x="924.5" y="-1057.8" font-family="arial" font-size="14.00"> </text>
<text text-anchor="start" x="895" y="-1038.8" font-family="arial" font-size="14.00">Dsub&#45;37:7</text>
<text text-anchor="start" x="1011" y="-1038.8" font-family="arial" font-size="14.00"> &#160;&#160;&#160;&#160;BK &#160;&#160;&#160;</text>
<text text-anchor="start" x="1092" y="-1038.8" font-family="arial" font-size="14.00">Molex CAN 2:1:CAN_LOW_2</text>
<polygon fill="#000000" stroke="transparent" points="856,-1031 856,-1033 1286,-1033 1286,-1031 856,-1031"/>
<polygon fill="#000000" stroke="transparent" points="856,-1029 856,-1031 1286,-1031 1286,-1029 856,-1029"/>
<polygon fill="#000000" stroke="transparent" points="856,-1027 856,-1029 1286,-1029 1286,-1027 856,-1027"/>
<text text-anchor="start" x="895" y="-1013.8" font-family="arial" font-size="14.00">Dsub&#45;37:8</text>
<text text-anchor="start" x="1011" y="-1013.8" font-family="arial" font-size="14.00"> &#160;&#160;&#160;&#160;BK &#160;&#160;&#160;</text>
<text text-anchor="start" x="1091" y="-1013.8" font-family="arial" font-size="14.00">Molex CAN 2:2:CAN_HIGN_2</text>
<polygon fill="#000000" stroke="transparent" points="856,-1006 856,-1008 1286,-1008 1286,-1006 856,-1006"/>
<polygon fill="#000000" stroke="transparent" points="856,-1004 856,-1006 1286,-1006 1286,-1004 856,-1004"/>
<polygon fill="#000000" stroke="transparent" points="856,-1002 856,-1004 1286,-1004 1286,-1002 856,-1002"/>
<text text-anchor="start" x="895" y="-988.8" font-family="arial" font-size="14.00">Dsub&#45;37:9</text>
<text text-anchor="start" x="1011" y="-988.8" font-family="arial" font-size="14.00"> &#160;&#160;&#160;&#160;BK &#160;&#160;&#160;</text>
<text text-anchor="start" x="1092" y="-988.8" font-family="arial" font-size="14.00">Molex CAN 1:1:CAN_LOW_1</text>
<polygon fill="#000000" stroke="transparent" points="856,-981 856,-983 1286,-983 1286,-981 856,-981"/>
<polygon fill="#000000" stroke="transparent" points="856,-979 856,-981 1286,-981 1286,-979 856,-979"/>
<polygon fill="#000000" stroke="transparent" points="856,-977 856,-979 1286,-979 1286,-977 856,-977"/>
<text text-anchor="start" x="891.5" y="-963.8" font-family="arial" font-size="14.00">Dsub&#45;37:10</text>
<text text-anchor="start" x="1011" y="-963.8" font-family="arial" font-size="14.00"> &#160;&#160;&#160;&#160;BK &#160;&#160;&#160;</text>
<text text-anchor="start" x="1091" y="-963.8" font-family="arial" font-size="14.00">Molex CAN 1:2:CAN_HIGN_1</text>
<polygon fill="#000000" stroke="transparent" points="856,-956 856,-958 1286,-958 1286,-956 856,-956"/>
<polygon fill="#000000" stroke="transparent" points="856,-954 856,-956 1286,-956 1286,-954 856,-954"/>
<polygon fill="#000000" stroke="transparent" points="856,-952 856,-954 1286,-954 1286,-952 856,-952"/>
<text text-anchor="start" x="924.5" y="-938.8" font-family="arial" font-size="14.00"> </text>
<text text-anchor="start" x="870" y="-919.8" font-family="arial" font-size="14.00">Dsub&#45;37:Backshell</text>
<text text-anchor="start" x="1018" y="-919.8" font-family="arial" font-size="14.00">Shield</text>
<text text-anchor="start" x="1118" y="-919.8" font-family="arial" font-size="14.00">Molex CAN 2:3:GND</text>
<polygon fill="#000000" stroke="transparent" points="856,-912 856,-914 1286,-914 1286,-912 856,-912"/>
<text text-anchor="start" x="924.5" y="-898.8" font-family="arial" font-size="14.00"> </text>
<polygon fill="none" stroke="black" points="856,-780 856,-893 1286,-893 1286,-780 856,-780"/>
<text text-anchor="start" x="860" y="-877.8" font-family="arial" font-size="14.00">Wires CAN_LOW_2 and CAN_HIGH_2 are a twisted pair </text>
<text text-anchor="start" x="860" y="-862.8" font-family="arial" font-size="14.00">with 120 Ohms differential impedance. </text>
<text text-anchor="start" x="860" y="-847.8" font-family="arial" font-size="14.00">Wires CAN_LOW_1 and CAN_HIGH_1 are a twisted pair </text>
<text text-anchor="start" x="860" y="-832.8" font-family="arial" font-size="14.00">with 120 Ohms differential impedance.</text>
<text text-anchor="start" x="860" y="-817.8" font-family="arial" font-size="14.00">Wires CAN_LOW_2, CAN_HIGH_2, CAN_LOW_1 and CAN_HIGH_1</text>
<text text-anchor="start" x="860" y="-802.8" font-family="arial" font-size="14.00">have a common shield. The shield is terminated on the</text>
<text text-anchor="start" x="860" y="-787.8" font-family="arial" font-size="14.00">Dsub Backshell and on the GND pins of the 2 connectors.</text>
</g>
<!-- Dsub&#45;37&#45;&#45;CAN Cable -->
<g id="edge35" class="edge">
<title>Dsub&#45;37:e&#45;&#45;CAN Cable:w</title>
<path fill="none" stroke="#000000" stroke-width="2" d="M299,-1191C554.57,-1192.51 595.55,-1029.51 855,-1028"/>
<path fill="none" stroke="#000000" stroke-width="2" d="M299,-1193C556.51,-1193 597.49,-1030 855,-1030"/>
<path fill="none" stroke="#000000" stroke-width="2" d="M299,-1195C558.45,-1193.49 599.43,-1030.49 855,-1032"/>
</g>
<!-- Dsub&#45;37&#45;&#45;CAN Cable -->
<g id="edge37" class="edge">
<title>Dsub&#45;37:e&#45;&#45;CAN Cable:w</title>
<path fill="none" stroke="#000000" stroke-width="2" d="M299,-1168C554.82,-1169.52 595.29,-1004.52 855,-1003"/>
<path fill="none" stroke="#000000" stroke-width="2" d="M299,-1170C556.76,-1170 597.24,-1005 855,-1005"/>
<path fill="none" stroke="#000000" stroke-width="2" d="M299,-1172C558.71,-1170.48 599.18,-1005.48 855,-1007"/>
</g>
<!-- Dsub&#45;37&#45;&#45;CAN Cable -->
<g id="edge39" class="edge">
<title>Dsub&#45;37:e&#45;&#45;CAN Cable:w</title>
<path fill="none" stroke="#000000" stroke-width="2" d="M299,-479C477.84,-479 435.82,-660.84 579,-768 689.94,-851.02 716.44,-913 855,-913"/>
</g>
<!-- Dsub&#45;37&#45;&#45;CAN Cable -->
<g id="edge41" class="edge">
<title>Dsub&#45;37:e&#45;&#45;CAN Cable:w</title>
<path fill="none" stroke="#000000" stroke-width="2" d="M299,-1145C555.07,-1146.53 595.04,-979.53 855,-978"/>
<path fill="none" stroke="#000000" stroke-width="2" d="M299,-1147C557.02,-1147 596.98,-980 855,-980"/>
<path fill="none" stroke="#000000" stroke-width="2" d="M299,-1149C558.96,-1147.47 598.93,-980.47 855,-982"/>
</g>
<!-- Dsub&#45;37&#45;&#45;CAN Cable -->
<g id="edge43" class="edge">
<title>Dsub&#45;37:e&#45;&#45;CAN Cable:w</title>
<path fill="none" stroke="#000000" stroke-width="2" d="M299,-1122C555.33,-1123.55 594.78,-954.55 855,-953"/>
<path fill="none" stroke="#000000" stroke-width="2" d="M299,-1124C557.27,-1124 596.73,-955 855,-955"/>
<path fill="none" stroke="#000000" stroke-width="2" d="M299,-1126C559.22,-1124.45 598.67,-955.45 855,-957"/>
</g>
<!-- Dsub&#45;37&#45;&#45;CAN Cable -->
<g id="edge45" class="edge">
<title>Dsub&#45;37:e&#45;&#45;CAN Cable:w</title>
<path fill="none" stroke="#000000" stroke-width="2" d="M299,-479C477.84,-479 435.82,-660.84 579,-768 689.94,-851.02 716.44,-913 855,-913"/>
</g>
<!-- Harwin Gecko Power 1 -->
<g id="node2" class="node">
<title>Harwin Gecko Power 1</title>
<polygon fill="#ffffff" stroke="black" points="2158,-1756.5 1843,-1756.5 1843,-1479.5 2158,-1479.5 2158,-1756.5"/>
<polygon fill="none" stroke="black" points="1843.5,-1733 1843.5,-1756 2158.5,-1756 2158.5,-1733 1843.5,-1733"/>
<text text-anchor="start" x="1931.5" y="-1740.8" font-family="arial" font-size="14.00">Harwin Gecko Power 1</text>
<polygon fill="none" stroke="black" points="1843.5,-1710 1843.5,-1733 2158.5,-1733 2158.5,-1710 1843.5,-1710"/>
<text text-anchor="start" x="1923" y="-1717.8" font-family="arial" font-size="14.00">Harwin: G125&#45;2040696L0</text>
<polygon fill="none" stroke="black" points="1843.5,-1687 1843.5,-1710 1990.5,-1710 1990.5,-1687 1843.5,-1687"/>
<text text-anchor="start" x="1847.5" y="-1694.8" font-family="arial" font-size="14.00">Harwin Gecko Power 2</text>
<polygon fill="none" stroke="black" points="1990.5,-1687 1990.5,-1710 2119.5,-1710 2119.5,-1687 1990.5,-1687"/>
<text text-anchor="start" x="1994.5" y="-1694.8" font-family="arial" font-size="14.00">Receptacle Housing</text>
<polygon fill="none" stroke="black" points="2119.5,-1687 2119.5,-1710 2158.5,-1710 2158.5,-1687 2119.5,-1687"/>
<text text-anchor="start" x="2123.5" y="-1694.8" font-family="arial" font-size="14.00">6&#45;pin</text>
<polygon fill="none" stroke="black" points="1843.5,-1660 1843.5,-1687 1875.5,-1687 1875.5,-1660 1843.5,-1660"/>
<text text-anchor="start" x="1855.5" y="-1669.8" font-family="arial" font-size="14.00">1</text>
<polygon fill="none" stroke="black" points="1875.5,-1660 1875.5,-1687 1930.5,-1687 1930.5,-1660 1875.5,-1660"/>
<text text-anchor="start" x="1890.5" y="-1669.8" font-family="arial" font-size="14.00">3V3</text>
<polygon fill="none" stroke="black" points="1843.5,-1633 1843.5,-1660 1875.5,-1660 1875.5,-1633 1843.5,-1633"/>
<text text-anchor="start" x="1855.5" y="-1642.8" font-family="arial" font-size="14.00">2</text>
<polygon fill="none" stroke="black" points="1875.5,-1633 1875.5,-1660 1930.5,-1660 1930.5,-1633 1875.5,-1633"/>
<text text-anchor="start" x="1887.5" y="-1642.8" font-family="arial" font-size="14.00">GND</text>
<polygon fill="none" stroke="black" points="1843.5,-1606 1843.5,-1633 1875.5,-1633 1875.5,-1606 1843.5,-1606"/>
<text text-anchor="start" x="1855.5" y="-1615.8" font-family="arial" font-size="14.00">3</text>
<polygon fill="none" stroke="black" points="1875.5,-1606 1875.5,-1633 1930.5,-1633 1930.5,-1606 1875.5,-1606"/>
<text text-anchor="start" x="1890.5" y="-1615.8" font-family="arial" font-size="14.00">12V</text>
<polygon fill="none" stroke="black" points="1843.5,-1579 1843.5,-1606 1875.5,-1606 1875.5,-1579 1843.5,-1579"/>
<text text-anchor="start" x="1855.5" y="-1588.8" font-family="arial" font-size="14.00">4</text>
<polygon fill="none" stroke="black" points="1875.5,-1579 1875.5,-1606 1930.5,-1606 1930.5,-1579 1875.5,-1579"/>
<text text-anchor="start" x="1887.5" y="-1588.8" font-family="arial" font-size="14.00">GND</text>
<polygon fill="none" stroke="black" points="1843.5,-1552 1843.5,-1579 1875.5,-1579 1875.5,-1552 1843.5,-1552"/>
<text text-anchor="start" x="1855.5" y="-1561.8" font-family="arial" font-size="14.00">5</text>
<polygon fill="none" stroke="black" points="1875.5,-1552 1875.5,-1579 1930.5,-1579 1930.5,-1552 1875.5,-1552"/>
<text text-anchor="start" x="1894.5" y="-1561.8" font-family="arial" font-size="14.00">5V</text>
<polygon fill="none" stroke="black" points="1843.5,-1525 1843.5,-1552 1875.5,-1552 1875.5,-1525 1843.5,-1525"/>
<text text-anchor="start" x="1855.5" y="-1534.8" font-family="arial" font-size="14.00">6</text>
<polygon fill="none" stroke="black" points="1875.5,-1525 1875.5,-1552 1930.5,-1552 1930.5,-1525 1875.5,-1525"/>
<text text-anchor="start" x="1887.5" y="-1534.8" font-family="arial" font-size="14.00">GND</text>
<polygon fill="none" stroke="black" points="1930.5,-1525 1930.5,-1687 2158.5,-1687 2158.5,-1525 1930.5,-1525"/>
<image xlink:href="icons/power-connector-1.png" width="220px" height="154px" preserveAspectRatio="xMinYMin meet" x="1934.5" y="-1683"/>
<polygon fill="none" stroke="black" points="1843.5,-1502 1843.5,-1525 2158.5,-1525 2158.5,-1502 1843.5,-1502"/>
<text text-anchor="start" x="1932" y="-1509.8" font-family="arial" font-size="14.00">Additional components</text>
<polygon fill="none" stroke="black" points="1843.5,-1479 1843.5,-1502 2158.5,-1502 2158.5,-1479 1843.5,-1479"/>
<text text-anchor="start" x="1934.5" y="-1486.8" font-family="arial" font-size="14.00">6 x #7 (Harwin Crimp)</text>
</g>
<!-- Harwin Gecko Power 2 -->
<g id="node3" class="node">
<title>Harwin Gecko Power 2</title>
<polygon fill="#ffffff" stroke="black" points="2158,-1455 1843,-1455 1843,-1179 2158,-1179 2158,-1455"/>
<polygon fill="none" stroke="black" points="1843.5,-1432 1843.5,-1455 2158.5,-1455 2158.5,-1432 1843.5,-1432"/>
<text text-anchor="start" x="1931.5" y="-1439.8" font-family="arial" font-size="14.00">Harwin Gecko Power 2</text>
<polygon fill="none" stroke="black" points="1843.5,-1409 1843.5,-1432 2158.5,-1432 2158.5,-1409 1843.5,-1409"/>
<text text-anchor="start" x="1923" y="-1416.8" font-family="arial" font-size="14.00">Harwin: G125&#45;2040696L0</text>
<polygon fill="none" stroke="black" points="1843.5,-1386 1843.5,-1409 1990.5,-1409 1990.5,-1386 1843.5,-1386"/>
<text text-anchor="start" x="1847.5" y="-1393.8" font-family="arial" font-size="14.00">Harwin Gecko Power 2</text>
<polygon fill="none" stroke="black" points="1990.5,-1386 1990.5,-1409 2119.5,-1409 2119.5,-1386 1990.5,-1386"/>
<text text-anchor="start" x="1994.5" y="-1393.8" font-family="arial" font-size="14.00">Receptacle Housing</text>
<polygon fill="none" stroke="black" points="2119.5,-1386 2119.5,-1409 2158.5,-1409 2158.5,-1386 2119.5,-1386"/>
<text text-anchor="start" x="2123.5" y="-1393.8" font-family="arial" font-size="14.00">6&#45;pin</text>
<polygon fill="none" stroke="black" points="1843.5,-1359 1843.5,-1386 1875.5,-1386 1875.5,-1359 1843.5,-1359"/>
<text text-anchor="start" x="1855.5" y="-1368.8" font-family="arial" font-size="14.00">1</text>
<polygon fill="none" stroke="black" points="1875.5,-1359 1875.5,-1386 1930.5,-1386 1930.5,-1359 1875.5,-1359"/>
<text text-anchor="start" x="1890.5" y="-1368.8" font-family="arial" font-size="14.00">12V</text>
<polygon fill="none" stroke="black" points="1843.5,-1332 1843.5,-1359 1875.5,-1359 1875.5,-1332 1843.5,-1332"/>
<text text-anchor="start" x="1855.5" y="-1341.8" font-family="arial" font-size="14.00">2</text>
<polygon fill="none" stroke="black" points="1875.5,-1332 1875.5,-1359 1930.5,-1359 1930.5,-1332 1875.5,-1332"/>
<text text-anchor="start" x="1887.5" y="-1341.8" font-family="arial" font-size="14.00">GND</text>
<polygon fill="none" stroke="black" points="1843.5,-1305 1843.5,-1332 1875.5,-1332 1875.5,-1305 1843.5,-1305"/>
<text text-anchor="start" x="1855.5" y="-1314.8" font-family="arial" font-size="14.00">3</text>
<polygon fill="none" stroke="black" points="1875.5,-1305 1875.5,-1332 1930.5,-1332 1930.5,-1305 1875.5,-1305"/>
<text text-anchor="start" x="1890.5" y="-1314.8" font-family="arial" font-size="14.00">3V3</text>
<polygon fill="none" stroke="black" points="1843.5,-1278 1843.5,-1305 1875.5,-1305 1875.5,-1278 1843.5,-1278"/>
<text text-anchor="start" x="1855.5" y="-1287.8" font-family="arial" font-size="14.00">4</text>
<polygon fill="none" stroke="black" points="1875.5,-1278 1875.5,-1305 1930.5,-1305 1930.5,-1278 1875.5,-1278"/>
<text text-anchor="start" x="1887.5" y="-1287.8" font-family="arial" font-size="14.00">GND</text>
<polygon fill="none" stroke="black" points="1843.5,-1251 1843.5,-1278 1875.5,-1278 1875.5,-1251 1843.5,-1251"/>
<text text-anchor="start" x="1855.5" y="-1260.8" font-family="arial" font-size="14.00">5</text>
<polygon fill="none" stroke="black" points="1875.5,-1251 1875.5,-1278 1930.5,-1278 1930.5,-1251 1875.5,-1251"/>
<text text-anchor="start" x="1894.5" y="-1260.8" font-family="arial" font-size="14.00">5V</text>
<polygon fill="none" stroke="black" points="1843.5,-1225 1843.5,-1251 1875.5,-1251 1875.5,-1225 1843.5,-1225"/>
<text text-anchor="start" x="1855.5" y="-1234.3" font-family="arial" font-size="14.00">6</text>
<polygon fill="none" stroke="black" points="1875.5,-1225 1875.5,-1251 1930.5,-1251 1930.5,-1225 1875.5,-1225"/>
<text text-anchor="start" x="1887.5" y="-1234.3" font-family="arial" font-size="14.00">GND</text>
<polygon fill="none" stroke="black" points="1930.5,-1225 1930.5,-1386 2158.5,-1386 2158.5,-1225 1930.5,-1225"/>
<image xlink:href="icons/power-connector-2.png" width="220px" height="153px" preserveAspectRatio="xMinYMin meet" x="1934.5" y="-1382"/>
<polygon fill="none" stroke="black" points="1843.5,-1202 1843.5,-1225 2158.5,-1225 2158.5,-1202 1843.5,-1202"/>
<text text-anchor="start" x="1932" y="-1209.8" font-family="arial" font-size="14.00">Additional components</text>
<polygon fill="none" stroke="black" points="1843.5,-1179 1843.5,-1202 2158.5,-1202 2158.5,-1179 1843.5,-1179"/>
<text text-anchor="start" x="1934.5" y="-1186.8" font-family="arial" font-size="14.00">6 x #7 (Harwin Crimp)</text>
</g>
<!-- Harwin Gecko Debug -->
<g id="node4" class="node">
<title>Harwin Gecko Debug</title>
<polygon fill="#ffffff" stroke="black" points="2157,-628.5 1844,-628.5 1844,-283.5 2157,-283.5 2157,-628.5"/>
<polygon fill="none" stroke="black" points="1844.5,-605 1844.5,-628 2157.5,-628 2157.5,-605 1844.5,-605"/>
<text text-anchor="start" x="1936" y="-612.8" font-family="arial" font-size="14.00">Harwin Gecko Debug</text>
<polygon fill="none" stroke="black" points="1844.5,-582 1844.5,-605 2157.5,-605 2157.5,-582 1844.5,-582"/>
<text text-anchor="start" x="1923" y="-589.8" font-family="arial" font-size="14.00">Harwin: G125&#45;2041096L0</text>
<polygon fill="none" stroke="black" points="1844.5,-559 1844.5,-582 1982.5,-582 1982.5,-559 1844.5,-559"/>
<text text-anchor="start" x="1848.5" y="-566.8" font-family="arial" font-size="14.00">Harwin Gecko Debug</text>
<polygon fill="none" stroke="black" points="1982.5,-559 1982.5,-582 2111.5,-582 2111.5,-559 1982.5,-559"/>
<text text-anchor="start" x="1986.5" y="-566.8" font-family="arial" font-size="14.00">Receptacle Housing</text>
<polygon fill="none" stroke="black" points="2111.5,-559 2111.5,-582 2157.5,-582 2157.5,-559 2111.5,-559"/>
<text text-anchor="start" x="2115.5" y="-566.8" font-family="arial" font-size="14.00">10&#45;pin</text>
<polygon fill="none" stroke="black" points="1844.5,-536 1844.5,-559 1880.5,-559 1880.5,-536 1844.5,-536"/>
<text text-anchor="start" x="1858.5" y="-543.8" font-family="arial" font-size="14.00">1</text>
<polygon fill="none" stroke="black" points="1880.5,-536 1880.5,-559 1975.5,-559 1975.5,-536 1880.5,-536"/>
<text text-anchor="start" x="1894.5" y="-543.8" font-family="arial" font-size="14.00">SWD_CKL</text>
<polygon fill="none" stroke="black" points="1844.5,-513 1844.5,-536 1880.5,-536 1880.5,-513 1844.5,-513"/>
<text text-anchor="start" x="1858.5" y="-520.8" font-family="arial" font-size="14.00">2</text>
<polygon fill="none" stroke="black" points="1880.5,-513 1880.5,-536 1975.5,-536 1975.5,-513 1880.5,-513"/>
<text text-anchor="start" x="1904" y="-520.8" font-family="arial" font-size="14.00">SWDIO</text>
<polygon fill="none" stroke="black" points="1844.5,-490 1844.5,-513 1880.5,-513 1880.5,-490 1844.5,-490"/>
<text text-anchor="start" x="1858.5" y="-497.8" font-family="arial" font-size="14.00">3</text>
<polygon fill="none" stroke="black" points="1880.5,-490 1880.5,-513 1975.5,-513 1975.5,-490 1880.5,-490"/>
<text text-anchor="start" x="1924.5" y="-497.8" font-family="arial" font-size="14.00">x</text>
<polygon fill="none" stroke="black" points="1844.5,-467 1844.5,-490 1880.5,-490 1880.5,-467 1844.5,-467"/>
<text text-anchor="start" x="1858.5" y="-474.8" font-family="arial" font-size="14.00">4</text>
<polygon fill="none" stroke="black" points="1880.5,-467 1880.5,-490 1975.5,-490 1975.5,-467 1880.5,-467"/>
<text text-anchor="start" x="1890" y="-474.8" font-family="arial" font-size="14.00">USART2_Tx</text>
<polygon fill="none" stroke="black" points="1844.5,-444 1844.5,-467 1880.5,-467 1880.5,-444 1844.5,-444"/>
<text text-anchor="start" x="1858.5" y="-451.8" font-family="arial" font-size="14.00">5</text>
<polygon fill="none" stroke="black" points="1880.5,-444 1880.5,-467 1975.5,-467 1975.5,-444 1880.5,-444"/>
<text text-anchor="start" x="1893.5" y="-451.8" font-family="arial" font-size="14.00">UART0_Rx</text>
<polygon fill="none" stroke="black" points="1844.5,-421 1844.5,-444 1880.5,-444 1880.5,-421 1844.5,-421"/>
<text text-anchor="start" x="1858.5" y="-428.8" font-family="arial" font-size="14.00">6</text>
<polygon fill="none" stroke="black" points="1880.5,-421 1880.5,-444 1975.5,-444 1975.5,-421 1880.5,-421"/>
<text text-anchor="start" x="1924.5" y="-428.8" font-family="arial" font-size="14.00">x</text>
<polygon fill="none" stroke="black" points="1844.5,-398 1844.5,-421 1880.5,-421 1880.5,-398 1844.5,-398"/>
<text text-anchor="start" x="1858.5" y="-405.8" font-family="arial" font-size="14.00">7</text>
<polygon fill="none" stroke="black" points="1880.5,-398 1880.5,-421 1975.5,-421 1975.5,-398 1880.5,-398"/>
<text text-anchor="start" x="1924.5" y="-405.8" font-family="arial" font-size="14.00">x</text>
<polygon fill="none" stroke="black" points="1844.5,-375 1844.5,-398 1880.5,-398 1880.5,-375 1844.5,-375"/>
<text text-anchor="start" x="1858.5" y="-382.8" font-family="arial" font-size="14.00">8</text>
<polygon fill="none" stroke="black" points="1880.5,-375 1880.5,-398 1975.5,-398 1975.5,-375 1880.5,-375"/>
<text text-anchor="start" x="1924.5" y="-382.8" font-family="arial" font-size="14.00">x</text>
<polygon fill="none" stroke="black" points="1844.5,-352 1844.5,-375 1880.5,-375 1880.5,-352 1844.5,-352"/>
<text text-anchor="start" x="1858.5" y="-359.8" font-family="arial" font-size="14.00">9</text>
<polygon fill="none" stroke="black" points="1880.5,-352 1880.5,-375 1975.5,-375 1975.5,-352 1880.5,-352"/>
<text text-anchor="start" x="1924.5" y="-359.8" font-family="arial" font-size="14.00">x</text>
<polygon fill="none" stroke="black" points="1844.5,-329 1844.5,-352 1880.5,-352 1880.5,-329 1844.5,-329"/>
<text text-anchor="start" x="1854.5" y="-336.8" font-family="arial" font-size="14.00">10</text>
<polygon fill="none" stroke="black" points="1880.5,-329 1880.5,-352 1975.5,-352 1975.5,-329 1880.5,-329"/>
<text text-anchor="start" x="1894.5" y="-336.8" font-family="arial" font-size="14.00">UART0_Tx</text>
<polygon fill="none" stroke="black" points="1975.5,-329 1975.5,-559 2157.5,-559 2157.5,-329 1975.5,-329"/>
<image xlink:href="icons/debug-connector.png" width="174px" height="144px" preserveAspectRatio="xMinYMin meet" x="1979.5" y="-516"/>
<polygon fill="none" stroke="black" points="1844.5,-306 1844.5,-329 2157.5,-329 2157.5,-306 1844.5,-306"/>
<text text-anchor="start" x="1932" y="-313.8" font-family="arial" font-size="14.00">Additional components</text>
<polygon fill="none" stroke="black" points="1844.5,-283 1844.5,-306 2157.5,-306 2157.5,-283 1844.5,-283"/>
<text text-anchor="start" x="1931" y="-290.8" font-family="arial" font-size="14.00">10 x #7 (Harwin Crimp)</text>
</g>
<!-- Molex CAN 2 -->
<g id="node5" class="node">
<title>Molex CAN 2</title>
<polygon fill="#ffffff" stroke="black" points="2147,-1154.5 1854,-1154.5 1854,-915.5 2147,-915.5 2147,-1154.5"/>
<polygon fill="none" stroke="black" points="1854.5,-1131 1854.5,-1154 2147.5,-1154 2147.5,-1131 1854.5,-1131"/>
<text text-anchor="start" x="1960.5" y="-1138.8" font-family="arial" font-size="14.00">Molex CAN 2</text>
<polygon fill="none" stroke="black" points="1854.5,-1108 1854.5,-1131 2147.5,-1131 2147.5,-1108 1854.5,-1108"/>
<text text-anchor="start" x="1939" y="-1115.8" font-family="arial" font-size="14.00">Molex: 505565&#45;0301</text>
<polygon fill="none" stroke="black" points="1854.5,-1085 1854.5,-1108 2000.5,-1108 2000.5,-1085 1854.5,-1085"/>
<text text-anchor="start" x="1858.5" y="-1092.8" font-family="arial" font-size="14.00">Molex Micro&#45;Lock Plus</text>
<polygon fill="none" stroke="black" points="2000.5,-1085 2000.5,-1108 2108.5,-1108 2108.5,-1085 2000.5,-1085"/>
<text text-anchor="start" x="2004.5" y="-1092.8" font-family="arial" font-size="14.00">Socket (Female)</text>
<polygon fill="none" stroke="black" points="2108.5,-1085 2108.5,-1108 2147.5,-1108 2147.5,-1085 2108.5,-1085"/>
<text text-anchor="start" x="2112.5" y="-1092.8" font-family="arial" font-size="14.00">3&#45;pin</text>
<polygon fill="none" stroke="black" points="1854.5,-1043 1854.5,-1085 1876.5,-1085 1876.5,-1043 1854.5,-1043"/>
<text text-anchor="start" x="1861.5" y="-1060.3" font-family="arial" font-size="14.00">1</text>
<polygon fill="none" stroke="black" points="1876.5,-1043 1876.5,-1085 1976.5,-1085 1976.5,-1043 1876.5,-1043"/>
<text text-anchor="start" x="1884.5" y="-1060.3" font-family="arial" font-size="14.00">CAN_LOW_2</text>
<polygon fill="none" stroke="black" points="1854.5,-1002 1854.5,-1043 1876.5,-1043 1876.5,-1002 1854.5,-1002"/>
<text text-anchor="start" x="1861.5" y="-1018.8" font-family="arial" font-size="14.00">2</text>
<polygon fill="none" stroke="black" points="1876.5,-1002 1876.5,-1043 1976.5,-1043 1976.5,-1002 1876.5,-1002"/>
<text text-anchor="start" x="1883.5" y="-1018.8" font-family="arial" font-size="14.00">CAN_HIGN_2</text>
<polygon fill="none" stroke="black" points="1854.5,-961 1854.5,-1002 1876.5,-1002 1876.5,-961 1854.5,-961"/>
<text text-anchor="start" x="1861.5" y="-977.8" font-family="arial" font-size="14.00">3</text>
<polygon fill="none" stroke="black" points="1876.5,-961 1876.5,-1002 1976.5,-1002 1976.5,-961 1876.5,-961"/>
<text text-anchor="start" x="1911" y="-977.8" font-family="arial" font-size="14.00">GND</text>
<polygon fill="none" stroke="black" points="1976.5,-961 1976.5,-1085 2147.5,-1085 2147.5,-961 1976.5,-961"/>
<image xlink:href="icons/can-connector.png" width="163px" height="116px" preserveAspectRatio="xMinYMin meet" x="1980.5" y="-1081"/>
<polygon fill="none" stroke="black" points="1854.5,-938 1854.5,-961 2147.5,-961 2147.5,-938 1854.5,-938"/>
<text text-anchor="start" x="1932" y="-945.8" font-family="arial" font-size="14.00">Additional components</text>
<polygon fill="none" stroke="black" points="1854.5,-915 1854.5,-938 2147.5,-938 2147.5,-915 1854.5,-915"/>
<text text-anchor="start" x="1937.5" y="-922.8" font-family="arial" font-size="14.00">3 x #8 (Molex Crimp)</text>
</g>
<!-- Molex CAN 1 -->
<g id="node6" class="node">
<title>Molex CAN 1</title>
<polygon fill="#ffffff" stroke="black" points="2147,-891.5 1854,-891.5 1854,-652.5 2147,-652.5 2147,-891.5"/>
<polygon fill="none" stroke="black" points="1854.5,-868 1854.5,-891 2147.5,-891 2147.5,-868 1854.5,-868"/>
<text text-anchor="start" x="1960.5" y="-875.8" font-family="arial" font-size="14.00">Molex CAN 1</text>
<polygon fill="none" stroke="black" points="1854.5,-845 1854.5,-868 2147.5,-868 2147.5,-845 1854.5,-845"/>
<text text-anchor="start" x="1939" y="-852.8" font-family="arial" font-size="14.00">Molex: 505565&#45;0301</text>
<polygon fill="none" stroke="black" points="1854.5,-822 1854.5,-845 2000.5,-845 2000.5,-822 1854.5,-822"/>
<text text-anchor="start" x="1858.5" y="-829.8" font-family="arial" font-size="14.00">Molex Micro&#45;Lock Plus</text>
<polygon fill="none" stroke="black" points="2000.5,-822 2000.5,-845 2108.5,-845 2108.5,-822 2000.5,-822"/>
<text text-anchor="start" x="2004.5" y="-829.8" font-family="arial" font-size="14.00">Socket (Female)</text>
<polygon fill="none" stroke="black" points="2108.5,-822 2108.5,-845 2147.5,-845 2147.5,-822 2108.5,-822"/>
<text text-anchor="start" x="2112.5" y="-829.8" font-family="arial" font-size="14.00">3&#45;pin</text>
<polygon fill="none" stroke="black" points="1854.5,-780 1854.5,-822 1876.5,-822 1876.5,-780 1854.5,-780"/>
<text text-anchor="start" x="1861.5" y="-797.3" font-family="arial" font-size="14.00">1</text>
<polygon fill="none" stroke="black" points="1876.5,-780 1876.5,-822 1976.5,-822 1976.5,-780 1876.5,-780"/>
<text text-anchor="start" x="1884.5" y="-797.3" font-family="arial" font-size="14.00">CAN_LOW_1</text>
<polygon fill="none" stroke="black" points="1854.5,-739 1854.5,-780 1876.5,-780 1876.5,-739 1854.5,-739"/>
<text text-anchor="start" x="1861.5" y="-755.8" font-family="arial" font-size="14.00">2</text>
<polygon fill="none" stroke="black" points="1876.5,-739 1876.5,-780 1976.5,-780 1976.5,-739 1876.5,-739"/>
<text text-anchor="start" x="1883.5" y="-755.8" font-family="arial" font-size="14.00">CAN_HIGN_1</text>
<polygon fill="none" stroke="black" points="1854.5,-698 1854.5,-739 1876.5,-739 1876.5,-698 1854.5,-698"/>
<text text-anchor="start" x="1861.5" y="-714.8" font-family="arial" font-size="14.00">3</text>
<polygon fill="none" stroke="black" points="1876.5,-698 1876.5,-739 1976.5,-739 1976.5,-698 1876.5,-698"/>
<text text-anchor="start" x="1911" y="-714.8" font-family="arial" font-size="14.00">GND</text>
<polygon fill="none" stroke="black" points="1976.5,-698 1976.5,-822 2147.5,-822 2147.5,-698 1976.5,-698"/>
<image xlink:href="icons/can-connector.png" width="163px" height="116px" preserveAspectRatio="xMinYMin meet" x="1980.5" y="-818"/>
<polygon fill="none" stroke="black" points="1854.5,-675 1854.5,-698 2147.5,-698 2147.5,-675 1854.5,-675"/>
<text text-anchor="start" x="1932" y="-682.8" font-family="arial" font-size="14.00">Additional components</text>
<polygon fill="none" stroke="black" points="1854.5,-652 1854.5,-675 2147.5,-675 2147.5,-652 1854.5,-652"/>
<text text-anchor="start" x="1937.5" y="-659.8" font-family="arial" font-size="14.00">3 x #8 (Molex Crimp)</text>
</g>
<!-- Hidden1 -->
<!-- Unconnected Cable 1 -->
<g id="node14" class="node">
<title>Unconnected Cable 1</title>
<polygon fill="#ffffff" stroke="black" stroke-dasharray="5,2" points="1210,-500 932,-500 932,-270 1210,-270 1210,-500"/>
<polygon fill="none" stroke="black" points="932,-477 932,-500 1210,-500 1210,-477 932,-477"/>
<text text-anchor="start" x="1006" y="-484.8" font-family="arial" font-size="14.00">Unconnected Cable 1</text>
<polygon fill="none" stroke="black" points="932,-454 932,-477 1210,-477 1210,-454 932,-454"/>
<text text-anchor="start" x="991" y="-461.8" font-family="arial" font-size="14.00">Alpha Wire: 2843/1 BK005</text>
<polygon fill="none" stroke="black" points="932,-431 932,-454 1062,-454 1062,-431 932,-431"/>
<text text-anchor="start" x="936" y="-438.8" font-family="arial" font-size="14.00">PTFE Hook&#45;up Wire</text>
<polygon fill="none" stroke="black" points="1062,-431 1062,-454 1085,-454 1085,-431 1062,-431"/>
<text text-anchor="start" x="1066" y="-438.8" font-family="arial" font-size="14.00">4x</text>
<polygon fill="none" stroke="black" points="1085,-431 1085,-454 1145,-454 1145,-431 1085,-431"/>
<text text-anchor="start" x="1089" y="-438.8" font-family="arial" font-size="14.00">26 AWG</text>
<polygon fill="none" stroke="black" points="1145,-431 1145,-454 1210,-454 1210,-431 1145,-431"/>
<text text-anchor="start" x="1149" y="-438.8" font-family="arial" font-size="14.00">123.0 cm</text>
<text text-anchor="start" x="968.5" y="-417.8" font-family="arial" font-size="14.00"> </text>
<text text-anchor="start" x="1045.5" y="-398.8" font-family="arial" font-size="14.00"> &#160;&#160;&#160;&#160;GN &#160;&#160;&#160;</text>
<polygon fill="#000000" stroke="transparent" points="932,-391 932,-393 1210,-393 1210,-391 932,-391"/>
<polygon fill="#00ff00" stroke="transparent" points="932,-389 932,-391 1210,-391 1210,-389 932,-389"/>
<polygon fill="#000000" stroke="transparent" points="932,-387 932,-389 1210,-389 1210,-387 932,-387"/>
<text text-anchor="start" x="1045.5" y="-373.8" font-family="arial" font-size="14.00"> &#160;&#160;&#160;&#160;GN &#160;&#160;&#160;</text>
<polygon fill="#000000" stroke="transparent" points="932,-366 932,-368 1210,-368 1210,-366 932,-366"/>
<polygon fill="#00ff00" stroke="transparent" points="932,-364 932,-366 1210,-366 1210,-364 932,-364"/>
<polygon fill="#000000" stroke="transparent" points="932,-362 932,-364 1210,-364 1210,-362 932,-362"/>
<text text-anchor="start" x="1045.5" y="-348.8" font-family="arial" font-size="14.00"> &#160;&#160;&#160;&#160;GN &#160;&#160;&#160;</text>
<polygon fill="#000000" stroke="transparent" points="932,-341 932,-343 1210,-343 1210,-341 932,-341"/>
<polygon fill="#00ff00" stroke="transparent" points="932,-339 932,-341 1210,-341 1210,-339 932,-339"/>
<polygon fill="#000000" stroke="transparent" points="932,-337 932,-339 1210,-339 1210,-337 932,-337"/>
<text text-anchor="start" x="1045.5" y="-323.8" font-family="arial" font-size="14.00"> &#160;&#160;&#160;&#160;GN &#160;&#160;&#160;</text>
<polygon fill="#000000" stroke="transparent" points="932,-316 932,-318 1210,-318 1210,-316 932,-316"/>
<polygon fill="#00ff00" stroke="transparent" points="932,-314 932,-316 1210,-316 1210,-314 932,-314"/>
<polygon fill="#000000" stroke="transparent" points="932,-312 932,-314 1210,-314 1210,-312 932,-312"/>
<text text-anchor="start" x="968.5" y="-298.8" font-family="arial" font-size="14.00"> </text>
<polygon fill="none" stroke="black" points="932,-270 932,-293 1210,-293 1210,-270 932,-270"/>
<text text-anchor="start" x="946" y="-277.8" font-family="arial" font-size="14.00">Wires are left unconnected on both sides.</text>
</g>
<!-- Hidden1&#45;&#45;Unconnected Cable 1 -->
<g id="edge47" class="edge">
<title>Hidden1:e&#45;&#45;Unconnected Cable 1:w</title>
<path fill="none" stroke="#000000" stroke-width="2" d="M158.5,-362C502.61,-362.09 588.05,-388.09 931,-388"/>
<path fill="none" stroke="#00ff00" stroke-width="2" d="M158.5,-364C502.03,-364 587.47,-390 931,-390"/>
<path fill="none" stroke="#000000" stroke-width="2" d="M158.5,-366C501.45,-365.91 586.89,-391.91 931,-392"/>
</g>
<!-- Hidden1&#45;&#45;Unconnected Cable 1 -->
<g id="edge49" class="edge">
<title>Hidden1:e&#45;&#45;Unconnected Cable 1:w</title>
<path fill="none" stroke="#000000" stroke-width="2" d="M158.5,-339C502.54,-339.07 588.04,-363.07 931,-363"/>
<path fill="none" stroke="#00ff00" stroke-width="2" d="M158.5,-341C502,-341 587.5,-365 931,-365"/>
<path fill="none" stroke="#000000" stroke-width="2" d="M158.5,-343C501.46,-342.93 586.96,-366.93 931,-367"/>
</g>
<!-- Hidden1&#45;&#45;Unconnected Cable 1 -->
<g id="edge51" class="edge">
<title>Hidden1:e&#45;&#45;Unconnected Cable 1:w</title>
<path fill="none" stroke="#000000" stroke-width="2" d="M158.5,-315C502.5,-315.07 588.03,-338.07 931,-338"/>
<path fill="none" stroke="#00ff00" stroke-width="2" d="M158.5,-317C501.99,-317 587.51,-340 931,-340"/>
<path fill="none" stroke="#000000" stroke-width="2" d="M158.5,-319C501.47,-318.93 587,-341.93 931,-342"/>
</g>
<!-- Hidden1&#45;&#45;Unconnected Cable 1 -->
<g id="edge53" class="edge">
<title>Hidden1:e&#45;&#45;Unconnected Cable 1:w</title>
<path fill="none" stroke="#000000" stroke-width="2" d="M158.5,-292C502.44,-292.06 588.02,-313.06 931,-313"/>
<path fill="none" stroke="#00ff00" stroke-width="2" d="M158.5,-294C501.96,-294 587.54,-315 931,-315"/>
<path fill="none" stroke="#000000" stroke-width="2" d="M158.5,-296C501.48,-295.94 587.06,-316.94 931,-317"/>
</g>
<!-- Hidden2 -->
<!-- Hidden3 -->
<!-- Unconnected Cable 2 -->
<g id="node15" class="node">
<title>Unconnected Cable 2</title>
<polygon fill="#ffffff" stroke="black" stroke-dasharray="5,2" points="1210,-246 932,-246 932,-16 1210,-16 1210,-246"/>
<polygon fill="none" stroke="black" points="932,-223 932,-246 1210,-246 1210,-223 932,-223"/>
<text text-anchor="start" x="1006" y="-230.8" font-family="arial" font-size="14.00">Unconnected Cable 2</text>
<polygon fill="none" stroke="black" points="932,-200 932,-223 1210,-223 1210,-200 932,-200"/>
<text text-anchor="start" x="991" y="-207.8" font-family="arial" font-size="14.00">Alpha Wire: 2843/1 BK005</text>
<polygon fill="none" stroke="black" points="932,-177 932,-200 1062,-200 1062,-177 932,-177"/>
<text text-anchor="start" x="936" y="-184.8" font-family="arial" font-size="14.00">PTFE Hook&#45;up Wire</text>
<polygon fill="none" stroke="black" points="1062,-177 1062,-200 1085,-200 1085,-177 1062,-177"/>
<text text-anchor="start" x="1066" y="-184.8" font-family="arial" font-size="14.00">4x</text>
<polygon fill="none" stroke="black" points="1085,-177 1085,-200 1145,-200 1145,-177 1085,-177"/>
<text text-anchor="start" x="1089" y="-184.8" font-family="arial" font-size="14.00">26 AWG</text>
<polygon fill="none" stroke="black" points="1145,-177 1145,-200 1210,-200 1210,-177 1145,-177"/>
<text text-anchor="start" x="1149" y="-184.8" font-family="arial" font-size="14.00">123.0 cm</text>
<text text-anchor="start" x="968.5" y="-163.8" font-family="arial" font-size="14.00"> </text>
<text text-anchor="start" x="1045.5" y="-144.8" font-family="arial" font-size="14.00"> &#160;&#160;&#160;&#160;GN &#160;&#160;&#160;</text>
<polygon fill="#000000" stroke="transparent" points="932,-137 932,-139 1210,-139 1210,-137 932,-137"/>
<polygon fill="#00ff00" stroke="transparent" points="932,-135 932,-137 1210,-137 1210,-135 932,-135"/>
<polygon fill="#000000" stroke="transparent" points="932,-133 932,-135 1210,-135 1210,-133 932,-133"/>
<text text-anchor="start" x="1045.5" y="-119.8" font-family="arial" font-size="14.00"> &#160;&#160;&#160;&#160;GN &#160;&#160;&#160;</text>
<polygon fill="#000000" stroke="transparent" points="932,-112 932,-114 1210,-114 1210,-112 932,-112"/>
<polygon fill="#00ff00" stroke="transparent" points="932,-110 932,-112 1210,-112 1210,-110 932,-110"/>
<polygon fill="#000000" stroke="transparent" points="932,-108 932,-110 1210,-110 1210,-108 932,-108"/>
<text text-anchor="start" x="1045.5" y="-94.8" font-family="arial" font-size="14.00"> &#160;&#160;&#160;&#160;GN &#160;&#160;&#160;</text>
<polygon fill="#000000" stroke="transparent" points="932,-87 932,-89 1210,-89 1210,-87 932,-87"/>
<polygon fill="#00ff00" stroke="transparent" points="932,-85 932,-87 1210,-87 1210,-85 932,-85"/>
<polygon fill="#000000" stroke="transparent" points="932,-83 932,-85 1210,-85 1210,-83 932,-83"/>
<text text-anchor="start" x="1045.5" y="-69.8" font-family="arial" font-size="14.00"> &#160;&#160;&#160;&#160;GN &#160;&#160;&#160;</text>
<polygon fill="#000000" stroke="transparent" points="932,-62 932,-64 1210,-64 1210,-62 932,-62"/>
<polygon fill="#00ff00" stroke="transparent" points="932,-60 932,-62 1210,-62 1210,-60 932,-60"/>
<polygon fill="#000000" stroke="transparent" points="932,-58 932,-60 1210,-60 1210,-58 932,-58"/>
<text text-anchor="start" x="968.5" y="-44.8" font-family="arial" font-size="14.00"> </text>
<polygon fill="none" stroke="black" points="932,-16 932,-39 1210,-39 1210,-16 932,-16"/>
<text text-anchor="start" x="946" y="-23.8" font-family="arial" font-size="14.00">Wires are left unconnected on both sides.</text>
</g>
<!-- Hidden3&#45;&#45;Unconnected Cable 2 -->
<g id="edge55" class="edge">
<title>Hidden3:e&#45;&#45;Unconnected Cable 2:w</title>
<path fill="none" stroke="#000000" stroke-width="2" d="M158.5,-132C501.88,-132 587.71,-134 931,-134"/>
<path fill="none" stroke="#00ff00" stroke-width="2" d="M158.5,-134C501.83,-134 587.67,-136 931,-136"/>
<path fill="none" stroke="#000000" stroke-width="2" d="M158.5,-136C501.79,-136 587.62,-138 931,-138"/>
</g>
<!-- Hidden3&#45;&#45;Unconnected Cable 2 -->
<g id="edge57" class="edge">
<title>Hidden3:e&#45;&#45;Unconnected Cable 2:w</title>
<path fill="none" stroke="#000000" stroke-width="2" d="M158.5,-109C501.83,-109 587.67,-109 931,-109"/>
<path fill="none" stroke="#00ff00" stroke-width="2" d="M158.5,-111C501.83,-111 587.67,-111 931,-111"/>
<path fill="none" stroke="#000000" stroke-width="2" d="M158.5,-113C501.83,-113 587.67,-113 931,-113"/>
</g>
<!-- Hidden3&#45;&#45;Unconnected Cable 2 -->
<g id="edge59" class="edge">
<title>Hidden3:e&#45;&#45;Unconnected Cable 2:w</title>
<path fill="none" stroke="#000000" stroke-width="2" d="M158.5,-85C501.81,-85 587.64,-84 931,-84"/>
<path fill="none" stroke="#00ff00" stroke-width="2" d="M158.5,-87C501.83,-87 587.67,-86 931,-86"/>
<path fill="none" stroke="#000000" stroke-width="2" d="M158.5,-89C501.86,-89 587.69,-88 931,-88"/>
</g>
<!-- Hidden3&#45;&#45;Unconnected Cable 2 -->
<g id="edge61" class="edge">
<title>Hidden3:e&#45;&#45;Unconnected Cable 2:w</title>
<path fill="none" stroke="#000000" stroke-width="2" d="M158.5,-62C501.77,-62 587.59,-59 931,-59"/>
<path fill="none" stroke="#00ff00" stroke-width="2" d="M158.5,-64C501.84,-64 587.66,-61 931,-61"/>
<path fill="none" stroke="#000000" stroke-width="2" d="M158.5,-66C501.91,-66 587.73,-63 931,-63"/>
</g>
<!-- Hidden4 -->
<!-- Power Cable&#45;&#45;Harwin Gecko Power 1 -->
<g id="edge2" class="edge">
<title>Power Cable:e&#45;&#45;Harwin Gecko Power 1:w</title>
<path fill="none" stroke="#000000" stroke-width="2" d="M1229,-1459C1507.5,-1459.99 1567.95,-1563.99 1843,-1563"/>
<path fill="none" stroke="#0066ff" stroke-width="2" d="M1229,-1461C1505.78,-1461 1566.22,-1565 1843,-1565"/>
<path fill="none" stroke="#000000" stroke-width="2" d="M1229,-1463C1504.05,-1462.01 1564.5,-1566.01 1843,-1567"/>
</g>
<!-- Power Cable&#45;&#45;Harwin Gecko Power 1 -->
<g id="edge4" class="edge">
<title>Power Cable:e&#45;&#45;Harwin Gecko Power 1:w</title>
<path fill="none" stroke="#000000" stroke-width="2" d="M1229,-1434C1519.52,-1435.66 1556.42,-1646.66 1843,-1645"/>
<path fill="none" stroke="#0066ff" stroke-width="2" d="M1229,-1436C1517.55,-1436 1554.45,-1647 1843,-1647"/>
<path fill="none" stroke="#000000" stroke-width="2" d="M1229,-1438C1515.58,-1436.34 1552.48,-1647.34 1843,-1649"/>
</g>
<!-- Power Cable&#45;&#45;Harwin Gecko Power 1 -->
<g id="edge6" class="edge">
<title>Power Cable:e&#45;&#45;Harwin Gecko Power 1:w</title>
<path fill="none" stroke="#000000" stroke-width="2" d="M1229,-1409C1527.86,-1410.85 1548.12,-1673.85 1843,-1672"/>
<path fill="none" stroke="#0066ff" stroke-width="2" d="M1229,-1411C1525.87,-1411 1546.13,-1674 1843,-1674"/>
<path fill="none" stroke="#000000" stroke-width="2" d="M1229,-1413C1523.88,-1411.15 1544.14,-1674.15 1843,-1676"/>
</g>
<!-- Power Cable&#45;&#45;Harwin Gecko Power 1 -->
<g id="edge8" class="edge">
<title>Power Cable:e&#45;&#45;Harwin Gecko Power 1:w</title>
<path fill="none" stroke="#000000" stroke-width="2" d="M1229,-1384C1518.8,-1385.63 1557.13,-1591.63 1843,-1590"/>
<path fill="none" stroke="#0066ff" stroke-width="2" d="M1229,-1386C1516.84,-1386 1555.16,-1592 1843,-1592"/>
<path fill="none" stroke="#000000" stroke-width="2" d="M1229,-1388C1514.87,-1386.37 1553.2,-1592.37 1843,-1594"/>
</g>
<!-- Power Cable&#45;&#45;Harwin Gecko Power 1 -->
<g id="edge10" class="edge">
<title>Power Cable:e&#45;&#45;Harwin Gecko Power 1:w</title>
<path fill="none" stroke="#000000" stroke-width="2" d="M1229,-1359C1527.17,-1360.83 1548.82,-1619.83 1843,-1618"/>
<path fill="none" stroke="#0066ff" stroke-width="2" d="M1229,-1361C1525.17,-1361 1546.83,-1620 1843,-1620"/>
<path fill="none" stroke="#000000" stroke-width="2" d="M1229,-1363C1523.18,-1361.17 1544.83,-1620.17 1843,-1622"/>
</g>
<!-- Power Cable&#45;&#45;Harwin Gecko Power 1 -->
<g id="edge12" class="edge">
<title>Power Cable:e&#45;&#45;Harwin Gecko Power 1:w</title>
<path fill="none" stroke="#000000" stroke-width="2" d="M1229,-1334C1518.24,-1335.62 1557.69,-1537.62 1843,-1536"/>
<path fill="none" stroke="#0066ff" stroke-width="2" d="M1229,-1336C1516.28,-1336 1555.72,-1538 1843,-1538"/>
<path fill="none" stroke="#000000" stroke-width="2" d="M1229,-1338C1514.31,-1336.38 1553.76,-1538.38 1843,-1540"/>
</g>
<!-- Power Cable&#45;&#45;Harwin Gecko Power 2 -->
<g id="edge14" class="edge">
<title>Power Cable:e&#45;&#45;Harwin Gecko Power 2:w</title>
<path fill="none" stroke="#000000" stroke-width="2" d="M1229,-1309C1501.53,-1309.37 1568.16,-1262.37 1843,-1262"/>
<path fill="none" stroke="#ff0000" stroke-width="2" d="M1229,-1311C1502.69,-1311 1569.31,-1264 1843,-1264"/>
<path fill="none" stroke="#000000" stroke-width="2" d="M1229,-1313C1503.84,-1312.63 1570.47,-1265.63 1843,-1266"/>
</g>
<!-- Power Cable&#45;&#45;Harwin Gecko Power 2 -->
<g id="edge16" class="edge">
<title>Power Cable:e&#45;&#45;Harwin Gecko Power 2:w</title>
<path fill="none" stroke="#000000" stroke-width="2" d="M1229,-1284C1504.54,-1284.52 1570.16,-1344.52 1843,-1344"/>
<path fill="none" stroke="#ff0000" stroke-width="2" d="M1229,-1286C1503.19,-1286 1568.81,-1346 1843,-1346"/>
<path fill="none" stroke="#000000" stroke-width="2" d="M1229,-1288C1501.84,-1287.48 1567.46,-1347.48 1843,-1348"/>
</g>
<!-- Power Cable&#45;&#45;Harwin Gecko Power 2 -->
<g id="edge18" class="edge">
<title>Power Cable:e&#45;&#45;Harwin Gecko Power 2:w</title>
<path fill="none" stroke="#000000" stroke-width="2" d="M1229,-1259C1504.43,-1259.5 1570.22,-1317.5 1843,-1317"/>
<path fill="none" stroke="#ff0000" stroke-width="2" d="M1229,-1261C1503.1,-1261 1568.9,-1319 1843,-1319"/>
<path fill="none" stroke="#000000" stroke-width="2" d="M1229,-1263C1501.78,-1262.5 1567.57,-1320.5 1843,-1321"/>
</g>
<!-- Power Cable&#45;&#45;Harwin Gecko Power 2 -->
<g id="edge20" class="edge">
<title>Power Cable:e&#45;&#45;Harwin Gecko Power 2:w</title>
<path fill="none" stroke="#000000" stroke-width="2" d="M1229,-1234C1504.26,-1234.46 1570.3,-1289.46 1843,-1289"/>
<path fill="none" stroke="#ff0000" stroke-width="2" d="M1229,-1236C1502.98,-1236 1569.02,-1291 1843,-1291"/>
<path fill="none" stroke="#000000" stroke-width="2" d="M1229,-1238C1501.7,-1237.54 1567.74,-1292.54 1843,-1293"/>
</g>
<!-- Power Cable&#45;&#45;Harwin Gecko Power 2 -->
<g id="edge22" class="edge">
<title>Power Cable:e&#45;&#45;Harwin Gecko Power 2:w</title>
<path fill="none" stroke="#000000" stroke-width="2" d="M1229,-1209C1513.14,-1210.42 1562.69,-1372.42 1843,-1371"/>
<path fill="none" stroke="#ff0000" stroke-width="2" d="M1229,-1211C1511.23,-1211 1560.77,-1373 1843,-1373"/>
<path fill="none" stroke="#000000" stroke-width="2" d="M1229,-1213C1509.31,-1211.58 1558.86,-1373.58 1843,-1375"/>
</g>
<!-- Power Cable&#45;&#45;Harwin Gecko Power 2 -->
<g id="edge24" class="edge">
<title>Power Cable:e&#45;&#45;Harwin Gecko Power 2:w</title>
<path fill="none" stroke="#000000" stroke-width="2" d="M1229,-1184C1504.1,-1184.43 1570.37,-1236.43 1843,-1236"/>
<path fill="none" stroke="#ff0000" stroke-width="2" d="M1229,-1186C1502.87,-1186 1569.13,-1238 1843,-1238"/>
<path fill="none" stroke="#000000" stroke-width="2" d="M1229,-1188C1501.63,-1187.57 1567.9,-1239.57 1843,-1240"/>
</g>
<!-- Debug Cable&#45;&#45;Harwin Gecko Debug -->
<g id="edge26" class="edge">
<title>Debug Cable:e&#45;&#45;Harwin Gecko Debug:w</title>
<path fill="none" stroke="#000000" stroke-width="2" d="M1252,-644C1516.76,-644.97 1575.31,-546.97 1843.5,-546"/>
<path fill="none" stroke="#ff8000" stroke-width="2" d="M1252,-646C1518.47,-646 1577.03,-548 1843.5,-548"/>
<path fill="none" stroke="#000000" stroke-width="2" d="M1252,-648C1520.19,-647.03 1578.74,-549.03 1843.5,-550"/>
</g>
<!-- Debug Cable&#45;&#45;Harwin Gecko Debug -->
<g id="edge28" class="edge">
<title>Debug Cable:e&#45;&#45;Harwin Gecko Debug:w</title>
<path fill="none" stroke="#000000" stroke-width="2" d="M1252,-619C1516.62,-619.95 1575.47,-523.95 1843.5,-523"/>
<path fill="none" stroke="#ff8000" stroke-width="2" d="M1252,-621C1518.33,-621 1577.17,-525 1843.5,-525"/>
<path fill="none" stroke="#000000" stroke-width="2" d="M1252,-623C1520.03,-622.05 1578.88,-526.05 1843.5,-527"/>
</g>
<!-- Debug Cable&#45;&#45;Harwin Gecko Debug -->
<g id="edge30" class="edge">
<title>Debug Cable:e&#45;&#45;Harwin Gecko Debug:w</title>
<path fill="none" stroke="#000000" stroke-width="2" d="M1252,-594C1518.18,-595.14 1573.71,-478.14 1843.5,-477"/>
<path fill="none" stroke="#ff8000" stroke-width="2" d="M1252,-596C1519.98,-596 1575.52,-479 1843.5,-479"/>
<path fill="none" stroke="#000000" stroke-width="2" d="M1252,-598C1521.79,-596.86 1577.32,-479.86 1843.5,-481"/>
</g>
<!-- Debug Cable&#45;&#45;Harwin Gecko Debug -->
<g id="edge32" class="edge">
<title>Debug Cable:e&#45;&#45;Harwin Gecko Debug:w</title>
<path fill="none" stroke="#000000" stroke-width="2" d="M1252,-569C1391.28,-569.58 1423.55,-537.7 1562.61,-510.04 1686.32,-486.16 1714.78,-453.68 1843.5,-453"/>
<path fill="none" stroke="#ff8000" stroke-width="2" d="M1252,-571C1392.69,-571 1424.95,-539.12 1563,-512 1687.83,-487.48 1716.29,-455 1843.5,-455"/>
<path fill="none" stroke="#000000" stroke-width="2" d="M1252,-573C1394.09,-572.42 1426.36,-540.54 1563.39,-513.96 1689.33,-488.8 1717.79,-456.32 1843.5,-457"/>
</g>
<!-- Debug Cable&#45;&#45;Harwin Gecko Debug -->
<g id="edge34" class="edge">
<title>Debug Cable:e&#45;&#45;Harwin Gecko Debug:w</title>
<path fill="none" stroke="#000000" stroke-width="2" d="M1252,-544C1391.57,-544.07 1431.96,-555.06 1562.35,-510.11 1699.37,-464.75 1695.26,-340.07 1843.5,-338"/>
<path fill="none" stroke="#ff8000" stroke-width="2" d="M1252,-546C1391.05,-546 1431.43,-556.99 1563,-512 1701.37,-464.68 1697.26,-340 1843.5,-340"/>
<path fill="none" stroke="#000000" stroke-width="2" d="M1252,-548C1390.52,-547.93 1430.91,-558.92 1563.65,-513.89 1703.37,-464.62 1699.26,-339.93 1843.5,-342"/>
</g>
<!-- CAN Cable&#45;&#45;Molex CAN 2 -->
<g id="edge36" class="edge">
<title>CAN Cable:e&#45;&#45;Molex CAN 2:w</title>
<path fill="none" stroke="#000000" stroke-width="2" d="M1287,-1028C1540.19,-1028.25 1602.23,-1062.25 1853.5,-1062"/>
<path fill="none" stroke="#000000" stroke-width="2" d="M1287,-1030C1539.23,-1030 1601.27,-1064 1853.5,-1064"/>
<path fill="none" stroke="#000000" stroke-width="2" d="M1287,-1032C1538.27,-1031.75 1600.31,-1065.75 1853.5,-1066"/>
</g>
<!-- CAN Cable&#45;&#45;Molex CAN 2 -->
<g id="edge38" class="edge">
<title>CAN Cable:e&#45;&#45;Molex CAN 2:w</title>
<path fill="none" stroke="#000000" stroke-width="2" d="M1287,-1003C1539.41,-1003.07 1602.13,-1020.07 1853.5,-1020"/>
<path fill="none" stroke="#000000" stroke-width="2" d="M1287,-1005C1538.89,-1005 1601.61,-1022 1853.5,-1022"/>
<path fill="none" stroke="#000000" stroke-width="2" d="M1287,-1007C1538.37,-1006.93 1601.09,-1023.93 1853.5,-1024"/>
</g>
<!-- CAN Cable&#45;&#45;Molex CAN 2 -->
<g id="edge40" class="edge">
<title>CAN Cable:e&#45;&#45;Molex CAN 2:w</title>
<path fill="none" stroke="#000000" stroke-width="2" d="M1287,-913C1540.59,-913 1599.91,-981 1853.5,-981"/>
</g>
<!-- CAN Cable&#45;&#45;Molex CAN 1 -->
<g id="edge42" class="edge">
<title>CAN Cable:e&#45;&#45;Molex CAN 1:w</title>
<path fill="none" stroke="#000000" stroke-width="2" d="M1287,-978C1549.09,-979.58 1587.5,-800.58 1853.5,-799"/>
<path fill="none" stroke="#000000" stroke-width="2" d="M1287,-980C1551.05,-980 1589.45,-801 1853.5,-801"/>
<path fill="none" stroke="#000000" stroke-width="2" d="M1287,-982C1553,-980.42 1591.41,-801.42 1853.5,-803"/>
</g>
<!-- CAN Cable&#45;&#45;Molex CAN 1 -->
<g id="edge44" class="edge">
<title>CAN Cable:e&#45;&#45;Molex CAN 1:w</title>
<path fill="none" stroke="#000000" stroke-width="2" d="M1287,-953C1551.45,-954.66 1585.11,-758.66 1853.5,-757"/>
<path fill="none" stroke="#000000" stroke-width="2" d="M1287,-955C1553.42,-955 1587.08,-759 1853.5,-759"/>
<path fill="none" stroke="#000000" stroke-width="2" d="M1287,-957C1555.39,-955.34 1589.05,-759.34 1853.5,-761"/>
</g>
<!-- CAN Cable&#45;&#45;Molex CAN 1 -->
<g id="edge46" class="edge">
<title>CAN Cable:e&#45;&#45;Molex CAN 1:w</title>
<path fill="none" stroke="#000000" stroke-width="2" d="M1287,-913C1553.28,-913 1587.22,-718 1853.5,-718"/>
</g>
<!-- Unconnected Cable 1&#45;&#45;Hidden2 -->
<g id="edge48" class="edge">
<title>Unconnected Cable 1:e&#45;&#45;Hidden2:w</title>
<path fill="none" stroke="#000000" stroke-width="2" d="M1211,-388C1561.74,-389.06 1637.23,-248.06 1991.5,-247"/>
<path fill="none" stroke="#00ff00" stroke-width="2" d="M1211,-390C1563.5,-390 1639,-249 1991.5,-249"/>
<path fill="none" stroke="#000000" stroke-width="2" d="M1211,-392C1565.27,-390.94 1640.76,-249.94 1991.5,-251"/>
</g>
<!-- Unconnected Cable 1&#45;&#45;Hidden2 -->
<g id="edge50" class="edge">
<title>Unconnected Cable 1:e&#45;&#45;Hidden2:w</title>
<path fill="none" stroke="#000000" stroke-width="2" d="M1211,-363C1561.59,-364.04 1637.4,-225.04 1991.5,-224"/>
<path fill="none" stroke="#00ff00" stroke-width="2" d="M1211,-365C1563.35,-365 1639.15,-226 1991.5,-226"/>
<path fill="none" stroke="#000000" stroke-width="2" d="M1211,-367C1565.1,-365.96 1640.91,-226.96 1991.5,-228"/>
</g>
<!-- Unconnected Cable 1&#45;&#45;Hidden2 -->
<g id="edge52" class="edge">
<title>Unconnected Cable 1:e&#45;&#45;Hidden2:w</title>
<path fill="none" stroke="#000000" stroke-width="2" d="M1211,-338C1561.52,-339.04 1637.48,-201.04 1991.5,-200"/>
<path fill="none" stroke="#00ff00" stroke-width="2" d="M1211,-340C1563.27,-340 1639.23,-202 1991.5,-202"/>
<path fill="none" stroke="#000000" stroke-width="2" d="M1211,-342C1565.02,-340.96 1640.98,-202.96 1991.5,-204"/>
</g>
<!-- Unconnected Cable 1&#45;&#45;Hidden2 -->
<g id="edge54" class="edge">
<title>Unconnected Cable 1:e&#45;&#45;Hidden2:w</title>
<path fill="none" stroke="#000000" stroke-width="2" d="M1211,-313C1561.37,-314.02 1637.64,-178.02 1991.5,-177"/>
<path fill="none" stroke="#00ff00" stroke-width="2" d="M1211,-315C1563.12,-315 1639.38,-179 1991.5,-179"/>
<path fill="none" stroke="#000000" stroke-width="2" d="M1211,-317C1564.86,-315.98 1641.13,-179.98 1991.5,-181"/>
</g>
<!-- Unconnected Cable 2&#45;&#45;Hidden4 -->
<g id="edge56" class="edge">
<title>Unconnected Cable 2:e&#45;&#45;Hidden4:w</title>
<path fill="none" stroke="#000000" stroke-width="2" d="M1211,-134C1557.82,-134 1644.54,-131 1991.5,-131"/>
<path fill="none" stroke="#00ff00" stroke-width="2" d="M1211,-136C1557.89,-136 1644.61,-133 1991.5,-133"/>
<path fill="none" stroke="#000000" stroke-width="2" d="M1211,-138C1557.96,-138 1644.68,-135 1991.5,-135"/>
</g>
<!-- Unconnected Cable 2&#45;&#45;Hidden4 -->
<g id="edge58" class="edge">
<title>Unconnected Cable 2:e&#45;&#45;Hidden4:w</title>
<path fill="none" stroke="#000000" stroke-width="2" d="M1211,-109C1557.87,-109 1644.59,-108 1991.5,-108"/>
<path fill="none" stroke="#00ff00" stroke-width="2" d="M1211,-111C1557.89,-111 1644.61,-110 1991.5,-110"/>
<path fill="none" stroke="#000000" stroke-width="2" d="M1211,-113C1557.91,-113 1644.63,-112 1991.5,-112"/>
</g>
<!-- Unconnected Cable 2&#45;&#45;Hidden4 -->
<g id="edge60" class="edge">
<title>Unconnected Cable 2:e&#45;&#45;Hidden4:w</title>
<path fill="none" stroke="#000000" stroke-width="2" d="M1211,-84C1557.89,-84 1644.61,-84 1991.5,-84"/>
<path fill="none" stroke="#00ff00" stroke-width="2" d="M1211,-86C1557.89,-86 1644.61,-86 1991.5,-86"/>
<path fill="none" stroke="#000000" stroke-width="2" d="M1211,-88C1557.89,-88 1644.61,-88 1991.5,-88"/>
</g>
<!-- Unconnected Cable 2&#45;&#45;Hidden4 -->
<g id="edge62" class="edge">
<title>Unconnected Cable 2:e&#45;&#45;Hidden4:w</title>
<path fill="none" stroke="#000000" stroke-width="2" d="M1211,-59C1557.94,-59 1644.66,-61 1991.5,-61"/>
<path fill="none" stroke="#00ff00" stroke-width="2" d="M1211,-61C1557.89,-61 1644.61,-63 1991.5,-63"/>
<path fill="none" stroke="#000000" stroke-width="2" d="M1211,-63C1557.84,-63 1644.56,-65 1991.5,-65"/>
</g>
</g>
</svg>
