Id	Description	Qty	Unit	Designators	Manufacturer	MPN
1	Connector, Micro-Lock Plus, Receptacle Housing, 4 pins	1		Bag Heater Connector	Molex	5055650401
2	Micro-Lock Plus Crimp, Socket (Female)	4		Bag Heater Connector	Molex	5054311200
3	Wire, PTFE Hook-up Wire, 26 AWG, BU	88	cm	Bag Heater Cable	Alpha Wire	2843/1 BK005
