Id	Description	Qty	Unit	Designators	Manufacturer	MPN
1	Backshell for Dsub50	1		Adapter-pcb		
2	Cable, 13 x 28 AWG	0	m	Umbilical-cable		
3	Cable, 2 x 26 AWG shielded	0	m	Umbilical-cable-CAN-1, Umbilical-cable-CAN-2		
4	Cable, 4 x 24 AWG	0	m	Power-cable		
5	Connector, D-sub 50, 51 pins	1		Adapter-pcb		
6	Connector, Harwin Datamate, Socket (Female), 4 pins	1		Voltage-Regulator	Harwin	M80-8880405
7	Connector, Samtek Tiger Eye, Socket (Female), 20 pins	1		OBC-ADCS-pcb	Samtek	ISDF-10-D-M
8	D-sub Crimp, Socket (Female)	50		Adapter-pcb		
9	Samtek Crimp, Socket (Female)	20		OBC-ADCS-pcb	Samtek	CC03R-2830-01-G
