Id	Description	Qty	Unit	Designators	Manufacturer	MPN
1	Backshell for Dsub50	1		Adapter-pcb		
2	Cable, 2 x 26 AWG shielded	0	m	Umbilical-cable-CAN-1, Umbilical-cable-CAN-2		
3	Cable, 20 x 28 AWG	0	m	Umbilical-cable		
4	Cable, 4 x 24 AWG	0	m	Power-cable		
5	Connector, D-sub 50, 51 pins	1		Adapter-pcb		
6	Connector, Harwin Datamate, Socket (Female), 26 pins	1		OBC-ADCS-pcb	Harwin	M80-8882605
7	Connector, Harwin Datamate, Socket (Female), 4 pins	1		Voltage-Regulator	Harwin	M80-8880405
8	D-sub Crimp, Socket (Female)	50		Adapter-pcb		
