<?xml version="1.0" encoding="UTF-8"?>
<!-- Do not edit this file with editors other than draw.io -->
<!DOCTYPE svg PUBLIC "-//W3C//DTD SVG 1.1//EN" "http://www.w3.org/Graphics/SVG/1.1/DTD/svg11.dtd">
<svg xmlns="http://www.w3.org/2000/svg" xmlns:xlink="http://www.w3.org/1999/xlink" version="1.1" width="787px" height="509px" viewBox="-0.5 -0.5 787 509" content="&lt;mxfile host=&quot;app.diagrams.net&quot; agent=&quot;Mozilla/5.0 (Windows NT 10.0; Win64; x64) AppleWebKit/537.36 (KHTML, like Gecko) Chrome/131.0.0.0 Safari/537.36 Edg/131.0.0.0&quot; version=&quot;25.0.3&quot;&gt;&#10;  &lt;diagram id=&quot;OX5aafMQljurD7XW0Pac&quot; name=&quot;Page-1&quot;&gt;&#10;    &lt;mxGraphModel dx=&quot;978&quot; dy=&quot;1134&quot; grid=&quot;1&quot; gridSize=&quot;10&quot; guides=&quot;1&quot; tooltips=&quot;1&quot; connect=&quot;1&quot; arrows=&quot;1&quot; fold=&quot;1&quot; page=&quot;1&quot; pageScale=&quot;1&quot; pageWidth=&quot;827&quot; pageHeight=&quot;1169&quot; math=&quot;0&quot; shadow=&quot;0&quot;&gt;&#10;      &lt;root&gt;&#10;        &lt;mxCell id=&quot;0&quot; /&gt;&#10;        &lt;mxCell id=&quot;1&quot; parent=&quot;0&quot; /&gt;&#10;        &lt;mxCell id=&quot;fPkV0-gB92nhyspcfDQZ-1&quot; style=&quot;edgeStyle=orthogonalEdgeStyle;rounded=0;orthogonalLoop=1;jettySize=auto;html=1;exitX=0.5;exitY=1;exitDx=0;exitDy=0;entryX=0.5;entryY=0;entryDx=0;entryDy=0;&quot; edge=&quot;1&quot; parent=&quot;1&quot; source=&quot;uy0SehUbqx5PQUWP40yV-6&quot; target=&quot;9UuHxXsjFwuZ7oKohJ_V-17&quot;&gt;&#10;          &lt;mxGeometry relative=&quot;1&quot; as=&quot;geometry&quot; /&gt;&#10;        &lt;/mxCell&gt;&#10;        &lt;mxCell id=&quot;uy0SehUbqx5PQUWP40yV-6&quot; value=&quot;Integration with&amp;lt;br&amp;gt;&amp;lt;b&amp;gt;EQM flatsat&amp;lt;/b&amp;gt;&quot; style=&quot;rounded=1;whiteSpace=wrap;html=1;strokeWidth=2;fillColor=#dae8fc;fontFamily=Georgia;align=center;strokeColor=#6c8ebf;arcSize=50;&quot; parent=&quot;1&quot; vertex=&quot;1&quot;&gt;&#10;          &lt;mxGeometry x=&quot;647&quot; y=&quot;90&quot; width=&quot;160&quot; height=&quot;60&quot; as=&quot;geometry&quot; /&gt;&#10;        &lt;/mxCell&gt;&#10;        &lt;mxCell id=&quot;uy0SehUbqx5PQUWP40yV-1&quot; value=&quot;&amp;lt;div style=&amp;quot;font-size: 16px&amp;quot;&amp;gt;&amp;lt;font style=&amp;quot;font-size: 16px&amp;quot; face=&amp;quot;Georgia&amp;quot;&amp;gt;&amp;lt;span&amp;gt;Legend&amp;lt;/span&amp;gt;&amp;lt;/font&amp;gt;&amp;lt;/div&amp;gt;&quot; style=&quot;rounded=0;whiteSpace=wrap;html=1;align=left;labelPosition=center;verticalLabelPosition=middle;verticalAlign=top;spacing=10;fillColor=none;&quot; parent=&quot;1&quot; vertex=&quot;1&quot;&gt;&#10;          &lt;mxGeometry x=&quot;27&quot; y=&quot;290&quot; width=&quot;370&quot; height=&quot;220&quot; as=&quot;geometry&quot; /&gt;&#10;        &lt;/mxCell&gt;&#10;        &lt;mxCell id=&quot;uy0SehUbqx5PQUWP40yV-4&quot; value=&quot;&quot; style=&quot;rounded=1;fillColor=#f8cecc;align=center;strokeColor=#b85450;verticalAlign=middle;spacing=2;fontFamily=Georgia;arcSize=20;strokeWidth=2;labelPosition=center;verticalLabelPosition=middle;html=1;whiteSpace=wrap;labelBorderColor=none;&quot; parent=&quot;1&quot; vertex=&quot;1&quot;&gt;&#10;          &lt;mxGeometry x=&quot;80.80952380952381&quot; y=&quot;340&quot; width=&quot;54.761904761904766&quot; height=&quot;30&quot; as=&quot;geometry&quot; /&gt;&#10;        &lt;/mxCell&gt;&#10;        &lt;mxCell id=&quot;uy0SehUbqx5PQUWP40yV-5&quot; value=&quot;&amp;lt;div align=&amp;quot;left&amp;quot;&amp;gt;Model&amp;lt;/div&amp;gt;&quot; style=&quot;text;html=1;strokeColor=none;fillColor=none;align=left;verticalAlign=middle;whiteSpace=wrap;rounded=0;fontFamily=Georgia;&quot; parent=&quot;1&quot; vertex=&quot;1&quot;&gt;&#10;          &lt;mxGeometry x=&quot;157.47619047619048&quot; y=&quot;345&quot; width=&quot;43.80952380952381&quot; height=&quot;20&quot; as=&quot;geometry&quot; /&gt;&#10;        &lt;/mxCell&gt;&#10;        &lt;mxCell id=&quot;uy0SehUbqx5PQUWP40yV-16&quot; value=&quot;&quot; style=&quot;rounded=1;whiteSpace=wrap;html=1;strokeWidth=2;fillColor=#dae8fc;fontFamily=Georgia;align=center;strokeColor=#6c8ebf;arcSize=50;&quot; parent=&quot;1&quot; vertex=&quot;1&quot;&gt;&#10;          &lt;mxGeometry x=&quot;80.80952380952381&quot; y=&quot;380&quot; width=&quot;54.761904761904766&quot; height=&quot;30&quot; as=&quot;geometry&quot; /&gt;&#10;        &lt;/mxCell&gt;&#10;        &lt;mxCell id=&quot;uy0SehUbqx5PQUWP40yV-17&quot; value=&quot;Integration with system&quot; style=&quot;text;html=1;strokeColor=none;fillColor=none;align=left;verticalAlign=middle;whiteSpace=wrap;rounded=0;fontFamily=Georgia;&quot; parent=&quot;1&quot; vertex=&quot;1&quot;&gt;&#10;          &lt;mxGeometry x=&quot;157.47619047619048&quot; y=&quot;385&quot; width=&quot;76.66666666666667&quot; height=&quot;20&quot; as=&quot;geometry&quot; /&gt;&#10;        &lt;/mxCell&gt;&#10;        &lt;mxCell id=&quot;uy0SehUbqx5PQUWP40yV-18&quot; value=&quot;&quot; style=&quot;shape=step;perimeter=stepPerimeter;whiteSpace=wrap;html=1;fixedSize=1;strokeWidth=2;fillColor=#d5e8d4;fontFamily=Georgia;align=center;strokeColor=#82b366;&quot; parent=&quot;1&quot; vertex=&quot;1&quot;&gt;&#10;          &lt;mxGeometry x=&quot;80.80952380952381&quot; y=&quot;420&quot; width=&quot;54.761904761904766&quot; height=&quot;30&quot; as=&quot;geometry&quot; /&gt;&#10;        &lt;/mxCell&gt;&#10;        &lt;mxCell id=&quot;uy0SehUbqx5PQUWP40yV-19&quot; value=&quot;Testing Activity&quot; style=&quot;text;html=1;strokeColor=none;fillColor=none;align=left;verticalAlign=middle;whiteSpace=wrap;rounded=0;fontFamily=Georgia;&quot; parent=&quot;1&quot; vertex=&quot;1&quot;&gt;&#10;          &lt;mxGeometry x=&quot;157.47619047619048&quot; y=&quot;425&quot; width=&quot;76.66666666666667&quot; height=&quot;20&quot; as=&quot;geometry&quot; /&gt;&#10;        &lt;/mxCell&gt;&#10;        &lt;mxCell id=&quot;uy0SehUbqx5PQUWP40yV-20&quot; value=&quot;&quot; style=&quot;shape=step;perimeter=stepPerimeter;whiteSpace=wrap;html=1;fixedSize=1;strokeWidth=2;fillColor=#fff2cc;fontFamily=Georgia;align=center;strokeColor=#d6b656;&quot; parent=&quot;1&quot; vertex=&quot;1&quot;&gt;&#10;          &lt;mxGeometry x=&quot;80.80952380952381&quot; y=&quot;460&quot; width=&quot;54.761904761904766&quot; height=&quot;30&quot; as=&quot;geometry&quot; /&gt;&#10;        &lt;/mxCell&gt;&#10;        &lt;mxCell id=&quot;uy0SehUbqx5PQUWP40yV-21&quot; value=&quot;&amp;lt;div&amp;gt;Inspection&amp;lt;/div&amp;gt;&amp;lt;div&amp;gt;Activity&amp;lt;br&amp;gt;&amp;lt;/div&amp;gt;&quot; style=&quot;text;html=1;strokeColor=none;fillColor=none;align=left;verticalAlign=middle;whiteSpace=wrap;rounded=0;fontFamily=Georgia;&quot; parent=&quot;1&quot; vertex=&quot;1&quot;&gt;&#10;          &lt;mxGeometry x=&quot;157.47619047619048&quot; y=&quot;465&quot; width=&quot;76.66666666666667&quot; height=&quot;20&quot; as=&quot;geometry&quot; /&gt;&#10;        &lt;/mxCell&gt;&#10;        &lt;mxCell id=&quot;FCYUcSS5aIMhxrausXVU-9&quot; value=&quot;&amp;lt;b&amp;gt;COTS:&amp;lt;/b&amp;gt; &quot; style=&quot;text;html=1;strokeColor=none;fillColor=none;align=center;verticalAlign=middle;whiteSpace=wrap;rounded=0;fontFamily=Georgia;&quot; parent=&quot;1&quot; vertex=&quot;1&quot;&gt;&#10;          &lt;mxGeometry x=&quot;257&quot; y=&quot;370&quot; width=&quot;40&quot; height=&quot;20&quot; as=&quot;geometry&quot; /&gt;&#10;        &lt;/mxCell&gt;&#10;        &lt;mxCell id=&quot;FCYUcSS5aIMhxrausXVU-10&quot; value=&quot;&amp;lt;b&amp;gt;PFM:&amp;lt;/b&amp;gt;&quot; style=&quot;text;html=1;strokeColor=none;fillColor=none;align=center;verticalAlign=middle;whiteSpace=wrap;rounded=0;fontFamily=Georgia;&quot; parent=&quot;1&quot; vertex=&quot;1&quot;&gt;&#10;          &lt;mxGeometry x=&quot;257&quot; y=&quot;410&quot; width=&quot;40&quot; height=&quot;20&quot; as=&quot;geometry&quot; /&gt;&#10;        &lt;/mxCell&gt;&#10;        &lt;mxCell id=&quot;FCYUcSS5aIMhxrausXVU-11&quot; value=&quot;Commercial off the shelf&quot; style=&quot;text;html=1;strokeColor=none;fillColor=none;align=left;verticalAlign=middle;whiteSpace=wrap;rounded=0;fontFamily=Georgia;&quot; parent=&quot;1&quot; vertex=&quot;1&quot;&gt;&#10;          &lt;mxGeometry x=&quot;307&quot; y=&quot;375&quot; width=&quot;70&quot; height=&quot;20&quot; as=&quot;geometry&quot; /&gt;&#10;        &lt;/mxCell&gt;&#10;        &lt;mxCell id=&quot;FCYUcSS5aIMhxrausXVU-14&quot; value=&quot;Protoflight Model&quot; style=&quot;text;html=1;strokeColor=none;fillColor=none;align=left;verticalAlign=middle;whiteSpace=wrap;rounded=0;fontFamily=Georgia;&quot; parent=&quot;1&quot; vertex=&quot;1&quot;&gt;&#10;          &lt;mxGeometry x=&quot;307&quot; y=&quot;415&quot; width=&quot;70&quot; height=&quot;20&quot; as=&quot;geometry&quot; /&gt;&#10;        &lt;/mxCell&gt;&#10;        &lt;mxCell id=&quot;9UuHxXsjFwuZ7oKohJ_V-15&quot; style=&quot;edgeStyle=orthogonalEdgeStyle;rounded=0;orthogonalLoop=1;jettySize=auto;html=1;exitX=1;exitY=0.5;exitDx=0;exitDy=0;entryX=0;entryY=0.5;entryDx=0;entryDy=0;&quot; parent=&quot;1&quot; source=&quot;9UuHxXsjFwuZ7oKohJ_V-10&quot; target=&quot;9UuHxXsjFwuZ7oKohJ_V-14&quot; edge=&quot;1&quot;&gt;&#10;          &lt;mxGeometry relative=&quot;1&quot; as=&quot;geometry&quot; /&gt;&#10;        &lt;/mxCell&gt;&#10;        &lt;mxCell id=&quot;9UuHxXsjFwuZ7oKohJ_V-10&quot; value=&quot;&amp;lt;div&amp;gt;UHF Deployable Antenna/Mechanism&amp;lt;/div&amp;gt;&amp;lt;div&amp;gt;&amp;lt;b&amp;gt;PFM &amp;lt;/b&amp;gt;procurement&amp;lt;br&amp;gt;&amp;lt;/div&amp;gt;&quot; style=&quot;rounded=1;fillColor=#f8cecc;align=center;strokeColor=#b85450;verticalAlign=middle;spacing=2;fontFamily=Georgia;arcSize=20;strokeWidth=2;labelPosition=center;verticalLabelPosition=middle;html=1;whiteSpace=wrap;labelBorderColor=none;&quot; parent=&quot;1&quot; vertex=&quot;1&quot;&gt;&#10;          &lt;mxGeometry x=&quot;27&quot; y=&quot;90&quot; width=&quot;160&quot; height=&quot;60&quot; as=&quot;geometry&quot; /&gt;&#10;        &lt;/mxCell&gt;&#10;        &lt;mxCell id=&quot;2BXpRtXaHkEq1STQe-8n-3&quot; style=&quot;edgeStyle=orthogonalEdgeStyle;rounded=0;orthogonalLoop=1;jettySize=auto;html=1;exitX=1;exitY=0.5;exitDx=0;exitDy=0;&quot; parent=&quot;1&quot; source=&quot;9UuHxXsjFwuZ7oKohJ_V-14&quot; target=&quot;2BXpRtXaHkEq1STQe-8n-1&quot; edge=&quot;1&quot;&gt;&#10;          &lt;mxGeometry relative=&quot;1&quot; as=&quot;geometry&quot; /&gt;&#10;        &lt;/mxCell&gt;&#10;        &lt;mxCell id=&quot;9UuHxXsjFwuZ7oKohJ_V-14&quot; value=&quot;Functional Test&amp;lt;br&amp;gt;(including deployment)&quot; style=&quot;shape=step;perimeter=stepPerimeter;whiteSpace=wrap;html=1;fixedSize=1;strokeWidth=2;fillColor=#d5e8d4;fontFamily=Georgia;align=center;strokeColor=#82b366;&quot; parent=&quot;1&quot; vertex=&quot;1&quot;&gt;&#10;          &lt;mxGeometry x=&quot;227&quot; y=&quot;90&quot; width=&quot;160&quot; height=&quot;60&quot; as=&quot;geometry&quot; /&gt;&#10;        &lt;/mxCell&gt;&#10;        &lt;mxCell id=&quot;9UuHxXsjFwuZ7oKohJ_V-17&quot; value=&quot;Integration with&amp;lt;br&amp;gt;&amp;lt;b&amp;gt;PFM spacecraft&amp;lt;br&amp;gt;&amp;lt;/b&amp;gt;&quot; style=&quot;rounded=1;whiteSpace=wrap;html=1;strokeWidth=2;fillColor=#dae8fc;fontFamily=Georgia;align=center;strokeColor=#6c8ebf;arcSize=50;&quot; parent=&quot;1&quot; vertex=&quot;1&quot;&gt;&#10;          &lt;mxGeometry x=&quot;647&quot; y=&quot;190&quot; width=&quot;160&quot; height=&quot;60&quot; as=&quot;geometry&quot; /&gt;&#10;        &lt;/mxCell&gt;&#10;        &lt;mxCell id=&quot;Dud4smzzSYOyhVmM1V9E-2&quot; value=&quot;&amp;lt;font style=&amp;quot;font-size: 20px&amp;quot;&amp;gt;&amp;lt;br&amp;gt;&amp;lt;/font&amp;gt;&amp;lt;div style=&amp;quot;font-size: 20px&amp;quot; align=&amp;quot;left&amp;quot;&amp;gt;&amp;lt;font style=&amp;quot;font-size: 20px&amp;quot;&amp;gt;&amp;lt;b&amp;gt;&amp;lt;font style=&amp;quot;font-size: 20px&amp;quot; color=&amp;quot;#808080&amp;quot;&amp;gt;UHF Deployable Antenna+Mechanism&amp;lt;/font&amp;gt;&amp;lt;/b&amp;gt;&amp;lt;/font&amp;gt;&amp;lt;/div&amp;gt;&amp;lt;div style=&amp;quot;font-size: 20px&amp;quot; align=&amp;quot;center&amp;quot;&amp;gt;&amp;lt;font style=&amp;quot;font-size: 20px&amp;quot; color=&amp;quot;#808080&amp;quot;&amp;gt;COTS (P&amp;lt;b&amp;gt;FM&amp;lt;/b&amp;gt;)&amp;lt;br&amp;gt;&amp;lt;/font&amp;gt;&amp;lt;/div&amp;gt;&amp;lt;div style=&amp;quot;font-size: 20px&amp;quot; align=&amp;quot;left&amp;quot;&amp;gt;&amp;lt;font style=&amp;quot;font-size: 20px&amp;quot; color=&amp;quot;#808080&amp;quot;&amp;gt;&amp;lt;br&amp;gt;&amp;lt;/font&amp;gt;&amp;lt;/div&amp;gt;&quot; style=&quot;text;html=1;strokeColor=none;fillColor=none;align=center;verticalAlign=middle;whiteSpace=wrap;rounded=0;fontFamily=Georgia;&quot; parent=&quot;1&quot; vertex=&quot;1&quot;&gt;&#10;          &lt;mxGeometry x=&quot;21&quot; y=&quot;40&quot; width=&quot;780&quot; height=&quot;20&quot; as=&quot;geometry&quot; /&gt;&#10;        &lt;/mxCell&gt;&#10;        &lt;mxCell id=&quot;2BXpRtXaHkEq1STQe-8n-5&quot; style=&quot;edgeStyle=orthogonalEdgeStyle;rounded=0;orthogonalLoop=1;jettySize=auto;html=1;exitX=1;exitY=0.5;exitDx=0;exitDy=0;entryX=0;entryY=0.5;entryDx=0;entryDy=0;&quot; parent=&quot;1&quot; source=&quot;2BXpRtXaHkEq1STQe-8n-1&quot; edge=&quot;1&quot;&gt;&#10;          &lt;mxGeometry relative=&quot;1&quot; as=&quot;geometry&quot;&gt;&#10;            &lt;mxPoint x=&quot;647&quot; y=&quot;120&quot; as=&quot;targetPoint&quot; /&gt;&#10;          &lt;/mxGeometry&gt;&#10;        &lt;/mxCell&gt;&#10;        &lt;mxCell id=&quot;2BXpRtXaHkEq1STQe-8n-1&quot; value=&quot;Refurbishment of&amp;lt;div&amp;gt;deployment&amp;lt;br&amp;gt;mechanism&amp;lt;/div&amp;gt;&quot; style=&quot;shape=step;perimeter=stepPerimeter;whiteSpace=wrap;html=1;fixedSize=1;strokeWidth=2;fillColor=#fff2cc;fontFamily=Georgia;align=center;strokeColor=#d6b656;&quot; parent=&quot;1&quot; vertex=&quot;1&quot;&gt;&#10;          &lt;mxGeometry x=&quot;427&quot; y=&quot;90&quot; width=&quot;160&quot; height=&quot;60&quot; as=&quot;geometry&quot; /&gt;&#10;        &lt;/mxCell&gt;&#10;      &lt;/root&gt;&#10;    &lt;/mxGraphModel&gt;&#10;  &lt;/diagram&gt;&#10;&lt;/mxfile&gt;&#10;" resource="https://app.diagrams.net/#Aacubesat%2Fsystems-engineering%2Fmaiv-plan%2Fmaster%2FSubsystems%20Development%20and%20Verification%20Plan%2FUHF_Deployable.svg#%7B%22pageId%22%3A%22OX5aafMQljurD7XW0Pac%22%7D"><defs/><g><g data-cell-id="0"><g data-cell-id="1"><g data-cell-id="fPkV0-gB92nhyspcfDQZ-1"><g><path d="M 706 148 L 706 181.63" fill="none" stroke="rgb(0, 0, 0)" stroke-miterlimit="10" pointer-events="stroke"/><path d="M 706 186.88 L 702.5 179.88 L 706 181.63 L 709.5 179.88 Z" fill="rgb(0, 0, 0)" stroke="rgb(0, 0, 0)" stroke-miterlimit="10" pointer-events="all"/></g></g><g data-cell-id="uy0SehUbqx5PQUWP40yV-6"><g><rect x="626" y="88" width="160" height="60" rx="30" ry="30" fill="#dae8fc" stroke="#6c8ebf" stroke-width="2" pointer-events="all"/></g><g><g transform="translate(-0.5 -0.5)"><switch><foreignObject pointer-events="none" width="100%" height="100%" requiredFeatures="http://www.w3.org/TR/SVG11/feature#Extensibility" style="overflow: visible; text-align: left;"><div xmlns="http://www.w3.org/1999/xhtml" style="display: flex; align-items: unsafe center; justify-content: unsafe center; width: 158px; height: 1px; padding-top: 118px; margin-left: 627px;"><div data-drawio-colors="color: rgb(0, 0, 0); " style="box-sizing: border-box; font-size: 0px; text-align: center;"><div style="display: inline-block; font-size: 12px; font-family: Georgia; color: rgb(0, 0, 0); line-height: 1.2; pointer-events: all; white-space: normal; overflow-wrap: normal;">Integration with<br /><b>EQM flatsat</b></div></div></div></foreignObject><text x="706" y="122" fill="rgb(0, 0, 0)" font-family="&quot;Georgia&quot;" font-size="12px" text-anchor="middle">Integration with...</text></switch></g></g></g><g data-cell-id="uy0SehUbqx5PQUWP40yV-1"><g><rect x="6" y="288" width="370" height="220" fill="none" stroke="rgb(0, 0, 0)" pointer-events="all"/></g><g><g transform="translate(-0.5 -0.5)"><switch><foreignObject pointer-events="none" width="100%" height="100%" requiredFeatures="http://www.w3.org/TR/SVG11/feature#Extensibility" style="overflow: visible; text-align: left;"><div xmlns="http://www.w3.org/1999/xhtml" style="display: flex; align-items: unsafe flex-start; justify-content: unsafe flex-start; width: 352px; height: 1px; padding-top: 303px; margin-left: 16px;"><div data-drawio-colors="color: rgb(0, 0, 0); " style="box-sizing: border-box; font-size: 0px; text-align: left;"><div style="display: inline-block; font-size: 12px; font-family: Helvetica; color: rgb(0, 0, 0); line-height: 1.2; pointer-events: all; white-space: normal; overflow-wrap: normal;"><div style="font-size: 16px"><font face="Georgia" style="font-size: 16px"><span>Legend</span></font></div></div></div></div></foreignObject><text x="16" y="315" fill="rgb(0, 0, 0)" font-family="&quot;Helvetica&quot;" font-size="12px">Legend</text></switch></g></g></g><g data-cell-id="uy0SehUbqx5PQUWP40yV-4"><g><rect x="59.81" y="338" width="54.76" height="30" rx="6" ry="6" fill="#f8cecc" stroke="#b85450" stroke-width="2" pointer-events="all"/></g></g><g data-cell-id="uy0SehUbqx5PQUWP40yV-5"><g><rect x="136.48" y="343" width="43.81" height="20" fill="none" stroke="none" pointer-events="all"/></g><g><g transform="translate(-0.5 -0.5)"><switch><foreignObject pointer-events="none" width="100%" height="100%" requiredFeatures="http://www.w3.org/TR/SVG11/feature#Extensibility" style="overflow: visible; text-align: left;"><div xmlns="http://www.w3.org/1999/xhtml" style="display: flex; align-items: unsafe center; justify-content: unsafe flex-start; width: 42px; height: 1px; padding-top: 353px; margin-left: 138px;"><div data-drawio-colors="color: rgb(0, 0, 0); " style="box-sizing: border-box; font-size: 0px; text-align: left;"><div style="display: inline-block; font-size: 12px; font-family: Georgia; color: rgb(0, 0, 0); line-height: 1.2; pointer-events: all; white-space: normal; overflow-wrap: normal;"><div align="left">Model</div></div></div></div></foreignObject><text x="138" y="357" fill="rgb(0, 0, 0)" font-family="&quot;Georgia&quot;" font-size="12px">Model</text></switch></g></g></g><g data-cell-id="uy0SehUbqx5PQUWP40yV-16"><g><rect x="59.81" y="378" width="54.76" height="30" rx="15" ry="15" fill="#dae8fc" stroke="#6c8ebf" stroke-width="2" pointer-events="all"/></g></g><g data-cell-id="uy0SehUbqx5PQUWP40yV-17"><g><rect x="136.48" y="383" width="76.67" height="20" fill="none" stroke="none" pointer-events="all"/></g><g><g transform="translate(-0.5 -0.5)"><switch><foreignObject pointer-events="none" width="100%" height="100%" requiredFeatures="http://www.w3.org/TR/SVG11/feature#Extensibility" style="overflow: visible; text-align: left;"><div xmlns="http://www.w3.org/1999/xhtml" style="display: flex; align-items: unsafe center; justify-content: unsafe flex-start; width: 75px; height: 1px; padding-top: 393px; margin-left: 138px;"><div data-drawio-colors="color: rgb(0, 0, 0); " style="box-sizing: border-box; font-size: 0px; text-align: left;"><div style="display: inline-block; font-size: 12px; font-family: Georgia; color: rgb(0, 0, 0); line-height: 1.2; pointer-events: all; white-space: normal; overflow-wrap: normal;">Integration with system</div></div></div></foreignObject><text x="138" y="397" fill="rgb(0, 0, 0)" font-family="&quot;Georgia&quot;" font-size="12px">Integration w...</text></switch></g></g></g><g data-cell-id="uy0SehUbqx5PQUWP40yV-18"><g><path d="M 59.81 418 L 94.57 418 L 114.57 433 L 94.57 448 L 59.81 448 L 79.81 433 Z" fill="#d5e8d4" stroke="#82b366" stroke-width="2" stroke-miterlimit="10" pointer-events="all"/></g></g><g data-cell-id="uy0SehUbqx5PQUWP40yV-19"><g><rect x="136.48" y="423" width="76.67" height="20" fill="none" stroke="none" pointer-events="all"/></g><g><g transform="translate(-0.5 -0.5)"><switch><foreignObject pointer-events="none" width="100%" height="100%" requiredFeatures="http://www.w3.org/TR/SVG11/feature#Extensibility" style="overflow: visible; text-align: left;"><div xmlns="http://www.w3.org/1999/xhtml" style="display: flex; align-items: unsafe center; justify-content: unsafe flex-start; width: 75px; height: 1px; padding-top: 433px; margin-left: 138px;"><div data-drawio-colors="color: rgb(0, 0, 0); " style="box-sizing: border-box; font-size: 0px; text-align: left;"><div style="display: inline-block; font-size: 12px; font-family: Georgia; color: rgb(0, 0, 0); line-height: 1.2; pointer-events: all; white-space: normal; overflow-wrap: normal;">Testing Activity</div></div></div></foreignObject><text x="138" y="437" fill="rgb(0, 0, 0)" font-family="&quot;Georgia&quot;" font-size="12px">Testing Activ...</text></switch></g></g></g><g data-cell-id="uy0SehUbqx5PQUWP40yV-20"><g><path d="M 59.81 458 L 94.57 458 L 114.57 473 L 94.57 488 L 59.81 488 L 79.81 473 Z" fill="#fff2cc" stroke="#d6b656" stroke-width="2" stroke-miterlimit="10" pointer-events="all"/></g></g><g data-cell-id="uy0SehUbqx5PQUWP40yV-21"><g><rect x="136.48" y="463" width="76.67" height="20" fill="none" stroke="none" pointer-events="all"/></g><g><g transform="translate(-0.5 -0.5)"><switch><foreignObject pointer-events="none" width="100%" height="100%" requiredFeatures="http://www.w3.org/TR/SVG11/feature#Extensibility" style="overflow: visible; text-align: left;"><div xmlns="http://www.w3.org/1999/xhtml" style="display: flex; align-items: unsafe center; justify-content: unsafe flex-start; width: 75px; height: 1px; padding-top: 473px; margin-left: 138px;"><div data-drawio-colors="color: rgb(0, 0, 0); " style="box-sizing: border-box; font-size: 0px; text-align: left;"><div style="display: inline-block; font-size: 12px; font-family: Georgia; color: rgb(0, 0, 0); line-height: 1.2; pointer-events: all; white-space: normal; overflow-wrap: normal;"><div>Inspection</div><div>Activity<br /></div></div></div></div></foreignObject><text x="138" y="477" fill="rgb(0, 0, 0)" font-family="&quot;Georgia&quot;" font-size="12px">Inspection...</text></switch></g></g></g><g data-cell-id="FCYUcSS5aIMhxrausXVU-9"><g><rect x="236" y="368" width="40" height="20" fill="none" stroke="none" pointer-events="all"/></g><g><g transform="translate(-0.5 -0.5)"><switch><foreignObject pointer-events="none" width="100%" height="100%" requiredFeatures="http://www.w3.org/TR/SVG11/feature#Extensibility" style="overflow: visible; text-align: left;"><div xmlns="http://www.w3.org/1999/xhtml" style="display: flex; align-items: unsafe center; justify-content: unsafe center; width: 38px; height: 1px; padding-top: 378px; margin-left: 237px;"><div data-drawio-colors="color: rgb(0, 0, 0); " style="box-sizing: border-box; font-size: 0px; text-align: center;"><div style="display: inline-block; font-size: 12px; font-family: Georgia; color: rgb(0, 0, 0); line-height: 1.2; pointer-events: all; white-space: normal; overflow-wrap: normal;"><b>COTS:</b> </div></div></div></foreignObject><text x="256" y="382" fill="rgb(0, 0, 0)" font-family="&quot;Georgia&quot;" font-size="12px" text-anchor="middle">COTS: </text></switch></g></g></g><g data-cell-id="FCYUcSS5aIMhxrausXVU-10"><g><rect x="236" y="408" width="40" height="20" fill="none" stroke="none" pointer-events="all"/></g><g><g transform="translate(-0.5 -0.5)"><switch><foreignObject pointer-events="none" width="100%" height="100%" requiredFeatures="http://www.w3.org/TR/SVG11/feature#Extensibility" style="overflow: visible; text-align: left;"><div xmlns="http://www.w3.org/1999/xhtml" style="display: flex; align-items: unsafe center; justify-content: unsafe center; width: 38px; height: 1px; padding-top: 418px; margin-left: 237px;"><div data-drawio-colors="color: rgb(0, 0, 0); " style="box-sizing: border-box; font-size: 0px; text-align: center;"><div style="display: inline-block; font-size: 12px; font-family: Georgia; color: rgb(0, 0, 0); line-height: 1.2; pointer-events: all; white-space: normal; overflow-wrap: normal;"><b>PFM:</b></div></div></div></foreignObject><text x="256" y="422" fill="rgb(0, 0, 0)" font-family="&quot;Georgia&quot;" font-size="12px" text-anchor="middle">PFM:</text></switch></g></g></g><g data-cell-id="FCYUcSS5aIMhxrausXVU-11"><g><rect x="286" y="373" width="70" height="20" fill="none" stroke="none" pointer-events="all"/></g><g><g transform="translate(-0.5 -0.5)"><switch><foreignObject pointer-events="none" width="100%" height="100%" requiredFeatures="http://www.w3.org/TR/SVG11/feature#Extensibility" style="overflow: visible; text-align: left;"><div xmlns="http://www.w3.org/1999/xhtml" style="display: flex; align-items: unsafe center; justify-content: unsafe flex-start; width: 68px; height: 1px; padding-top: 383px; margin-left: 288px;"><div data-drawio-colors="color: rgb(0, 0, 0); " style="box-sizing: border-box; font-size: 0px; text-align: left;"><div style="display: inline-block; font-size: 12px; font-family: Georgia; color: rgb(0, 0, 0); line-height: 1.2; pointer-events: all; white-space: normal; overflow-wrap: normal;">Commercial off the shelf</div></div></div></foreignObject><text x="288" y="387" fill="rgb(0, 0, 0)" font-family="&quot;Georgia&quot;" font-size="12px">Commercial...</text></switch></g></g></g><g data-cell-id="FCYUcSS5aIMhxrausXVU-14"><g><rect x="286" y="413" width="70" height="20" fill="none" stroke="none" pointer-events="all"/></g><g><g transform="translate(-0.5 -0.5)"><switch><foreignObject pointer-events="none" width="100%" height="100%" requiredFeatures="http://www.w3.org/TR/SVG11/feature#Extensibility" style="overflow: visible; text-align: left;"><div xmlns="http://www.w3.org/1999/xhtml" style="display: flex; align-items: unsafe center; justify-content: unsafe flex-start; width: 68px; height: 1px; padding-top: 423px; margin-left: 288px;"><div data-drawio-colors="color: rgb(0, 0, 0); " style="box-sizing: border-box; font-size: 0px; text-align: left;"><div style="display: inline-block; font-size: 12px; font-family: Georgia; color: rgb(0, 0, 0); line-height: 1.2; pointer-events: all; white-space: normal; overflow-wrap: normal;">Protoflight Model</div></div></div></foreignObject><text x="288" y="427" fill="rgb(0, 0, 0)" font-family="&quot;Georgia&quot;" font-size="12px">Protoflight...</text></switch></g></g></g><g data-cell-id="9UuHxXsjFwuZ7oKohJ_V-15"><g><path d="M 166 118 L 219.63 118" fill="none" stroke="rgb(0, 0, 0)" stroke-miterlimit="10" pointer-events="stroke"/><path d="M 224.88 118 L 217.88 121.5 L 219.63 118 L 217.88 114.5 Z" fill="rgb(0, 0, 0)" stroke="rgb(0, 0, 0)" stroke-miterlimit="10" pointer-events="all"/></g></g><g data-cell-id="9UuHxXsjFwuZ7oKohJ_V-10"><g><rect x="6" y="88" width="160" height="60" rx="12" ry="12" fill="#f8cecc" stroke="#b85450" stroke-width="2" pointer-events="all"/></g><g><g transform="translate(-0.5 -0.5)"><switch><foreignObject pointer-events="none" width="100%" height="100%" requiredFeatures="http://www.w3.org/TR/SVG11/feature#Extensibility" style="overflow: visible; text-align: left;"><div xmlns="http://www.w3.org/1999/xhtml" style="display: flex; align-items: unsafe center; justify-content: unsafe center; width: 158px; height: 1px; padding-top: 118px; margin-left: 7px;"><div data-drawio-colors="color: rgb(0, 0, 0); " style="box-sizing: border-box; font-size: 0px; text-align: center;"><div style="display: inline-block; font-size: 12px; font-family: Georgia; color: rgb(0, 0, 0); line-height: 1.2; pointer-events: all; white-space: normal; overflow-wrap: normal;"><div>UHF Deployable Antenna/Mechanism</div><div><b>PFM </b>procurement<br /></div></div></div></div></foreignObject><text x="86" y="122" fill="rgb(0, 0, 0)" font-family="&quot;Georgia&quot;" font-size="12px" text-anchor="middle">UHF Deployable Antenna/Mec...</text></switch></g></g></g><g data-cell-id="2BXpRtXaHkEq1STQe-8n-3"><g><path d="M 366 118 L 419.63 118" fill="none" stroke="rgb(0, 0, 0)" stroke-miterlimit="10" pointer-events="stroke"/><path d="M 424.88 118 L 417.88 121.5 L 419.63 118 L 417.88 114.5 Z" fill="rgb(0, 0, 0)" stroke="rgb(0, 0, 0)" stroke-miterlimit="10" pointer-events="all"/></g></g><g data-cell-id="9UuHxXsjFwuZ7oKohJ_V-14"><g><path d="M 206 88 L 346 88 L 366 118 L 346 148 L 206 148 L 226 118 Z" fill="#d5e8d4" stroke="#82b366" stroke-width="2" stroke-miterlimit="10" pointer-events="all"/></g><g><g transform="translate(-0.5 -0.5)"><switch><foreignObject pointer-events="none" width="100%" height="100%" requiredFeatures="http://www.w3.org/TR/SVG11/feature#Extensibility" style="overflow: visible; text-align: left;"><div xmlns="http://www.w3.org/1999/xhtml" style="display: flex; align-items: unsafe center; justify-content: unsafe center; width: 158px; height: 1px; padding-top: 118px; margin-left: 207px;"><div data-drawio-colors="color: rgb(0, 0, 0); " style="box-sizing: border-box; font-size: 0px; text-align: center;"><div style="display: inline-block; font-size: 12px; font-family: Georgia; color: rgb(0, 0, 0); line-height: 1.2; pointer-events: all; white-space: normal; overflow-wrap: normal;">Functional Test<br />(including deployment)</div></div></div></foreignObject><text x="286" y="122" fill="rgb(0, 0, 0)" font-family="&quot;Georgia&quot;" font-size="12px" text-anchor="middle">Functional Test...</text></switch></g></g></g><g data-cell-id="9UuHxXsjFwuZ7oKohJ_V-17"><g><rect x="626" y="188" width="160" height="60" rx="30" ry="30" fill="#dae8fc" stroke="#6c8ebf" stroke-width="2" pointer-events="all"/></g><g><g transform="translate(-0.5 -0.5)"><switch><foreignObject pointer-events="none" width="100%" height="100%" requiredFeatures="http://www.w3.org/TR/SVG11/feature#Extensibility" style="overflow: visible; text-align: left;"><div xmlns="http://www.w3.org/1999/xhtml" style="display: flex; align-items: unsafe center; justify-content: unsafe center; width: 158px; height: 1px; padding-top: 218px; margin-left: 627px;"><div data-drawio-colors="color: rgb(0, 0, 0); " style="box-sizing: border-box; font-size: 0px; text-align: center;"><div style="display: inline-block; font-size: 12px; font-family: Georgia; color: rgb(0, 0, 0); line-height: 1.2; pointer-events: all; white-space: normal; overflow-wrap: normal;">Integration with<br /><b>PFM spacecraft<br /></b></div></div></div></foreignObject><text x="706" y="222" fill="rgb(0, 0, 0)" font-family="&quot;Georgia&quot;" font-size="12px" text-anchor="middle">Integration with...</text></switch></g></g></g><g data-cell-id="Dud4smzzSYOyhVmM1V9E-2"><g><rect x="0" y="38" width="780" height="20" fill="none" stroke="none" pointer-events="all"/></g><g><g transform="translate(-0.5 -0.5)"><switch><foreignObject pointer-events="none" width="100%" height="100%" requiredFeatures="http://www.w3.org/TR/SVG11/feature#Extensibility" style="overflow: visible; text-align: left;"><div xmlns="http://www.w3.org/1999/xhtml" style="display: flex; align-items: unsafe center; justify-content: unsafe center; width: 778px; height: 1px; padding-top: 48px; margin-left: 1px;"><div data-drawio-colors="color: rgb(0, 0, 0); " style="box-sizing: border-box; font-size: 0px; text-align: center;"><div style="display: inline-block; font-size: 12px; font-family: Georgia; color: rgb(0, 0, 0); line-height: 1.2; pointer-events: all; white-space: normal; overflow-wrap: normal;"><font style="font-size: 20px"><br /></font><div align="left" style="font-size: 20px"><font style="font-size: 20px"><b><font color="#808080" style="font-size: 20px">UHF Deployable Antenna+Mechanism</font></b></font></div><div align="center" style="font-size: 20px"><font color="#808080" style="font-size: 20px">COTS (P<b>FM</b>)<br /></font></div><div align="left" style="font-size: 20px"><font color="#808080" style="font-size: 20px"><br /></font></div></div></div></div></foreignObject><text x="390" y="52" fill="rgb(0, 0, 0)" font-family="&quot;Georgia&quot;" font-size="12px" text-anchor="middle">UHF Deployable Antenna+Mechanism...</text></switch></g></g></g><g data-cell-id="2BXpRtXaHkEq1STQe-8n-5"><g><path d="M 566 118 L 596 118 L 619.63 118" fill="none" stroke="rgb(0, 0, 0)" stroke-miterlimit="10" pointer-events="stroke"/><path d="M 624.88 118 L 617.88 121.5 L 619.63 118 L 617.88 114.5 Z" fill="rgb(0, 0, 0)" stroke="rgb(0, 0, 0)" stroke-miterlimit="10" pointer-events="all"/></g></g><g data-cell-id="2BXpRtXaHkEq1STQe-8n-1"><g><path d="M 406 88 L 546 88 L 566 118 L 546 148 L 406 148 L 426 118 Z" fill="#fff2cc" stroke="#d6b656" stroke-width="2" stroke-miterlimit="10" pointer-events="all"/></g><g><g transform="translate(-0.5 -0.5)"><switch><foreignObject pointer-events="none" width="100%" height="100%" requiredFeatures="http://www.w3.org/TR/SVG11/feature#Extensibility" style="overflow: visible; text-align: left;"><div xmlns="http://www.w3.org/1999/xhtml" style="display: flex; align-items: unsafe center; justify-content: unsafe center; width: 158px; height: 1px; padding-top: 118px; margin-left: 407px;"><div data-drawio-colors="color: rgb(0, 0, 0); " style="box-sizing: border-box; font-size: 0px; text-align: center;"><div style="display: inline-block; font-size: 12px; font-family: Georgia; color: rgb(0, 0, 0); line-height: 1.2; pointer-events: all; white-space: normal; overflow-wrap: normal;">Refurbishment of<div>deployment<br />mechanism</div></div></div></div></foreignObject><text x="486" y="122" fill="rgb(0, 0, 0)" font-family="&quot;Georgia&quot;" font-size="12px" text-anchor="middle">Refurbishment of...</text></switch></g></g></g></g></g></g><switch><g requiredFeatures="http://www.w3.org/TR/SVG11/feature#Extensibility"/><a transform="translate(0,-5)" xlink:href="https://www.drawio.com/doc/faq/svg-export-text-problems" target="_blank"><text text-anchor="middle" font-size="10px" x="50%" y="100%">Text is not SVG - cannot display</text></a></switch></svg>