<?xml version="1.0" encoding="UTF-8"?>
<!-- Do not edit this file with editors other than draw.io -->
<!DOCTYPE svg PUBLIC "-//W3C//DTD SVG 1.1//EN" "http://www.w3.org/Graphics/SVG/1.1/DTD/svg11.dtd">
<svg xmlns="http://www.w3.org/2000/svg" xmlns:xlink="http://www.w3.org/1999/xlink" version="1.1" width="810px" height="555px" viewBox="-0.5 -0.5 810 555" content="&lt;mxfile host=&quot;app.diagrams.net&quot; agent=&quot;Mozilla/5.0 (Windows NT 10.0; Win64; x64) AppleWebKit/537.36 (KHTML, like Gecko) Chrome/131.0.0.0 Safari/537.36 Edg/131.0.0.0&quot; version=&quot;25.0.3&quot;&gt;&#10;  &lt;diagram id=&quot;OX5aafMQljurD7XW0Pac&quot; name=&quot;Page-1&quot;&gt;&#10;    &lt;mxGraphModel dx=&quot;978&quot; dy=&quot;1134&quot; grid=&quot;1&quot; gridSize=&quot;10&quot; guides=&quot;1&quot; tooltips=&quot;1&quot; connect=&quot;1&quot; arrows=&quot;1&quot; fold=&quot;1&quot; page=&quot;1&quot; pageScale=&quot;1&quot; pageWidth=&quot;827&quot; pageHeight=&quot;1169&quot; math=&quot;0&quot; shadow=&quot;0&quot;&gt;&#10;      &lt;root&gt;&#10;        &lt;mxCell id=&quot;0&quot; /&gt;&#10;        &lt;mxCell id=&quot;1&quot; parent=&quot;0&quot; /&gt;&#10;        &lt;mxCell id=&quot;FCYUcSS5aIMhxrausXVU-2&quot; style=&quot;edgeStyle=orthogonalEdgeStyle;rounded=0;orthogonalLoop=1;jettySize=auto;html=1;exitX=1;exitY=0.5;exitDx=0;exitDy=0;fontFamily=Georgia;&quot; parent=&quot;1&quot; source=&quot;uy0SehUbqx5PQUWP40yV-3&quot; target=&quot;uy0SehUbqx5PQUWP40yV-14&quot; edge=&quot;1&quot;&gt;&#10;          &lt;mxGeometry relative=&quot;1&quot; as=&quot;geometry&quot; /&gt;&#10;        &lt;/mxCell&gt;&#10;        &lt;mxCell id=&quot;uy0SehUbqx5PQUWP40yV-3&quot; value=&quot;&amp;lt;div&amp;gt;Magnetorquer Board&amp;lt;/div&amp;gt;&amp;lt;div&amp;gt;&amp;lt;b&amp;gt;PFM&amp;lt;/b&amp;gt; procurement&amp;lt;br&amp;gt;&amp;lt;/div&amp;gt;&quot; style=&quot;rounded=1;fillColor=#f8cecc;align=center;strokeColor=#b85450;verticalAlign=middle;spacing=2;fontFamily=Georgia;arcSize=20;strokeWidth=2;labelPosition=center;verticalLabelPosition=middle;html=1;whiteSpace=wrap;labelBorderColor=none;&quot; parent=&quot;1&quot; vertex=&quot;1&quot;&gt;&#10;          &lt;mxGeometry x=&quot;30&quot; y=&quot;110&quot; width=&quot;160&quot; height=&quot;60&quot; as=&quot;geometry&quot; /&gt;&#10;        &lt;/mxCell&gt;&#10;        &lt;mxCell id=&quot;CS__R-Iqk9x4BLMZED6L-1&quot; style=&quot;edgeStyle=orthogonalEdgeStyle;rounded=0;orthogonalLoop=1;jettySize=auto;html=1;exitX=0.5;exitY=1;exitDx=0;exitDy=0;&quot; edge=&quot;1&quot; parent=&quot;1&quot; source=&quot;uy0SehUbqx5PQUWP40yV-6&quot; target=&quot;FCYUcSS5aIMhxrausXVU-5&quot;&gt;&#10;          &lt;mxGeometry relative=&quot;1&quot; as=&quot;geometry&quot; /&gt;&#10;        &lt;/mxCell&gt;&#10;        &lt;mxCell id=&quot;uy0SehUbqx5PQUWP40yV-6&quot; value=&quot;Integration with&amp;lt;br&amp;gt;&amp;lt;b&amp;gt;EM/PFM flatsat&amp;lt;/b&amp;gt;&quot; style=&quot;rounded=1;whiteSpace=wrap;html=1;strokeWidth=2;fillColor=#dae8fc;fontFamily=Georgia;align=center;strokeColor=#6c8ebf;arcSize=50;&quot; parent=&quot;1&quot; vertex=&quot;1&quot;&gt;&#10;          &lt;mxGeometry x=&quot;650&quot; y=&quot;110&quot; width=&quot;160&quot; height=&quot;60&quot; as=&quot;geometry&quot; /&gt;&#10;        &lt;/mxCell&gt;&#10;        &lt;mxCell id=&quot;FCYUcSS5aIMhxrausXVU-3&quot; style=&quot;edgeStyle=orthogonalEdgeStyle;rounded=0;orthogonalLoop=1;jettySize=auto;html=1;exitX=1;exitY=0.5;exitDx=0;exitDy=0;entryX=0;entryY=0.5;entryDx=0;entryDy=0;fontFamily=Georgia;&quot; parent=&quot;1&quot; source=&quot;uy0SehUbqx5PQUWP40yV-14&quot; target=&quot;Z9TUkLQl32TIw4FETAKS-1&quot; edge=&quot;1&quot;&gt;&#10;          &lt;mxGeometry relative=&quot;1&quot; as=&quot;geometry&quot;&gt;&#10;            &lt;mxPoint x=&quot;450&quot; y=&quot;140&quot; as=&quot;targetPoint&quot; /&gt;&#10;          &lt;/mxGeometry&gt;&#10;        &lt;/mxCell&gt;&#10;        &lt;mxCell id=&quot;uy0SehUbqx5PQUWP40yV-14&quot; value=&quot;Incoming Inspection&quot; style=&quot;shape=step;perimeter=stepPerimeter;whiteSpace=wrap;html=1;fixedSize=1;strokeWidth=2;fillColor=#fff2cc;fontFamily=Georgia;align=center;strokeColor=#d6b656;&quot; parent=&quot;1&quot; vertex=&quot;1&quot;&gt;&#10;          &lt;mxGeometry x=&quot;230&quot; y=&quot;110&quot; width=&quot;160&quot; height=&quot;60&quot; as=&quot;geometry&quot; /&gt;&#10;        &lt;/mxCell&gt;&#10;        &lt;mxCell id=&quot;FCYUcSS5aIMhxrausXVU-4&quot; style=&quot;edgeStyle=orthogonalEdgeStyle;rounded=0;orthogonalLoop=1;jettySize=auto;html=1;exitX=1;exitY=0.5;exitDx=0;exitDy=0;fontFamily=Georgia;&quot; parent=&quot;1&quot; source=&quot;Z9TUkLQl32TIw4FETAKS-1&quot; target=&quot;uy0SehUbqx5PQUWP40yV-6&quot; edge=&quot;1&quot;&gt;&#10;          &lt;mxGeometry relative=&quot;1&quot; as=&quot;geometry&quot; /&gt;&#10;        &lt;/mxCell&gt;&#10;        &lt;mxCell id=&quot;FCYUcSS5aIMhxrausXVU-1&quot; value=&quot;&amp;lt;font style=&amp;quot;font-size: 20px&amp;quot; color=&amp;quot;#808080&amp;quot;&amp;gt;&amp;lt;b&amp;gt;Magnetorquer Board&amp;lt;/b&amp;gt;&amp;lt;br&amp;gt;COTS &amp;lt;b&amp;gt;(PFM)&amp;lt;/b&amp;gt;&amp;lt;br&amp;gt;&amp;lt;/font&amp;gt;&quot; style=&quot;text;html=1;strokeColor=none;fillColor=none;align=center;verticalAlign=middle;whiteSpace=wrap;rounded=0;fontFamily=Georgia;&quot; parent=&quot;1&quot; vertex=&quot;1&quot;&gt;&#10;          &lt;mxGeometry x=&quot;10&quot; y=&quot;30&quot; width=&quot;810&quot; height=&quot;20&quot; as=&quot;geometry&quot; /&gt;&#10;        &lt;/mxCell&gt;&#10;        &lt;mxCell id=&quot;FCYUcSS5aIMhxrausXVU-5&quot; value=&quot;Integration with&amp;lt;br&amp;gt;&amp;lt;b&amp;gt;PFM spacecraft&amp;lt;br&amp;gt;&amp;lt;/b&amp;gt;&quot; style=&quot;rounded=1;whiteSpace=wrap;html=1;strokeWidth=2;fillColor=#dae8fc;fontFamily=Georgia;align=center;strokeColor=#6c8ebf;arcSize=50;&quot; parent=&quot;1&quot; vertex=&quot;1&quot;&gt;&#10;          &lt;mxGeometry x=&quot;650&quot; y=&quot;230&quot; width=&quot;160&quot; height=&quot;60&quot; as=&quot;geometry&quot; /&gt;&#10;        &lt;/mxCell&gt;&#10;        &lt;mxCell id=&quot;uy0SehUbqx5PQUWP40yV-1&quot; value=&quot;&amp;lt;div style=&amp;quot;font-size: 16px&amp;quot;&amp;gt;&amp;lt;font style=&amp;quot;font-size: 16px&amp;quot; face=&amp;quot;Georgia&amp;quot;&amp;gt;&amp;lt;span&amp;gt;Legend&amp;lt;/span&amp;gt;&amp;lt;/font&amp;gt;&amp;lt;/div&amp;gt;&quot; style=&quot;rounded=0;whiteSpace=wrap;html=1;align=left;labelPosition=center;verticalLabelPosition=middle;verticalAlign=top;spacing=10;fillColor=none;&quot; parent=&quot;1&quot; vertex=&quot;1&quot;&gt;&#10;          &lt;mxGeometry x=&quot;44&quot; y=&quot;350&quot; width=&quot;370&quot; height=&quot;220&quot; as=&quot;geometry&quot; /&gt;&#10;        &lt;/mxCell&gt;&#10;        &lt;mxCell id=&quot;uy0SehUbqx5PQUWP40yV-4&quot; value=&quot;&quot; style=&quot;rounded=1;fillColor=#f8cecc;align=center;strokeColor=#b85450;verticalAlign=middle;spacing=2;fontFamily=Georgia;arcSize=20;strokeWidth=2;labelPosition=center;verticalLabelPosition=middle;html=1;whiteSpace=wrap;labelBorderColor=none;&quot; parent=&quot;1&quot; vertex=&quot;1&quot;&gt;&#10;          &lt;mxGeometry x=&quot;97.80952380952381&quot; y=&quot;400&quot; width=&quot;54.761904761904766&quot; height=&quot;30&quot; as=&quot;geometry&quot; /&gt;&#10;        &lt;/mxCell&gt;&#10;        &lt;mxCell id=&quot;uy0SehUbqx5PQUWP40yV-5&quot; value=&quot;&amp;lt;div align=&amp;quot;left&amp;quot;&amp;gt;Model&amp;lt;/div&amp;gt;&quot; style=&quot;text;html=1;strokeColor=none;fillColor=none;align=left;verticalAlign=middle;whiteSpace=wrap;rounded=0;fontFamily=Georgia;&quot; parent=&quot;1&quot; vertex=&quot;1&quot;&gt;&#10;          &lt;mxGeometry x=&quot;174.47619047619048&quot; y=&quot;405&quot; width=&quot;43.80952380952381&quot; height=&quot;20&quot; as=&quot;geometry&quot; /&gt;&#10;        &lt;/mxCell&gt;&#10;        &lt;mxCell id=&quot;uy0SehUbqx5PQUWP40yV-16&quot; value=&quot;&quot; style=&quot;rounded=1;whiteSpace=wrap;html=1;strokeWidth=2;fillColor=#dae8fc;fontFamily=Georgia;align=center;strokeColor=#6c8ebf;arcSize=50;&quot; parent=&quot;1&quot; vertex=&quot;1&quot;&gt;&#10;          &lt;mxGeometry x=&quot;97.80952380952381&quot; y=&quot;440&quot; width=&quot;54.761904761904766&quot; height=&quot;30&quot; as=&quot;geometry&quot; /&gt;&#10;        &lt;/mxCell&gt;&#10;        &lt;mxCell id=&quot;uy0SehUbqx5PQUWP40yV-17&quot; value=&quot;Integration with system&quot; style=&quot;text;html=1;strokeColor=none;fillColor=none;align=left;verticalAlign=middle;whiteSpace=wrap;rounded=0;fontFamily=Georgia;&quot; parent=&quot;1&quot; vertex=&quot;1&quot;&gt;&#10;          &lt;mxGeometry x=&quot;174.47619047619048&quot; y=&quot;445&quot; width=&quot;76.66666666666667&quot; height=&quot;20&quot; as=&quot;geometry&quot; /&gt;&#10;        &lt;/mxCell&gt;&#10;        &lt;mxCell id=&quot;uy0SehUbqx5PQUWP40yV-18&quot; value=&quot;&quot; style=&quot;shape=step;perimeter=stepPerimeter;whiteSpace=wrap;html=1;fixedSize=1;strokeWidth=2;fillColor=#d5e8d4;fontFamily=Georgia;align=center;strokeColor=#82b366;&quot; parent=&quot;1&quot; vertex=&quot;1&quot;&gt;&#10;          &lt;mxGeometry x=&quot;97.80952380952381&quot; y=&quot;480&quot; width=&quot;54.761904761904766&quot; height=&quot;30&quot; as=&quot;geometry&quot; /&gt;&#10;        &lt;/mxCell&gt;&#10;        &lt;mxCell id=&quot;uy0SehUbqx5PQUWP40yV-19&quot; value=&quot;Testing Activity&quot; style=&quot;text;html=1;strokeColor=none;fillColor=none;align=left;verticalAlign=middle;whiteSpace=wrap;rounded=0;fontFamily=Georgia;&quot; parent=&quot;1&quot; vertex=&quot;1&quot;&gt;&#10;          &lt;mxGeometry x=&quot;174.47619047619048&quot; y=&quot;485&quot; width=&quot;76.66666666666667&quot; height=&quot;20&quot; as=&quot;geometry&quot; /&gt;&#10;        &lt;/mxCell&gt;&#10;        &lt;mxCell id=&quot;uy0SehUbqx5PQUWP40yV-20&quot; value=&quot;&quot; style=&quot;shape=step;perimeter=stepPerimeter;whiteSpace=wrap;html=1;fixedSize=1;strokeWidth=2;fillColor=#fff2cc;fontFamily=Georgia;align=center;strokeColor=#d6b656;&quot; parent=&quot;1&quot; vertex=&quot;1&quot;&gt;&#10;          &lt;mxGeometry x=&quot;97.80952380952381&quot; y=&quot;520&quot; width=&quot;54.761904761904766&quot; height=&quot;30&quot; as=&quot;geometry&quot; /&gt;&#10;        &lt;/mxCell&gt;&#10;        &lt;mxCell id=&quot;uy0SehUbqx5PQUWP40yV-21&quot; value=&quot;&amp;lt;div&amp;gt;Inspection&amp;lt;/div&amp;gt;&amp;lt;div&amp;gt;Activity&amp;lt;br&amp;gt;&amp;lt;/div&amp;gt;&quot; style=&quot;text;html=1;strokeColor=none;fillColor=none;align=left;verticalAlign=middle;whiteSpace=wrap;rounded=0;fontFamily=Georgia;&quot; parent=&quot;1&quot; vertex=&quot;1&quot;&gt;&#10;          &lt;mxGeometry x=&quot;174.47619047619048&quot; y=&quot;525&quot; width=&quot;76.66666666666667&quot; height=&quot;20&quot; as=&quot;geometry&quot; /&gt;&#10;        &lt;/mxCell&gt;&#10;        &lt;mxCell id=&quot;FCYUcSS5aIMhxrausXVU-9&quot; value=&quot;&amp;lt;b&amp;gt;COTS:&amp;lt;/b&amp;gt; &quot; style=&quot;text;html=1;strokeColor=none;fillColor=none;align=center;verticalAlign=middle;whiteSpace=wrap;rounded=0;fontFamily=Georgia;&quot; parent=&quot;1&quot; vertex=&quot;1&quot;&gt;&#10;          &lt;mxGeometry x=&quot;274&quot; y=&quot;430&quot; width=&quot;40&quot; height=&quot;20&quot; as=&quot;geometry&quot; /&gt;&#10;        &lt;/mxCell&gt;&#10;        &lt;mxCell id=&quot;FCYUcSS5aIMhxrausXVU-10&quot; value=&quot;&amp;lt;b&amp;gt;PFM:&amp;lt;/b&amp;gt;&quot; style=&quot;text;html=1;strokeColor=none;fillColor=none;align=center;verticalAlign=middle;whiteSpace=wrap;rounded=0;fontFamily=Georgia;&quot; parent=&quot;1&quot; vertex=&quot;1&quot;&gt;&#10;          &lt;mxGeometry x=&quot;274&quot; y=&quot;470&quot; width=&quot;40&quot; height=&quot;20&quot; as=&quot;geometry&quot; /&gt;&#10;        &lt;/mxCell&gt;&#10;        &lt;mxCell id=&quot;FCYUcSS5aIMhxrausXVU-11&quot; value=&quot;Commercial off the shelf&quot; style=&quot;text;html=1;strokeColor=none;fillColor=none;align=left;verticalAlign=middle;whiteSpace=wrap;rounded=0;fontFamily=Georgia;&quot; parent=&quot;1&quot; vertex=&quot;1&quot;&gt;&#10;          &lt;mxGeometry x=&quot;324&quot; y=&quot;435&quot; width=&quot;70&quot; height=&quot;20&quot; as=&quot;geometry&quot; /&gt;&#10;        &lt;/mxCell&gt;&#10;        &lt;mxCell id=&quot;FCYUcSS5aIMhxrausXVU-14&quot; value=&quot;Protoflight Model&quot; style=&quot;text;html=1;strokeColor=none;fillColor=none;align=left;verticalAlign=middle;whiteSpace=wrap;rounded=0;fontFamily=Georgia;&quot; parent=&quot;1&quot; vertex=&quot;1&quot;&gt;&#10;          &lt;mxGeometry x=&quot;324&quot; y=&quot;475&quot; width=&quot;70&quot; height=&quot;20&quot; as=&quot;geometry&quot; /&gt;&#10;        &lt;/mxCell&gt;&#10;        &lt;mxCell id=&quot;Z9TUkLQl32TIw4FETAKS-1&quot; value=&quot;Ambient Functional&amp;lt;br&amp;gt;Tests&quot; style=&quot;shape=step;perimeter=stepPerimeter;whiteSpace=wrap;html=1;fixedSize=1;strokeWidth=2;fillColor=#d5e8d4;fontFamily=Georgia;align=center;strokeColor=#82b366;&quot; parent=&quot;1&quot; vertex=&quot;1&quot;&gt;&#10;          &lt;mxGeometry x=&quot;440&quot; y=&quot;110&quot; width=&quot;160&quot; height=&quot;60&quot; as=&quot;geometry&quot; /&gt;&#10;        &lt;/mxCell&gt;&#10;      &lt;/root&gt;&#10;    &lt;/mxGraphModel&gt;&#10;  &lt;/diagram&gt;&#10;&lt;/mxfile&gt;&#10;" resource="https://app.diagrams.net/#Aacubesat%2Fsystems-engineering%2Fmaiv-plan%2Fmaster%2FSubsystems%20Development%20and%20Verification%20Plan%2F(DEVF-ADCS)_Magnetorquer_Board.svg#%7B%22pageId%22%3A%22OX5aafMQljurD7XW0Pac%22%7D"><defs/><g><g data-cell-id="0"><g data-cell-id="1"><g data-cell-id="FCYUcSS5aIMhxrausXVU-2"><g><path d="M 180 124 L 233.63 124" fill="none" stroke="rgb(0, 0, 0)" stroke-miterlimit="10" pointer-events="stroke"/><path d="M 238.88 124 L 231.88 127.5 L 233.63 124 L 231.88 120.5 Z" fill="rgb(0, 0, 0)" stroke="rgb(0, 0, 0)" stroke-miterlimit="10" pointer-events="all"/></g></g><g data-cell-id="uy0SehUbqx5PQUWP40yV-3"><g><rect x="20" y="94" width="160" height="60" rx="12" ry="12" fill="#f8cecc" stroke="#b85450" stroke-width="2" pointer-events="all"/></g><g><g transform="translate(-0.5 -0.5)"><switch><foreignObject pointer-events="none" width="100%" height="100%" requiredFeatures="http://www.w3.org/TR/SVG11/feature#Extensibility" style="overflow: visible; text-align: left;"><div xmlns="http://www.w3.org/1999/xhtml" style="display: flex; align-items: unsafe center; justify-content: unsafe center; width: 158px; height: 1px; padding-top: 124px; margin-left: 21px;"><div data-drawio-colors="color: rgb(0, 0, 0); " style="box-sizing: border-box; font-size: 0px; text-align: center;"><div style="display: inline-block; font-size: 12px; font-family: Georgia; color: rgb(0, 0, 0); line-height: 1.2; pointer-events: all; white-space: normal; overflow-wrap: normal;"><div>Magnetorquer Board</div><div><b>PFM</b> procurement<br /></div></div></div></div></foreignObject><text x="100" y="128" fill="rgb(0, 0, 0)" font-family="&quot;Georgia&quot;" font-size="12px" text-anchor="middle">Magnetorquer Board...</text></switch></g></g></g><g data-cell-id="CS__R-Iqk9x4BLMZED6L-1"><g><path d="M 720 154 L 720 207.63" fill="none" stroke="rgb(0, 0, 0)" stroke-miterlimit="10" pointer-events="stroke"/><path d="M 720 212.88 L 716.5 205.88 L 720 207.63 L 723.5 205.88 Z" fill="rgb(0, 0, 0)" stroke="rgb(0, 0, 0)" stroke-miterlimit="10" pointer-events="all"/></g></g><g data-cell-id="uy0SehUbqx5PQUWP40yV-6"><g><rect x="640" y="94" width="160" height="60" rx="30" ry="30" fill="#dae8fc" stroke="#6c8ebf" stroke-width="2" pointer-events="all"/></g><g><g transform="translate(-0.5 -0.5)"><switch><foreignObject pointer-events="none" width="100%" height="100%" requiredFeatures="http://www.w3.org/TR/SVG11/feature#Extensibility" style="overflow: visible; text-align: left;"><div xmlns="http://www.w3.org/1999/xhtml" style="display: flex; align-items: unsafe center; justify-content: unsafe center; width: 158px; height: 1px; padding-top: 124px; margin-left: 641px;"><div data-drawio-colors="color: rgb(0, 0, 0); " style="box-sizing: border-box; font-size: 0px; text-align: center;"><div style="display: inline-block; font-size: 12px; font-family: Georgia; color: rgb(0, 0, 0); line-height: 1.2; pointer-events: all; white-space: normal; overflow-wrap: normal;">Integration with<br /><b>EM/PFM flatsat</b></div></div></div></foreignObject><text x="720" y="128" fill="rgb(0, 0, 0)" font-family="&quot;Georgia&quot;" font-size="12px" text-anchor="middle">Integration with...</text></switch></g></g></g><g data-cell-id="FCYUcSS5aIMhxrausXVU-3"><g><path d="M 380 124 L 443.63 124" fill="none" stroke="rgb(0, 0, 0)" stroke-miterlimit="10" pointer-events="stroke"/><path d="M 448.88 124 L 441.88 127.5 L 443.63 124 L 441.88 120.5 Z" fill="rgb(0, 0, 0)" stroke="rgb(0, 0, 0)" stroke-miterlimit="10" pointer-events="all"/></g></g><g data-cell-id="uy0SehUbqx5PQUWP40yV-14"><g><path d="M 220 94 L 360 94 L 380 124 L 360 154 L 220 154 L 240 124 Z" fill="#fff2cc" stroke="#d6b656" stroke-width="2" stroke-miterlimit="10" pointer-events="all"/></g><g><g transform="translate(-0.5 -0.5)"><switch><foreignObject pointer-events="none" width="100%" height="100%" requiredFeatures="http://www.w3.org/TR/SVG11/feature#Extensibility" style="overflow: visible; text-align: left;"><div xmlns="http://www.w3.org/1999/xhtml" style="display: flex; align-items: unsafe center; justify-content: unsafe center; width: 158px; height: 1px; padding-top: 124px; margin-left: 221px;"><div data-drawio-colors="color: rgb(0, 0, 0); " style="box-sizing: border-box; font-size: 0px; text-align: center;"><div style="display: inline-block; font-size: 12px; font-family: Georgia; color: rgb(0, 0, 0); line-height: 1.2; pointer-events: all; white-space: normal; overflow-wrap: normal;">Incoming Inspection</div></div></div></foreignObject><text x="300" y="128" fill="rgb(0, 0, 0)" font-family="&quot;Georgia&quot;" font-size="12px" text-anchor="middle">Incoming Inspection</text></switch></g></g></g><g data-cell-id="FCYUcSS5aIMhxrausXVU-4"><g><path d="M 590 124 L 633.63 124" fill="none" stroke="rgb(0, 0, 0)" stroke-miterlimit="10" pointer-events="stroke"/><path d="M 638.88 124 L 631.88 127.5 L 633.63 124 L 631.88 120.5 Z" fill="rgb(0, 0, 0)" stroke="rgb(0, 0, 0)" stroke-miterlimit="10" pointer-events="all"/></g></g><g data-cell-id="FCYUcSS5aIMhxrausXVU-1"><g><rect x="0" y="14" width="810" height="20" fill="none" stroke="none" pointer-events="all"/></g><g><g transform="translate(-0.5 -0.5)"><switch><foreignObject pointer-events="none" width="100%" height="100%" requiredFeatures="http://www.w3.org/TR/SVG11/feature#Extensibility" style="overflow: visible; text-align: left;"><div xmlns="http://www.w3.org/1999/xhtml" style="display: flex; align-items: unsafe center; justify-content: unsafe center; width: 808px; height: 1px; padding-top: 24px; margin-left: 1px;"><div data-drawio-colors="color: rgb(0, 0, 0); " style="box-sizing: border-box; font-size: 0px; text-align: center;"><div style="display: inline-block; font-size: 12px; font-family: Georgia; color: rgb(0, 0, 0); line-height: 1.2; pointer-events: all; white-space: normal; overflow-wrap: normal;"><font color="#808080" style="font-size: 20px"><b>Magnetorquer Board</b><br />COTS <b>(PFM)</b><br /></font></div></div></div></foreignObject><text x="405" y="28" fill="rgb(0, 0, 0)" font-family="&quot;Georgia&quot;" font-size="12px" text-anchor="middle">Magnetorquer Board...</text></switch></g></g></g><g data-cell-id="FCYUcSS5aIMhxrausXVU-5"><g><rect x="640" y="214" width="160" height="60" rx="30" ry="30" fill="#dae8fc" stroke="#6c8ebf" stroke-width="2" pointer-events="all"/></g><g><g transform="translate(-0.5 -0.5)"><switch><foreignObject pointer-events="none" width="100%" height="100%" requiredFeatures="http://www.w3.org/TR/SVG11/feature#Extensibility" style="overflow: visible; text-align: left;"><div xmlns="http://www.w3.org/1999/xhtml" style="display: flex; align-items: unsafe center; justify-content: unsafe center; width: 158px; height: 1px; padding-top: 244px; margin-left: 641px;"><div data-drawio-colors="color: rgb(0, 0, 0); " style="box-sizing: border-box; font-size: 0px; text-align: center;"><div style="display: inline-block; font-size: 12px; font-family: Georgia; color: rgb(0, 0, 0); line-height: 1.2; pointer-events: all; white-space: normal; overflow-wrap: normal;">Integration with<br /><b>PFM spacecraft<br /></b></div></div></div></foreignObject><text x="720" y="248" fill="rgb(0, 0, 0)" font-family="&quot;Georgia&quot;" font-size="12px" text-anchor="middle">Integration with...</text></switch></g></g></g><g data-cell-id="uy0SehUbqx5PQUWP40yV-1"><g><rect x="34" y="334" width="370" height="220" fill="none" stroke="rgb(0, 0, 0)" pointer-events="all"/></g><g><g transform="translate(-0.5 -0.5)"><switch><foreignObject pointer-events="none" width="100%" height="100%" requiredFeatures="http://www.w3.org/TR/SVG11/feature#Extensibility" style="overflow: visible; text-align: left;"><div xmlns="http://www.w3.org/1999/xhtml" style="display: flex; align-items: unsafe flex-start; justify-content: unsafe flex-start; width: 352px; height: 1px; padding-top: 349px; margin-left: 44px;"><div data-drawio-colors="color: rgb(0, 0, 0); " style="box-sizing: border-box; font-size: 0px; text-align: left;"><div style="display: inline-block; font-size: 12px; font-family: Helvetica; color: rgb(0, 0, 0); line-height: 1.2; pointer-events: all; white-space: normal; overflow-wrap: normal;"><div style="font-size: 16px"><font face="Georgia" style="font-size: 16px"><span>Legend</span></font></div></div></div></div></foreignObject><text x="44" y="361" fill="rgb(0, 0, 0)" font-family="&quot;Helvetica&quot;" font-size="12px">Legend</text></switch></g></g></g><g data-cell-id="uy0SehUbqx5PQUWP40yV-4"><g><rect x="87.81" y="384" width="54.76" height="30" rx="6" ry="6" fill="#f8cecc" stroke="#b85450" stroke-width="2" pointer-events="all"/></g></g><g data-cell-id="uy0SehUbqx5PQUWP40yV-5"><g><rect x="164.48" y="389" width="43.81" height="20" fill="none" stroke="none" pointer-events="all"/></g><g><g transform="translate(-0.5 -0.5)"><switch><foreignObject pointer-events="none" width="100%" height="100%" requiredFeatures="http://www.w3.org/TR/SVG11/feature#Extensibility" style="overflow: visible; text-align: left;"><div xmlns="http://www.w3.org/1999/xhtml" style="display: flex; align-items: unsafe center; justify-content: unsafe flex-start; width: 42px; height: 1px; padding-top: 399px; margin-left: 166px;"><div data-drawio-colors="color: rgb(0, 0, 0); " style="box-sizing: border-box; font-size: 0px; text-align: left;"><div style="display: inline-block; font-size: 12px; font-family: Georgia; color: rgb(0, 0, 0); line-height: 1.2; pointer-events: all; white-space: normal; overflow-wrap: normal;"><div align="left">Model</div></div></div></div></foreignObject><text x="166" y="403" fill="rgb(0, 0, 0)" font-family="&quot;Georgia&quot;" font-size="12px">Model</text></switch></g></g></g><g data-cell-id="uy0SehUbqx5PQUWP40yV-16"><g><rect x="87.81" y="424" width="54.76" height="30" rx="15" ry="15" fill="#dae8fc" stroke="#6c8ebf" stroke-width="2" pointer-events="all"/></g></g><g data-cell-id="uy0SehUbqx5PQUWP40yV-17"><g><rect x="164.48" y="429" width="76.67" height="20" fill="none" stroke="none" pointer-events="all"/></g><g><g transform="translate(-0.5 -0.5)"><switch><foreignObject pointer-events="none" width="100%" height="100%" requiredFeatures="http://www.w3.org/TR/SVG11/feature#Extensibility" style="overflow: visible; text-align: left;"><div xmlns="http://www.w3.org/1999/xhtml" style="display: flex; align-items: unsafe center; justify-content: unsafe flex-start; width: 75px; height: 1px; padding-top: 439px; margin-left: 166px;"><div data-drawio-colors="color: rgb(0, 0, 0); " style="box-sizing: border-box; font-size: 0px; text-align: left;"><div style="display: inline-block; font-size: 12px; font-family: Georgia; color: rgb(0, 0, 0); line-height: 1.2; pointer-events: all; white-space: normal; overflow-wrap: normal;">Integration with system</div></div></div></foreignObject><text x="166" y="443" fill="rgb(0, 0, 0)" font-family="&quot;Georgia&quot;" font-size="12px">Integration w...</text></switch></g></g></g><g data-cell-id="uy0SehUbqx5PQUWP40yV-18"><g><path d="M 87.81 464 L 122.57 464 L 142.57 479 L 122.57 494 L 87.81 494 L 107.81 479 Z" fill="#d5e8d4" stroke="#82b366" stroke-width="2" stroke-miterlimit="10" pointer-events="all"/></g></g><g data-cell-id="uy0SehUbqx5PQUWP40yV-19"><g><rect x="164.48" y="469" width="76.67" height="20" fill="none" stroke="none" pointer-events="all"/></g><g><g transform="translate(-0.5 -0.5)"><switch><foreignObject pointer-events="none" width="100%" height="100%" requiredFeatures="http://www.w3.org/TR/SVG11/feature#Extensibility" style="overflow: visible; text-align: left;"><div xmlns="http://www.w3.org/1999/xhtml" style="display: flex; align-items: unsafe center; justify-content: unsafe flex-start; width: 75px; height: 1px; padding-top: 479px; margin-left: 166px;"><div data-drawio-colors="color: rgb(0, 0, 0); " style="box-sizing: border-box; font-size: 0px; text-align: left;"><div style="display: inline-block; font-size: 12px; font-family: Georgia; color: rgb(0, 0, 0); line-height: 1.2; pointer-events: all; white-space: normal; overflow-wrap: normal;">Testing Activity</div></div></div></foreignObject><text x="166" y="483" fill="rgb(0, 0, 0)" font-family="&quot;Georgia&quot;" font-size="12px">Testing Activ...</text></switch></g></g></g><g data-cell-id="uy0SehUbqx5PQUWP40yV-20"><g><path d="M 87.81 504 L 122.57 504 L 142.57 519 L 122.57 534 L 87.81 534 L 107.81 519 Z" fill="#fff2cc" stroke="#d6b656" stroke-width="2" stroke-miterlimit="10" pointer-events="all"/></g></g><g data-cell-id="uy0SehUbqx5PQUWP40yV-21"><g><rect x="164.48" y="509" width="76.67" height="20" fill="none" stroke="none" pointer-events="all"/></g><g><g transform="translate(-0.5 -0.5)"><switch><foreignObject pointer-events="none" width="100%" height="100%" requiredFeatures="http://www.w3.org/TR/SVG11/feature#Extensibility" style="overflow: visible; text-align: left;"><div xmlns="http://www.w3.org/1999/xhtml" style="display: flex; align-items: unsafe center; justify-content: unsafe flex-start; width: 75px; height: 1px; padding-top: 519px; margin-left: 166px;"><div data-drawio-colors="color: rgb(0, 0, 0); " style="box-sizing: border-box; font-size: 0px; text-align: left;"><div style="display: inline-block; font-size: 12px; font-family: Georgia; color: rgb(0, 0, 0); line-height: 1.2; pointer-events: all; white-space: normal; overflow-wrap: normal;"><div>Inspection</div><div>Activity<br /></div></div></div></div></foreignObject><text x="166" y="523" fill="rgb(0, 0, 0)" font-family="&quot;Georgia&quot;" font-size="12px">Inspection...</text></switch></g></g></g><g data-cell-id="FCYUcSS5aIMhxrausXVU-9"><g><rect x="264" y="414" width="40" height="20" fill="none" stroke="none" pointer-events="all"/></g><g><g transform="translate(-0.5 -0.5)"><switch><foreignObject pointer-events="none" width="100%" height="100%" requiredFeatures="http://www.w3.org/TR/SVG11/feature#Extensibility" style="overflow: visible; text-align: left;"><div xmlns="http://www.w3.org/1999/xhtml" style="display: flex; align-items: unsafe center; justify-content: unsafe center; width: 38px; height: 1px; padding-top: 424px; margin-left: 265px;"><div data-drawio-colors="color: rgb(0, 0, 0); " style="box-sizing: border-box; font-size: 0px; text-align: center;"><div style="display: inline-block; font-size: 12px; font-family: Georgia; color: rgb(0, 0, 0); line-height: 1.2; pointer-events: all; white-space: normal; overflow-wrap: normal;"><b>COTS:</b> </div></div></div></foreignObject><text x="284" y="428" fill="rgb(0, 0, 0)" font-family="&quot;Georgia&quot;" font-size="12px" text-anchor="middle">COTS: </text></switch></g></g></g><g data-cell-id="FCYUcSS5aIMhxrausXVU-10"><g><rect x="264" y="454" width="40" height="20" fill="none" stroke="none" pointer-events="all"/></g><g><g transform="translate(-0.5 -0.5)"><switch><foreignObject pointer-events="none" width="100%" height="100%" requiredFeatures="http://www.w3.org/TR/SVG11/feature#Extensibility" style="overflow: visible; text-align: left;"><div xmlns="http://www.w3.org/1999/xhtml" style="display: flex; align-items: unsafe center; justify-content: unsafe center; width: 38px; height: 1px; padding-top: 464px; margin-left: 265px;"><div data-drawio-colors="color: rgb(0, 0, 0); " style="box-sizing: border-box; font-size: 0px; text-align: center;"><div style="display: inline-block; font-size: 12px; font-family: Georgia; color: rgb(0, 0, 0); line-height: 1.2; pointer-events: all; white-space: normal; overflow-wrap: normal;"><b>PFM:</b></div></div></div></foreignObject><text x="284" y="468" fill="rgb(0, 0, 0)" font-family="&quot;Georgia&quot;" font-size="12px" text-anchor="middle">PFM:</text></switch></g></g></g><g data-cell-id="FCYUcSS5aIMhxrausXVU-11"><g><rect x="314" y="419" width="70" height="20" fill="none" stroke="none" pointer-events="all"/></g><g><g transform="translate(-0.5 -0.5)"><switch><foreignObject pointer-events="none" width="100%" height="100%" requiredFeatures="http://www.w3.org/TR/SVG11/feature#Extensibility" style="overflow: visible; text-align: left;"><div xmlns="http://www.w3.org/1999/xhtml" style="display: flex; align-items: unsafe center; justify-content: unsafe flex-start; width: 68px; height: 1px; padding-top: 429px; margin-left: 316px;"><div data-drawio-colors="color: rgb(0, 0, 0); " style="box-sizing: border-box; font-size: 0px; text-align: left;"><div style="display: inline-block; font-size: 12px; font-family: Georgia; color: rgb(0, 0, 0); line-height: 1.2; pointer-events: all; white-space: normal; overflow-wrap: normal;">Commercial off the shelf</div></div></div></foreignObject><text x="316" y="433" fill="rgb(0, 0, 0)" font-family="&quot;Georgia&quot;" font-size="12px">Commercial...</text></switch></g></g></g><g data-cell-id="FCYUcSS5aIMhxrausXVU-14"><g><rect x="314" y="459" width="70" height="20" fill="none" stroke="none" pointer-events="all"/></g><g><g transform="translate(-0.5 -0.5)"><switch><foreignObject pointer-events="none" width="100%" height="100%" requiredFeatures="http://www.w3.org/TR/SVG11/feature#Extensibility" style="overflow: visible; text-align: left;"><div xmlns="http://www.w3.org/1999/xhtml" style="display: flex; align-items: unsafe center; justify-content: unsafe flex-start; width: 68px; height: 1px; padding-top: 469px; margin-left: 316px;"><div data-drawio-colors="color: rgb(0, 0, 0); " style="box-sizing: border-box; font-size: 0px; text-align: left;"><div style="display: inline-block; font-size: 12px; font-family: Georgia; color: rgb(0, 0, 0); line-height: 1.2; pointer-events: all; white-space: normal; overflow-wrap: normal;">Protoflight Model</div></div></div></foreignObject><text x="316" y="473" fill="rgb(0, 0, 0)" font-family="&quot;Georgia&quot;" font-size="12px">Protoflight...</text></switch></g></g></g><g data-cell-id="Z9TUkLQl32TIw4FETAKS-1"><g><path d="M 430 94 L 570 94 L 590 124 L 570 154 L 430 154 L 450 124 Z" fill="#d5e8d4" stroke="#82b366" stroke-width="2" stroke-miterlimit="10" pointer-events="all"/></g><g><g transform="translate(-0.5 -0.5)"><switch><foreignObject pointer-events="none" width="100%" height="100%" requiredFeatures="http://www.w3.org/TR/SVG11/feature#Extensibility" style="overflow: visible; text-align: left;"><div xmlns="http://www.w3.org/1999/xhtml" style="display: flex; align-items: unsafe center; justify-content: unsafe center; width: 158px; height: 1px; padding-top: 124px; margin-left: 431px;"><div data-drawio-colors="color: rgb(0, 0, 0); " style="box-sizing: border-box; font-size: 0px; text-align: center;"><div style="display: inline-block; font-size: 12px; font-family: Georgia; color: rgb(0, 0, 0); line-height: 1.2; pointer-events: all; white-space: normal; overflow-wrap: normal;">Ambient Functional<br />Tests</div></div></div></foreignObject><text x="510" y="128" fill="rgb(0, 0, 0)" font-family="&quot;Georgia&quot;" font-size="12px" text-anchor="middle">Ambient Functional...</text></switch></g></g></g></g></g></g><switch><g requiredFeatures="http://www.w3.org/TR/SVG11/feature#Extensibility"/><a transform="translate(0,-5)" xlink:href="https://www.drawio.com/doc/faq/svg-export-text-problems" target="_blank"><text text-anchor="middle" font-size="10px" x="50%" y="100%">Text is not SVG - cannot display</text></a></switch></svg>