<?xml version="1.0" encoding="UTF-8"?>
<!-- Do not edit this file with editors other than draw.io -->
<!DOCTYPE svg PUBLIC "-//W3C//DTD SVG 1.1//EN" "http://www.w3.org/Graphics/SVG/1.1/DTD/svg11.dtd">
<svg xmlns="http://www.w3.org/2000/svg" xmlns:xlink="http://www.w3.org/1999/xlink" version="1.1" width="812px" height="687px" viewBox="-0.5 -0.5 812 687" content="&lt;mxfile host=&quot;app.diagrams.net&quot; agent=&quot;Mozilla/5.0 (Windows NT 10.0; Win64; x64) AppleWebKit/537.36 (KHTML, like Gecko) Chrome/131.0.0.0 Safari/537.36 Edg/131.0.0.0&quot; version=&quot;25.0.3&quot;&gt;&#10;  &lt;diagram id=&quot;OX5aafMQljurD7XW0Pac&quot; name=&quot;Page-1&quot;&gt;&#10;    &lt;mxGraphModel dx=&quot;961&quot; dy=&quot;544&quot; grid=&quot;1&quot; gridSize=&quot;10&quot; guides=&quot;1&quot; tooltips=&quot;1&quot; connect=&quot;1&quot; arrows=&quot;1&quot; fold=&quot;1&quot; page=&quot;1&quot; pageScale=&quot;1&quot; pageWidth=&quot;827&quot; pageHeight=&quot;1169&quot; math=&quot;0&quot; shadow=&quot;0&quot;&gt;&#10;      &lt;root&gt;&#10;        &lt;mxCell id=&quot;0&quot; /&gt;&#10;        &lt;mxCell id=&quot;1&quot; parent=&quot;0&quot; /&gt;&#10;        &lt;mxCell id=&quot;uy0SehUbqx5PQUWP40yV-1&quot; value=&quot;&amp;lt;div style=&amp;quot;font-size: 16px&amp;quot;&amp;gt;&amp;lt;font style=&amp;quot;font-size: 16px&amp;quot; face=&amp;quot;Georgia&amp;quot;&amp;gt;&amp;lt;span&amp;gt;Legend&amp;lt;/span&amp;gt;&amp;lt;/font&amp;gt;&amp;lt;/div&amp;gt;&quot; style=&quot;rounded=0;whiteSpace=wrap;html=1;align=left;labelPosition=center;verticalLabelPosition=middle;verticalAlign=top;spacing=10;fillColor=none;&quot; parent=&quot;1&quot; vertex=&quot;1&quot;&gt;&#10;          &lt;mxGeometry x=&quot;30&quot; y=&quot;480&quot; width=&quot;370&quot; height=&quot;220&quot; as=&quot;geometry&quot; /&gt;&#10;        &lt;/mxCell&gt;&#10;        &lt;mxCell id=&quot;uy0SehUbqx5PQUWP40yV-4&quot; value=&quot;&quot; style=&quot;rounded=1;fillColor=#f8cecc;align=center;strokeColor=#b85450;verticalAlign=middle;spacing=2;fontFamily=Georgia;arcSize=20;strokeWidth=2;labelPosition=center;verticalLabelPosition=middle;html=1;whiteSpace=wrap;labelBorderColor=none;&quot; parent=&quot;1&quot; vertex=&quot;1&quot;&gt;&#10;          &lt;mxGeometry x=&quot;83.80952380952381&quot; y=&quot;530&quot; width=&quot;54.761904761904766&quot; height=&quot;30&quot; as=&quot;geometry&quot; /&gt;&#10;        &lt;/mxCell&gt;&#10;        &lt;mxCell id=&quot;uy0SehUbqx5PQUWP40yV-5&quot; value=&quot;&amp;lt;div align=&amp;quot;left&amp;quot;&amp;gt;Model&amp;lt;/div&amp;gt;&quot; style=&quot;text;html=1;strokeColor=none;fillColor=none;align=left;verticalAlign=middle;whiteSpace=wrap;rounded=0;fontFamily=Georgia;&quot; parent=&quot;1&quot; vertex=&quot;1&quot;&gt;&#10;          &lt;mxGeometry x=&quot;160.47619047619048&quot; y=&quot;535&quot; width=&quot;43.80952380952381&quot; height=&quot;20&quot; as=&quot;geometry&quot; /&gt;&#10;        &lt;/mxCell&gt;&#10;        &lt;mxCell id=&quot;uy0SehUbqx5PQUWP40yV-16&quot; value=&quot;&quot; style=&quot;rounded=1;whiteSpace=wrap;html=1;strokeWidth=2;fillColor=#dae8fc;fontFamily=Georgia;align=center;strokeColor=#6c8ebf;arcSize=50;&quot; parent=&quot;1&quot; vertex=&quot;1&quot;&gt;&#10;          &lt;mxGeometry x=&quot;83.80952380952381&quot; y=&quot;570&quot; width=&quot;54.761904761904766&quot; height=&quot;30&quot; as=&quot;geometry&quot; /&gt;&#10;        &lt;/mxCell&gt;&#10;        &lt;mxCell id=&quot;uy0SehUbqx5PQUWP40yV-17&quot; value=&quot;Integration with system&quot; style=&quot;text;html=1;strokeColor=none;fillColor=none;align=left;verticalAlign=middle;whiteSpace=wrap;rounded=0;fontFamily=Georgia;&quot; parent=&quot;1&quot; vertex=&quot;1&quot;&gt;&#10;          &lt;mxGeometry x=&quot;160.47619047619048&quot; y=&quot;575&quot; width=&quot;76.66666666666667&quot; height=&quot;20&quot; as=&quot;geometry&quot; /&gt;&#10;        &lt;/mxCell&gt;&#10;        &lt;mxCell id=&quot;uy0SehUbqx5PQUWP40yV-18&quot; value=&quot;&quot; style=&quot;shape=step;perimeter=stepPerimeter;whiteSpace=wrap;html=1;fixedSize=1;strokeWidth=2;fillColor=#d5e8d4;fontFamily=Georgia;align=center;strokeColor=#82b366;&quot; parent=&quot;1&quot; vertex=&quot;1&quot;&gt;&#10;          &lt;mxGeometry x=&quot;83.80952380952381&quot; y=&quot;610&quot; width=&quot;54.761904761904766&quot; height=&quot;30&quot; as=&quot;geometry&quot; /&gt;&#10;        &lt;/mxCell&gt;&#10;        &lt;mxCell id=&quot;uy0SehUbqx5PQUWP40yV-19&quot; value=&quot;Testing Activity&quot; style=&quot;text;html=1;strokeColor=none;fillColor=none;align=left;verticalAlign=middle;whiteSpace=wrap;rounded=0;fontFamily=Georgia;&quot; parent=&quot;1&quot; vertex=&quot;1&quot;&gt;&#10;          &lt;mxGeometry x=&quot;160.47619047619048&quot; y=&quot;615&quot; width=&quot;76.66666666666667&quot; height=&quot;20&quot; as=&quot;geometry&quot; /&gt;&#10;        &lt;/mxCell&gt;&#10;        &lt;mxCell id=&quot;uy0SehUbqx5PQUWP40yV-20&quot; value=&quot;&quot; style=&quot;shape=step;perimeter=stepPerimeter;whiteSpace=wrap;html=1;fixedSize=1;strokeWidth=2;fillColor=#fff2cc;fontFamily=Georgia;align=center;strokeColor=#d6b656;&quot; parent=&quot;1&quot; vertex=&quot;1&quot;&gt;&#10;          &lt;mxGeometry x=&quot;83.80952380952381&quot; y=&quot;650&quot; width=&quot;54.761904761904766&quot; height=&quot;30&quot; as=&quot;geometry&quot; /&gt;&#10;        &lt;/mxCell&gt;&#10;        &lt;mxCell id=&quot;uy0SehUbqx5PQUWP40yV-21&quot; value=&quot;&amp;lt;div&amp;gt;Process including inspection&amp;lt;/div&amp;gt;&quot; style=&quot;text;html=1;strokeColor=none;fillColor=none;align=left;verticalAlign=middle;whiteSpace=wrap;rounded=0;fontFamily=Georgia;&quot; parent=&quot;1&quot; vertex=&quot;1&quot;&gt;&#10;          &lt;mxGeometry x=&quot;160.48&quot; y=&quot;655&quot; width=&quot;99.52&quot; height=&quot;20&quot; as=&quot;geometry&quot; /&gt;&#10;        &lt;/mxCell&gt;&#10;        &lt;mxCell id=&quot;FCYUcSS5aIMhxrausXVU-9&quot; value=&quot;&amp;lt;b&amp;gt;COTS:&amp;lt;/b&amp;gt; &quot; style=&quot;text;html=1;strokeColor=none;fillColor=none;align=center;verticalAlign=middle;whiteSpace=wrap;rounded=0;fontFamily=Georgia;&quot; parent=&quot;1&quot; vertex=&quot;1&quot;&gt;&#10;          &lt;mxGeometry x=&quot;260&quot; y=&quot;560&quot; width=&quot;40&quot; height=&quot;20&quot; as=&quot;geometry&quot; /&gt;&#10;        &lt;/mxCell&gt;&#10;        &lt;mxCell id=&quot;FCYUcSS5aIMhxrausXVU-10&quot; value=&quot;&amp;lt;b&amp;gt;PFM:&amp;lt;/b&amp;gt;&quot; style=&quot;text;html=1;strokeColor=none;fillColor=none;align=center;verticalAlign=middle;whiteSpace=wrap;rounded=0;fontFamily=Georgia;&quot; parent=&quot;1&quot; vertex=&quot;1&quot;&gt;&#10;          &lt;mxGeometry x=&quot;260&quot; y=&quot;600&quot; width=&quot;40&quot; height=&quot;20&quot; as=&quot;geometry&quot; /&gt;&#10;        &lt;/mxCell&gt;&#10;        &lt;mxCell id=&quot;FCYUcSS5aIMhxrausXVU-11&quot; value=&quot;Commercial off the shelf&quot; style=&quot;text;html=1;strokeColor=none;fillColor=none;align=left;verticalAlign=middle;whiteSpace=wrap;rounded=0;fontFamily=Georgia;&quot; parent=&quot;1&quot; vertex=&quot;1&quot;&gt;&#10;          &lt;mxGeometry x=&quot;310&quot; y=&quot;565&quot; width=&quot;70&quot; height=&quot;20&quot; as=&quot;geometry&quot; /&gt;&#10;        &lt;/mxCell&gt;&#10;        &lt;mxCell id=&quot;FCYUcSS5aIMhxrausXVU-14&quot; value=&quot;Protoflight Model&quot; style=&quot;text;html=1;strokeColor=none;fillColor=none;align=left;verticalAlign=middle;whiteSpace=wrap;rounded=0;fontFamily=Georgia;&quot; parent=&quot;1&quot; vertex=&quot;1&quot;&gt;&#10;          &lt;mxGeometry x=&quot;310&quot; y=&quot;605&quot; width=&quot;70&quot; height=&quot;20&quot; as=&quot;geometry&quot; /&gt;&#10;        &lt;/mxCell&gt;&#10;        &lt;mxCell id=&quot;kyz6KV44orSXh0V8Vsg7-1&quot; value=&quot;&amp;lt;div&amp;gt;Payload Unibody &amp;lt;b&amp;gt;&amp;lt;br&amp;gt;QM &amp;lt;/b&amp;gt;procurement&amp;lt;br&amp;gt;&amp;lt;/div&amp;gt;&quot; style=&quot;rounded=1;fillColor=#f8cecc;align=center;strokeColor=#b85450;verticalAlign=middle;spacing=2;fontFamily=Georgia;arcSize=20;strokeWidth=2;labelPosition=center;verticalLabelPosition=middle;html=1;whiteSpace=wrap;labelBorderColor=none;&quot; parent=&quot;1&quot; vertex=&quot;1&quot;&gt;&#10;          &lt;mxGeometry x=&quot;30&quot; y=&quot;110&quot; width=&quot;160&quot; height=&quot;60&quot; as=&quot;geometry&quot; /&gt;&#10;        &lt;/mxCell&gt;&#10;        &lt;mxCell id=&quot;kyz6KV44orSXh0V8Vsg7-2&quot; value=&quot;&amp;lt;div style=&amp;quot;font-size: 22px;&amp;quot;&amp;gt;&amp;lt;font style=&amp;quot;font-size: 22px;&amp;quot; color=&amp;quot;#999999&amp;quot;&amp;gt;&amp;lt;b style=&amp;quot;font-size: 22px;&amp;quot;&amp;gt;Payload Unibody&amp;lt;/b&amp;gt;&amp;lt;br style=&amp;quot;font-size: 22px;&amp;quot;&amp;gt;&amp;lt;/font&amp;gt;&amp;lt;/div&amp;gt;&amp;lt;div style=&amp;quot;font-size: 22px;&amp;quot;&amp;gt;&amp;lt;font style=&amp;quot;font-size: 22px;&amp;quot; color=&amp;quot;#999999&amp;quot;&amp;gt;COTS (&amp;lt;b style=&amp;quot;font-size: 22px;&amp;quot;&amp;gt;QM&amp;lt;/b&amp;gt;)&amp;lt;br style=&amp;quot;font-size: 22px;&amp;quot;&amp;gt;&amp;lt;/font&amp;gt;&amp;lt;/div&amp;gt;&quot; style=&quot;text;html=1;strokeColor=none;fillColor=none;align=center;verticalAlign=middle;whiteSpace=wrap;rounded=0;fontFamily=Georgia;fontSize=22;&quot; parent=&quot;1&quot; vertex=&quot;1&quot;&gt;&#10;          &lt;mxGeometry x=&quot;10&quot; y=&quot;30&quot; width=&quot;810&quot; height=&quot;20&quot; as=&quot;geometry&quot; /&gt;&#10;        &lt;/mxCell&gt;&#10;        &lt;mxCell id=&quot;kyz6KV44orSXh0V8Vsg7-3&quot; value=&quot;Integration with&amp;lt;br&amp;gt;&amp;lt;b&amp;gt;PFM spacecraft&amp;lt;br&amp;gt;&amp;lt;/b&amp;gt;&quot; style=&quot;rounded=1;whiteSpace=wrap;html=1;strokeWidth=2;fillColor=#dae8fc;fontFamily=Georgia;align=center;strokeColor=#6c8ebf;arcSize=50;&quot; parent=&quot;1&quot; vertex=&quot;1&quot;&gt;&#10;          &lt;mxGeometry x=&quot;630&quot; y=&quot;410&quot; width=&quot;160&quot; height=&quot;65&quot; as=&quot;geometry&quot; /&gt;&#10;        &lt;/mxCell&gt;&#10;        &lt;mxCell id=&quot;kyz6KV44orSXh0V8Vsg7-4&quot; value=&quot;Incoming Inspection &amp;lt;br&amp;gt;&amp;amp;amp;&amp;amp;nbsp;&amp;lt;span style=&amp;quot;background-color: initial;&amp;quot;&amp;gt;Fit checks&amp;lt;/span&amp;gt;&quot; style=&quot;shape=step;perimeter=stepPerimeter;whiteSpace=wrap;html=1;fixedSize=1;strokeWidth=2;fillColor=#fff2cc;fontFamily=Georgia;align=center;strokeColor=#d6b656;&quot; parent=&quot;1&quot; vertex=&quot;1&quot;&gt;&#10;          &lt;mxGeometry x=&quot;230&quot; y=&quot;110&quot; width=&quot;160&quot; height=&quot;60&quot; as=&quot;geometry&quot; /&gt;&#10;        &lt;/mxCell&gt;&#10;        &lt;mxCell id=&quot;kyz6KV44orSXh0V8Vsg7-5&quot; value=&quot;&quot; style=&quot;endArrow=classic;html=1;&quot; parent=&quot;1&quot; target=&quot;kyz6KV44orSXh0V8Vsg7-4&quot; edge=&quot;1&quot;&gt;&#10;          &lt;mxGeometry width=&quot;50&quot; height=&quot;50&quot; relative=&quot;1&quot; as=&quot;geometry&quot;&gt;&#10;            &lt;mxPoint x=&quot;190&quot; y=&quot;140&quot; as=&quot;sourcePoint&quot; /&gt;&#10;            &lt;mxPoint x=&quot;240&quot; y=&quot;90&quot; as=&quot;targetPoint&quot; /&gt;&#10;          &lt;/mxGeometry&gt;&#10;        &lt;/mxCell&gt;&#10;        &lt;mxCell id=&quot;kyz6KV44orSXh0V8Vsg7-6&quot; value=&quot;&quot; style=&quot;endArrow=classic;html=1;&quot; parent=&quot;1&quot; edge=&quot;1&quot;&gt;&#10;          &lt;mxGeometry width=&quot;50&quot; height=&quot;50&quot; relative=&quot;1&quot; as=&quot;geometry&quot;&gt;&#10;            &lt;mxPoint x=&quot;390&quot; y=&quot;140&quot; as=&quot;sourcePoint&quot; /&gt;&#10;            &lt;mxPoint x=&quot;450&quot; y=&quot;140&quot; as=&quot;targetPoint&quot; /&gt;&#10;          &lt;/mxGeometry&gt;&#10;        &lt;/mxCell&gt;&#10;        &lt;mxCell id=&quot;kyz6KV44orSXh0V8Vsg7-7&quot; style=&quot;edgeStyle=orthogonalEdgeStyle;rounded=0;orthogonalLoop=1;jettySize=auto;html=1;exitX=1;exitY=0.5;exitDx=0;exitDy=0;&quot; parent=&quot;1&quot; source=&quot;kyz6KV44orSXh0V8Vsg7-8&quot; target=&quot;kyz6KV44orSXh0V8Vsg7-10&quot; edge=&quot;1&quot;&gt;&#10;          &lt;mxGeometry relative=&quot;1&quot; as=&quot;geometry&quot; /&gt;&#10;        &lt;/mxCell&gt;&#10;        &lt;mxCell id=&quot;kyz6KV44orSXh0V8Vsg7-8&quot; value=&quot;&amp;lt;div&amp;gt;Autoclave&amp;lt;/div&amp;gt;&quot; style=&quot;shape=step;perimeter=stepPerimeter;whiteSpace=wrap;html=1;fixedSize=1;strokeWidth=2;fillColor=#fff2cc;fontFamily=Georgia;align=center;strokeColor=#d6b656;&quot; parent=&quot;1&quot; vertex=&quot;1&quot;&gt;&#10;          &lt;mxGeometry x=&quot;430&quot; y=&quot;110&quot; width=&quot;160&quot; height=&quot;60&quot; as=&quot;geometry&quot; /&gt;&#10;        &lt;/mxCell&gt;&#10;        &lt;mxCell id=&quot;kyz6KV44orSXh0V8Vsg7-10&quot; value=&quot;Integration with&amp;lt;br&amp;gt;&amp;lt;b&amp;gt;Payload Container QM + SU Components EQM + SU PCB EQM&amp;lt;br&amp;gt;&amp;lt;/b&amp;gt;&quot; style=&quot;rounded=1;whiteSpace=wrap;html=1;strokeWidth=2;fillColor=#dae8fc;fontFamily=Georgia;align=center;strokeColor=#6c8ebf;arcSize=50;&quot; parent=&quot;1&quot; vertex=&quot;1&quot;&gt;&#10;          &lt;mxGeometry x=&quot;640&quot; y=&quot;110&quot; width=&quot;160&quot; height=&quot;60&quot; as=&quot;geometry&quot; /&gt;&#10;        &lt;/mxCell&gt;&#10;        &lt;mxCell id=&quot;kyz6KV44orSXh0V8Vsg7-11&quot; value=&quot;&amp;lt;div&amp;gt;Payload Unibody &amp;lt;b&amp;gt;&amp;lt;br&amp;gt;FM &amp;lt;/b&amp;gt;procurement&amp;lt;br&amp;gt;&amp;lt;/div&amp;gt;&quot; style=&quot;rounded=1;fillColor=#f8cecc;align=center;strokeColor=#b85450;verticalAlign=middle;spacing=2;fontFamily=Georgia;arcSize=20;strokeWidth=2;labelPosition=center;verticalLabelPosition=middle;html=1;whiteSpace=wrap;labelBorderColor=none;&quot; parent=&quot;1&quot; vertex=&quot;1&quot;&gt;&#10;          &lt;mxGeometry x=&quot;30&quot; y=&quot;320&quot; width=&quot;160&quot; height=&quot;60&quot; as=&quot;geometry&quot; /&gt;&#10;        &lt;/mxCell&gt;&#10;        &lt;mxCell id=&quot;kyz6KV44orSXh0V8Vsg7-12&quot; value=&quot;Incoming Inspection &amp;lt;br&amp;gt;&amp;amp;amp;&amp;amp;nbsp;&amp;lt;span style=&amp;quot;background-color: initial;&amp;quot;&amp;gt;Fit checks&amp;lt;/span&amp;gt;&quot; style=&quot;shape=step;perimeter=stepPerimeter;whiteSpace=wrap;html=1;fixedSize=1;strokeWidth=2;fillColor=#fff2cc;fontFamily=Georgia;align=center;strokeColor=#d6b656;&quot; parent=&quot;1&quot; vertex=&quot;1&quot;&gt;&#10;          &lt;mxGeometry x=&quot;230&quot; y=&quot;320&quot; width=&quot;160&quot; height=&quot;60&quot; as=&quot;geometry&quot; /&gt;&#10;        &lt;/mxCell&gt;&#10;        &lt;mxCell id=&quot;kyz6KV44orSXh0V8Vsg7-13&quot; value=&quot;&quot; style=&quot;endArrow=classic;html=1;&quot; parent=&quot;1&quot; target=&quot;kyz6KV44orSXh0V8Vsg7-12&quot; edge=&quot;1&quot;&gt;&#10;          &lt;mxGeometry width=&quot;50&quot; height=&quot;50&quot; relative=&quot;1&quot; as=&quot;geometry&quot;&gt;&#10;            &lt;mxPoint x=&quot;190&quot; y=&quot;350&quot; as=&quot;sourcePoint&quot; /&gt;&#10;            &lt;mxPoint x=&quot;240&quot; y=&quot;300&quot; as=&quot;targetPoint&quot; /&gt;&#10;          &lt;/mxGeometry&gt;&#10;        &lt;/mxCell&gt;&#10;        &lt;mxCell id=&quot;kyz6KV44orSXh0V8Vsg7-14&quot; value=&quot;&quot; style=&quot;endArrow=classic;html=1;&quot; parent=&quot;1&quot; edge=&quot;1&quot;&gt;&#10;          &lt;mxGeometry width=&quot;50&quot; height=&quot;50&quot; relative=&quot;1&quot; as=&quot;geometry&quot;&gt;&#10;            &lt;mxPoint x=&quot;390&quot; y=&quot;350&quot; as=&quot;sourcePoint&quot; /&gt;&#10;            &lt;mxPoint x=&quot;450&quot; y=&quot;350&quot; as=&quot;targetPoint&quot; /&gt;&#10;          &lt;/mxGeometry&gt;&#10;        &lt;/mxCell&gt;&#10;        &lt;mxCell id=&quot;kyz6KV44orSXh0V8Vsg7-15&quot; style=&quot;edgeStyle=orthogonalEdgeStyle;rounded=0;orthogonalLoop=1;jettySize=auto;html=1;exitX=1;exitY=0.5;exitDx=0;exitDy=0;&quot; parent=&quot;1&quot; source=&quot;kyz6KV44orSXh0V8Vsg7-16&quot; target=&quot;kyz6KV44orSXh0V8Vsg7-18&quot; edge=&quot;1&quot;&gt;&#10;          &lt;mxGeometry relative=&quot;1&quot; as=&quot;geometry&quot; /&gt;&#10;        &lt;/mxCell&gt;&#10;        &lt;mxCell id=&quot;kyz6KV44orSXh0V8Vsg7-16&quot; value=&quot;&amp;lt;div&amp;gt;Autoclave&amp;lt;/div&amp;gt;&quot; style=&quot;shape=step;perimeter=stepPerimeter;whiteSpace=wrap;html=1;fixedSize=1;strokeWidth=2;fillColor=#fff2cc;fontFamily=Georgia;align=center;strokeColor=#d6b656;&quot; parent=&quot;1&quot; vertex=&quot;1&quot;&gt;&#10;          &lt;mxGeometry x=&quot;430&quot; y=&quot;320&quot; width=&quot;160&quot; height=&quot;60&quot; as=&quot;geometry&quot; /&gt;&#10;        &lt;/mxCell&gt;&#10;        &lt;mxCell id=&quot;kyz6KV44orSXh0V8Vsg7-17&quot; style=&quot;edgeStyle=orthogonalEdgeStyle;rounded=0;orthogonalLoop=1;jettySize=auto;html=1;exitX=0.5;exitY=1;exitDx=0;exitDy=0;&quot; parent=&quot;1&quot; source=&quot;kyz6KV44orSXh0V8Vsg7-18&quot; target=&quot;kyz6KV44orSXh0V8Vsg7-3&quot; edge=&quot;1&quot;&gt;&#10;          &lt;mxGeometry relative=&quot;1&quot; as=&quot;geometry&quot; /&gt;&#10;        &lt;/mxCell&gt;&#10;        &lt;mxCell id=&quot;kyz6KV44orSXh0V8Vsg7-18&quot; value=&quot;Integration with&amp;lt;br&amp;gt;&amp;lt;b&amp;gt;Payload Container FM + SU Components FM +&amp;lt;br&amp;gt;SU PCB FM&amp;lt;/b&amp;gt;&quot; style=&quot;rounded=1;whiteSpace=wrap;html=1;strokeWidth=2;fillColor=#dae8fc;fontFamily=Georgia;align=center;strokeColor=#6c8ebf;arcSize=50;&quot; parent=&quot;1&quot; vertex=&quot;1&quot;&gt;&#10;          &lt;mxGeometry x=&quot;630&quot; y=&quot;320&quot; width=&quot;160&quot; height=&quot;60&quot; as=&quot;geometry&quot; /&gt;&#10;        &lt;/mxCell&gt;&#10;        &lt;mxCell id=&quot;jcTCQRQ3FkwBXX4GRfQT-1&quot; value=&quot;&amp;lt;div style=&amp;quot;font-size: 22px;&amp;quot;&amp;gt;&amp;lt;font style=&amp;quot;font-size: 22px;&amp;quot; color=&amp;quot;#999999&amp;quot;&amp;gt;&amp;lt;b style=&amp;quot;font-size: 22px;&amp;quot;&amp;gt;Payload Unibody&amp;lt;/b&amp;gt;&amp;lt;br style=&amp;quot;font-size: 22px;&amp;quot;&amp;gt;&amp;lt;/font&amp;gt;&amp;lt;/div&amp;gt;&amp;lt;div style=&amp;quot;font-size: 22px;&amp;quot;&amp;gt;&amp;lt;font style=&amp;quot;font-size: 22px;&amp;quot; color=&amp;quot;#999999&amp;quot;&amp;gt;COTS (&amp;lt;b style=&amp;quot;font-size: 22px;&amp;quot;&amp;gt;FM&amp;lt;/b&amp;gt;)&amp;lt;br style=&amp;quot;font-size: 22px;&amp;quot;&amp;gt;&amp;lt;/font&amp;gt;&amp;lt;/div&amp;gt;&quot; style=&quot;text;html=1;strokeColor=none;fillColor=none;align=center;verticalAlign=middle;whiteSpace=wrap;rounded=0;fontFamily=Georgia;fontSize=22;&quot; parent=&quot;1&quot; vertex=&quot;1&quot;&gt;&#10;          &lt;mxGeometry x=&quot;9&quot; y=&quot;260&quot; width=&quot;810&quot; height=&quot;20&quot; as=&quot;geometry&quot; /&gt;&#10;        &lt;/mxCell&gt;&#10;      &lt;/root&gt;&#10;    &lt;/mxGraphModel&gt;&#10;  &lt;/diagram&gt;&#10;&lt;/mxfile&gt;&#10;" resource="https://app.diagrams.net/#Aacubesat%2Fsystems-engineering%2Fmaiv-plan%2Fmaster%2FSubsystems%20Development%20and%20Verification%20Plan%2FUnibody.svg#%7B%22pageId%22%3A%22OX5aafMQljurD7XW0Pac%22%7D"><defs/><g><g data-cell-id="0"><g data-cell-id="1"><g data-cell-id="uy0SehUbqx5PQUWP40yV-1"><g><rect x="21" y="466" width="370" height="220" fill="none" stroke="rgb(0, 0, 0)" pointer-events="all"/></g><g><g transform="translate(-0.5 -0.5)"><switch><foreignObject pointer-events="none" width="100%" height="100%" requiredFeatures="http://www.w3.org/TR/SVG11/feature#Extensibility" style="overflow: visible; text-align: left;"><div xmlns="http://www.w3.org/1999/xhtml" style="display: flex; align-items: unsafe flex-start; justify-content: unsafe flex-start; width: 352px; height: 1px; padding-top: 481px; margin-left: 31px;"><div data-drawio-colors="color: rgb(0, 0, 0); " style="box-sizing: border-box; font-size: 0px; text-align: left;"><div style="display: inline-block; font-size: 12px; font-family: Helvetica; color: rgb(0, 0, 0); line-height: 1.2; pointer-events: all; white-space: normal; overflow-wrap: normal;"><div style="font-size: 16px"><font face="Georgia" style="font-size: 16px"><span>Legend</span></font></div></div></div></div></foreignObject><text x="31" y="493" fill="rgb(0, 0, 0)" font-family="&quot;Helvetica&quot;" font-size="12px">Legend</text></switch></g></g></g><g data-cell-id="uy0SehUbqx5PQUWP40yV-4"><g><rect x="74.81" y="516" width="54.76" height="30" rx="6" ry="6" fill="#f8cecc" stroke="#b85450" stroke-width="2" pointer-events="all"/></g></g><g data-cell-id="uy0SehUbqx5PQUWP40yV-5"><g><rect x="151.48" y="521" width="43.81" height="20" fill="none" stroke="none" pointer-events="all"/></g><g><g transform="translate(-0.5 -0.5)"><switch><foreignObject pointer-events="none" width="100%" height="100%" requiredFeatures="http://www.w3.org/TR/SVG11/feature#Extensibility" style="overflow: visible; text-align: left;"><div xmlns="http://www.w3.org/1999/xhtml" style="display: flex; align-items: unsafe center; justify-content: unsafe flex-start; width: 42px; height: 1px; padding-top: 531px; margin-left: 153px;"><div data-drawio-colors="color: rgb(0, 0, 0); " style="box-sizing: border-box; font-size: 0px; text-align: left;"><div style="display: inline-block; font-size: 12px; font-family: Georgia; color: rgb(0, 0, 0); line-height: 1.2; pointer-events: all; white-space: normal; overflow-wrap: normal;"><div align="left">Model</div></div></div></div></foreignObject><text x="153" y="535" fill="rgb(0, 0, 0)" font-family="&quot;Georgia&quot;" font-size="12px">Model</text></switch></g></g></g><g data-cell-id="uy0SehUbqx5PQUWP40yV-16"><g><rect x="74.81" y="556" width="54.76" height="30" rx="15" ry="15" fill="#dae8fc" stroke="#6c8ebf" stroke-width="2" pointer-events="all"/></g></g><g data-cell-id="uy0SehUbqx5PQUWP40yV-17"><g><rect x="151.48" y="561" width="76.67" height="20" fill="none" stroke="none" pointer-events="all"/></g><g><g transform="translate(-0.5 -0.5)"><switch><foreignObject pointer-events="none" width="100%" height="100%" requiredFeatures="http://www.w3.org/TR/SVG11/feature#Extensibility" style="overflow: visible; text-align: left;"><div xmlns="http://www.w3.org/1999/xhtml" style="display: flex; align-items: unsafe center; justify-content: unsafe flex-start; width: 75px; height: 1px; padding-top: 571px; margin-left: 153px;"><div data-drawio-colors="color: rgb(0, 0, 0); " style="box-sizing: border-box; font-size: 0px; text-align: left;"><div style="display: inline-block; font-size: 12px; font-family: Georgia; color: rgb(0, 0, 0); line-height: 1.2; pointer-events: all; white-space: normal; overflow-wrap: normal;">Integration with system</div></div></div></foreignObject><text x="153" y="575" fill="rgb(0, 0, 0)" font-family="&quot;Georgia&quot;" font-size="12px">Integration w...</text></switch></g></g></g><g data-cell-id="uy0SehUbqx5PQUWP40yV-18"><g><path d="M 74.81 596 L 109.57 596 L 129.57 611 L 109.57 626 L 74.81 626 L 94.81 611 Z" fill="#d5e8d4" stroke="#82b366" stroke-width="2" stroke-miterlimit="10" pointer-events="all"/></g></g><g data-cell-id="uy0SehUbqx5PQUWP40yV-19"><g><rect x="151.48" y="601" width="76.67" height="20" fill="none" stroke="none" pointer-events="all"/></g><g><g transform="translate(-0.5 -0.5)"><switch><foreignObject pointer-events="none" width="100%" height="100%" requiredFeatures="http://www.w3.org/TR/SVG11/feature#Extensibility" style="overflow: visible; text-align: left;"><div xmlns="http://www.w3.org/1999/xhtml" style="display: flex; align-items: unsafe center; justify-content: unsafe flex-start; width: 75px; height: 1px; padding-top: 611px; margin-left: 153px;"><div data-drawio-colors="color: rgb(0, 0, 0); " style="box-sizing: border-box; font-size: 0px; text-align: left;"><div style="display: inline-block; font-size: 12px; font-family: Georgia; color: rgb(0, 0, 0); line-height: 1.2; pointer-events: all; white-space: normal; overflow-wrap: normal;">Testing Activity</div></div></div></foreignObject><text x="153" y="615" fill="rgb(0, 0, 0)" font-family="&quot;Georgia&quot;" font-size="12px">Testing Activ...</text></switch></g></g></g><g data-cell-id="uy0SehUbqx5PQUWP40yV-20"><g><path d="M 74.81 636 L 109.57 636 L 129.57 651 L 109.57 666 L 74.81 666 L 94.81 651 Z" fill="#fff2cc" stroke="#d6b656" stroke-width="2" stroke-miterlimit="10" pointer-events="all"/></g></g><g data-cell-id="uy0SehUbqx5PQUWP40yV-21"><g><rect x="151.48" y="641" width="99.52" height="20" fill="none" stroke="none" pointer-events="all"/></g><g><g transform="translate(-0.5 -0.5)"><switch><foreignObject pointer-events="none" width="100%" height="100%" requiredFeatures="http://www.w3.org/TR/SVG11/feature#Extensibility" style="overflow: visible; text-align: left;"><div xmlns="http://www.w3.org/1999/xhtml" style="display: flex; align-items: unsafe center; justify-content: unsafe flex-start; width: 98px; height: 1px; padding-top: 651px; margin-left: 153px;"><div data-drawio-colors="color: rgb(0, 0, 0); " style="box-sizing: border-box; font-size: 0px; text-align: left;"><div style="display: inline-block; font-size: 12px; font-family: Georgia; color: rgb(0, 0, 0); line-height: 1.2; pointer-events: all; white-space: normal; overflow-wrap: normal;"><div>Process including inspection</div></div></div></div></foreignObject><text x="153" y="655" fill="rgb(0, 0, 0)" font-family="&quot;Georgia&quot;" font-size="12px">Process includin...</text></switch></g></g></g><g data-cell-id="FCYUcSS5aIMhxrausXVU-9"><g><rect x="251" y="546" width="40" height="20" fill="none" stroke="none" pointer-events="all"/></g><g><g transform="translate(-0.5 -0.5)"><switch><foreignObject pointer-events="none" width="100%" height="100%" requiredFeatures="http://www.w3.org/TR/SVG11/feature#Extensibility" style="overflow: visible; text-align: left;"><div xmlns="http://www.w3.org/1999/xhtml" style="display: flex; align-items: unsafe center; justify-content: unsafe center; width: 38px; height: 1px; padding-top: 556px; margin-left: 252px;"><div data-drawio-colors="color: rgb(0, 0, 0); " style="box-sizing: border-box; font-size: 0px; text-align: center;"><div style="display: inline-block; font-size: 12px; font-family: Georgia; color: rgb(0, 0, 0); line-height: 1.2; pointer-events: all; white-space: normal; overflow-wrap: normal;"><b>COTS:</b> </div></div></div></foreignObject><text x="271" y="560" fill="rgb(0, 0, 0)" font-family="&quot;Georgia&quot;" font-size="12px" text-anchor="middle">COTS: </text></switch></g></g></g><g data-cell-id="FCYUcSS5aIMhxrausXVU-10"><g><rect x="251" y="586" width="40" height="20" fill="none" stroke="none" pointer-events="all"/></g><g><g transform="translate(-0.5 -0.5)"><switch><foreignObject pointer-events="none" width="100%" height="100%" requiredFeatures="http://www.w3.org/TR/SVG11/feature#Extensibility" style="overflow: visible; text-align: left;"><div xmlns="http://www.w3.org/1999/xhtml" style="display: flex; align-items: unsafe center; justify-content: unsafe center; width: 38px; height: 1px; padding-top: 596px; margin-left: 252px;"><div data-drawio-colors="color: rgb(0, 0, 0); " style="box-sizing: border-box; font-size: 0px; text-align: center;"><div style="display: inline-block; font-size: 12px; font-family: Georgia; color: rgb(0, 0, 0); line-height: 1.2; pointer-events: all; white-space: normal; overflow-wrap: normal;"><b>PFM:</b></div></div></div></foreignObject><text x="271" y="600" fill="rgb(0, 0, 0)" font-family="&quot;Georgia&quot;" font-size="12px" text-anchor="middle">PFM:</text></switch></g></g></g><g data-cell-id="FCYUcSS5aIMhxrausXVU-11"><g><rect x="301" y="551" width="70" height="20" fill="none" stroke="none" pointer-events="all"/></g><g><g transform="translate(-0.5 -0.5)"><switch><foreignObject pointer-events="none" width="100%" height="100%" requiredFeatures="http://www.w3.org/TR/SVG11/feature#Extensibility" style="overflow: visible; text-align: left;"><div xmlns="http://www.w3.org/1999/xhtml" style="display: flex; align-items: unsafe center; justify-content: unsafe flex-start; width: 68px; height: 1px; padding-top: 561px; margin-left: 303px;"><div data-drawio-colors="color: rgb(0, 0, 0); " style="box-sizing: border-box; font-size: 0px; text-align: left;"><div style="display: inline-block; font-size: 12px; font-family: Georgia; color: rgb(0, 0, 0); line-height: 1.2; pointer-events: all; white-space: normal; overflow-wrap: normal;">Commercial off the shelf</div></div></div></foreignObject><text x="303" y="565" fill="rgb(0, 0, 0)" font-family="&quot;Georgia&quot;" font-size="12px">Commercial...</text></switch></g></g></g><g data-cell-id="FCYUcSS5aIMhxrausXVU-14"><g><rect x="301" y="591" width="70" height="20" fill="none" stroke="none" pointer-events="all"/></g><g><g transform="translate(-0.5 -0.5)"><switch><foreignObject pointer-events="none" width="100%" height="100%" requiredFeatures="http://www.w3.org/TR/SVG11/feature#Extensibility" style="overflow: visible; text-align: left;"><div xmlns="http://www.w3.org/1999/xhtml" style="display: flex; align-items: unsafe center; justify-content: unsafe flex-start; width: 68px; height: 1px; padding-top: 601px; margin-left: 303px;"><div data-drawio-colors="color: rgb(0, 0, 0); " style="box-sizing: border-box; font-size: 0px; text-align: left;"><div style="display: inline-block; font-size: 12px; font-family: Georgia; color: rgb(0, 0, 0); line-height: 1.2; pointer-events: all; white-space: normal; overflow-wrap: normal;">Protoflight Model</div></div></div></foreignObject><text x="303" y="605" fill="rgb(0, 0, 0)" font-family="&quot;Georgia&quot;" font-size="12px">Protoflight...</text></switch></g></g></g><g data-cell-id="kyz6KV44orSXh0V8Vsg7-1"><g><rect x="21" y="96" width="160" height="60" rx="12" ry="12" fill="#f8cecc" stroke="#b85450" stroke-width="2" pointer-events="all"/></g><g><g transform="translate(-0.5 -0.5)"><switch><foreignObject pointer-events="none" width="100%" height="100%" requiredFeatures="http://www.w3.org/TR/SVG11/feature#Extensibility" style="overflow: visible; text-align: left;"><div xmlns="http://www.w3.org/1999/xhtml" style="display: flex; align-items: unsafe center; justify-content: unsafe center; width: 158px; height: 1px; padding-top: 126px; margin-left: 22px;"><div data-drawio-colors="color: rgb(0, 0, 0); " style="box-sizing: border-box; font-size: 0px; text-align: center;"><div style="display: inline-block; font-size: 12px; font-family: Georgia; color: rgb(0, 0, 0); line-height: 1.2; pointer-events: all; white-space: normal; overflow-wrap: normal;"><div>Payload Unibody <b><br />QM </b>procurement<br /></div></div></div></div></foreignObject><text x="101" y="130" fill="rgb(0, 0, 0)" font-family="&quot;Georgia&quot;" font-size="12px" text-anchor="middle">Payload Unibody...</text></switch></g></g></g><g data-cell-id="kyz6KV44orSXh0V8Vsg7-2"><g><rect x="1" y="16" width="810" height="20" fill="none" stroke="none" pointer-events="all"/></g><g><g transform="translate(-0.5 -0.5)"><switch><foreignObject pointer-events="none" width="100%" height="100%" requiredFeatures="http://www.w3.org/TR/SVG11/feature#Extensibility" style="overflow: visible; text-align: left;"><div xmlns="http://www.w3.org/1999/xhtml" style="display: flex; align-items: unsafe center; justify-content: unsafe center; width: 808px; height: 1px; padding-top: 26px; margin-left: 2px;"><div data-drawio-colors="color: rgb(0, 0, 0); " style="box-sizing: border-box; font-size: 0px; text-align: center;"><div style="display: inline-block; font-size: 22px; font-family: Georgia; color: rgb(0, 0, 0); line-height: 1.2; pointer-events: all; white-space: normal; overflow-wrap: normal;"><div style="font-size: 22px;"><font color="#999999" style="font-size: 22px;"><b style="font-size: 22px;">Payload Unibody</b><br style="font-size: 22px;" /></font></div><div style="font-size: 22px;"><font color="#999999" style="font-size: 22px;">COTS (<b style="font-size: 22px;">QM</b>)<br style="font-size: 22px;" /></font></div></div></div></div></foreignObject><text x="406" y="33" fill="rgb(0, 0, 0)" font-family="&quot;Georgia&quot;" font-size="22px" text-anchor="middle">Payload Unibody...</text></switch></g></g></g><g data-cell-id="kyz6KV44orSXh0V8Vsg7-3"><g><rect x="621" y="396" width="160" height="65" rx="32.5" ry="32.5" fill="#dae8fc" stroke="#6c8ebf" stroke-width="2" pointer-events="all"/></g><g><g transform="translate(-0.5 -0.5)"><switch><foreignObject pointer-events="none" width="100%" height="100%" requiredFeatures="http://www.w3.org/TR/SVG11/feature#Extensibility" style="overflow: visible; text-align: left;"><div xmlns="http://www.w3.org/1999/xhtml" style="display: flex; align-items: unsafe center; justify-content: unsafe center; width: 158px; height: 1px; padding-top: 429px; margin-left: 622px;"><div data-drawio-colors="color: rgb(0, 0, 0); " style="box-sizing: border-box; font-size: 0px; text-align: center;"><div style="display: inline-block; font-size: 12px; font-family: Georgia; color: rgb(0, 0, 0); line-height: 1.2; pointer-events: all; white-space: normal; overflow-wrap: normal;">Integration with<br /><b>PFM spacecraft<br /></b></div></div></div></foreignObject><text x="701" y="432" fill="rgb(0, 0, 0)" font-family="&quot;Georgia&quot;" font-size="12px" text-anchor="middle">Integration with...</text></switch></g></g></g><g data-cell-id="kyz6KV44orSXh0V8Vsg7-4"><g><path d="M 221 96 L 361 96 L 381 126 L 361 156 L 221 156 L 241 126 Z" fill="#fff2cc" stroke="#d6b656" stroke-width="2" stroke-miterlimit="10" pointer-events="all"/></g><g><g transform="translate(-0.5 -0.5)"><switch><foreignObject pointer-events="none" width="100%" height="100%" requiredFeatures="http://www.w3.org/TR/SVG11/feature#Extensibility" style="overflow: visible; text-align: left;"><div xmlns="http://www.w3.org/1999/xhtml" style="display: flex; align-items: unsafe center; justify-content: unsafe center; width: 158px; height: 1px; padding-top: 126px; margin-left: 222px;"><div data-drawio-colors="color: rgb(0, 0, 0); " style="box-sizing: border-box; font-size: 0px; text-align: center;"><div style="display: inline-block; font-size: 12px; font-family: Georgia; color: rgb(0, 0, 0); line-height: 1.2; pointer-events: all; white-space: normal; overflow-wrap: normal;">Incoming Inspection <br />&amp; <span style="background-color: initial;">Fit checks</span></div></div></div></foreignObject><text x="301" y="130" fill="rgb(0, 0, 0)" font-family="&quot;Georgia&quot;" font-size="12px" text-anchor="middle">Incoming Inspection...</text></switch></g></g></g><g data-cell-id="kyz6KV44orSXh0V8Vsg7-5"><g><path d="M 181 126 L 234.63 126" fill="none" stroke="rgb(0, 0, 0)" stroke-miterlimit="10" pointer-events="stroke"/><path d="M 239.88 126 L 232.88 129.5 L 234.63 126 L 232.88 122.5 Z" fill="rgb(0, 0, 0)" stroke="rgb(0, 0, 0)" stroke-miterlimit="10" pointer-events="all"/></g></g><g data-cell-id="kyz6KV44orSXh0V8Vsg7-6"><g><path d="M 381 126 L 434.63 126" fill="none" stroke="rgb(0, 0, 0)" stroke-miterlimit="10" pointer-events="stroke"/><path d="M 439.88 126 L 432.88 129.5 L 434.63 126 L 432.88 122.5 Z" fill="rgb(0, 0, 0)" stroke="rgb(0, 0, 0)" stroke-miterlimit="10" pointer-events="all"/></g></g><g data-cell-id="kyz6KV44orSXh0V8Vsg7-7"><g><path d="M 581 126 L 624.63 126" fill="none" stroke="rgb(0, 0, 0)" stroke-miterlimit="10" pointer-events="stroke"/><path d="M 629.88 126 L 622.88 129.5 L 624.63 126 L 622.88 122.5 Z" fill="rgb(0, 0, 0)" stroke="rgb(0, 0, 0)" stroke-miterlimit="10" pointer-events="all"/></g></g><g data-cell-id="kyz6KV44orSXh0V8Vsg7-8"><g><path d="M 421 96 L 561 96 L 581 126 L 561 156 L 421 156 L 441 126 Z" fill="#fff2cc" stroke="#d6b656" stroke-width="2" stroke-miterlimit="10" pointer-events="all"/></g><g><g transform="translate(-0.5 -0.5)"><switch><foreignObject pointer-events="none" width="100%" height="100%" requiredFeatures="http://www.w3.org/TR/SVG11/feature#Extensibility" style="overflow: visible; text-align: left;"><div xmlns="http://www.w3.org/1999/xhtml" style="display: flex; align-items: unsafe center; justify-content: unsafe center; width: 158px; height: 1px; padding-top: 126px; margin-left: 422px;"><div data-drawio-colors="color: rgb(0, 0, 0); " style="box-sizing: border-box; font-size: 0px; text-align: center;"><div style="display: inline-block; font-size: 12px; font-family: Georgia; color: rgb(0, 0, 0); line-height: 1.2; pointer-events: all; white-space: normal; overflow-wrap: normal;"><div>Autoclave</div></div></div></div></foreignObject><text x="501" y="130" fill="rgb(0, 0, 0)" font-family="&quot;Georgia&quot;" font-size="12px" text-anchor="middle">Autoclave</text></switch></g></g></g><g data-cell-id="kyz6KV44orSXh0V8Vsg7-10"><g><rect x="631" y="96" width="160" height="60" rx="30" ry="30" fill="#dae8fc" stroke="#6c8ebf" stroke-width="2" pointer-events="all"/></g><g><g transform="translate(-0.5 -0.5)"><switch><foreignObject pointer-events="none" width="100%" height="100%" requiredFeatures="http://www.w3.org/TR/SVG11/feature#Extensibility" style="overflow: visible; text-align: left;"><div xmlns="http://www.w3.org/1999/xhtml" style="display: flex; align-items: unsafe center; justify-content: unsafe center; width: 158px; height: 1px; padding-top: 126px; margin-left: 632px;"><div data-drawio-colors="color: rgb(0, 0, 0); " style="box-sizing: border-box; font-size: 0px; text-align: center;"><div style="display: inline-block; font-size: 12px; font-family: Georgia; color: rgb(0, 0, 0); line-height: 1.2; pointer-events: all; white-space: normal; overflow-wrap: normal;">Integration with<br /><b>Payload Container QM + SU Components EQM + SU PCB EQM<br /></b></div></div></div></foreignObject><text x="711" y="130" fill="rgb(0, 0, 0)" font-family="&quot;Georgia&quot;" font-size="12px" text-anchor="middle">Integration with...</text></switch></g></g></g><g data-cell-id="kyz6KV44orSXh0V8Vsg7-11"><g><rect x="21" y="306" width="160" height="60" rx="12" ry="12" fill="#f8cecc" stroke="#b85450" stroke-width="2" pointer-events="all"/></g><g><g transform="translate(-0.5 -0.5)"><switch><foreignObject pointer-events="none" width="100%" height="100%" requiredFeatures="http://www.w3.org/TR/SVG11/feature#Extensibility" style="overflow: visible; text-align: left;"><div xmlns="http://www.w3.org/1999/xhtml" style="display: flex; align-items: unsafe center; justify-content: unsafe center; width: 158px; height: 1px; padding-top: 336px; margin-left: 22px;"><div data-drawio-colors="color: rgb(0, 0, 0); " style="box-sizing: border-box; font-size: 0px; text-align: center;"><div style="display: inline-block; font-size: 12px; font-family: Georgia; color: rgb(0, 0, 0); line-height: 1.2; pointer-events: all; white-space: normal; overflow-wrap: normal;"><div>Payload Unibody <b><br />FM </b>procurement<br /></div></div></div></div></foreignObject><text x="101" y="340" fill="rgb(0, 0, 0)" font-family="&quot;Georgia&quot;" font-size="12px" text-anchor="middle">Payload Unibody...</text></switch></g></g></g><g data-cell-id="kyz6KV44orSXh0V8Vsg7-12"><g><path d="M 221 306 L 361 306 L 381 336 L 361 366 L 221 366 L 241 336 Z" fill="#fff2cc" stroke="#d6b656" stroke-width="2" stroke-miterlimit="10" pointer-events="all"/></g><g><g transform="translate(-0.5 -0.5)"><switch><foreignObject pointer-events="none" width="100%" height="100%" requiredFeatures="http://www.w3.org/TR/SVG11/feature#Extensibility" style="overflow: visible; text-align: left;"><div xmlns="http://www.w3.org/1999/xhtml" style="display: flex; align-items: unsafe center; justify-content: unsafe center; width: 158px; height: 1px; padding-top: 336px; margin-left: 222px;"><div data-drawio-colors="color: rgb(0, 0, 0); " style="box-sizing: border-box; font-size: 0px; text-align: center;"><div style="display: inline-block; font-size: 12px; font-family: Georgia; color: rgb(0, 0, 0); line-height: 1.2; pointer-events: all; white-space: normal; overflow-wrap: normal;">Incoming Inspection <br />&amp; <span style="background-color: initial;">Fit checks</span></div></div></div></foreignObject><text x="301" y="340" fill="rgb(0, 0, 0)" font-family="&quot;Georgia&quot;" font-size="12px" text-anchor="middle">Incoming Inspection...</text></switch></g></g></g><g data-cell-id="kyz6KV44orSXh0V8Vsg7-13"><g><path d="M 181 336 L 234.63 336" fill="none" stroke="rgb(0, 0, 0)" stroke-miterlimit="10" pointer-events="stroke"/><path d="M 239.88 336 L 232.88 339.5 L 234.63 336 L 232.88 332.5 Z" fill="rgb(0, 0, 0)" stroke="rgb(0, 0, 0)" stroke-miterlimit="10" pointer-events="all"/></g></g><g data-cell-id="kyz6KV44orSXh0V8Vsg7-14"><g><path d="M 381 336 L 434.63 336" fill="none" stroke="rgb(0, 0, 0)" stroke-miterlimit="10" pointer-events="stroke"/><path d="M 439.88 336 L 432.88 339.5 L 434.63 336 L 432.88 332.5 Z" fill="rgb(0, 0, 0)" stroke="rgb(0, 0, 0)" stroke-miterlimit="10" pointer-events="all"/></g></g><g data-cell-id="kyz6KV44orSXh0V8Vsg7-15"><g><path d="M 581 336 L 614.63 336" fill="none" stroke="rgb(0, 0, 0)" stroke-miterlimit="10" pointer-events="stroke"/><path d="M 619.88 336 L 612.88 339.5 L 614.63 336 L 612.88 332.5 Z" fill="rgb(0, 0, 0)" stroke="rgb(0, 0, 0)" stroke-miterlimit="10" pointer-events="all"/></g></g><g data-cell-id="kyz6KV44orSXh0V8Vsg7-16"><g><path d="M 421 306 L 561 306 L 581 336 L 561 366 L 421 366 L 441 336 Z" fill="#fff2cc" stroke="#d6b656" stroke-width="2" stroke-miterlimit="10" pointer-events="all"/></g><g><g transform="translate(-0.5 -0.5)"><switch><foreignObject pointer-events="none" width="100%" height="100%" requiredFeatures="http://www.w3.org/TR/SVG11/feature#Extensibility" style="overflow: visible; text-align: left;"><div xmlns="http://www.w3.org/1999/xhtml" style="display: flex; align-items: unsafe center; justify-content: unsafe center; width: 158px; height: 1px; padding-top: 336px; margin-left: 422px;"><div data-drawio-colors="color: rgb(0, 0, 0); " style="box-sizing: border-box; font-size: 0px; text-align: center;"><div style="display: inline-block; font-size: 12px; font-family: Georgia; color: rgb(0, 0, 0); line-height: 1.2; pointer-events: all; white-space: normal; overflow-wrap: normal;"><div>Autoclave</div></div></div></div></foreignObject><text x="501" y="340" fill="rgb(0, 0, 0)" font-family="&quot;Georgia&quot;" font-size="12px" text-anchor="middle">Autoclave</text></switch></g></g></g><g data-cell-id="kyz6KV44orSXh0V8Vsg7-17"><g><path d="M 701 366 L 701 386 L 701 376 L 701 389.63" fill="none" stroke="rgb(0, 0, 0)" stroke-miterlimit="10" pointer-events="stroke"/><path d="M 701 394.88 L 697.5 387.88 L 701 389.63 L 704.5 387.88 Z" fill="rgb(0, 0, 0)" stroke="rgb(0, 0, 0)" stroke-miterlimit="10" pointer-events="all"/></g></g><g data-cell-id="kyz6KV44orSXh0V8Vsg7-18"><g><rect x="621" y="306" width="160" height="60" rx="30" ry="30" fill="#dae8fc" stroke="#6c8ebf" stroke-width="2" pointer-events="all"/></g><g><g transform="translate(-0.5 -0.5)"><switch><foreignObject pointer-events="none" width="100%" height="100%" requiredFeatures="http://www.w3.org/TR/SVG11/feature#Extensibility" style="overflow: visible; text-align: left;"><div xmlns="http://www.w3.org/1999/xhtml" style="display: flex; align-items: unsafe center; justify-content: unsafe center; width: 158px; height: 1px; padding-top: 336px; margin-left: 622px;"><div data-drawio-colors="color: rgb(0, 0, 0); " style="box-sizing: border-box; font-size: 0px; text-align: center;"><div style="display: inline-block; font-size: 12px; font-family: Georgia; color: rgb(0, 0, 0); line-height: 1.2; pointer-events: all; white-space: normal; overflow-wrap: normal;">Integration with<br /><b>Payload Container FM + SU Components FM +<br />SU PCB FM</b></div></div></div></foreignObject><text x="701" y="340" fill="rgb(0, 0, 0)" font-family="&quot;Georgia&quot;" font-size="12px" text-anchor="middle">Integration with...</text></switch></g></g></g><g data-cell-id="jcTCQRQ3FkwBXX4GRfQT-1"><g><rect x="0" y="246" width="810" height="20" fill="none" stroke="none" pointer-events="all"/></g><g><g transform="translate(-0.5 -0.5)"><switch><foreignObject pointer-events="none" width="100%" height="100%" requiredFeatures="http://www.w3.org/TR/SVG11/feature#Extensibility" style="overflow: visible; text-align: left;"><div xmlns="http://www.w3.org/1999/xhtml" style="display: flex; align-items: unsafe center; justify-content: unsafe center; width: 808px; height: 1px; padding-top: 256px; margin-left: 1px;"><div data-drawio-colors="color: rgb(0, 0, 0); " style="box-sizing: border-box; font-size: 0px; text-align: center;"><div style="display: inline-block; font-size: 22px; font-family: Georgia; color: rgb(0, 0, 0); line-height: 1.2; pointer-events: all; white-space: normal; overflow-wrap: normal;"><div style="font-size: 22px;"><font color="#999999" style="font-size: 22px;"><b style="font-size: 22px;">Payload Unibody</b><br style="font-size: 22px;" /></font></div><div style="font-size: 22px;"><font color="#999999" style="font-size: 22px;">COTS (<b style="font-size: 22px;">FM</b>)<br style="font-size: 22px;" /></font></div></div></div></div></foreignObject><text x="405" y="263" fill="rgb(0, 0, 0)" font-family="&quot;Georgia&quot;" font-size="22px" text-anchor="middle">Payload Unibody...</text></switch></g></g></g></g></g></g><switch><g requiredFeatures="http://www.w3.org/TR/SVG11/feature#Extensibility"/><a transform="translate(0,-5)" xlink:href="https://www.drawio.com/doc/faq/svg-export-text-problems" target="_blank"><text text-anchor="middle" font-size="10px" x="50%" y="100%">Text is not SVG - cannot display</text></a></switch></svg>