<?xml version="1.0" encoding="UTF-8"?>
<!-- Do not edit this file with editors other than draw.io -->
<!DOCTYPE svg PUBLIC "-//W3C//DTD SVG 1.1//EN" "http://www.w3.org/Graphics/SVG/1.1/DTD/svg11.dtd">
<svg xmlns="http://www.w3.org/2000/svg" xmlns:xlink="http://www.w3.org/1999/xlink" version="1.1" width="812px" height="1106px" viewBox="-0.5 -0.5 812 1106" content="&lt;mxfile host=&quot;app.diagrams.net&quot; agent=&quot;Mozilla/5.0 (Windows NT 10.0; Win64; x64) AppleWebKit/537.36 (KHTML, like Gecko) Chrome/131.0.0.0 Safari/537.36&quot; version=&quot;25.0.3&quot;&gt;&#10;  &lt;diagram id=&quot;DFkY3160zYKJ3aZtAoEV&quot; name=&quot;Page-1&quot;&gt;&#10;    &lt;mxGraphModel dx=&quot;1726&quot; dy=&quot;1001&quot; grid=&quot;1&quot; gridSize=&quot;10&quot; guides=&quot;1&quot; tooltips=&quot;1&quot; connect=&quot;1&quot; arrows=&quot;1&quot; fold=&quot;1&quot; page=&quot;1&quot; pageScale=&quot;1&quot; pageWidth=&quot;850&quot; pageHeight=&quot;1100&quot; math=&quot;0&quot; shadow=&quot;0&quot;&gt;&#10;      &lt;root&gt;&#10;        &lt;mxCell id=&quot;0&quot; /&gt;&#10;        &lt;mxCell id=&quot;1&quot; parent=&quot;0&quot; /&gt;&#10;        &lt;mxCell id=&quot;lHj1bqGTADj1EBmBJ9V9-7&quot; style=&quot;edgeStyle=orthogonalEdgeStyle;rounded=0;orthogonalLoop=1;jettySize=auto;html=1;entryX=0;entryY=0.5;entryDx=0;entryDy=0;&quot; edge=&quot;1&quot; parent=&quot;1&quot; source=&quot;zp9XOmUiPlZiaDm-wida-73&quot; target=&quot;zp9XOmUiPlZiaDm-wida-92&quot;&gt;&#10;          &lt;mxGeometry relative=&quot;1&quot; as=&quot;geometry&quot; /&gt;&#10;        &lt;/mxCell&gt;&#10;        &lt;mxCell id=&quot;zp9XOmUiPlZiaDm-wida-73&quot; value=&quot;&amp;lt;div&amp;gt;Comms Board&amp;lt;/div&amp;gt;&amp;lt;div&amp;gt;&amp;lt;b&amp;gt;EQM &amp;lt;/b&amp;gt;Procurement&amp;lt;br&amp;gt;&amp;lt;/div&amp;gt;&quot; style=&quot;rounded=1;fillColor=#f8cecc;align=center;strokeColor=#b85450;verticalAlign=middle;spacing=2;fontFamily=Georgia;arcSize=20;strokeWidth=2;labelPosition=center;verticalLabelPosition=middle;html=1;whiteSpace=wrap;labelBorderColor=none;&quot; parent=&quot;1&quot; vertex=&quot;1&quot;&gt;&#10;          &lt;mxGeometry x=&quot;62&quot; y=&quot;340&quot; width=&quot;160&quot; height=&quot;60&quot; as=&quot;geometry&quot; /&gt;&#10;        &lt;/mxCell&gt;&#10;        &lt;mxCell id=&quot;zp9XOmUiPlZiaDm-wida-74&quot; value=&quot;EQM Integration with&amp;lt;br&amp;gt;&amp;lt;b&amp;gt;system flatsat&amp;lt;/b&amp;gt;&quot; style=&quot;rounded=1;whiteSpace=wrap;html=1;strokeWidth=2;fillColor=#dae8fc;fontFamily=Georgia;align=center;strokeColor=#6c8ebf;arcSize=50;&quot; parent=&quot;1&quot; vertex=&quot;1&quot;&gt;&#10;          &lt;mxGeometry x=&quot;265&quot; y=&quot;460&quot; width=&quot;160&quot; height=&quot;60&quot; as=&quot;geometry&quot; /&gt;&#10;        &lt;/mxCell&gt;&#10;        &lt;mxCell id=&quot;zp9XOmUiPlZiaDm-wida-78&quot; value=&quot;&amp;lt;b style=&amp;quot;font-size: 21px;&amp;quot;&amp;gt;&amp;lt;font style=&amp;quot;font-size: 21px;&amp;quot;&amp;gt;Comms Board&amp;lt;/font&amp;gt;&amp;lt;/b&amp;gt;&amp;lt;font style=&amp;quot;font-size: 21px;&amp;quot;&amp;gt;&amp;lt;br style=&amp;quot;font-size: 21px;&amp;quot;&amp;gt;&amp;lt;/font&amp;gt;&amp;lt;font style=&amp;quot;font-size: 21px&amp;quot;&amp;gt;COTS &amp;lt;b style=&amp;quot;font-size: 21px;&amp;quot;&amp;gt;(EQM)&amp;lt;/b&amp;gt;&amp;lt;/font&amp;gt;&quot; style=&quot;text;html=1;strokeColor=none;fillColor=none;align=center;verticalAlign=middle;whiteSpace=wrap;rounded=0;fontFamily=Georgia;fontColor=#808080;fontSize=21;&quot; parent=&quot;1&quot; vertex=&quot;1&quot;&gt;&#10;          &lt;mxGeometry x=&quot;42&quot; y=&quot;260&quot; width=&quot;810&quot; height=&quot;20&quot; as=&quot;geometry&quot; /&gt;&#10;        &lt;/mxCell&gt;&#10;        &lt;mxCell id=&quot;zp9XOmUiPlZiaDm-wida-79&quot; value=&quot;&amp;lt;div style=&amp;quot;font-size: 16px&amp;quot;&amp;gt;&amp;lt;font style=&amp;quot;font-size: 16px&amp;quot; face=&amp;quot;Georgia&amp;quot;&amp;gt;&amp;lt;span&amp;gt;Legend&amp;lt;/span&amp;gt;&amp;lt;/font&amp;gt;&amp;lt;/div&amp;gt;&quot; style=&quot;rounded=0;whiteSpace=wrap;html=1;align=left;labelPosition=center;verticalLabelPosition=middle;verticalAlign=top;spacing=10;fillColor=none;&quot; parent=&quot;1&quot; vertex=&quot;1&quot;&gt;&#10;          &lt;mxGeometry x=&quot;62&quot; y=&quot;910&quot; width=&quot;370&quot; height=&quot;220&quot; as=&quot;geometry&quot; /&gt;&#10;        &lt;/mxCell&gt;&#10;        &lt;mxCell id=&quot;zp9XOmUiPlZiaDm-wida-80&quot; value=&quot;&quot; style=&quot;rounded=1;fillColor=#f8cecc;align=center;strokeColor=#b85450;verticalAlign=middle;spacing=2;fontFamily=Georgia;arcSize=20;strokeWidth=2;labelPosition=center;verticalLabelPosition=middle;html=1;whiteSpace=wrap;labelBorderColor=none;&quot; parent=&quot;1&quot; vertex=&quot;1&quot;&gt;&#10;          &lt;mxGeometry x=&quot;115.80952380952381&quot; y=&quot;960&quot; width=&quot;54.761904761904766&quot; height=&quot;30&quot; as=&quot;geometry&quot; /&gt;&#10;        &lt;/mxCell&gt;&#10;        &lt;mxCell id=&quot;zp9XOmUiPlZiaDm-wida-81&quot; value=&quot;&amp;lt;div align=&amp;quot;left&amp;quot;&amp;gt;Model&amp;lt;/div&amp;gt;&quot; style=&quot;text;html=1;strokeColor=none;fillColor=none;align=left;verticalAlign=middle;whiteSpace=wrap;rounded=0;fontFamily=Georgia;&quot; parent=&quot;1&quot; vertex=&quot;1&quot;&gt;&#10;          &lt;mxGeometry x=&quot;192.47619047619048&quot; y=&quot;965&quot; width=&quot;43.80952380952381&quot; height=&quot;20&quot; as=&quot;geometry&quot; /&gt;&#10;        &lt;/mxCell&gt;&#10;        &lt;mxCell id=&quot;zp9XOmUiPlZiaDm-wida-82&quot; value=&quot;&quot; style=&quot;rounded=1;whiteSpace=wrap;html=1;strokeWidth=2;fillColor=#dae8fc;fontFamily=Georgia;align=center;strokeColor=#6c8ebf;arcSize=50;&quot; parent=&quot;1&quot; vertex=&quot;1&quot;&gt;&#10;          &lt;mxGeometry x=&quot;115.80952380952381&quot; y=&quot;1000&quot; width=&quot;54.761904761904766&quot; height=&quot;30&quot; as=&quot;geometry&quot; /&gt;&#10;        &lt;/mxCell&gt;&#10;        &lt;mxCell id=&quot;zp9XOmUiPlZiaDm-wida-83&quot; value=&quot;Integration with system&quot; style=&quot;text;html=1;strokeColor=none;fillColor=none;align=left;verticalAlign=middle;whiteSpace=wrap;rounded=0;fontFamily=Georgia;&quot; parent=&quot;1&quot; vertex=&quot;1&quot;&gt;&#10;          &lt;mxGeometry x=&quot;192.47619047619048&quot; y=&quot;1005&quot; width=&quot;76.66666666666667&quot; height=&quot;20&quot; as=&quot;geometry&quot; /&gt;&#10;        &lt;/mxCell&gt;&#10;        &lt;mxCell id=&quot;zp9XOmUiPlZiaDm-wida-84&quot; value=&quot;&quot; style=&quot;shape=step;perimeter=stepPerimeter;whiteSpace=wrap;html=1;fixedSize=1;strokeWidth=2;fillColor=#d5e8d4;fontFamily=Georgia;align=center;strokeColor=#82b366;&quot; parent=&quot;1&quot; vertex=&quot;1&quot;&gt;&#10;          &lt;mxGeometry x=&quot;115.80952380952381&quot; y=&quot;1040&quot; width=&quot;54.761904761904766&quot; height=&quot;30&quot; as=&quot;geometry&quot; /&gt;&#10;        &lt;/mxCell&gt;&#10;        &lt;mxCell id=&quot;zp9XOmUiPlZiaDm-wida-85&quot; value=&quot;Testing Activity&quot; style=&quot;text;html=1;strokeColor=none;fillColor=none;align=left;verticalAlign=middle;whiteSpace=wrap;rounded=0;fontFamily=Georgia;&quot; parent=&quot;1&quot; vertex=&quot;1&quot;&gt;&#10;          &lt;mxGeometry x=&quot;192.47619047619048&quot; y=&quot;1045&quot; width=&quot;76.66666666666667&quot; height=&quot;20&quot; as=&quot;geometry&quot; /&gt;&#10;        &lt;/mxCell&gt;&#10;        &lt;mxCell id=&quot;zp9XOmUiPlZiaDm-wida-86&quot; value=&quot;&quot; style=&quot;shape=step;perimeter=stepPerimeter;whiteSpace=wrap;html=1;fixedSize=1;strokeWidth=2;fillColor=#fff2cc;fontFamily=Georgia;align=center;strokeColor=#d6b656;&quot; parent=&quot;1&quot; vertex=&quot;1&quot;&gt;&#10;          &lt;mxGeometry x=&quot;115.80952380952381&quot; y=&quot;1080&quot; width=&quot;54.761904761904766&quot; height=&quot;30&quot; as=&quot;geometry&quot; /&gt;&#10;        &lt;/mxCell&gt;&#10;        &lt;mxCell id=&quot;zp9XOmUiPlZiaDm-wida-87&quot; value=&quot;&amp;lt;div&amp;gt;Inspection&amp;lt;/div&amp;gt;&amp;lt;div&amp;gt;Activity&amp;lt;br&amp;gt;&amp;lt;/div&amp;gt;&quot; style=&quot;text;html=1;strokeColor=none;fillColor=none;align=left;verticalAlign=middle;whiteSpace=wrap;rounded=0;fontFamily=Georgia;&quot; parent=&quot;1&quot; vertex=&quot;1&quot;&gt;&#10;          &lt;mxGeometry x=&quot;192.47619047619048&quot; y=&quot;1085&quot; width=&quot;76.66666666666667&quot; height=&quot;20&quot; as=&quot;geometry&quot; /&gt;&#10;        &lt;/mxCell&gt;&#10;        &lt;mxCell id=&quot;zp9XOmUiPlZiaDm-wida-88&quot; value=&quot;&amp;lt;b&amp;gt;COTS:&amp;lt;/b&amp;gt; &quot; style=&quot;text;html=1;strokeColor=none;fillColor=none;align=center;verticalAlign=middle;whiteSpace=wrap;rounded=0;fontFamily=Georgia;&quot; parent=&quot;1&quot; vertex=&quot;1&quot;&gt;&#10;          &lt;mxGeometry x=&quot;292&quot; y=&quot;990&quot; width=&quot;40&quot; height=&quot;20&quot; as=&quot;geometry&quot; /&gt;&#10;        &lt;/mxCell&gt;&#10;        &lt;mxCell id=&quot;zp9XOmUiPlZiaDm-wida-89&quot; value=&quot;&amp;lt;b&amp;gt;PFM:&amp;lt;/b&amp;gt;&quot; style=&quot;text;html=1;strokeColor=none;fillColor=none;align=center;verticalAlign=middle;whiteSpace=wrap;rounded=0;fontFamily=Georgia;&quot; parent=&quot;1&quot; vertex=&quot;1&quot;&gt;&#10;          &lt;mxGeometry x=&quot;292&quot; y=&quot;1030&quot; width=&quot;40&quot; height=&quot;20&quot; as=&quot;geometry&quot; /&gt;&#10;        &lt;/mxCell&gt;&#10;        &lt;mxCell id=&quot;zp9XOmUiPlZiaDm-wida-90&quot; value=&quot;Commercial off the shelf&quot; style=&quot;text;html=1;strokeColor=none;fillColor=none;align=left;verticalAlign=middle;whiteSpace=wrap;rounded=0;fontFamily=Georgia;&quot; parent=&quot;1&quot; vertex=&quot;1&quot;&gt;&#10;          &lt;mxGeometry x=&quot;342&quot; y=&quot;995&quot; width=&quot;70&quot; height=&quot;20&quot; as=&quot;geometry&quot; /&gt;&#10;        &lt;/mxCell&gt;&#10;        &lt;mxCell id=&quot;zp9XOmUiPlZiaDm-wida-91&quot; value=&quot;Protoflight Model&quot; style=&quot;text;html=1;strokeColor=none;fillColor=none;align=left;verticalAlign=middle;whiteSpace=wrap;rounded=0;fontFamily=Georgia;&quot; parent=&quot;1&quot; vertex=&quot;1&quot;&gt;&#10;          &lt;mxGeometry x=&quot;342&quot; y=&quot;1035&quot; width=&quot;70&quot; height=&quot;20&quot; as=&quot;geometry&quot; /&gt;&#10;        &lt;/mxCell&gt;&#10;        &lt;mxCell id=&quot;zp9XOmUiPlZiaDm-wida-92&quot; value=&quot;Incoming Inspection&amp;lt;br&amp;gt;&quot; style=&quot;shape=step;perimeter=stepPerimeter;whiteSpace=wrap;html=1;fixedSize=1;strokeWidth=2;fillColor=#fff2cc;fontFamily=Georgia;align=center;strokeColor=#d6b656;&quot; parent=&quot;1&quot; vertex=&quot;1&quot;&gt;&#10;          &lt;mxGeometry x=&quot;262&quot; y=&quot;340&quot; width=&quot;160&quot; height=&quot;60&quot; as=&quot;geometry&quot; /&gt;&#10;        &lt;/mxCell&gt;&#10;        &lt;mxCell id=&quot;zp9XOmUiPlZiaDm-wida-93&quot; value=&quot;&quot; style=&quot;endArrow=classic;html=1;exitX=1;exitY=0.5;exitDx=0;exitDy=0;&quot; parent=&quot;1&quot; source=&quot;zp9XOmUiPlZiaDm-wida-92&quot; edge=&quot;1&quot;&gt;&#10;          &lt;mxGeometry width=&quot;50&quot; height=&quot;50&quot; relative=&quot;1&quot; as=&quot;geometry&quot;&gt;&#10;            &lt;mxPoint x=&quot;422&quot; y=&quot;540&quot; as=&quot;sourcePoint&quot; /&gt;&#10;            &lt;mxPoint x=&quot;472&quot; y=&quot;370&quot; as=&quot;targetPoint&quot; /&gt;&#10;          &lt;/mxGeometry&gt;&#10;        &lt;/mxCell&gt;&#10;        &lt;mxCell id=&quot;zp9XOmUiPlZiaDm-wida-94&quot; style=&quot;edgeStyle=orthogonalEdgeStyle;rounded=0;orthogonalLoop=1;jettySize=auto;html=1;exitX=1;exitY=0.5;exitDx=0;exitDy=0;entryX=0;entryY=0.5;entryDx=0;entryDy=0;fontColor=#808080;&quot; parent=&quot;1&quot; source=&quot;zp9XOmUiPlZiaDm-wida-95&quot; target=&quot;zp9XOmUiPlZiaDm-wida-96&quot; edge=&quot;1&quot;&gt;&#10;          &lt;mxGeometry relative=&quot;1&quot; as=&quot;geometry&quot; /&gt;&#10;        &lt;/mxCell&gt;&#10;        &lt;mxCell id=&quot;zp9XOmUiPlZiaDm-wida-95&quot; value=&quot;FM Integration with&amp;lt;br&amp;gt;&amp;lt;b&amp;gt;system flatsat&amp;lt;/b&amp;gt;&quot; style=&quot;rounded=1;whiteSpace=wrap;html=1;strokeWidth=2;fillColor=#dae8fc;fontFamily=Georgia;align=center;strokeColor=#6c8ebf;arcSize=50;&quot; parent=&quot;1&quot; vertex=&quot;1&quot;&gt;&#10;          &lt;mxGeometry x=&quot;62&quot; y=&quot;755&quot; width=&quot;160&quot; height=&quot;60&quot; as=&quot;geometry&quot; /&gt;&#10;        &lt;/mxCell&gt;&#10;        &lt;mxCell id=&quot;zp9XOmUiPlZiaDm-wida-96&quot; value=&quot;Integration with&amp;lt;br&amp;gt;&amp;lt;b&amp;gt;PFM spacecraft&amp;lt;br&amp;gt;&amp;lt;/b&amp;gt;&quot; style=&quot;rounded=1;whiteSpace=wrap;html=1;strokeWidth=2;fillColor=#dae8fc;fontFamily=Georgia;align=center;strokeColor=#6c8ebf;arcSize=50;&quot; parent=&quot;1&quot; vertex=&quot;1&quot;&gt;&#10;          &lt;mxGeometry x=&quot;262&quot; y=&quot;755&quot; width=&quot;160&quot; height=&quot;60&quot; as=&quot;geometry&quot; /&gt;&#10;        &lt;/mxCell&gt;&#10;        &lt;mxCell id=&quot;zp9XOmUiPlZiaDm-wida-97&quot; value=&quot;&amp;lt;b style=&amp;quot;font-size: 21px;&amp;quot;&amp;gt;&amp;lt;font style=&amp;quot;font-size: 21px;&amp;quot;&amp;gt;Comms Board&amp;lt;/font&amp;gt;&amp;lt;/b&amp;gt;&amp;lt;font style=&amp;quot;font-size: 21px;&amp;quot;&amp;gt;&amp;lt;br style=&amp;quot;font-size: 21px;&amp;quot;&amp;gt;&amp;lt;/font&amp;gt;&amp;lt;font style=&amp;quot;font-size: 21px&amp;quot;&amp;gt;COTS &amp;lt;b style=&amp;quot;font-size: 21px;&amp;quot;&amp;gt;(FM)&amp;lt;/b&amp;gt;&amp;lt;/font&amp;gt;&quot; style=&quot;text;html=1;strokeColor=none;fillColor=none;align=center;verticalAlign=middle;whiteSpace=wrap;rounded=0;fontFamily=Georgia;fontColor=#808080;fontSize=21;&quot; parent=&quot;1&quot; vertex=&quot;1&quot;&gt;&#10;          &lt;mxGeometry x=&quot;41&quot; y=&quot;570&quot; width=&quot;810&quot; height=&quot;20&quot; as=&quot;geometry&quot; /&gt;&#10;        &lt;/mxCell&gt;&#10;        &lt;mxCell id=&quot;zp9XOmUiPlZiaDm-wida-98&quot; style=&quot;edgeStyle=orthogonalEdgeStyle;rounded=0;orthogonalLoop=1;jettySize=auto;html=1;exitX=1;exitY=0.5;exitDx=0;exitDy=0;entryX=0;entryY=0.5;entryDx=0;entryDy=0;fontColor=#808080;&quot; parent=&quot;1&quot; source=&quot;zp9XOmUiPlZiaDm-wida-99&quot; target=&quot;zp9XOmUiPlZiaDm-wida-101&quot; edge=&quot;1&quot;&gt;&#10;          &lt;mxGeometry relative=&quot;1&quot; as=&quot;geometry&quot; /&gt;&#10;        &lt;/mxCell&gt;&#10;        &lt;mxCell id=&quot;zp9XOmUiPlZiaDm-wida-99&quot; value=&quot;&amp;lt;div&amp;gt;Comms Board&amp;lt;/div&amp;gt;&amp;lt;div&amp;gt;&amp;lt;b&amp;gt;FM &amp;lt;/b&amp;gt;Procurement&amp;lt;br&amp;gt;&amp;lt;/div&amp;gt;&quot; style=&quot;rounded=1;fillColor=#f8cecc;align=center;strokeColor=#b85450;verticalAlign=middle;spacing=2;fontFamily=Georgia;arcSize=20;strokeWidth=2;labelPosition=center;verticalLabelPosition=middle;html=1;whiteSpace=wrap;labelBorderColor=none;&quot; parent=&quot;1&quot; vertex=&quot;1&quot;&gt;&#10;          &lt;mxGeometry x=&quot;62&quot; y=&quot;640&quot; width=&quot;160&quot; height=&quot;60&quot; as=&quot;geometry&quot; /&gt;&#10;        &lt;/mxCell&gt;&#10;        &lt;mxCell id=&quot;zp9XOmUiPlZiaDm-wida-100&quot; style=&quot;edgeStyle=orthogonalEdgeStyle;rounded=0;orthogonalLoop=1;jettySize=auto;html=1;exitX=1;exitY=0.5;exitDx=0;exitDy=0;entryX=0;entryY=0.5;entryDx=0;entryDy=0;fontColor=#808080;&quot; parent=&quot;1&quot; source=&quot;zp9XOmUiPlZiaDm-wida-101&quot; target=&quot;zp9XOmUiPlZiaDm-wida-103&quot; edge=&quot;1&quot;&gt;&#10;          &lt;mxGeometry relative=&quot;1&quot; as=&quot;geometry&quot; /&gt;&#10;        &lt;/mxCell&gt;&#10;        &lt;mxCell id=&quot;zp9XOmUiPlZiaDm-wida-101&quot; value=&quot;Incoming Inspection&amp;lt;br&amp;gt;&quot; style=&quot;shape=step;perimeter=stepPerimeter;whiteSpace=wrap;html=1;fixedSize=1;strokeWidth=2;fillColor=#fff2cc;fontFamily=Georgia;align=center;strokeColor=#d6b656;&quot; parent=&quot;1&quot; vertex=&quot;1&quot;&gt;&#10;          &lt;mxGeometry x=&quot;262&quot; y=&quot;640&quot; width=&quot;160&quot; height=&quot;60&quot; as=&quot;geometry&quot; /&gt;&#10;        &lt;/mxCell&gt;&#10;        &lt;mxCell id=&quot;zp9XOmUiPlZiaDm-wida-102&quot; style=&quot;edgeStyle=orthogonalEdgeStyle;rounded=0;orthogonalLoop=1;jettySize=auto;html=1;exitX=1;exitY=0.5;exitDx=0;exitDy=0;&quot; parent=&quot;1&quot; source=&quot;zp9XOmUiPlZiaDm-wida-103&quot; target=&quot;zp9XOmUiPlZiaDm-wida-105&quot; edge=&quot;1&quot;&gt;&#10;          &lt;mxGeometry relative=&quot;1&quot; as=&quot;geometry&quot; /&gt;&#10;        &lt;/mxCell&gt;&#10;        &lt;mxCell id=&quot;zp9XOmUiPlZiaDm-wida-103&quot; value=&quot;EMC Tests&quot; style=&quot;shape=step;perimeter=stepPerimeter;whiteSpace=wrap;html=1;fixedSize=1;strokeWidth=2;fillColor=#d5e8d4;fontFamily=Georgia;align=center;strokeColor=#82b366;&quot; parent=&quot;1&quot; vertex=&quot;1&quot;&gt;&#10;          &lt;mxGeometry x=&quot;452&quot; y=&quot;640&quot; width=&quot;160&quot; height=&quot;60&quot; as=&quot;geometry&quot; /&gt;&#10;        &lt;/mxCell&gt;&#10;        &lt;mxCell id=&quot;zp9XOmUiPlZiaDm-wida-104&quot; style=&quot;edgeStyle=orthogonalEdgeStyle;rounded=0;orthogonalLoop=1;jettySize=auto;html=1;exitX=1;exitY=0.5;exitDx=0;exitDy=0;entryX=0.5;entryY=0;entryDx=0;entryDy=0;&quot; parent=&quot;1&quot; source=&quot;zp9XOmUiPlZiaDm-wida-105&quot; target=&quot;zp9XOmUiPlZiaDm-wida-95&quot; edge=&quot;1&quot;&gt;&#10;          &lt;mxGeometry relative=&quot;1&quot; as=&quot;geometry&quot; /&gt;&#10;        &lt;/mxCell&gt;&#10;        &lt;mxCell id=&quot;zp9XOmUiPlZiaDm-wida-105&quot; value=&quot;Ambient Functional&amp;lt;br&amp;gt;Tests&quot; style=&quot;shape=step;perimeter=stepPerimeter;whiteSpace=wrap;html=1;fixedSize=1;strokeWidth=2;fillColor=#d5e8d4;fontFamily=Georgia;align=center;strokeColor=#82b366;&quot; parent=&quot;1&quot; vertex=&quot;1&quot;&gt;&#10;          &lt;mxGeometry x=&quot;662&quot; y=&quot;640&quot; width=&quot;160&quot; height=&quot;60&quot; as=&quot;geometry&quot; /&gt;&#10;        &lt;/mxCell&gt;&#10;        &lt;mxCell id=&quot;lHj1bqGTADj1EBmBJ9V9-6&quot; style=&quot;edgeStyle=orthogonalEdgeStyle;rounded=0;orthogonalLoop=1;jettySize=auto;html=1;&quot; edge=&quot;1&quot; parent=&quot;1&quot; source=&quot;zp9XOmUiPlZiaDm-wida-106&quot; target=&quot;zp9XOmUiPlZiaDm-wida-112&quot;&gt;&#10;          &lt;mxGeometry relative=&quot;1&quot; as=&quot;geometry&quot; /&gt;&#10;        &lt;/mxCell&gt;&#10;        &lt;mxCell id=&quot;zp9XOmUiPlZiaDm-wida-106&quot; value=&quot;&amp;lt;div&amp;gt;Comms Board&amp;lt;/div&amp;gt;&amp;lt;div&amp;gt;&amp;lt;b&amp;gt;DM &amp;lt;/b&amp;gt;Procurement&amp;lt;br&amp;gt;&amp;lt;/div&amp;gt;&quot; style=&quot;rounded=1;fillColor=#f8cecc;align=center;strokeColor=#b85450;verticalAlign=middle;spacing=2;fontFamily=Georgia;arcSize=20;strokeWidth=2;labelPosition=center;verticalLabelPosition=middle;html=1;whiteSpace=wrap;labelBorderColor=none;&quot; parent=&quot;1&quot; vertex=&quot;1&quot;&gt;&#10;          &lt;mxGeometry x=&quot;60&quot; y=&quot;120&quot; width=&quot;160&quot; height=&quot;60&quot; as=&quot;geometry&quot; /&gt;&#10;        &lt;/mxCell&gt;&#10;        &lt;mxCell id=&quot;zp9XOmUiPlZiaDm-wida-107&quot; value=&quot;DM Integration with&amp;lt;br&amp;gt;&amp;lt;b&amp;gt;system flatsat&amp;lt;/b&amp;gt;&quot; style=&quot;rounded=1;whiteSpace=wrap;html=1;strokeWidth=2;fillColor=#dae8fc;fontFamily=Georgia;align=center;strokeColor=#6c8ebf;arcSize=50;&quot; parent=&quot;1&quot; vertex=&quot;1&quot;&gt;&#10;          &lt;mxGeometry x=&quot;660&quot; y=&quot;120&quot; width=&quot;160&quot; height=&quot;60&quot; as=&quot;geometry&quot; /&gt;&#10;        &lt;/mxCell&gt;&#10;        &lt;mxCell id=&quot;zp9XOmUiPlZiaDm-wida-109&quot; style=&quot;edgeStyle=orthogonalEdgeStyle;rounded=0;orthogonalLoop=1;jettySize=auto;html=1;fontFamily=Georgia;entryX=0;entryY=0.5;entryDx=0;entryDy=0;&quot; parent=&quot;1&quot; target=&quot;zp9XOmUiPlZiaDm-wida-107&quot; edge=&quot;1&quot;&gt;&#10;          &lt;mxGeometry relative=&quot;1&quot; as=&quot;geometry&quot;&gt;&#10;            &lt;mxPoint x=&quot;620&quot; y=&quot;150&quot; as=&quot;targetPoint&quot; /&gt;&#10;            &lt;mxPoint x=&quot;550&quot; y=&quot;150&quot; as=&quot;sourcePoint&quot; /&gt;&#10;          &lt;/mxGeometry&gt;&#10;        &lt;/mxCell&gt;&#10;        &lt;mxCell id=&quot;zp9XOmUiPlZiaDm-wida-110&quot; value=&quot;Ambient Functional&amp;lt;br&amp;gt;Tests&quot; style=&quot;shape=step;perimeter=stepPerimeter;whiteSpace=wrap;html=1;fixedSize=1;strokeWidth=2;fillColor=#d5e8d4;fontFamily=Georgia;align=center;strokeColor=#82b366;&quot; parent=&quot;1&quot; vertex=&quot;1&quot;&gt;&#10;          &lt;mxGeometry x=&quot;450&quot; y=&quot;120&quot; width=&quot;160&quot; height=&quot;60&quot; as=&quot;geometry&quot; /&gt;&#10;        &lt;/mxCell&gt;&#10;        &lt;mxCell id=&quot;zp9XOmUiPlZiaDm-wida-111&quot; value=&quot;&amp;lt;font style=&amp;quot;font-size: 21px&amp;quot;&amp;gt;&amp;lt;b&amp;gt;&amp;lt;font style=&amp;quot;font-size: 21px&amp;quot;&amp;gt;Comms Board&amp;lt;/font&amp;gt;&amp;lt;/b&amp;gt;&amp;lt;font style=&amp;quot;font-size: 21px&amp;quot;&amp;gt;&amp;lt;br&amp;gt;&amp;lt;/font&amp;gt;&amp;lt;font style=&amp;quot;font-size: 21px&amp;quot;&amp;gt;COTS &amp;lt;b&amp;gt;(DM)&amp;lt;/b&amp;gt;&amp;lt;/font&amp;gt;&amp;lt;/font&amp;gt;&quot; style=&quot;text;html=1;strokeColor=none;fillColor=none;align=center;verticalAlign=middle;whiteSpace=wrap;rounded=0;fontFamily=Georgia;fontColor=#808080;&quot; parent=&quot;1&quot; vertex=&quot;1&quot;&gt;&#10;          &lt;mxGeometry x=&quot;40&quot; y=&quot;40&quot; width=&quot;810&quot; height=&quot;20&quot; as=&quot;geometry&quot; /&gt;&#10;        &lt;/mxCell&gt;&#10;        &lt;mxCell id=&quot;zp9XOmUiPlZiaDm-wida-112&quot; value=&quot;Incoming Inspection&amp;lt;br&amp;gt;&quot; style=&quot;shape=step;perimeter=stepPerimeter;whiteSpace=wrap;html=1;fixedSize=1;strokeWidth=2;fillColor=#fff2cc;fontFamily=Georgia;align=center;strokeColor=#d6b656;&quot; parent=&quot;1&quot; vertex=&quot;1&quot;&gt;&#10;          &lt;mxGeometry x=&quot;260&quot; y=&quot;120&quot; width=&quot;160&quot; height=&quot;60&quot; as=&quot;geometry&quot; /&gt;&#10;        &lt;/mxCell&gt;&#10;        &lt;mxCell id=&quot;zp9XOmUiPlZiaDm-wida-113&quot; value=&quot;&quot; style=&quot;endArrow=classic;html=1;exitX=1;exitY=0.5;exitDx=0;exitDy=0;&quot; parent=&quot;1&quot; source=&quot;zp9XOmUiPlZiaDm-wida-112&quot; target=&quot;zp9XOmUiPlZiaDm-wida-110&quot; edge=&quot;1&quot;&gt;&#10;          &lt;mxGeometry width=&quot;50&quot; height=&quot;50&quot; relative=&quot;1&quot; as=&quot;geometry&quot;&gt;&#10;            &lt;mxPoint x=&quot;420&quot; y=&quot;320&quot; as=&quot;sourcePoint&quot; /&gt;&#10;            &lt;mxPoint x=&quot;470&quot; y=&quot;270&quot; as=&quot;targetPoint&quot; /&gt;&#10;          &lt;/mxGeometry&gt;&#10;        &lt;/mxCell&gt;&#10;        &lt;mxCell id=&quot;lHj1bqGTADj1EBmBJ9V9-4&quot; style=&quot;edgeStyle=orthogonalEdgeStyle;rounded=0;orthogonalLoop=1;jettySize=auto;html=1;&quot; edge=&quot;1&quot; parent=&quot;1&quot; source=&quot;zp9XOmUiPlZiaDm-wida-115&quot; target=&quot;zp9XOmUiPlZiaDm-wida-116&quot;&gt;&#10;          &lt;mxGeometry relative=&quot;1&quot; as=&quot;geometry&quot; /&gt;&#10;        &lt;/mxCell&gt;&#10;        &lt;mxCell id=&quot;zp9XOmUiPlZiaDm-wida-115&quot; value=&quot;Ambient Functional&amp;lt;br&amp;gt;Tests&quot; style=&quot;shape=step;perimeter=stepPerimeter;whiteSpace=wrap;html=1;fixedSize=1;strokeWidth=2;fillColor=#d5e8d4;fontFamily=Georgia;align=center;strokeColor=#82b366;&quot; parent=&quot;1&quot; vertex=&quot;1&quot;&gt;&#10;          &lt;mxGeometry x=&quot;452&quot; y=&quot;340&quot; width=&quot;160&quot; height=&quot;60&quot; as=&quot;geometry&quot; /&gt;&#10;        &lt;/mxCell&gt;&#10;        &lt;mxCell id=&quot;lHj1bqGTADj1EBmBJ9V9-5&quot; style=&quot;edgeStyle=orthogonalEdgeStyle;rounded=0;orthogonalLoop=1;jettySize=auto;html=1;entryX=0.5;entryY=0;entryDx=0;entryDy=0;&quot; edge=&quot;1&quot; parent=&quot;1&quot; source=&quot;zp9XOmUiPlZiaDm-wida-116&quot; target=&quot;lHj1bqGTADj1EBmBJ9V9-1&quot;&gt;&#10;          &lt;mxGeometry relative=&quot;1&quot; as=&quot;geometry&quot;&gt;&#10;            &lt;Array as=&quot;points&quot;&gt;&#10;              &lt;mxPoint x=&quot;840&quot; y=&quot;370&quot; /&gt;&#10;              &lt;mxPoint x=&quot;840&quot; y=&quot;430&quot; /&gt;&#10;              &lt;mxPoint x=&quot;145&quot; y=&quot;430&quot; /&gt;&#10;            &lt;/Array&gt;&#10;          &lt;/mxGeometry&gt;&#10;        &lt;/mxCell&gt;&#10;        &lt;mxCell id=&quot;zp9XOmUiPlZiaDm-wida-116&quot; value=&quot;Vibration Tests&quot; style=&quot;shape=step;perimeter=stepPerimeter;whiteSpace=wrap;html=1;fixedSize=1;strokeWidth=2;fillColor=#d5e8d4;fontFamily=Georgia;align=center;strokeColor=#82b366;&quot; parent=&quot;1&quot; vertex=&quot;1&quot;&gt;&#10;          &lt;mxGeometry x=&quot;660&quot; y=&quot;340&quot; width=&quot;160&quot; height=&quot;60&quot; as=&quot;geometry&quot; /&gt;&#10;        &lt;/mxCell&gt;&#10;        &lt;mxCell id=&quot;lHj1bqGTADj1EBmBJ9V9-3&quot; style=&quot;edgeStyle=orthogonalEdgeStyle;rounded=0;orthogonalLoop=1;jettySize=auto;html=1;entryX=0;entryY=0.5;entryDx=0;entryDy=0;&quot; edge=&quot;1&quot; parent=&quot;1&quot; source=&quot;lHj1bqGTADj1EBmBJ9V9-1&quot; target=&quot;zp9XOmUiPlZiaDm-wida-74&quot;&gt;&#10;          &lt;mxGeometry relative=&quot;1&quot; as=&quot;geometry&quot; /&gt;&#10;        &lt;/mxCell&gt;&#10;        &lt;mxCell id=&quot;lHj1bqGTADj1EBmBJ9V9-1&quot; value=&quot;TVAC Tests&quot; style=&quot;shape=step;perimeter=stepPerimeter;whiteSpace=wrap;html=1;fixedSize=1;strokeWidth=2;fillColor=#d5e8d4;fontFamily=Georgia;align=center;strokeColor=#82b366;&quot; vertex=&quot;1&quot; parent=&quot;1&quot;&gt;&#10;          &lt;mxGeometry x=&quot;65.00000000000003&quot; y=&quot;460&quot; width=&quot;160&quot; height=&quot;60&quot; as=&quot;geometry&quot; /&gt;&#10;        &lt;/mxCell&gt;&#10;      &lt;/root&gt;&#10;    &lt;/mxGraphModel&gt;&#10;  &lt;/diagram&gt;&#10;&lt;/mxfile&gt;&#10;"><defs/><g><g data-cell-id="0"><g data-cell-id="1"><g data-cell-id="lHj1bqGTADj1EBmBJ9V9-7"><g><path d="M 182 345 L 235.63 345" fill="none" stroke="rgb(0, 0, 0)" stroke-miterlimit="10" pointer-events="stroke"/><path d="M 240.88 345 L 233.88 348.5 L 235.63 345 L 233.88 341.5 Z" fill="rgb(0, 0, 0)" stroke="rgb(0, 0, 0)" stroke-miterlimit="10" pointer-events="all"/></g></g><g data-cell-id="zp9XOmUiPlZiaDm-wida-73"><g><rect x="22" y="315" width="160" height="60" rx="12" ry="12" fill="#f8cecc" stroke="#b85450" stroke-width="2" pointer-events="all"/></g><g><g transform="translate(-0.5 -0.5)"><switch><foreignObject pointer-events="none" width="100%" height="100%" requiredFeatures="http://www.w3.org/TR/SVG11/feature#Extensibility" style="overflow: visible; text-align: left;"><div xmlns="http://www.w3.org/1999/xhtml" style="display: flex; align-items: unsafe center; justify-content: unsafe center; width: 158px; height: 1px; padding-top: 345px; margin-left: 23px;"><div data-drawio-colors="color: rgb(0, 0, 0); " style="box-sizing: border-box; font-size: 0px; text-align: center;"><div style="display: inline-block; font-size: 12px; font-family: Georgia; color: rgb(0, 0, 0); line-height: 1.2; pointer-events: all; white-space: normal; overflow-wrap: normal;"><div>Comms Board</div><div><b>EQM </b>Procurement<br /></div></div></div></div></foreignObject><text x="102" y="349" fill="rgb(0, 0, 0)" font-family="&quot;Georgia&quot;" font-size="12px" text-anchor="middle">Comms Board...</text></switch></g></g></g><g data-cell-id="zp9XOmUiPlZiaDm-wida-74"><g><rect x="225" y="435" width="160" height="60" rx="30" ry="30" fill="#dae8fc" stroke="#6c8ebf" stroke-width="2" pointer-events="all"/></g><g><g transform="translate(-0.5 -0.5)"><switch><foreignObject pointer-events="none" width="100%" height="100%" requiredFeatures="http://www.w3.org/TR/SVG11/feature#Extensibility" style="overflow: visible; text-align: left;"><div xmlns="http://www.w3.org/1999/xhtml" style="display: flex; align-items: unsafe center; justify-content: unsafe center; width: 158px; height: 1px; padding-top: 465px; margin-left: 226px;"><div data-drawio-colors="color: rgb(0, 0, 0); " style="box-sizing: border-box; font-size: 0px; text-align: center;"><div style="display: inline-block; font-size: 12px; font-family: Georgia; color: rgb(0, 0, 0); line-height: 1.2; pointer-events: all; white-space: normal; overflow-wrap: normal;">EQM Integration with<br /><b>system flatsat</b></div></div></div></foreignObject><text x="305" y="469" fill="rgb(0, 0, 0)" font-family="&quot;Georgia&quot;" font-size="12px" text-anchor="middle">EQM Integration with...</text></switch></g></g></g><g data-cell-id="zp9XOmUiPlZiaDm-wida-78"><g><rect x="2" y="235" width="810" height="20" fill="none" stroke="none" pointer-events="all"/></g><g><g transform="translate(-0.5 -0.5)"><switch><foreignObject pointer-events="none" width="100%" height="100%" requiredFeatures="http://www.w3.org/TR/SVG11/feature#Extensibility" style="overflow: visible; text-align: left;"><div xmlns="http://www.w3.org/1999/xhtml" style="display: flex; align-items: unsafe center; justify-content: unsafe center; width: 808px; height: 1px; padding-top: 245px; margin-left: 3px;"><div data-drawio-colors="color: #808080; " style="box-sizing: border-box; font-size: 0px; text-align: center;"><div style="display: inline-block; font-size: 21px; font-family: Georgia; color: rgb(128, 128, 128); line-height: 1.2; pointer-events: all; white-space: normal; overflow-wrap: normal;"><b style="font-size: 21px;"><font style="font-size: 21px;">Comms Board</font></b><font style="font-size: 21px;"><br style="font-size: 21px;" /></font><font style="font-size: 21px">COTS <b style="font-size: 21px;">(EQM)</b></font></div></div></div></foreignObject><text x="407" y="251" fill="#808080" font-family="&quot;Georgia&quot;" font-size="21px" text-anchor="middle">Comms BoardCOTS (EQM)</text></switch></g></g></g><g data-cell-id="zp9XOmUiPlZiaDm-wida-79"><g><rect x="22" y="885" width="370" height="220" fill="none" stroke="rgb(0, 0, 0)" pointer-events="all"/></g><g><g transform="translate(-0.5 -0.5)"><switch><foreignObject pointer-events="none" width="100%" height="100%" requiredFeatures="http://www.w3.org/TR/SVG11/feature#Extensibility" style="overflow: visible; text-align: left;"><div xmlns="http://www.w3.org/1999/xhtml" style="display: flex; align-items: unsafe flex-start; justify-content: unsafe flex-start; width: 352px; height: 1px; padding-top: 900px; margin-left: 32px;"><div data-drawio-colors="color: rgb(0, 0, 0); " style="box-sizing: border-box; font-size: 0px; text-align: left;"><div style="display: inline-block; font-size: 12px; font-family: Helvetica; color: rgb(0, 0, 0); line-height: 1.2; pointer-events: all; white-space: normal; overflow-wrap: normal;"><div style="font-size: 16px"><font face="Georgia" style="font-size: 16px"><span>Legend</span></font></div></div></div></div></foreignObject><text x="32" y="912" fill="rgb(0, 0, 0)" font-family="&quot;Helvetica&quot;" font-size="12px">Legend</text></switch></g></g></g><g data-cell-id="zp9XOmUiPlZiaDm-wida-80"><g><rect x="75.81" y="935" width="54.76" height="30" rx="6" ry="6" fill="#f8cecc" stroke="#b85450" stroke-width="2" pointer-events="all"/></g></g><g data-cell-id="zp9XOmUiPlZiaDm-wida-81"><g><rect x="152.48" y="940" width="43.81" height="20" fill="none" stroke="none" pointer-events="all"/></g><g><g transform="translate(-0.5 -0.5)"><switch><foreignObject pointer-events="none" width="100%" height="100%" requiredFeatures="http://www.w3.org/TR/SVG11/feature#Extensibility" style="overflow: visible; text-align: left;"><div xmlns="http://www.w3.org/1999/xhtml" style="display: flex; align-items: unsafe center; justify-content: unsafe flex-start; width: 42px; height: 1px; padding-top: 950px; margin-left: 154px;"><div data-drawio-colors="color: rgb(0, 0, 0); " style="box-sizing: border-box; font-size: 0px; text-align: left;"><div style="display: inline-block; font-size: 12px; font-family: Georgia; color: rgb(0, 0, 0); line-height: 1.2; pointer-events: all; white-space: normal; overflow-wrap: normal;"><div align="left">Model</div></div></div></div></foreignObject><text x="154" y="954" fill="rgb(0, 0, 0)" font-family="&quot;Georgia&quot;" font-size="12px">Model</text></switch></g></g></g><g data-cell-id="zp9XOmUiPlZiaDm-wida-82"><g><rect x="75.81" y="975" width="54.76" height="30" rx="15" ry="15" fill="#dae8fc" stroke="#6c8ebf" stroke-width="2" pointer-events="all"/></g></g><g data-cell-id="zp9XOmUiPlZiaDm-wida-83"><g><rect x="152.48" y="980" width="76.67" height="20" fill="none" stroke="none" pointer-events="all"/></g><g><g transform="translate(-0.5 -0.5)"><switch><foreignObject pointer-events="none" width="100%" height="100%" requiredFeatures="http://www.w3.org/TR/SVG11/feature#Extensibility" style="overflow: visible; text-align: left;"><div xmlns="http://www.w3.org/1999/xhtml" style="display: flex; align-items: unsafe center; justify-content: unsafe flex-start; width: 75px; height: 1px; padding-top: 990px; margin-left: 154px;"><div data-drawio-colors="color: rgb(0, 0, 0); " style="box-sizing: border-box; font-size: 0px; text-align: left;"><div style="display: inline-block; font-size: 12px; font-family: Georgia; color: rgb(0, 0, 0); line-height: 1.2; pointer-events: all; white-space: normal; overflow-wrap: normal;">Integration with system</div></div></div></foreignObject><text x="154" y="994" fill="rgb(0, 0, 0)" font-family="&quot;Georgia&quot;" font-size="12px">Integration w...</text></switch></g></g></g><g data-cell-id="zp9XOmUiPlZiaDm-wida-84"><g><path d="M 75.81 1015 L 110.57 1015 L 130.57 1030 L 110.57 1045 L 75.81 1045 L 95.81 1030 Z" fill="#d5e8d4" stroke="#82b366" stroke-width="2" stroke-miterlimit="10" pointer-events="all"/></g></g><g data-cell-id="zp9XOmUiPlZiaDm-wida-85"><g><rect x="152.48" y="1020" width="76.67" height="20" fill="none" stroke="none" pointer-events="all"/></g><g><g transform="translate(-0.5 -0.5)"><switch><foreignObject pointer-events="none" width="100%" height="100%" requiredFeatures="http://www.w3.org/TR/SVG11/feature#Extensibility" style="overflow: visible; text-align: left;"><div xmlns="http://www.w3.org/1999/xhtml" style="display: flex; align-items: unsafe center; justify-content: unsafe flex-start; width: 75px; height: 1px; padding-top: 1030px; margin-left: 154px;"><div data-drawio-colors="color: rgb(0, 0, 0); " style="box-sizing: border-box; font-size: 0px; text-align: left;"><div style="display: inline-block; font-size: 12px; font-family: Georgia; color: rgb(0, 0, 0); line-height: 1.2; pointer-events: all; white-space: normal; overflow-wrap: normal;">Testing Activity</div></div></div></foreignObject><text x="154" y="1034" fill="rgb(0, 0, 0)" font-family="&quot;Georgia&quot;" font-size="12px">Testing Activ...</text></switch></g></g></g><g data-cell-id="zp9XOmUiPlZiaDm-wida-86"><g><path d="M 75.81 1055 L 110.57 1055 L 130.57 1070 L 110.57 1085 L 75.81 1085 L 95.81 1070 Z" fill="#fff2cc" stroke="#d6b656" stroke-width="2" stroke-miterlimit="10" pointer-events="all"/></g></g><g data-cell-id="zp9XOmUiPlZiaDm-wida-87"><g><rect x="152.48" y="1060" width="76.67" height="20" fill="none" stroke="none" pointer-events="all"/></g><g><g transform="translate(-0.5 -0.5)"><switch><foreignObject pointer-events="none" width="100%" height="100%" requiredFeatures="http://www.w3.org/TR/SVG11/feature#Extensibility" style="overflow: visible; text-align: left;"><div xmlns="http://www.w3.org/1999/xhtml" style="display: flex; align-items: unsafe center; justify-content: unsafe flex-start; width: 75px; height: 1px; padding-top: 1070px; margin-left: 154px;"><div data-drawio-colors="color: rgb(0, 0, 0); " style="box-sizing: border-box; font-size: 0px; text-align: left;"><div style="display: inline-block; font-size: 12px; font-family: Georgia; color: rgb(0, 0, 0); line-height: 1.2; pointer-events: all; white-space: normal; overflow-wrap: normal;"><div>Inspection</div><div>Activity<br /></div></div></div></div></foreignObject><text x="154" y="1074" fill="rgb(0, 0, 0)" font-family="&quot;Georgia&quot;" font-size="12px">Inspection...</text></switch></g></g></g><g data-cell-id="zp9XOmUiPlZiaDm-wida-88"><g><rect x="252" y="965" width="40" height="20" fill="none" stroke="none" pointer-events="all"/></g><g><g transform="translate(-0.5 -0.5)"><switch><foreignObject pointer-events="none" width="100%" height="100%" requiredFeatures="http://www.w3.org/TR/SVG11/feature#Extensibility" style="overflow: visible; text-align: left;"><div xmlns="http://www.w3.org/1999/xhtml" style="display: flex; align-items: unsafe center; justify-content: unsafe center; width: 38px; height: 1px; padding-top: 975px; margin-left: 253px;"><div data-drawio-colors="color: rgb(0, 0, 0); " style="box-sizing: border-box; font-size: 0px; text-align: center;"><div style="display: inline-block; font-size: 12px; font-family: Georgia; color: rgb(0, 0, 0); line-height: 1.2; pointer-events: all; white-space: normal; overflow-wrap: normal;"><b>COTS:</b> </div></div></div></foreignObject><text x="272" y="979" fill="rgb(0, 0, 0)" font-family="&quot;Georgia&quot;" font-size="12px" text-anchor="middle">COTS: </text></switch></g></g></g><g data-cell-id="zp9XOmUiPlZiaDm-wida-89"><g><rect x="252" y="1005" width="40" height="20" fill="none" stroke="none" pointer-events="all"/></g><g><g transform="translate(-0.5 -0.5)"><switch><foreignObject pointer-events="none" width="100%" height="100%" requiredFeatures="http://www.w3.org/TR/SVG11/feature#Extensibility" style="overflow: visible; text-align: left;"><div xmlns="http://www.w3.org/1999/xhtml" style="display: flex; align-items: unsafe center; justify-content: unsafe center; width: 38px; height: 1px; padding-top: 1015px; margin-left: 253px;"><div data-drawio-colors="color: rgb(0, 0, 0); " style="box-sizing: border-box; font-size: 0px; text-align: center;"><div style="display: inline-block; font-size: 12px; font-family: Georgia; color: rgb(0, 0, 0); line-height: 1.2; pointer-events: all; white-space: normal; overflow-wrap: normal;"><b>PFM:</b></div></div></div></foreignObject><text x="272" y="1019" fill="rgb(0, 0, 0)" font-family="&quot;Georgia&quot;" font-size="12px" text-anchor="middle">PFM:</text></switch></g></g></g><g data-cell-id="zp9XOmUiPlZiaDm-wida-90"><g><rect x="302" y="970" width="70" height="20" fill="none" stroke="none" pointer-events="all"/></g><g><g transform="translate(-0.5 -0.5)"><switch><foreignObject pointer-events="none" width="100%" height="100%" requiredFeatures="http://www.w3.org/TR/SVG11/feature#Extensibility" style="overflow: visible; text-align: left;"><div xmlns="http://www.w3.org/1999/xhtml" style="display: flex; align-items: unsafe center; justify-content: unsafe flex-start; width: 68px; height: 1px; padding-top: 980px; margin-left: 304px;"><div data-drawio-colors="color: rgb(0, 0, 0); " style="box-sizing: border-box; font-size: 0px; text-align: left;"><div style="display: inline-block; font-size: 12px; font-family: Georgia; color: rgb(0, 0, 0); line-height: 1.2; pointer-events: all; white-space: normal; overflow-wrap: normal;">Commercial off the shelf</div></div></div></foreignObject><text x="304" y="984" fill="rgb(0, 0, 0)" font-family="&quot;Georgia&quot;" font-size="12px">Commercial...</text></switch></g></g></g><g data-cell-id="zp9XOmUiPlZiaDm-wida-91"><g><rect x="302" y="1010" width="70" height="20" fill="none" stroke="none" pointer-events="all"/></g><g><g transform="translate(-0.5 -0.5)"><switch><foreignObject pointer-events="none" width="100%" height="100%" requiredFeatures="http://www.w3.org/TR/SVG11/feature#Extensibility" style="overflow: visible; text-align: left;"><div xmlns="http://www.w3.org/1999/xhtml" style="display: flex; align-items: unsafe center; justify-content: unsafe flex-start; width: 68px; height: 1px; padding-top: 1020px; margin-left: 304px;"><div data-drawio-colors="color: rgb(0, 0, 0); " style="box-sizing: border-box; font-size: 0px; text-align: left;"><div style="display: inline-block; font-size: 12px; font-family: Georgia; color: rgb(0, 0, 0); line-height: 1.2; pointer-events: all; white-space: normal; overflow-wrap: normal;">Protoflight Model</div></div></div></foreignObject><text x="304" y="1024" fill="rgb(0, 0, 0)" font-family="&quot;Georgia&quot;" font-size="12px">Protoflight...</text></switch></g></g></g><g data-cell-id="zp9XOmUiPlZiaDm-wida-92"><g><path d="M 222 315 L 362 315 L 382 345 L 362 375 L 222 375 L 242 345 Z" fill="#fff2cc" stroke="#d6b656" stroke-width="2" stroke-miterlimit="10" pointer-events="all"/></g><g><g transform="translate(-0.5 -0.5)"><switch><foreignObject pointer-events="none" width="100%" height="100%" requiredFeatures="http://www.w3.org/TR/SVG11/feature#Extensibility" style="overflow: visible; text-align: left;"><div xmlns="http://www.w3.org/1999/xhtml" style="display: flex; align-items: unsafe center; justify-content: unsafe center; width: 158px; height: 1px; padding-top: 345px; margin-left: 223px;"><div data-drawio-colors="color: rgb(0, 0, 0); " style="box-sizing: border-box; font-size: 0px; text-align: center;"><div style="display: inline-block; font-size: 12px; font-family: Georgia; color: rgb(0, 0, 0); line-height: 1.2; pointer-events: all; white-space: normal; overflow-wrap: normal;">Incoming Inspection<br /></div></div></div></foreignObject><text x="302" y="349" fill="rgb(0, 0, 0)" font-family="&quot;Georgia&quot;" font-size="12px" text-anchor="middle">Incoming Inspection&#xa;</text></switch></g></g></g><g data-cell-id="zp9XOmUiPlZiaDm-wida-93"><g><path d="M 382 345 L 425.63 345" fill="none" stroke="rgb(0, 0, 0)" stroke-miterlimit="10" pointer-events="stroke"/><path d="M 430.88 345 L 423.88 348.5 L 425.63 345 L 423.88 341.5 Z" fill="rgb(0, 0, 0)" stroke="rgb(0, 0, 0)" stroke-miterlimit="10" pointer-events="all"/></g></g><g data-cell-id="zp9XOmUiPlZiaDm-wida-94"><g><path d="M 182 760 L 215.63 760" fill="none" stroke="rgb(0, 0, 0)" stroke-miterlimit="10" pointer-events="stroke"/><path d="M 220.88 760 L 213.88 763.5 L 215.63 760 L 213.88 756.5 Z" fill="rgb(0, 0, 0)" stroke="rgb(0, 0, 0)" stroke-miterlimit="10" pointer-events="all"/></g></g><g data-cell-id="zp9XOmUiPlZiaDm-wida-95"><g><rect x="22" y="730" width="160" height="60" rx="30" ry="30" fill="#dae8fc" stroke="#6c8ebf" stroke-width="2" pointer-events="all"/></g><g><g transform="translate(-0.5 -0.5)"><switch><foreignObject pointer-events="none" width="100%" height="100%" requiredFeatures="http://www.w3.org/TR/SVG11/feature#Extensibility" style="overflow: visible; text-align: left;"><div xmlns="http://www.w3.org/1999/xhtml" style="display: flex; align-items: unsafe center; justify-content: unsafe center; width: 158px; height: 1px; padding-top: 760px; margin-left: 23px;"><div data-drawio-colors="color: rgb(0, 0, 0); " style="box-sizing: border-box; font-size: 0px; text-align: center;"><div style="display: inline-block; font-size: 12px; font-family: Georgia; color: rgb(0, 0, 0); line-height: 1.2; pointer-events: all; white-space: normal; overflow-wrap: normal;">FM Integration with<br /><b>system flatsat</b></div></div></div></foreignObject><text x="102" y="764" fill="rgb(0, 0, 0)" font-family="&quot;Georgia&quot;" font-size="12px" text-anchor="middle">FM Integration with...</text></switch></g></g></g><g data-cell-id="zp9XOmUiPlZiaDm-wida-96"><g><rect x="222" y="730" width="160" height="60" rx="30" ry="30" fill="#dae8fc" stroke="#6c8ebf" stroke-width="2" pointer-events="all"/></g><g><g transform="translate(-0.5 -0.5)"><switch><foreignObject pointer-events="none" width="100%" height="100%" requiredFeatures="http://www.w3.org/TR/SVG11/feature#Extensibility" style="overflow: visible; text-align: left;"><div xmlns="http://www.w3.org/1999/xhtml" style="display: flex; align-items: unsafe center; justify-content: unsafe center; width: 158px; height: 1px; padding-top: 760px; margin-left: 223px;"><div data-drawio-colors="color: rgb(0, 0, 0); " style="box-sizing: border-box; font-size: 0px; text-align: center;"><div style="display: inline-block; font-size: 12px; font-family: Georgia; color: rgb(0, 0, 0); line-height: 1.2; pointer-events: all; white-space: normal; overflow-wrap: normal;">Integration with<br /><b>PFM spacecraft<br /></b></div></div></div></foreignObject><text x="302" y="764" fill="rgb(0, 0, 0)" font-family="&quot;Georgia&quot;" font-size="12px" text-anchor="middle">Integration with...</text></switch></g></g></g><g data-cell-id="zp9XOmUiPlZiaDm-wida-97"><g><rect x="1" y="545" width="810" height="20" fill="none" stroke="none" pointer-events="all"/></g><g><g transform="translate(-0.5 -0.5)"><switch><foreignObject pointer-events="none" width="100%" height="100%" requiredFeatures="http://www.w3.org/TR/SVG11/feature#Extensibility" style="overflow: visible; text-align: left;"><div xmlns="http://www.w3.org/1999/xhtml" style="display: flex; align-items: unsafe center; justify-content: unsafe center; width: 808px; height: 1px; padding-top: 555px; margin-left: 2px;"><div data-drawio-colors="color: #808080; " style="box-sizing: border-box; font-size: 0px; text-align: center;"><div style="display: inline-block; font-size: 21px; font-family: Georgia; color: rgb(128, 128, 128); line-height: 1.2; pointer-events: all; white-space: normal; overflow-wrap: normal;"><b style="font-size: 21px;"><font style="font-size: 21px;">Comms Board</font></b><font style="font-size: 21px;"><br style="font-size: 21px;" /></font><font style="font-size: 21px">COTS <b style="font-size: 21px;">(FM)</b></font></div></div></div></foreignObject><text x="406" y="561" fill="#808080" font-family="&quot;Georgia&quot;" font-size="21px" text-anchor="middle">Comms BoardCOTS (FM)</text></switch></g></g></g><g data-cell-id="zp9XOmUiPlZiaDm-wida-98"><g><path d="M 182 645 L 235.63 645" fill="none" stroke="rgb(0, 0, 0)" stroke-miterlimit="10" pointer-events="stroke"/><path d="M 240.88 645 L 233.88 648.5 L 235.63 645 L 233.88 641.5 Z" fill="rgb(0, 0, 0)" stroke="rgb(0, 0, 0)" stroke-miterlimit="10" pointer-events="all"/></g></g><g data-cell-id="zp9XOmUiPlZiaDm-wida-99"><g><rect x="22" y="615" width="160" height="60" rx="12" ry="12" fill="#f8cecc" stroke="#b85450" stroke-width="2" pointer-events="all"/></g><g><g transform="translate(-0.5 -0.5)"><switch><foreignObject pointer-events="none" width="100%" height="100%" requiredFeatures="http://www.w3.org/TR/SVG11/feature#Extensibility" style="overflow: visible; text-align: left;"><div xmlns="http://www.w3.org/1999/xhtml" style="display: flex; align-items: unsafe center; justify-content: unsafe center; width: 158px; height: 1px; padding-top: 645px; margin-left: 23px;"><div data-drawio-colors="color: rgb(0, 0, 0); " style="box-sizing: border-box; font-size: 0px; text-align: center;"><div style="display: inline-block; font-size: 12px; font-family: Georgia; color: rgb(0, 0, 0); line-height: 1.2; pointer-events: all; white-space: normal; overflow-wrap: normal;"><div>Comms Board</div><div><b>FM </b>Procurement<br /></div></div></div></div></foreignObject><text x="102" y="649" fill="rgb(0, 0, 0)" font-family="&quot;Georgia&quot;" font-size="12px" text-anchor="middle">Comms Board...</text></switch></g></g></g><g data-cell-id="zp9XOmUiPlZiaDm-wida-100"><g><path d="M 382 645 L 402 645.03 L 392 645.03 L 425.63 645.01" fill="none" stroke="rgb(0, 0, 0)" stroke-miterlimit="10" pointer-events="stroke"/><path d="M 430.88 645 L 423.88 648.51 L 425.63 645.01 L 423.88 641.51 Z" fill="rgb(0, 0, 0)" stroke="rgb(0, 0, 0)" stroke-miterlimit="10" pointer-events="all"/></g></g><g data-cell-id="zp9XOmUiPlZiaDm-wida-101"><g><path d="M 222 615 L 362 615 L 382 645 L 362 675 L 222 675 L 242 645 Z" fill="#fff2cc" stroke="#d6b656" stroke-width="2" stroke-miterlimit="10" pointer-events="all"/></g><g><g transform="translate(-0.5 -0.5)"><switch><foreignObject pointer-events="none" width="100%" height="100%" requiredFeatures="http://www.w3.org/TR/SVG11/feature#Extensibility" style="overflow: visible; text-align: left;"><div xmlns="http://www.w3.org/1999/xhtml" style="display: flex; align-items: unsafe center; justify-content: unsafe center; width: 158px; height: 1px; padding-top: 645px; margin-left: 223px;"><div data-drawio-colors="color: rgb(0, 0, 0); " style="box-sizing: border-box; font-size: 0px; text-align: center;"><div style="display: inline-block; font-size: 12px; font-family: Georgia; color: rgb(0, 0, 0); line-height: 1.2; pointer-events: all; white-space: normal; overflow-wrap: normal;">Incoming Inspection<br /></div></div></div></foreignObject><text x="302" y="649" fill="rgb(0, 0, 0)" font-family="&quot;Georgia&quot;" font-size="12px" text-anchor="middle">Incoming Inspection&#xa;</text></switch></g></g></g><g data-cell-id="zp9XOmUiPlZiaDm-wida-102"><g><path d="M 572 645 L 635.63 645" fill="none" stroke="rgb(0, 0, 0)" stroke-miterlimit="10" pointer-events="stroke"/><path d="M 640.88 645 L 633.88 648.5 L 635.63 645 L 633.88 641.5 Z" fill="rgb(0, 0, 0)" stroke="rgb(0, 0, 0)" stroke-miterlimit="10" pointer-events="all"/></g></g><g data-cell-id="zp9XOmUiPlZiaDm-wida-103"><g><path d="M 412 615 L 552 615 L 572 645 L 552 675 L 412 675 L 432 645 Z" fill="#d5e8d4" stroke="#82b366" stroke-width="2" stroke-miterlimit="10" pointer-events="all"/></g><g><g transform="translate(-0.5 -0.5)"><switch><foreignObject pointer-events="none" width="100%" height="100%" requiredFeatures="http://www.w3.org/TR/SVG11/feature#Extensibility" style="overflow: visible; text-align: left;"><div xmlns="http://www.w3.org/1999/xhtml" style="display: flex; align-items: unsafe center; justify-content: unsafe center; width: 158px; height: 1px; padding-top: 645px; margin-left: 413px;"><div data-drawio-colors="color: rgb(0, 0, 0); " style="box-sizing: border-box; font-size: 0px; text-align: center;"><div style="display: inline-block; font-size: 12px; font-family: Georgia; color: rgb(0, 0, 0); line-height: 1.2; pointer-events: all; white-space: normal; overflow-wrap: normal;">EMC Tests</div></div></div></foreignObject><text x="492" y="649" fill="rgb(0, 0, 0)" font-family="&quot;Georgia&quot;" font-size="12px" text-anchor="middle">EMC Tests</text></switch></g></g></g><g data-cell-id="zp9XOmUiPlZiaDm-wida-104"><g><path d="M 782 645 L 802 645.03 L 802 702.52 L 102 702.52 L 102 723.63" fill="none" stroke="rgb(0, 0, 0)" stroke-miterlimit="10" pointer-events="stroke"/><path d="M 102 728.88 L 98.5 721.88 L 102 723.63 L 105.5 721.88 Z" fill="rgb(0, 0, 0)" stroke="rgb(0, 0, 0)" stroke-miterlimit="10" pointer-events="all"/></g></g><g data-cell-id="zp9XOmUiPlZiaDm-wida-105"><g><path d="M 622 615 L 762 615 L 782 645 L 762 675 L 622 675 L 642 645 Z" fill="#d5e8d4" stroke="#82b366" stroke-width="2" stroke-miterlimit="10" pointer-events="all"/></g><g><g transform="translate(-0.5 -0.5)"><switch><foreignObject pointer-events="none" width="100%" height="100%" requiredFeatures="http://www.w3.org/TR/SVG11/feature#Extensibility" style="overflow: visible; text-align: left;"><div xmlns="http://www.w3.org/1999/xhtml" style="display: flex; align-items: unsafe center; justify-content: unsafe center; width: 158px; height: 1px; padding-top: 645px; margin-left: 623px;"><div data-drawio-colors="color: rgb(0, 0, 0); " style="box-sizing: border-box; font-size: 0px; text-align: center;"><div style="display: inline-block; font-size: 12px; font-family: Georgia; color: rgb(0, 0, 0); line-height: 1.2; pointer-events: all; white-space: normal; overflow-wrap: normal;">Ambient Functional<br />Tests</div></div></div></foreignObject><text x="702" y="649" fill="rgb(0, 0, 0)" font-family="&quot;Georgia&quot;" font-size="12px" text-anchor="middle">Ambient Functional...</text></switch></g></g></g><g data-cell-id="lHj1bqGTADj1EBmBJ9V9-6"><g><path d="M 180 125 L 233.63 125" fill="none" stroke="rgb(0, 0, 0)" stroke-miterlimit="10" pointer-events="stroke"/><path d="M 238.88 125 L 231.88 128.5 L 233.63 125 L 231.88 121.5 Z" fill="rgb(0, 0, 0)" stroke="rgb(0, 0, 0)" stroke-miterlimit="10" pointer-events="all"/></g></g><g data-cell-id="zp9XOmUiPlZiaDm-wida-106"><g><rect x="20" y="95" width="160" height="60" rx="12" ry="12" fill="#f8cecc" stroke="#b85450" stroke-width="2" pointer-events="all"/></g><g><g transform="translate(-0.5 -0.5)"><switch><foreignObject pointer-events="none" width="100%" height="100%" requiredFeatures="http://www.w3.org/TR/SVG11/feature#Extensibility" style="overflow: visible; text-align: left;"><div xmlns="http://www.w3.org/1999/xhtml" style="display: flex; align-items: unsafe center; justify-content: unsafe center; width: 158px; height: 1px; padding-top: 125px; margin-left: 21px;"><div data-drawio-colors="color: rgb(0, 0, 0); " style="box-sizing: border-box; font-size: 0px; text-align: center;"><div style="display: inline-block; font-size: 12px; font-family: Georgia; color: rgb(0, 0, 0); line-height: 1.2; pointer-events: all; white-space: normal; overflow-wrap: normal;"><div>Comms Board</div><div><b>DM </b>Procurement<br /></div></div></div></div></foreignObject><text x="100" y="129" fill="rgb(0, 0, 0)" font-family="&quot;Georgia&quot;" font-size="12px" text-anchor="middle">Comms Board...</text></switch></g></g></g><g data-cell-id="zp9XOmUiPlZiaDm-wida-107"><g><rect x="620" y="95" width="160" height="60" rx="30" ry="30" fill="#dae8fc" stroke="#6c8ebf" stroke-width="2" pointer-events="all"/></g><g><g transform="translate(-0.5 -0.5)"><switch><foreignObject pointer-events="none" width="100%" height="100%" requiredFeatures="http://www.w3.org/TR/SVG11/feature#Extensibility" style="overflow: visible; text-align: left;"><div xmlns="http://www.w3.org/1999/xhtml" style="display: flex; align-items: unsafe center; justify-content: unsafe center; width: 158px; height: 1px; padding-top: 125px; margin-left: 621px;"><div data-drawio-colors="color: rgb(0, 0, 0); " style="box-sizing: border-box; font-size: 0px; text-align: center;"><div style="display: inline-block; font-size: 12px; font-family: Georgia; color: rgb(0, 0, 0); line-height: 1.2; pointer-events: all; white-space: normal; overflow-wrap: normal;">DM Integration with<br /><b>system flatsat</b></div></div></div></foreignObject><text x="700" y="129" fill="rgb(0, 0, 0)" font-family="&quot;Georgia&quot;" font-size="12px" text-anchor="middle">DM Integration with...</text></switch></g></g></g><g data-cell-id="zp9XOmUiPlZiaDm-wida-109"><g><path d="M 510 125 L 565.48 125.48 L 613.63 125.06" fill="none" stroke="rgb(0, 0, 0)" stroke-miterlimit="10" pointer-events="stroke"/><path d="M 618.88 125.01 L 611.91 128.57 L 613.63 125.06 L 611.85 121.57 Z" fill="rgb(0, 0, 0)" stroke="rgb(0, 0, 0)" stroke-miterlimit="10" pointer-events="all"/></g></g><g data-cell-id="zp9XOmUiPlZiaDm-wida-110"><g><path d="M 410 95 L 550 95 L 570 125 L 550 155 L 410 155 L 430 125 Z" fill="#d5e8d4" stroke="#82b366" stroke-width="2" stroke-miterlimit="10" pointer-events="all"/></g><g><g transform="translate(-0.5 -0.5)"><switch><foreignObject pointer-events="none" width="100%" height="100%" requiredFeatures="http://www.w3.org/TR/SVG11/feature#Extensibility" style="overflow: visible; text-align: left;"><div xmlns="http://www.w3.org/1999/xhtml" style="display: flex; align-items: unsafe center; justify-content: unsafe center; width: 158px; height: 1px; padding-top: 125px; margin-left: 411px;"><div data-drawio-colors="color: rgb(0, 0, 0); " style="box-sizing: border-box; font-size: 0px; text-align: center;"><div style="display: inline-block; font-size: 12px; font-family: Georgia; color: rgb(0, 0, 0); line-height: 1.2; pointer-events: all; white-space: normal; overflow-wrap: normal;">Ambient Functional<br />Tests</div></div></div></foreignObject><text x="490" y="129" fill="rgb(0, 0, 0)" font-family="&quot;Georgia&quot;" font-size="12px" text-anchor="middle">Ambient Functional...</text></switch></g></g></g><g data-cell-id="zp9XOmUiPlZiaDm-wida-111"><g><rect x="0" y="15" width="810" height="20" fill="none" stroke="none" pointer-events="all"/></g><g><g transform="translate(-0.5 -0.5)"><switch><foreignObject pointer-events="none" width="100%" height="100%" requiredFeatures="http://www.w3.org/TR/SVG11/feature#Extensibility" style="overflow: visible; text-align: left;"><div xmlns="http://www.w3.org/1999/xhtml" style="display: flex; align-items: unsafe center; justify-content: unsafe center; width: 808px; height: 1px; padding-top: 25px; margin-left: 1px;"><div data-drawio-colors="color: #808080; " style="box-sizing: border-box; font-size: 0px; text-align: center;"><div style="display: inline-block; font-size: 12px; font-family: Georgia; color: rgb(128, 128, 128); line-height: 1.2; pointer-events: all; white-space: normal; overflow-wrap: normal;"><font style="font-size: 21px"><b><font style="font-size: 21px">Comms Board</font></b><font style="font-size: 21px"><br /></font><font style="font-size: 21px">COTS <b>(DM)</b></font></font></div></div></div></foreignObject><text x="405" y="29" fill="#808080" font-family="&quot;Georgia&quot;" font-size="12px" text-anchor="middle">Comms BoardCOTS (DM)</text></switch></g></g></g><g data-cell-id="zp9XOmUiPlZiaDm-wida-112"><g><path d="M 220 95 L 360 95 L 380 125 L 360 155 L 220 155 L 240 125 Z" fill="#fff2cc" stroke="#d6b656" stroke-width="2" stroke-miterlimit="10" pointer-events="all"/></g><g><g transform="translate(-0.5 -0.5)"><switch><foreignObject pointer-events="none" width="100%" height="100%" requiredFeatures="http://www.w3.org/TR/SVG11/feature#Extensibility" style="overflow: visible; text-align: left;"><div xmlns="http://www.w3.org/1999/xhtml" style="display: flex; align-items: unsafe center; justify-content: unsafe center; width: 158px; height: 1px; padding-top: 125px; margin-left: 221px;"><div data-drawio-colors="color: rgb(0, 0, 0); " style="box-sizing: border-box; font-size: 0px; text-align: center;"><div style="display: inline-block; font-size: 12px; font-family: Georgia; color: rgb(0, 0, 0); line-height: 1.2; pointer-events: all; white-space: normal; overflow-wrap: normal;">Incoming Inspection<br /></div></div></div></foreignObject><text x="300" y="129" fill="rgb(0, 0, 0)" font-family="&quot;Georgia&quot;" font-size="12px" text-anchor="middle">Incoming Inspection&#xa;</text></switch></g></g></g><g data-cell-id="zp9XOmUiPlZiaDm-wida-113"><g><path d="M 380 125 L 423.63 125" fill="none" stroke="rgb(0, 0, 0)" stroke-miterlimit="10" pointer-events="stroke"/><path d="M 428.88 125 L 421.88 128.5 L 423.63 125 L 421.88 121.5 Z" fill="rgb(0, 0, 0)" stroke="rgb(0, 0, 0)" stroke-miterlimit="10" pointer-events="all"/></g></g><g data-cell-id="lHj1bqGTADj1EBmBJ9V9-4"><g><path d="M 572 345 L 633.63 345" fill="none" stroke="rgb(0, 0, 0)" stroke-miterlimit="10" pointer-events="stroke"/><path d="M 638.88 345 L 631.88 348.5 L 633.63 345 L 631.88 341.5 Z" fill="rgb(0, 0, 0)" stroke="rgb(0, 0, 0)" stroke-miterlimit="10" pointer-events="all"/></g></g><g data-cell-id="zp9XOmUiPlZiaDm-wida-115"><g><path d="M 412 315 L 552 315 L 572 345 L 552 375 L 412 375 L 432 345 Z" fill="#d5e8d4" stroke="#82b366" stroke-width="2" stroke-miterlimit="10" pointer-events="all"/></g><g><g transform="translate(-0.5 -0.5)"><switch><foreignObject pointer-events="none" width="100%" height="100%" requiredFeatures="http://www.w3.org/TR/SVG11/feature#Extensibility" style="overflow: visible; text-align: left;"><div xmlns="http://www.w3.org/1999/xhtml" style="display: flex; align-items: unsafe center; justify-content: unsafe center; width: 158px; height: 1px; padding-top: 345px; margin-left: 413px;"><div data-drawio-colors="color: rgb(0, 0, 0); " style="box-sizing: border-box; font-size: 0px; text-align: center;"><div style="display: inline-block; font-size: 12px; font-family: Georgia; color: rgb(0, 0, 0); line-height: 1.2; pointer-events: all; white-space: normal; overflow-wrap: normal;">Ambient Functional<br />Tests</div></div></div></foreignObject><text x="492" y="349" fill="rgb(0, 0, 0)" font-family="&quot;Georgia&quot;" font-size="12px" text-anchor="middle">Ambient Functional...</text></switch></g></g></g><g data-cell-id="lHj1bqGTADj1EBmBJ9V9-5"><g><path d="M 779.98 345.03 L 800 345.03 L 800 405.03 L 105.03 405.03 L 105.01 428.63" fill="none" stroke="rgb(0, 0, 0)" stroke-miterlimit="10" pointer-events="stroke"/><path d="M 105 433.88 L 101.51 426.88 L 105.01 428.63 L 108.51 426.89 Z" fill="rgb(0, 0, 0)" stroke="rgb(0, 0, 0)" stroke-miterlimit="10" pointer-events="all"/></g></g><g data-cell-id="zp9XOmUiPlZiaDm-wida-116"><g><path d="M 620 315 L 760 315 L 780 345 L 760 375 L 620 375 L 640 345 Z" fill="#d5e8d4" stroke="#82b366" stroke-width="2" stroke-miterlimit="10" pointer-events="all"/></g><g><g transform="translate(-0.5 -0.5)"><switch><foreignObject pointer-events="none" width="100%" height="100%" requiredFeatures="http://www.w3.org/TR/SVG11/feature#Extensibility" style="overflow: visible; text-align: left;"><div xmlns="http://www.w3.org/1999/xhtml" style="display: flex; align-items: unsafe center; justify-content: unsafe center; width: 158px; height: 1px; padding-top: 345px; margin-left: 621px;"><div data-drawio-colors="color: rgb(0, 0, 0); " style="box-sizing: border-box; font-size: 0px; text-align: center;"><div style="display: inline-block; font-size: 12px; font-family: Georgia; color: rgb(0, 0, 0); line-height: 1.2; pointer-events: all; white-space: normal; overflow-wrap: normal;">Vibration Tests</div></div></div></foreignObject><text x="700" y="349" fill="rgb(0, 0, 0)" font-family="&quot;Georgia&quot;" font-size="12px" text-anchor="middle">Vibration Tests</text></switch></g></g></g><g data-cell-id="lHj1bqGTADj1EBmBJ9V9-3"><g><path d="M 185 465 L 218.63 465" fill="none" stroke="rgb(0, 0, 0)" stroke-miterlimit="10" pointer-events="stroke"/><path d="M 223.88 465 L 216.88 468.5 L 218.63 465 L 216.88 461.5 Z" fill="rgb(0, 0, 0)" stroke="rgb(0, 0, 0)" stroke-miterlimit="10" pointer-events="all"/></g></g><g data-cell-id="lHj1bqGTADj1EBmBJ9V9-1"><g><path d="M 25 435 L 165 435 L 185 465 L 165 495 L 25 495 L 45 465 Z" fill="#d5e8d4" stroke="#82b366" stroke-width="2" stroke-miterlimit="10" pointer-events="all"/></g><g><g transform="translate(-0.5 -0.5)"><switch><foreignObject pointer-events="none" width="100%" height="100%" requiredFeatures="http://www.w3.org/TR/SVG11/feature#Extensibility" style="overflow: visible; text-align: left;"><div xmlns="http://www.w3.org/1999/xhtml" style="display: flex; align-items: unsafe center; justify-content: unsafe center; width: 158px; height: 1px; padding-top: 465px; margin-left: 26px;"><div data-drawio-colors="color: rgb(0, 0, 0); " style="box-sizing: border-box; font-size: 0px; text-align: center;"><div style="display: inline-block; font-size: 12px; font-family: Georgia; color: rgb(0, 0, 0); line-height: 1.2; pointer-events: all; white-space: normal; overflow-wrap: normal;">TVAC Tests</div></div></div></foreignObject><text x="105" y="469" fill="rgb(0, 0, 0)" font-family="&quot;Georgia&quot;" font-size="12px" text-anchor="middle">TVAC Tests</text></switch></g></g></g></g></g></g><switch><g requiredFeatures="http://www.w3.org/TR/SVG11/feature#Extensibility"/><a transform="translate(0,-5)" xlink:href="https://www.drawio.com/doc/faq/svg-export-text-problems" target="_blank"><text text-anchor="middle" font-size="10px" x="50%" y="100%">Text is not SVG - cannot display</text></a></switch></svg>