<?xml version="1.0" encoding="UTF-8"?>
<!-- Do not edit this file with editors other than draw.io -->
<!DOCTYPE svg PUBLIC "-//W3C//DTD SVG 1.1//EN" "http://www.w3.org/Graphics/SVG/1.1/DTD/svg11.dtd">
<svg xmlns="http://www.w3.org/2000/svg" xmlns:xlink="http://www.w3.org/1999/xlink" version="1.1" width="820px" height="1501px" viewBox="-0.5 -0.5 820 1501" content="&lt;mxfile host=&quot;app.diagrams.net&quot; agent=&quot;Mozilla/5.0 (Windows NT 10.0; Win64; x64) AppleWebKit/537.36 (KHTML, like Gecko) Chrome/131.0.0.0 Safari/537.36 Edg/131.0.0.0&quot; version=&quot;24.8.4&quot;&gt;&#10;  &lt;diagram id=&quot;ho_89WfpTrC8WPghvUhD&quot; name=&quot;Page-1&quot;&gt;&#10;    &lt;mxGraphModel dx=&quot;1379&quot; dy=&quot;785&quot; grid=&quot;1&quot; gridSize=&quot;10&quot; guides=&quot;1&quot; tooltips=&quot;1&quot; connect=&quot;1&quot; arrows=&quot;1&quot; fold=&quot;1&quot; page=&quot;1&quot; pageScale=&quot;1&quot; pageWidth=&quot;850&quot; pageHeight=&quot;1100&quot; math=&quot;0&quot; shadow=&quot;0&quot;&gt;&#10;      &lt;root&gt;&#10;        &lt;mxCell id=&quot;0&quot; /&gt;&#10;        &lt;mxCell id=&quot;1&quot; parent=&quot;0&quot; /&gt;&#10;        &lt;mxCell id=&quot;ishWGL877BXy5JMq_WcK-2&quot; style=&quot;edgeStyle=orthogonalEdgeStyle;rounded=0;orthogonalLoop=1;jettySize=auto;html=1;exitX=1;exitY=0.5;exitDx=0;exitDy=0;&quot; parent=&quot;1&quot; source=&quot;udTpt-ogcE15AfO5dpks-2&quot; target=&quot;udTpt-ogcE15AfO5dpks-6&quot; edge=&quot;1&quot;&gt;&#10;          &lt;mxGeometry relative=&quot;1&quot; as=&quot;geometry&quot; /&gt;&#10;        &lt;/mxCell&gt;&#10;        &lt;mxCell id=&quot;udTpt-ogcE15AfO5dpks-2&quot; value=&quot;&amp;lt;div&amp;gt;&amp;lt;span&amp;gt;OBC/ADCS Board &amp;lt;br&amp;gt;&amp;lt;/span&amp;gt;&amp;lt;/div&amp;gt;&amp;lt;div&amp;gt;&amp;lt;b&amp;gt;EQM&amp;amp;nbsp;&amp;lt;/b&amp;gt;procurement&amp;lt;br&amp;gt;&amp;lt;/div&amp;gt;&quot; style=&quot;rounded=1;fillColor=#f8cecc;align=center;strokeColor=#b85450;verticalAlign=middle;spacing=2;fontFamily=Georgia;arcSize=20;strokeWidth=2;labelPosition=center;verticalLabelPosition=middle;html=1;whiteSpace=wrap;labelBorderColor=none;&quot; parent=&quot;1&quot; vertex=&quot;1&quot;&gt;&#10;          &lt;mxGeometry x=&quot;40&quot; y=&quot;835&quot; width=&quot;160&quot; height=&quot;60&quot; as=&quot;geometry&quot; /&gt;&#10;        &lt;/mxCell&gt;&#10;        &lt;mxCell id=&quot;udTpt-ogcE15AfO5dpks-5&quot; style=&quot;edgeStyle=orthogonalEdgeStyle;rounded=0;orthogonalLoop=1;jettySize=auto;html=1;exitX=1;exitY=0.5;exitDx=0;exitDy=0;entryX=0;entryY=0.5;entryDx=0;entryDy=0;fontFamily=Georgia;&quot; parent=&quot;1&quot; source=&quot;udTpt-ogcE15AfO5dpks-6&quot; target=&quot;udTpt-ogcE15AfO5dpks-8&quot; edge=&quot;1&quot;&gt;&#10;          &lt;mxGeometry relative=&quot;1&quot; as=&quot;geometry&quot; /&gt;&#10;        &lt;/mxCell&gt;&#10;        &lt;mxCell id=&quot;udTpt-ogcE15AfO5dpks-6&quot; value=&quot;Incoming Inspection&quot; style=&quot;shape=step;perimeter=stepPerimeter;whiteSpace=wrap;html=1;fixedSize=1;strokeWidth=2;fillColor=#fff2cc;fontFamily=Georgia;align=center;strokeColor=#d6b656;&quot; parent=&quot;1&quot; vertex=&quot;1&quot;&gt;&#10;          &lt;mxGeometry x=&quot;240&quot; y=&quot;835&quot; width=&quot;160&quot; height=&quot;60&quot; as=&quot;geometry&quot; /&gt;&#10;        &lt;/mxCell&gt;&#10;        &lt;mxCell id=&quot;ishWGL877BXy5JMq_WcK-4&quot; style=&quot;edgeStyle=orthogonalEdgeStyle;rounded=0;orthogonalLoop=1;jettySize=auto;html=1;exitX=1;exitY=0.5;exitDx=0;exitDy=0;entryX=0;entryY=0.5;entryDx=0;entryDy=0;&quot; parent=&quot;1&quot; source=&quot;udTpt-ogcE15AfO5dpks-8&quot; target=&quot;ishWGL877BXy5JMq_WcK-3&quot; edge=&quot;1&quot;&gt;&#10;          &lt;mxGeometry relative=&quot;1&quot; as=&quot;geometry&quot; /&gt;&#10;        &lt;/mxCell&gt;&#10;        &lt;mxCell id=&quot;udTpt-ogcE15AfO5dpks-8&quot; value=&quot;EMC&amp;lt;br&amp;gt;Tests&quot; style=&quot;shape=step;perimeter=stepPerimeter;whiteSpace=wrap;html=1;fixedSize=1;strokeWidth=2;fillColor=#d5e8d4;fontFamily=Georgia;align=center;strokeColor=#82b366;&quot; parent=&quot;1&quot; vertex=&quot;1&quot;&gt;&#10;          &lt;mxGeometry x=&quot;440&quot; y=&quot;835&quot; width=&quot;160&quot; height=&quot;60&quot; as=&quot;geometry&quot; /&gt;&#10;        &lt;/mxCell&gt;&#10;        &lt;mxCell id=&quot;udTpt-ogcE15AfO5dpks-9&quot; value=&quot;&amp;lt;font style=&amp;quot;font-size: 20px&amp;quot; color=&amp;quot;#808080&amp;quot;&amp;gt;&amp;lt;b&amp;gt;OBC/ADCS Board&amp;lt;br&amp;gt;&amp;lt;/b&amp;gt;In-House (&amp;lt;b&amp;gt;DM&amp;lt;/b&amp;gt;)&amp;lt;br&amp;gt;&amp;lt;/font&amp;gt;&quot; style=&quot;text;html=1;strokeColor=none;fillColor=none;align=center;verticalAlign=middle;whiteSpace=wrap;rounded=0;fontFamily=Georgia;&quot; parent=&quot;1&quot; vertex=&quot;1&quot;&gt;&#10;          &lt;mxGeometry x=&quot;30&quot; y=&quot;10&quot; width=&quot;810&quot; height=&quot;50&quot; as=&quot;geometry&quot; /&gt;&#10;        &lt;/mxCell&gt;&#10;        &lt;mxCell id=&quot;udTpt-ogcE15AfO5dpks-11&quot; value=&quot;&amp;lt;div style=&amp;quot;font-size: 16px&amp;quot;&amp;gt;&amp;lt;font style=&amp;quot;font-size: 16px&amp;quot; face=&amp;quot;Georgia&amp;quot;&amp;gt;&amp;lt;span&amp;gt;Legend&amp;lt;/span&amp;gt;&amp;lt;/font&amp;gt;&amp;lt;/div&amp;gt;&quot; style=&quot;rounded=0;whiteSpace=wrap;html=1;align=left;labelPosition=center;verticalLabelPosition=middle;verticalAlign=top;spacing=10;fillColor=none;&quot; parent=&quot;1&quot; vertex=&quot;1&quot;&gt;&#10;          &lt;mxGeometry x=&quot;40&quot; y=&quot;1310&quot; width=&quot;370&quot; height=&quot;200&quot; as=&quot;geometry&quot; /&gt;&#10;        &lt;/mxCell&gt;&#10;        &lt;mxCell id=&quot;udTpt-ogcE15AfO5dpks-12&quot; value=&quot;&quot; style=&quot;rounded=1;fillColor=#f8cecc;align=center;strokeColor=#b85450;verticalAlign=middle;spacing=2;fontFamily=Georgia;arcSize=20;strokeWidth=2;labelPosition=center;verticalLabelPosition=middle;html=1;whiteSpace=wrap;labelBorderColor=none;&quot; parent=&quot;1&quot; vertex=&quot;1&quot;&gt;&#10;          &lt;mxGeometry x=&quot;93.80952380952381&quot; y=&quot;1345&quot; width=&quot;54.761904761904766&quot; height=&quot;30&quot; as=&quot;geometry&quot; /&gt;&#10;        &lt;/mxCell&gt;&#10;        &lt;mxCell id=&quot;udTpt-ogcE15AfO5dpks-13&quot; value=&quot;&amp;lt;div align=&amp;quot;left&amp;quot;&amp;gt;Model&amp;lt;/div&amp;gt;&quot; style=&quot;text;html=1;strokeColor=none;fillColor=none;align=left;verticalAlign=middle;whiteSpace=wrap;rounded=0;fontFamily=Georgia;&quot; parent=&quot;1&quot; vertex=&quot;1&quot;&gt;&#10;          &lt;mxGeometry x=&quot;170.47619047619048&quot; y=&quot;1350&quot; width=&quot;43.80952380952381&quot; height=&quot;20&quot; as=&quot;geometry&quot; /&gt;&#10;        &lt;/mxCell&gt;&#10;        &lt;mxCell id=&quot;udTpt-ogcE15AfO5dpks-14&quot; value=&quot;&quot; style=&quot;rounded=1;whiteSpace=wrap;html=1;strokeWidth=2;fillColor=#dae8fc;fontFamily=Georgia;align=center;strokeColor=#6c8ebf;arcSize=50;&quot; parent=&quot;1&quot; vertex=&quot;1&quot;&gt;&#10;          &lt;mxGeometry x=&quot;93.80952380952381&quot; y=&quot;1385&quot; width=&quot;54.761904761904766&quot; height=&quot;30&quot; as=&quot;geometry&quot; /&gt;&#10;        &lt;/mxCell&gt;&#10;        &lt;mxCell id=&quot;udTpt-ogcE15AfO5dpks-15&quot; value=&quot;Integration with system&quot; style=&quot;text;html=1;strokeColor=none;fillColor=none;align=left;verticalAlign=middle;whiteSpace=wrap;rounded=0;fontFamily=Georgia;&quot; parent=&quot;1&quot; vertex=&quot;1&quot;&gt;&#10;          &lt;mxGeometry x=&quot;170.47619047619048&quot; y=&quot;1390&quot; width=&quot;76.66666666666667&quot; height=&quot;20&quot; as=&quot;geometry&quot; /&gt;&#10;        &lt;/mxCell&gt;&#10;        &lt;mxCell id=&quot;udTpt-ogcE15AfO5dpks-16&quot; value=&quot;&quot; style=&quot;shape=step;perimeter=stepPerimeter;whiteSpace=wrap;html=1;fixedSize=1;strokeWidth=2;fillColor=#d5e8d4;fontFamily=Georgia;align=center;strokeColor=#82b366;&quot; parent=&quot;1&quot; vertex=&quot;1&quot;&gt;&#10;          &lt;mxGeometry x=&quot;93.80952380952381&quot; y=&quot;1425&quot; width=&quot;54.761904761904766&quot; height=&quot;30&quot; as=&quot;geometry&quot; /&gt;&#10;        &lt;/mxCell&gt;&#10;        &lt;mxCell id=&quot;udTpt-ogcE15AfO5dpks-17&quot; value=&quot;Testing Activity&quot; style=&quot;text;html=1;strokeColor=none;fillColor=none;align=left;verticalAlign=middle;whiteSpace=wrap;rounded=0;fontFamily=Georgia;&quot; parent=&quot;1&quot; vertex=&quot;1&quot;&gt;&#10;          &lt;mxGeometry x=&quot;170.47619047619048&quot; y=&quot;1430&quot; width=&quot;76.66666666666667&quot; height=&quot;20&quot; as=&quot;geometry&quot; /&gt;&#10;        &lt;/mxCell&gt;&#10;        &lt;mxCell id=&quot;udTpt-ogcE15AfO5dpks-18&quot; value=&quot;&quot; style=&quot;shape=step;perimeter=stepPerimeter;whiteSpace=wrap;html=1;fixedSize=1;strokeWidth=2;fillColor=#fff2cc;fontFamily=Georgia;align=center;strokeColor=#d6b656;&quot; parent=&quot;1&quot; vertex=&quot;1&quot;&gt;&#10;          &lt;mxGeometry x=&quot;93.80952380952381&quot; y=&quot;1465&quot; width=&quot;54.761904761904766&quot; height=&quot;30&quot; as=&quot;geometry&quot; /&gt;&#10;        &lt;/mxCell&gt;&#10;        &lt;mxCell id=&quot;udTpt-ogcE15AfO5dpks-19&quot; value=&quot;&amp;lt;div&amp;gt;Inspection&amp;lt;/div&amp;gt;&amp;lt;div&amp;gt;Activity&amp;lt;br&amp;gt;&amp;lt;/div&amp;gt;&quot; style=&quot;text;html=1;strokeColor=none;fillColor=none;align=left;verticalAlign=middle;whiteSpace=wrap;rounded=0;fontFamily=Georgia;&quot; parent=&quot;1&quot; vertex=&quot;1&quot;&gt;&#10;          &lt;mxGeometry x=&quot;170.47619047619048&quot; y=&quot;1470&quot; width=&quot;76.66666666666667&quot; height=&quot;20&quot; as=&quot;geometry&quot; /&gt;&#10;        &lt;/mxCell&gt;&#10;        &lt;mxCell id=&quot;udTpt-ogcE15AfO5dpks-20&quot; value=&quot;&amp;lt;b&amp;gt;EQM:&amp;lt;/b&amp;gt; &quot; style=&quot;text;html=1;strokeColor=none;fillColor=none;align=right;verticalAlign=middle;whiteSpace=wrap;rounded=0;fontFamily=Georgia;&quot; parent=&quot;1&quot; vertex=&quot;1&quot;&gt;&#10;          &lt;mxGeometry x=&quot;270&quot; y=&quot;1370&quot; width=&quot;40&quot; height=&quot;20&quot; as=&quot;geometry&quot; /&gt;&#10;        &lt;/mxCell&gt;&#10;        &lt;mxCell id=&quot;udTpt-ogcE15AfO5dpks-21&quot; value=&quot;&amp;lt;b&amp;gt;PFM:&amp;lt;/b&amp;gt;&quot; style=&quot;text;html=1;strokeColor=none;fillColor=none;align=right;verticalAlign=middle;whiteSpace=wrap;rounded=0;fontFamily=Georgia;&quot; parent=&quot;1&quot; vertex=&quot;1&quot;&gt;&#10;          &lt;mxGeometry x=&quot;270&quot; y=&quot;1450&quot; width=&quot;40&quot; height=&quot;20&quot; as=&quot;geometry&quot; /&gt;&#10;        &lt;/mxCell&gt;&#10;        &lt;mxCell id=&quot;udTpt-ogcE15AfO5dpks-22&quot; value=&quot;Engineering Qualification Model&quot; style=&quot;text;html=1;strokeColor=none;fillColor=none;align=left;verticalAlign=middle;whiteSpace=wrap;rounded=0;fontFamily=Georgia;&quot; parent=&quot;1&quot; vertex=&quot;1&quot;&gt;&#10;          &lt;mxGeometry x=&quot;320&quot; y=&quot;1375&quot; width=&quot;70&quot; height=&quot;20&quot; as=&quot;geometry&quot; /&gt;&#10;        &lt;/mxCell&gt;&#10;        &lt;mxCell id=&quot;udTpt-ogcE15AfO5dpks-23&quot; value=&quot;Protoflight Model&quot; style=&quot;text;html=1;strokeColor=none;fillColor=none;align=left;verticalAlign=middle;whiteSpace=wrap;rounded=0;fontFamily=Georgia;&quot; parent=&quot;1&quot; vertex=&quot;1&quot;&gt;&#10;          &lt;mxGeometry x=&quot;320&quot; y=&quot;1455&quot; width=&quot;70&quot; height=&quot;20&quot; as=&quot;geometry&quot; /&gt;&#10;        &lt;/mxCell&gt;&#10;        &lt;mxCell id=&quot;udTpt-ogcE15AfO5dpks-24&quot; value=&quot;Integration with&amp;lt;br&amp;gt;&amp;lt;b&amp;gt;system flatsat&amp;lt;br&amp;gt;&amp;lt;/b&amp;gt;&quot; style=&quot;rounded=1;whiteSpace=wrap;html=1;strokeWidth=2;fillColor=#dae8fc;fontFamily=Georgia;align=center;strokeColor=#6c8ebf;arcSize=50;&quot; parent=&quot;1&quot; vertex=&quot;1&quot;&gt;&#10;          &lt;mxGeometry x=&quot;645&quot; y=&quot;945&quot; width=&quot;160&quot; height=&quot;60&quot; as=&quot;geometry&quot; /&gt;&#10;        &lt;/mxCell&gt;&#10;        &lt;mxCell id=&quot;fnzB5w1usJaGF9YamlUQ-12&quot; style=&quot;edgeStyle=orthogonalEdgeStyle;rounded=0;orthogonalLoop=1;jettySize=auto;html=1;exitX=1;exitY=0.5;exitDx=0;exitDy=0;&quot; parent=&quot;1&quot; source=&quot;udTpt-ogcE15AfO5dpks-30&quot; target=&quot;fnzB5w1usJaGF9YamlUQ-9&quot; edge=&quot;1&quot;&gt;&#10;          &lt;mxGeometry relative=&quot;1&quot; as=&quot;geometry&quot; /&gt;&#10;        &lt;/mxCell&gt;&#10;        &lt;mxCell id=&quot;udTpt-ogcE15AfO5dpks-30&quot; value=&quot;&amp;lt;div&amp;gt;&amp;lt;span&amp;gt;OBC/ADCS Board&amp;lt;/span&amp;gt;&amp;lt;/div&amp;gt;&amp;lt;div&amp;gt;&amp;lt;b&amp;gt;FM &amp;lt;/b&amp;gt;procurement&amp;lt;br&amp;gt;&amp;lt;/div&amp;gt;&quot; style=&quot;rounded=1;fillColor=#f8cecc;align=center;strokeColor=#b85450;verticalAlign=middle;spacing=2;fontFamily=Georgia;arcSize=20;strokeWidth=2;labelPosition=center;verticalLabelPosition=middle;html=1;whiteSpace=wrap;labelBorderColor=none;&quot; parent=&quot;1&quot; vertex=&quot;1&quot;&gt;&#10;          &lt;mxGeometry x=&quot;30&quot; y=&quot;1130&quot; width=&quot;160&quot; height=&quot;60&quot; as=&quot;geometry&quot; /&gt;&#10;        &lt;/mxCell&gt;&#10;        &lt;mxCell id=&quot;fnzB5w1usJaGF9YamlUQ-6&quot; style=&quot;edgeStyle=orthogonalEdgeStyle;rounded=0;orthogonalLoop=1;jettySize=auto;html=1;exitX=1;exitY=0.5;exitDx=0;exitDy=0;entryX=0;entryY=0.5;entryDx=0;entryDy=0;&quot; parent=&quot;1&quot; source=&quot;fnzB5w1usJaGF9YamlUQ-3&quot; target=&quot;fnzB5w1usJaGF9YamlUQ-4&quot; edge=&quot;1&quot;&gt;&#10;          &lt;mxGeometry relative=&quot;1&quot; as=&quot;geometry&quot; /&gt;&#10;        &lt;/mxCell&gt;&#10;        &lt;mxCell id=&quot;fnzB5w1usJaGF9YamlUQ-3&quot; value=&quot;&amp;lt;div&amp;gt;&amp;lt;span&amp;gt;OBC/ADCS Board &amp;lt;br&amp;gt;&amp;lt;/span&amp;gt;&amp;lt;/div&amp;gt;&amp;lt;div&amp;gt;&amp;lt;b&amp;gt;DM&amp;amp;nbsp;&amp;lt;/b&amp;gt;procurement&amp;lt;br&amp;gt;&amp;lt;/div&amp;gt;&quot; style=&quot;rounded=1;fillColor=#f8cecc;align=center;strokeColor=#b85450;verticalAlign=middle;spacing=2;fontFamily=Georgia;arcSize=20;strokeWidth=2;labelPosition=center;verticalLabelPosition=middle;html=1;whiteSpace=wrap;labelBorderColor=none;&quot; parent=&quot;1&quot; vertex=&quot;1&quot;&gt;&#10;          &lt;mxGeometry x=&quot;40&quot; y=&quot;80&quot; width=&quot;160&quot; height=&quot;60&quot; as=&quot;geometry&quot; /&gt;&#10;        &lt;/mxCell&gt;&#10;        &lt;mxCell id=&quot;fnzB5w1usJaGF9YamlUQ-7&quot; style=&quot;edgeStyle=orthogonalEdgeStyle;rounded=0;orthogonalLoop=1;jettySize=auto;html=1;exitX=1;exitY=0.5;exitDx=0;exitDy=0;&quot; parent=&quot;1&quot; source=&quot;fnzB5w1usJaGF9YamlUQ-4&quot; target=&quot;fnzB5w1usJaGF9YamlUQ-5&quot; edge=&quot;1&quot;&gt;&#10;          &lt;mxGeometry relative=&quot;1&quot; as=&quot;geometry&quot; /&gt;&#10;        &lt;/mxCell&gt;&#10;        &lt;mxCell id=&quot;fnzB5w1usJaGF9YamlUQ-4&quot; value=&quot;Incoming Inspection&quot; style=&quot;shape=step;perimeter=stepPerimeter;whiteSpace=wrap;html=1;fixedSize=1;strokeWidth=2;fillColor=#fff2cc;fontFamily=Georgia;align=center;strokeColor=#d6b656;&quot; parent=&quot;1&quot; vertex=&quot;1&quot;&gt;&#10;          &lt;mxGeometry x=&quot;240&quot; y=&quot;80&quot; width=&quot;160&quot; height=&quot;60&quot; as=&quot;geometry&quot; /&gt;&#10;        &lt;/mxCell&gt;&#10;        &lt;mxCell id=&quot;fnzB5w1usJaGF9YamlUQ-5&quot; value=&quot;Functionality testing&quot; style=&quot;shape=step;perimeter=stepPerimeter;whiteSpace=wrap;html=1;fixedSize=1;strokeWidth=2;fillColor=#d5e8d4;fontFamily=Georgia;align=center;strokeColor=#82b366;&quot; parent=&quot;1&quot; vertex=&quot;1&quot;&gt;&#10;          &lt;mxGeometry x=&quot;440&quot; y=&quot;80&quot; width=&quot;160&quot; height=&quot;60&quot; as=&quot;geometry&quot; /&gt;&#10;        &lt;/mxCell&gt;&#10;        &lt;mxCell id=&quot;fnzB5w1usJaGF9YamlUQ-13&quot; style=&quot;edgeStyle=orthogonalEdgeStyle;rounded=0;orthogonalLoop=1;jettySize=auto;html=1;exitX=1;exitY=0.5;exitDx=0;exitDy=0;&quot; parent=&quot;1&quot; source=&quot;fnzB5w1usJaGF9YamlUQ-9&quot; edge=&quot;1&quot;&gt;&#10;          &lt;mxGeometry relative=&quot;1&quot; as=&quot;geometry&quot;&gt;&#10;            &lt;mxPoint x=&quot;460&quot; y=&quot;1160&quot; as=&quot;targetPoint&quot; /&gt;&#10;          &lt;/mxGeometry&gt;&#10;        &lt;/mxCell&gt;&#10;        &lt;mxCell id=&quot;fnzB5w1usJaGF9YamlUQ-9&quot; value=&quot;Incoming Inspection&quot; style=&quot;shape=step;perimeter=stepPerimeter;whiteSpace=wrap;html=1;fixedSize=1;strokeWidth=2;fillColor=#fff2cc;fontFamily=Georgia;align=center;strokeColor=#d6b656;&quot; parent=&quot;1&quot; vertex=&quot;1&quot;&gt;&#10;          &lt;mxGeometry x=&quot;240&quot; y=&quot;1130&quot; width=&quot;160&quot; height=&quot;60&quot; as=&quot;geometry&quot; /&gt;&#10;        &lt;/mxCell&gt;&#10;        &lt;mxCell id=&quot;IohnI3tezs_w-SwA3S8z-7&quot; style=&quot;edgeStyle=orthogonalEdgeStyle;rounded=0;orthogonalLoop=1;jettySize=auto;html=1;exitX=1;exitY=0.5;exitDx=0;exitDy=0;&quot; parent=&quot;1&quot; source=&quot;fnzB5w1usJaGF9YamlUQ-27&quot; target=&quot;fnzB5w1usJaGF9YamlUQ-29&quot; edge=&quot;1&quot;&gt;&#10;          &lt;mxGeometry relative=&quot;1&quot; as=&quot;geometry&quot;&gt;&#10;            &lt;Array as=&quot;points&quot;&gt;&#10;              &lt;mxPoint x=&quot;820&quot; y=&quot;1160&quot; /&gt;&#10;              &lt;mxPoint x=&quot;820&quot; y=&quot;1215&quot; /&gt;&#10;              &lt;mxPoint x=&quot;730&quot; y=&quot;1215&quot; /&gt;&#10;            &lt;/Array&gt;&#10;          &lt;/mxGeometry&gt;&#10;        &lt;/mxCell&gt;&#10;        &lt;mxCell id=&quot;fnzB5w1usJaGF9YamlUQ-27&quot; value=&quot;Integration with&amp;lt;br&amp;gt;&amp;lt;b&amp;gt;system flatsat&amp;lt;/b&amp;gt;&quot; style=&quot;rounded=1;whiteSpace=wrap;html=1;strokeWidth=2;fillColor=#dae8fc;fontFamily=Georgia;align=center;strokeColor=#6c8ebf;arcSize=50;&quot; parent=&quot;1&quot; vertex=&quot;1&quot;&gt;&#10;          &lt;mxGeometry x=&quot;640&quot; y=&quot;1130&quot; width=&quot;160&quot; height=&quot;60&quot; as=&quot;geometry&quot; /&gt;&#10;        &lt;/mxCell&gt;&#10;        &lt;mxCell id=&quot;fnzB5w1usJaGF9YamlUQ-29&quot; value=&quot;Integration with&amp;lt;br&amp;gt;&amp;lt;b&amp;gt;PFM spacecraft&amp;lt;br&amp;gt;&amp;lt;/b&amp;gt;&quot; style=&quot;rounded=1;whiteSpace=wrap;html=1;strokeWidth=2;fillColor=#dae8fc;fontFamily=Georgia;align=center;strokeColor=#6c8ebf;arcSize=50;&quot; parent=&quot;1&quot; vertex=&quot;1&quot;&gt;&#10;          &lt;mxGeometry x=&quot;640&quot; y=&quot;1240&quot; width=&quot;160&quot; height=&quot;60&quot; as=&quot;geometry&quot; /&gt;&#10;        &lt;/mxCell&gt;&#10;        &lt;mxCell id=&quot;_AOai00gr-lhleaZuruR-2&quot; style=&quot;edgeStyle=orthogonalEdgeStyle;rounded=0;orthogonalLoop=1;jettySize=auto;html=1;exitX=1;exitY=0.5;exitDx=0;exitDy=0;entryX=0;entryY=0.5;entryDx=0;entryDy=0;&quot; parent=&quot;1&quot; source=&quot;IohnI3tezs_w-SwA3S8z-1&quot; target=&quot;_AOai00gr-lhleaZuruR-1&quot; edge=&quot;1&quot;&gt;&#10;          &lt;mxGeometry relative=&quot;1&quot; as=&quot;geometry&quot; /&gt;&#10;        &lt;/mxCell&gt;&#10;        &lt;mxCell id=&quot;IohnI3tezs_w-SwA3S8z-1&quot; value=&quot;Vibration Tests&quot; style=&quot;shape=step;perimeter=stepPerimeter;whiteSpace=wrap;html=1;fixedSize=1;strokeWidth=2;fillColor=#d5e8d4;fontFamily=Georgia;align=center;strokeColor=#82b366;&quot; parent=&quot;1&quot; vertex=&quot;1&quot;&gt;&#10;          &lt;mxGeometry x=&quot;40&quot; y=&quot;945&quot; width=&quot;160&quot; height=&quot;60&quot; as=&quot;geometry&quot; /&gt;&#10;        &lt;/mxCell&gt;&#10;        &lt;mxCell id=&quot;IohnI3tezs_w-SwA3S8z-6&quot; style=&quot;edgeStyle=orthogonalEdgeStyle;rounded=0;orthogonalLoop=1;jettySize=auto;html=1;exitX=1;exitY=0.5;exitDx=0;exitDy=0;&quot; parent=&quot;1&quot; source=&quot;IohnI3tezs_w-SwA3S8z-2&quot; target=&quot;udTpt-ogcE15AfO5dpks-24&quot; edge=&quot;1&quot;&gt;&#10;          &lt;mxGeometry relative=&quot;1&quot; as=&quot;geometry&quot; /&gt;&#10;        &lt;/mxCell&gt;&#10;        &lt;mxCell id=&quot;IohnI3tezs_w-SwA3S8z-2&quot; value=&quot;TVAC Tests&quot; style=&quot;shape=step;perimeter=stepPerimeter;whiteSpace=wrap;html=1;fixedSize=1;strokeWidth=2;fillColor=#d5e8d4;fontFamily=Georgia;align=center;strokeColor=#82b366;&quot; parent=&quot;1&quot; vertex=&quot;1&quot;&gt;&#10;          &lt;mxGeometry x=&quot;440&quot; y=&quot;945&quot; width=&quot;160&quot; height=&quot;60&quot; as=&quot;geometry&quot; /&gt;&#10;        &lt;/mxCell&gt;&#10;        &lt;mxCell id=&quot;8XXDTQQdH0CVGJyUccaw-2&quot; value=&quot;&amp;lt;b&amp;gt;FM:&amp;lt;/b&amp;gt;&quot; style=&quot;text;html=1;strokeColor=none;fillColor=none;align=right;verticalAlign=middle;whiteSpace=wrap;rounded=0;fontFamily=Georgia;&quot; parent=&quot;1&quot; vertex=&quot;1&quot;&gt;&#10;          &lt;mxGeometry x=&quot;270&quot; y=&quot;1415&quot; width=&quot;40&quot; height=&quot;20&quot; as=&quot;geometry&quot; /&gt;&#10;        &lt;/mxCell&gt;&#10;        &lt;mxCell id=&quot;8XXDTQQdH0CVGJyUccaw-3&quot; value=&quot;Flight Model&quot; style=&quot;text;html=1;strokeColor=none;fillColor=none;align=left;verticalAlign=middle;whiteSpace=wrap;rounded=0;fontFamily=Georgia;&quot; parent=&quot;1&quot; vertex=&quot;1&quot;&gt;&#10;          &lt;mxGeometry x=&quot;320&quot; y=&quot;1420&quot; width=&quot;70&quot; height=&quot;20&quot; as=&quot;geometry&quot; /&gt;&#10;        &lt;/mxCell&gt;&#10;        &lt;mxCell id=&quot;ishWGL877BXy5JMq_WcK-5&quot; style=&quot;edgeStyle=orthogonalEdgeStyle;rounded=0;orthogonalLoop=1;jettySize=auto;html=1;exitX=1;exitY=0.5;exitDx=0;exitDy=0;entryX=0.5;entryY=0;entryDx=0;entryDy=0;&quot; parent=&quot;1&quot; source=&quot;ishWGL877BXy5JMq_WcK-3&quot; target=&quot;IohnI3tezs_w-SwA3S8z-1&quot; edge=&quot;1&quot;&gt;&#10;          &lt;mxGeometry relative=&quot;1&quot; as=&quot;geometry&quot; /&gt;&#10;        &lt;/mxCell&gt;&#10;        &lt;mxCell id=&quot;ishWGL877BXy5JMq_WcK-3&quot; value=&quot;Ambient Functional&amp;lt;br&amp;gt;Tests&quot; style=&quot;shape=step;perimeter=stepPerimeter;whiteSpace=wrap;html=1;fixedSize=1;strokeWidth=2;fillColor=#d5e8d4;fontFamily=Georgia;align=center;strokeColor=#82b366;&quot; parent=&quot;1&quot; vertex=&quot;1&quot;&gt;&#10;          &lt;mxGeometry x=&quot;640&quot; y=&quot;835&quot; width=&quot;160&quot; height=&quot;60&quot; as=&quot;geometry&quot; /&gt;&#10;        &lt;/mxCell&gt;&#10;        &lt;mxCell id=&quot;ishWGL877BXy5JMq_WcK-11&quot; style=&quot;edgeStyle=orthogonalEdgeStyle;rounded=0;orthogonalLoop=1;jettySize=auto;html=1;exitX=1;exitY=0.5;exitDx=0;exitDy=0;entryX=0;entryY=0.5;entryDx=0;entryDy=0;&quot; parent=&quot;1&quot; source=&quot;ishWGL877BXy5JMq_WcK-6&quot; target=&quot;fnzB5w1usJaGF9YamlUQ-27&quot; edge=&quot;1&quot;&gt;&#10;          &lt;mxGeometry relative=&quot;1&quot; as=&quot;geometry&quot;&gt;&#10;            &lt;Array as=&quot;points&quot; /&gt;&#10;          &lt;/mxGeometry&gt;&#10;        &lt;/mxCell&gt;&#10;        &lt;mxCell id=&quot;ishWGL877BXy5JMq_WcK-6&quot; value=&quot;Ambient Functional&amp;lt;br&amp;gt;Tests&quot; style=&quot;shape=step;perimeter=stepPerimeter;whiteSpace=wrap;html=1;fixedSize=1;strokeWidth=2;fillColor=#d5e8d4;fontFamily=Georgia;align=center;strokeColor=#82b366;&quot; parent=&quot;1&quot; vertex=&quot;1&quot;&gt;&#10;          &lt;mxGeometry x=&quot;440&quot; y=&quot;1130&quot; width=&quot;160&quot; height=&quot;60&quot; as=&quot;geometry&quot; /&gt;&#10;        &lt;/mxCell&gt;&#10;        &lt;mxCell id=&quot;ishWGL877BXy5JMq_WcK-9&quot; value=&quot;&amp;lt;font style=&amp;quot;font-size: 20px&amp;quot; color=&amp;quot;#808080&amp;quot;&amp;gt;&amp;lt;b&amp;gt;OBC/ADCS Board&amp;lt;br&amp;gt;&amp;lt;/b&amp;gt;In-House (&amp;lt;b&amp;gt;EQM&amp;lt;/b&amp;gt;)&amp;lt;br&amp;gt;&amp;lt;/font&amp;gt;&quot; style=&quot;text;html=1;strokeColor=none;fillColor=none;align=center;verticalAlign=middle;whiteSpace=wrap;rounded=0;fontFamily=Georgia;&quot; parent=&quot;1&quot; vertex=&quot;1&quot;&gt;&#10;          &lt;mxGeometry x=&quot;20&quot; y=&quot;750&quot; width=&quot;810&quot; height=&quot;50&quot; as=&quot;geometry&quot; /&gt;&#10;        &lt;/mxCell&gt;&#10;        &lt;mxCell id=&quot;ishWGL877BXy5JMq_WcK-10&quot; value=&quot;&amp;lt;font style=&amp;quot;font-size: 20px&amp;quot; color=&amp;quot;#808080&amp;quot;&amp;gt;&amp;lt;b&amp;gt;OBC/ADCS Board&amp;lt;br&amp;gt;&amp;lt;/b&amp;gt;In-House (&amp;lt;b&amp;gt;FM&amp;lt;/b&amp;gt;)&amp;lt;br&amp;gt;&amp;lt;/font&amp;gt;&quot; style=&quot;text;html=1;strokeColor=none;fillColor=none;align=center;verticalAlign=middle;whiteSpace=wrap;rounded=0;fontFamily=Georgia;&quot; parent=&quot;1&quot; vertex=&quot;1&quot;&gt;&#10;          &lt;mxGeometry x=&quot;20&quot; y=&quot;1050&quot; width=&quot;810&quot; height=&quot;50&quot; as=&quot;geometry&quot; /&gt;&#10;        &lt;/mxCell&gt;&#10;        &lt;mxCell id=&quot;_AOai00gr-lhleaZuruR-3&quot; style=&quot;edgeStyle=orthogonalEdgeStyle;rounded=0;orthogonalLoop=1;jettySize=auto;html=1;exitX=1;exitY=0.5;exitDx=0;exitDy=0;entryX=0;entryY=0.5;entryDx=0;entryDy=0;&quot; parent=&quot;1&quot; source=&quot;_AOai00gr-lhleaZuruR-1&quot; target=&quot;IohnI3tezs_w-SwA3S8z-2&quot; edge=&quot;1&quot;&gt;&#10;          &lt;mxGeometry relative=&quot;1&quot; as=&quot;geometry&quot; /&gt;&#10;        &lt;/mxCell&gt;&#10;        &lt;mxCell id=&quot;_AOai00gr-lhleaZuruR-1&quot; value=&quot;Shock Test&quot; style=&quot;shape=step;perimeter=stepPerimeter;whiteSpace=wrap;html=1;fixedSize=1;strokeWidth=2;fillColor=#d5e8d4;fontFamily=Georgia;align=center;strokeColor=#82b366;&quot; parent=&quot;1&quot; vertex=&quot;1&quot;&gt;&#10;          &lt;mxGeometry x=&quot;240&quot; y=&quot;945&quot; width=&quot;160&quot; height=&quot;60&quot; as=&quot;geometry&quot; /&gt;&#10;        &lt;/mxCell&gt;&#10;        &lt;mxCell id=&quot;ocxMV6QQNHyHgt8OVnz1-2&quot; style=&quot;edgeStyle=orthogonalEdgeStyle;rounded=0;orthogonalLoop=1;jettySize=auto;html=1;exitX=1;exitY=0.5;exitDx=0;exitDy=0;&quot; parent=&quot;1&quot; source=&quot;ocxMV6QQNHyHgt8OVnz1-3&quot; target=&quot;ocxMV6QQNHyHgt8OVnz1-5&quot; edge=&quot;1&quot;&gt;&#10;          &lt;mxGeometry relative=&quot;1&quot; as=&quot;geometry&quot; /&gt;&#10;        &lt;/mxCell&gt;&#10;        &lt;mxCell id=&quot;ocxMV6QQNHyHgt8OVnz1-3&quot; value=&quot;&amp;lt;div&amp;gt;&amp;lt;span&amp;gt;OBC/ADCS Board &amp;lt;br&amp;gt;&amp;lt;/span&amp;gt;&amp;lt;/div&amp;gt;&amp;lt;div&amp;gt;&amp;lt;b&amp;gt;EM&amp;amp;nbsp;&amp;lt;/b&amp;gt;procurement&amp;lt;br&amp;gt;&amp;lt;/div&amp;gt;&quot; style=&quot;rounded=1;fillColor=#f8cecc;align=center;strokeColor=#b85450;verticalAlign=middle;spacing=2;fontFamily=Georgia;arcSize=20;strokeWidth=2;labelPosition=center;verticalLabelPosition=middle;html=1;whiteSpace=wrap;labelBorderColor=none;&quot; parent=&quot;1&quot; vertex=&quot;1&quot;&gt;&#10;          &lt;mxGeometry x=&quot;40&quot; y=&quot;270&quot; width=&quot;160&quot; height=&quot;60&quot; as=&quot;geometry&quot; /&gt;&#10;        &lt;/mxCell&gt;&#10;        &lt;mxCell id=&quot;ocxMV6QQNHyHgt8OVnz1-19&quot; style=&quot;edgeStyle=orthogonalEdgeStyle;rounded=0;orthogonalLoop=1;jettySize=auto;html=1;entryX=0;entryY=0.5;entryDx=0;entryDy=0;&quot; parent=&quot;1&quot; source=&quot;ocxMV6QQNHyHgt8OVnz1-5&quot; target=&quot;ocxMV6QQNHyHgt8OVnz1-14&quot; edge=&quot;1&quot;&gt;&#10;          &lt;mxGeometry relative=&quot;1&quot; as=&quot;geometry&quot; /&gt;&#10;        &lt;/mxCell&gt;&#10;        &lt;mxCell id=&quot;ocxMV6QQNHyHgt8OVnz1-5&quot; value=&quot;Incoming Inspection&quot; style=&quot;shape=step;perimeter=stepPerimeter;whiteSpace=wrap;html=1;fixedSize=1;strokeWidth=2;fillColor=#fff2cc;fontFamily=Georgia;align=center;strokeColor=#d6b656;&quot; parent=&quot;1&quot; vertex=&quot;1&quot;&gt;&#10;          &lt;mxGeometry x=&quot;240&quot; y=&quot;270&quot; width=&quot;160&quot; height=&quot;60&quot; as=&quot;geometry&quot; /&gt;&#10;        &lt;/mxCell&gt;&#10;        &lt;mxCell id=&quot;ocxMV6QQNHyHgt8OVnz1-21&quot; style=&quot;edgeStyle=orthogonalEdgeStyle;rounded=0;orthogonalLoop=1;jettySize=auto;html=1;&quot; parent=&quot;1&quot; source=&quot;ocxMV6QQNHyHgt8OVnz1-10&quot; target=&quot;ocxMV6QQNHyHgt8OVnz1-12&quot; edge=&quot;1&quot;&gt;&#10;          &lt;mxGeometry relative=&quot;1&quot; as=&quot;geometry&quot;&gt;&#10;            &lt;Array as=&quot;points&quot;&gt;&#10;              &lt;mxPoint x=&quot;810&quot; y=&quot;300&quot; /&gt;&#10;              &lt;mxPoint x=&quot;810&quot; y=&quot;350&quot; /&gt;&#10;              &lt;mxPoint x=&quot;121&quot; y=&quot;350&quot; /&gt;&#10;            &lt;/Array&gt;&#10;          &lt;/mxGeometry&gt;&#10;        &lt;/mxCell&gt;&#10;        &lt;mxCell id=&quot;ocxMV6QQNHyHgt8OVnz1-10&quot; value=&quot;Vibration Tests&quot; style=&quot;shape=step;perimeter=stepPerimeter;whiteSpace=wrap;html=1;fixedSize=1;strokeWidth=2;fillColor=#d5e8d4;fontFamily=Georgia;align=center;strokeColor=#82b366;&quot; parent=&quot;1&quot; vertex=&quot;1&quot;&gt;&#10;          &lt;mxGeometry x=&quot;630&quot; y=&quot;270&quot; width=&quot;160&quot; height=&quot;60&quot; as=&quot;geometry&quot; /&gt;&#10;        &lt;/mxCell&gt;&#10;        &lt;mxCell id=&quot;ocxMV6QQNHyHgt8OVnz1-12&quot; value=&quot;TVAC Tests&quot; style=&quot;shape=step;perimeter=stepPerimeter;whiteSpace=wrap;html=1;fixedSize=1;strokeWidth=2;fillColor=#d5e8d4;fontFamily=Georgia;align=center;strokeColor=#82b366;&quot; parent=&quot;1&quot; vertex=&quot;1&quot;&gt;&#10;          &lt;mxGeometry x=&quot;41.190000000000055&quot; y=&quot;370&quot; width=&quot;160&quot; height=&quot;60&quot; as=&quot;geometry&quot; /&gt;&#10;        &lt;/mxCell&gt;&#10;        &lt;mxCell id=&quot;ocxMV6QQNHyHgt8OVnz1-20&quot; style=&quot;edgeStyle=orthogonalEdgeStyle;rounded=0;orthogonalLoop=1;jettySize=auto;html=1;&quot; parent=&quot;1&quot; source=&quot;ocxMV6QQNHyHgt8OVnz1-14&quot; target=&quot;ocxMV6QQNHyHgt8OVnz1-10&quot; edge=&quot;1&quot;&gt;&#10;          &lt;mxGeometry relative=&quot;1&quot; as=&quot;geometry&quot; /&gt;&#10;        &lt;/mxCell&gt;&#10;        &lt;mxCell id=&quot;ocxMV6QQNHyHgt8OVnz1-14&quot; value=&quot;Ambient Functional&amp;lt;br&amp;gt;Tests&quot; style=&quot;shape=step;perimeter=stepPerimeter;whiteSpace=wrap;html=1;fixedSize=1;strokeWidth=2;fillColor=#d5e8d4;fontFamily=Georgia;align=center;strokeColor=#82b366;&quot; parent=&quot;1&quot; vertex=&quot;1&quot;&gt;&#10;          &lt;mxGeometry x=&quot;440&quot; y=&quot;270&quot; width=&quot;160&quot; height=&quot;60&quot; as=&quot;geometry&quot; /&gt;&#10;        &lt;/mxCell&gt;&#10;        &lt;mxCell id=&quot;ocxMV6QQNHyHgt8OVnz1-15&quot; value=&quot;&amp;lt;font style=&amp;quot;font-size: 20px&amp;quot; color=&amp;quot;#808080&amp;quot;&amp;gt;&amp;lt;b&amp;gt;OBC/ADCS Board&amp;lt;br&amp;gt;&amp;lt;/b&amp;gt;In-House (&amp;lt;b&amp;gt;EM&amp;lt;/b&amp;gt;)&amp;lt;br&amp;gt;&amp;lt;/font&amp;gt;&quot; style=&quot;text;html=1;strokeColor=none;fillColor=none;align=center;verticalAlign=middle;whiteSpace=wrap;rounded=0;fontFamily=Georgia;&quot; parent=&quot;1&quot; vertex=&quot;1&quot;&gt;&#10;          &lt;mxGeometry x=&quot;30&quot; y=&quot;190&quot; width=&quot;810&quot; height=&quot;50&quot; as=&quot;geometry&quot; /&gt;&#10;        &lt;/mxCell&gt;&#10;        &lt;mxCell id=&quot;ocxMV6QQNHyHgt8OVnz1-22&quot; style=&quot;edgeStyle=orthogonalEdgeStyle;rounded=0;orthogonalLoop=1;jettySize=auto;html=1;exitX=1;exitY=0.5;exitDx=0;exitDy=0;&quot; parent=&quot;1&quot; source=&quot;ocxMV6QQNHyHgt8OVnz1-23&quot; target=&quot;ocxMV6QQNHyHgt8OVnz1-25&quot; edge=&quot;1&quot;&gt;&#10;          &lt;mxGeometry relative=&quot;1&quot; as=&quot;geometry&quot; /&gt;&#10;        &lt;/mxCell&gt;&#10;        &lt;mxCell id=&quot;ocxMV6QQNHyHgt8OVnz1-23&quot; value=&quot;&amp;lt;div&amp;gt;&amp;lt;span&amp;gt;OBC/ADCS Board &amp;lt;br&amp;gt;&amp;lt;/span&amp;gt;&amp;lt;/div&amp;gt;&amp;lt;div&amp;gt;&amp;lt;b&amp;gt;EM&amp;amp;nbsp;&amp;lt;/b&amp;gt;procurement&amp;lt;br&amp;gt;&amp;lt;/div&amp;gt;&quot; style=&quot;rounded=1;fillColor=#f8cecc;align=center;strokeColor=#b85450;verticalAlign=middle;spacing=2;fontFamily=Georgia;arcSize=20;strokeWidth=2;labelPosition=center;verticalLabelPosition=middle;html=1;whiteSpace=wrap;labelBorderColor=none;&quot; parent=&quot;1&quot; vertex=&quot;1&quot;&gt;&#10;          &lt;mxGeometry x=&quot;40&quot; y=&quot;510&quot; width=&quot;160&quot; height=&quot;60&quot; as=&quot;geometry&quot; /&gt;&#10;        &lt;/mxCell&gt;&#10;        &lt;mxCell id=&quot;ocxMV6QQNHyHgt8OVnz1-24&quot; style=&quot;edgeStyle=orthogonalEdgeStyle;rounded=0;orthogonalLoop=1;jettySize=auto;html=1;entryX=0;entryY=0.5;entryDx=0;entryDy=0;&quot; parent=&quot;1&quot; source=&quot;ocxMV6QQNHyHgt8OVnz1-25&quot; target=&quot;ocxMV6QQNHyHgt8OVnz1-30&quot; edge=&quot;1&quot;&gt;&#10;          &lt;mxGeometry relative=&quot;1&quot; as=&quot;geometry&quot; /&gt;&#10;        &lt;/mxCell&gt;&#10;        &lt;mxCell id=&quot;ocxMV6QQNHyHgt8OVnz1-25&quot; value=&quot;Incoming Inspection&quot; style=&quot;shape=step;perimeter=stepPerimeter;whiteSpace=wrap;html=1;fixedSize=1;strokeWidth=2;fillColor=#fff2cc;fontFamily=Georgia;align=center;strokeColor=#d6b656;&quot; parent=&quot;1&quot; vertex=&quot;1&quot;&gt;&#10;          &lt;mxGeometry x=&quot;240&quot; y=&quot;510&quot; width=&quot;160&quot; height=&quot;60&quot; as=&quot;geometry&quot; /&gt;&#10;        &lt;/mxCell&gt;&#10;        &lt;mxCell id=&quot;ocxMV6QQNHyHgt8OVnz1-26&quot; style=&quot;edgeStyle=orthogonalEdgeStyle;rounded=0;orthogonalLoop=1;jettySize=auto;html=1;&quot; parent=&quot;1&quot; source=&quot;ocxMV6QQNHyHgt8OVnz1-27&quot; target=&quot;ocxMV6QQNHyHgt8OVnz1-28&quot; edge=&quot;1&quot;&gt;&#10;          &lt;mxGeometry relative=&quot;1&quot; as=&quot;geometry&quot;&gt;&#10;            &lt;Array as=&quot;points&quot;&gt;&#10;              &lt;mxPoint x=&quot;810&quot; y=&quot;540&quot; /&gt;&#10;              &lt;mxPoint x=&quot;810&quot; y=&quot;610&quot; /&gt;&#10;              &lt;mxPoint x=&quot;110&quot; y=&quot;610&quot; /&gt;&#10;            &lt;/Array&gt;&#10;          &lt;/mxGeometry&gt;&#10;        &lt;/mxCell&gt;&#10;        &lt;mxCell id=&quot;ocxMV6QQNHyHgt8OVnz1-27&quot; value=&quot;Vibration Tests&quot; style=&quot;shape=step;perimeter=stepPerimeter;whiteSpace=wrap;html=1;fixedSize=1;strokeWidth=2;fillColor=#d5e8d4;fontFamily=Georgia;align=center;strokeColor=#82b366;&quot; parent=&quot;1&quot; vertex=&quot;1&quot;&gt;&#10;          &lt;mxGeometry x=&quot;630&quot; y=&quot;510&quot; width=&quot;160&quot; height=&quot;60&quot; as=&quot;geometry&quot; /&gt;&#10;        &lt;/mxCell&gt;&#10;        &lt;mxCell id=&quot;ocxMV6QQNHyHgt8OVnz1-33&quot; style=&quot;edgeStyle=orthogonalEdgeStyle;rounded=0;orthogonalLoop=1;jettySize=auto;html=1;entryX=0;entryY=0.5;entryDx=0;entryDy=0;&quot; parent=&quot;1&quot; source=&quot;ocxMV6QQNHyHgt8OVnz1-28&quot; target=&quot;ocxMV6QQNHyHgt8OVnz1-32&quot; edge=&quot;1&quot;&gt;&#10;          &lt;mxGeometry relative=&quot;1&quot; as=&quot;geometry&quot; /&gt;&#10;        &lt;/mxCell&gt;&#10;        &lt;mxCell id=&quot;ocxMV6QQNHyHgt8OVnz1-28&quot; value=&quot;Shock Test&quot; style=&quot;shape=step;perimeter=stepPerimeter;whiteSpace=wrap;html=1;fixedSize=1;strokeWidth=2;fillColor=#d5e8d4;fontFamily=Georgia;align=center;strokeColor=#82b366;&quot; parent=&quot;1&quot; vertex=&quot;1&quot;&gt;&#10;          &lt;mxGeometry x=&quot;41.19&quot; y=&quot;650&quot; width=&quot;160&quot; height=&quot;60&quot; as=&quot;geometry&quot; /&gt;&#10;        &lt;/mxCell&gt;&#10;        &lt;mxCell id=&quot;ocxMV6QQNHyHgt8OVnz1-29&quot; style=&quot;edgeStyle=orthogonalEdgeStyle;rounded=0;orthogonalLoop=1;jettySize=auto;html=1;&quot; parent=&quot;1&quot; source=&quot;ocxMV6QQNHyHgt8OVnz1-30&quot; target=&quot;ocxMV6QQNHyHgt8OVnz1-27&quot; edge=&quot;1&quot;&gt;&#10;          &lt;mxGeometry relative=&quot;1&quot; as=&quot;geometry&quot; /&gt;&#10;        &lt;/mxCell&gt;&#10;        &lt;mxCell id=&quot;ocxMV6QQNHyHgt8OVnz1-30&quot; value=&quot;Ambient Functional&amp;lt;br&amp;gt;Tests&quot; style=&quot;shape=step;perimeter=stepPerimeter;whiteSpace=wrap;html=1;fixedSize=1;strokeWidth=2;fillColor=#d5e8d4;fontFamily=Georgia;align=center;strokeColor=#82b366;&quot; parent=&quot;1&quot; vertex=&quot;1&quot;&gt;&#10;          &lt;mxGeometry x=&quot;440&quot; y=&quot;510&quot; width=&quot;160&quot; height=&quot;60&quot; as=&quot;geometry&quot; /&gt;&#10;        &lt;/mxCell&gt;&#10;        &lt;mxCell id=&quot;ocxMV6QQNHyHgt8OVnz1-31&quot; value=&quot;&amp;lt;font style=&amp;quot;font-size: 20px&amp;quot; color=&amp;quot;#808080&amp;quot;&amp;gt;&amp;lt;b&amp;gt;OBC/ADCS Board&amp;lt;br&amp;gt;&amp;lt;/b&amp;gt;In-House (&amp;lt;b&amp;gt;EM&amp;lt;/b&amp;gt;)&amp;lt;br&amp;gt;&amp;lt;/font&amp;gt;&quot; style=&quot;text;html=1;strokeColor=none;fillColor=none;align=center;verticalAlign=middle;whiteSpace=wrap;rounded=0;fontFamily=Georgia;&quot; parent=&quot;1&quot; vertex=&quot;1&quot;&gt;&#10;          &lt;mxGeometry x=&quot;30&quot; y=&quot;430&quot; width=&quot;810&quot; height=&quot;50&quot; as=&quot;geometry&quot; /&gt;&#10;        &lt;/mxCell&gt;&#10;        &lt;mxCell id=&quot;ocxMV6QQNHyHgt8OVnz1-32&quot; value=&quot;TVAC Tests&quot; style=&quot;shape=step;perimeter=stepPerimeter;whiteSpace=wrap;html=1;fixedSize=1;strokeWidth=2;fillColor=#d5e8d4;fontFamily=Georgia;align=center;strokeColor=#82b366;&quot; parent=&quot;1&quot; vertex=&quot;1&quot;&gt;&#10;          &lt;mxGeometry x=&quot;240&quot; y=&quot;650&quot; width=&quot;160&quot; height=&quot;60&quot; as=&quot;geometry&quot; /&gt;&#10;        &lt;/mxCell&gt;&#10;      &lt;/root&gt;&#10;    &lt;/mxGraphModel&gt;&#10;  &lt;/diagram&gt;&#10;&lt;/mxfile&gt;&#10;" resource="https://app.diagrams.net/#Aacubesat%2Fsystems-engineering%2Fmaiv-plan%2Fmaster%2FSubsystems%20Development%20and%20Verification%20Plan%2FOBC_Board.svg#%7B%22pageId%22%3A%22ho_89WfpTrC8WPghvUhD%22%7D"><defs/><g><g data-cell-id="0"><g data-cell-id="1"><g data-cell-id="ishWGL877BXy5JMq_WcK-2"><g><path d="M 180 855 L 233.63 855" fill="none" stroke="rgb(0, 0, 0)" stroke-miterlimit="10" pointer-events="stroke"/><path d="M 238.88 855 L 231.88 858.5 L 233.63 855 L 231.88 851.5 Z" fill="rgb(0, 0, 0)" stroke="rgb(0, 0, 0)" stroke-miterlimit="10" pointer-events="all"/></g></g><g data-cell-id="udTpt-ogcE15AfO5dpks-2"><g><rect x="20" y="825" width="160" height="60" rx="12" ry="12" fill="#f8cecc" stroke="#b85450" stroke-width="2" pointer-events="all"/></g><g><g transform="translate(-0.5 -0.5)"><switch><foreignObject pointer-events="none" width="100%" height="100%" requiredFeatures="http://www.w3.org/TR/SVG11/feature#Extensibility" style="overflow: visible; text-align: left;"><div xmlns="http://www.w3.org/1999/xhtml" style="display: flex; align-items: unsafe center; justify-content: unsafe center; width: 158px; height: 1px; padding-top: 855px; margin-left: 21px;"><div data-drawio-colors="color: rgb(0, 0, 0); " style="box-sizing: border-box; font-size: 0px; text-align: center;"><div style="display: inline-block; font-size: 12px; font-family: Georgia; color: rgb(0, 0, 0); line-height: 1.2; pointer-events: all; white-space: normal; overflow-wrap: normal;"><div><span>OBC/ADCS Board <br /></span></div><div><b>EQM </b>procurement<br /></div></div></div></div></foreignObject><text x="100" y="859" fill="rgb(0, 0, 0)" font-family="&quot;Georgia&quot;" font-size="12px" text-anchor="middle">OBC/ADCS Board...</text></switch></g></g></g><g data-cell-id="udTpt-ogcE15AfO5dpks-5"><g><path d="M 380 855 L 433.63 855" fill="none" stroke="rgb(0, 0, 0)" stroke-miterlimit="10" pointer-events="stroke"/><path d="M 438.88 855 L 431.88 858.5 L 433.63 855 L 431.88 851.5 Z" fill="rgb(0, 0, 0)" stroke="rgb(0, 0, 0)" stroke-miterlimit="10" pointer-events="all"/></g></g><g data-cell-id="udTpt-ogcE15AfO5dpks-6"><g><path d="M 220 825 L 360 825 L 380 855 L 360 885 L 220 885 L 240 855 Z" fill="#fff2cc" stroke="#d6b656" stroke-width="2" stroke-miterlimit="10" pointer-events="all"/></g><g><g transform="translate(-0.5 -0.5)"><switch><foreignObject pointer-events="none" width="100%" height="100%" requiredFeatures="http://www.w3.org/TR/SVG11/feature#Extensibility" style="overflow: visible; text-align: left;"><div xmlns="http://www.w3.org/1999/xhtml" style="display: flex; align-items: unsafe center; justify-content: unsafe center; width: 158px; height: 1px; padding-top: 855px; margin-left: 221px;"><div data-drawio-colors="color: rgb(0, 0, 0); " style="box-sizing: border-box; font-size: 0px; text-align: center;"><div style="display: inline-block; font-size: 12px; font-family: Georgia; color: rgb(0, 0, 0); line-height: 1.2; pointer-events: all; white-space: normal; overflow-wrap: normal;">Incoming Inspection</div></div></div></foreignObject><text x="300" y="859" fill="rgb(0, 0, 0)" font-family="&quot;Georgia&quot;" font-size="12px" text-anchor="middle">Incoming Inspection</text></switch></g></g></g><g data-cell-id="ishWGL877BXy5JMq_WcK-4"><g><path d="M 580 855 L 633.63 855" fill="none" stroke="rgb(0, 0, 0)" stroke-miterlimit="10" pointer-events="stroke"/><path d="M 638.88 855 L 631.88 858.5 L 633.63 855 L 631.88 851.5 Z" fill="rgb(0, 0, 0)" stroke="rgb(0, 0, 0)" stroke-miterlimit="10" pointer-events="all"/></g></g><g data-cell-id="udTpt-ogcE15AfO5dpks-8"><g><path d="M 420 825 L 560 825 L 580 855 L 560 885 L 420 885 L 440 855 Z" fill="#d5e8d4" stroke="#82b366" stroke-width="2" stroke-miterlimit="10" pointer-events="all"/></g><g><g transform="translate(-0.5 -0.5)"><switch><foreignObject pointer-events="none" width="100%" height="100%" requiredFeatures="http://www.w3.org/TR/SVG11/feature#Extensibility" style="overflow: visible; text-align: left;"><div xmlns="http://www.w3.org/1999/xhtml" style="display: flex; align-items: unsafe center; justify-content: unsafe center; width: 158px; height: 1px; padding-top: 855px; margin-left: 421px;"><div data-drawio-colors="color: rgb(0, 0, 0); " style="box-sizing: border-box; font-size: 0px; text-align: center;"><div style="display: inline-block; font-size: 12px; font-family: Georgia; color: rgb(0, 0, 0); line-height: 1.2; pointer-events: all; white-space: normal; overflow-wrap: normal;">EMC<br />Tests</div></div></div></foreignObject><text x="500" y="859" fill="rgb(0, 0, 0)" font-family="&quot;Georgia&quot;" font-size="12px" text-anchor="middle">EMC...</text></switch></g></g></g><g data-cell-id="udTpt-ogcE15AfO5dpks-9"><g><rect x="10" y="0" width="810" height="50" fill="none" stroke="none" pointer-events="all"/></g><g><g transform="translate(-0.5 -0.5)"><switch><foreignObject pointer-events="none" width="100%" height="100%" requiredFeatures="http://www.w3.org/TR/SVG11/feature#Extensibility" style="overflow: visible; text-align: left;"><div xmlns="http://www.w3.org/1999/xhtml" style="display: flex; align-items: unsafe center; justify-content: unsafe center; width: 808px; height: 1px; padding-top: 25px; margin-left: 11px;"><div data-drawio-colors="color: rgb(0, 0, 0); " style="box-sizing: border-box; font-size: 0px; text-align: center;"><div style="display: inline-block; font-size: 12px; font-family: Georgia; color: rgb(0, 0, 0); line-height: 1.2; pointer-events: all; white-space: normal; overflow-wrap: normal;"><font color="#808080" style="font-size: 20px"><b>OBC/ADCS Board<br /></b>In-House (<b>DM</b>)<br /></font></div></div></div></foreignObject><text x="415" y="29" fill="rgb(0, 0, 0)" font-family="&quot;Georgia&quot;" font-size="12px" text-anchor="middle">OBC/ADCS Board...</text></switch></g></g></g><g data-cell-id="udTpt-ogcE15AfO5dpks-11"><g><rect x="20" y="1300" width="370" height="200" fill="none" stroke="rgb(0, 0, 0)" pointer-events="all"/></g><g><g transform="translate(-0.5 -0.5)"><switch><foreignObject pointer-events="none" width="100%" height="100%" requiredFeatures="http://www.w3.org/TR/SVG11/feature#Extensibility" style="overflow: visible; text-align: left;"><div xmlns="http://www.w3.org/1999/xhtml" style="display: flex; align-items: unsafe flex-start; justify-content: unsafe flex-start; width: 352px; height: 1px; padding-top: 1315px; margin-left: 30px;"><div data-drawio-colors="color: rgb(0, 0, 0); " style="box-sizing: border-box; font-size: 0px; text-align: left;"><div style="display: inline-block; font-size: 12px; font-family: Helvetica; color: rgb(0, 0, 0); line-height: 1.2; pointer-events: all; white-space: normal; overflow-wrap: normal;"><div style="font-size: 16px"><font face="Georgia" style="font-size: 16px"><span>Legend</span></font></div></div></div></div></foreignObject><text x="30" y="1327" fill="rgb(0, 0, 0)" font-family="&quot;Helvetica&quot;" font-size="12px">Legend</text></switch></g></g></g><g data-cell-id="udTpt-ogcE15AfO5dpks-12"><g><rect x="73.81" y="1335" width="54.76" height="30" rx="6" ry="6" fill="#f8cecc" stroke="#b85450" stroke-width="2" pointer-events="all"/></g></g><g data-cell-id="udTpt-ogcE15AfO5dpks-13"><g><rect x="150.48" y="1340" width="43.81" height="20" fill="none" stroke="none" pointer-events="all"/></g><g><g transform="translate(-0.5 -0.5)"><switch><foreignObject pointer-events="none" width="100%" height="100%" requiredFeatures="http://www.w3.org/TR/SVG11/feature#Extensibility" style="overflow: visible; text-align: left;"><div xmlns="http://www.w3.org/1999/xhtml" style="display: flex; align-items: unsafe center; justify-content: unsafe flex-start; width: 42px; height: 1px; padding-top: 1350px; margin-left: 152px;"><div data-drawio-colors="color: rgb(0, 0, 0); " style="box-sizing: border-box; font-size: 0px; text-align: left;"><div style="display: inline-block; font-size: 12px; font-family: Georgia; color: rgb(0, 0, 0); line-height: 1.2; pointer-events: all; white-space: normal; overflow-wrap: normal;"><div align="left">Model</div></div></div></div></foreignObject><text x="152" y="1354" fill="rgb(0, 0, 0)" font-family="&quot;Georgia&quot;" font-size="12px">Model</text></switch></g></g></g><g data-cell-id="udTpt-ogcE15AfO5dpks-14"><g><rect x="73.81" y="1375" width="54.76" height="30" rx="15" ry="15" fill="#dae8fc" stroke="#6c8ebf" stroke-width="2" pointer-events="all"/></g></g><g data-cell-id="udTpt-ogcE15AfO5dpks-15"><g><rect x="150.48" y="1380" width="76.67" height="20" fill="none" stroke="none" pointer-events="all"/></g><g><g transform="translate(-0.5 -0.5)"><switch><foreignObject pointer-events="none" width="100%" height="100%" requiredFeatures="http://www.w3.org/TR/SVG11/feature#Extensibility" style="overflow: visible; text-align: left;"><div xmlns="http://www.w3.org/1999/xhtml" style="display: flex; align-items: unsafe center; justify-content: unsafe flex-start; width: 75px; height: 1px; padding-top: 1390px; margin-left: 152px;"><div data-drawio-colors="color: rgb(0, 0, 0); " style="box-sizing: border-box; font-size: 0px; text-align: left;"><div style="display: inline-block; font-size: 12px; font-family: Georgia; color: rgb(0, 0, 0); line-height: 1.2; pointer-events: all; white-space: normal; overflow-wrap: normal;">Integration with system</div></div></div></foreignObject><text x="152" y="1394" fill="rgb(0, 0, 0)" font-family="&quot;Georgia&quot;" font-size="12px">Integration w...</text></switch></g></g></g><g data-cell-id="udTpt-ogcE15AfO5dpks-16"><g><path d="M 73.81 1415 L 108.57 1415 L 128.57 1430 L 108.57 1445 L 73.81 1445 L 93.81 1430 Z" fill="#d5e8d4" stroke="#82b366" stroke-width="2" stroke-miterlimit="10" pointer-events="all"/></g></g><g data-cell-id="udTpt-ogcE15AfO5dpks-17"><g><rect x="150.48" y="1420" width="76.67" height="20" fill="none" stroke="none" pointer-events="all"/></g><g><g transform="translate(-0.5 -0.5)"><switch><foreignObject pointer-events="none" width="100%" height="100%" requiredFeatures="http://www.w3.org/TR/SVG11/feature#Extensibility" style="overflow: visible; text-align: left;"><div xmlns="http://www.w3.org/1999/xhtml" style="display: flex; align-items: unsafe center; justify-content: unsafe flex-start; width: 75px; height: 1px; padding-top: 1430px; margin-left: 152px;"><div data-drawio-colors="color: rgb(0, 0, 0); " style="box-sizing: border-box; font-size: 0px; text-align: left;"><div style="display: inline-block; font-size: 12px; font-family: Georgia; color: rgb(0, 0, 0); line-height: 1.2; pointer-events: all; white-space: normal; overflow-wrap: normal;">Testing Activity</div></div></div></foreignObject><text x="152" y="1434" fill="rgb(0, 0, 0)" font-family="&quot;Georgia&quot;" font-size="12px">Testing Activ...</text></switch></g></g></g><g data-cell-id="udTpt-ogcE15AfO5dpks-18"><g><path d="M 73.81 1455 L 108.57 1455 L 128.57 1470 L 108.57 1485 L 73.81 1485 L 93.81 1470 Z" fill="#fff2cc" stroke="#d6b656" stroke-width="2" stroke-miterlimit="10" pointer-events="all"/></g></g><g data-cell-id="udTpt-ogcE15AfO5dpks-19"><g><rect x="150.48" y="1460" width="76.67" height="20" fill="none" stroke="none" pointer-events="all"/></g><g><g transform="translate(-0.5 -0.5)"><switch><foreignObject pointer-events="none" width="100%" height="100%" requiredFeatures="http://www.w3.org/TR/SVG11/feature#Extensibility" style="overflow: visible; text-align: left;"><div xmlns="http://www.w3.org/1999/xhtml" style="display: flex; align-items: unsafe center; justify-content: unsafe flex-start; width: 75px; height: 1px; padding-top: 1470px; margin-left: 152px;"><div data-drawio-colors="color: rgb(0, 0, 0); " style="box-sizing: border-box; font-size: 0px; text-align: left;"><div style="display: inline-block; font-size: 12px; font-family: Georgia; color: rgb(0, 0, 0); line-height: 1.2; pointer-events: all; white-space: normal; overflow-wrap: normal;"><div>Inspection</div><div>Activity<br /></div></div></div></div></foreignObject><text x="152" y="1474" fill="rgb(0, 0, 0)" font-family="&quot;Georgia&quot;" font-size="12px">Inspection...</text></switch></g></g></g><g data-cell-id="udTpt-ogcE15AfO5dpks-20"><g><rect x="250" y="1360" width="40" height="20" fill="none" stroke="none" pointer-events="all"/></g><g><g transform="translate(-0.5 -0.5)"><switch><foreignObject pointer-events="none" width="100%" height="100%" requiredFeatures="http://www.w3.org/TR/SVG11/feature#Extensibility" style="overflow: visible; text-align: left;"><div xmlns="http://www.w3.org/1999/xhtml" style="display: flex; align-items: unsafe center; justify-content: unsafe flex-end; width: 38px; height: 1px; padding-top: 1370px; margin-left: 250px;"><div data-drawio-colors="color: rgb(0, 0, 0); " style="box-sizing: border-box; font-size: 0px; text-align: right;"><div style="display: inline-block; font-size: 12px; font-family: Georgia; color: rgb(0, 0, 0); line-height: 1.2; pointer-events: all; white-space: normal; overflow-wrap: normal;"><b>EQM:</b> </div></div></div></foreignObject><text x="288" y="1374" fill="rgb(0, 0, 0)" font-family="&quot;Georgia&quot;" font-size="12px" text-anchor="end">EQM: </text></switch></g></g></g><g data-cell-id="udTpt-ogcE15AfO5dpks-21"><g><rect x="250" y="1440" width="40" height="20" fill="none" stroke="none" pointer-events="all"/></g><g><g transform="translate(-0.5 -0.5)"><switch><foreignObject pointer-events="none" width="100%" height="100%" requiredFeatures="http://www.w3.org/TR/SVG11/feature#Extensibility" style="overflow: visible; text-align: left;"><div xmlns="http://www.w3.org/1999/xhtml" style="display: flex; align-items: unsafe center; justify-content: unsafe flex-end; width: 38px; height: 1px; padding-top: 1450px; margin-left: 250px;"><div data-drawio-colors="color: rgb(0, 0, 0); " style="box-sizing: border-box; font-size: 0px; text-align: right;"><div style="display: inline-block; font-size: 12px; font-family: Georgia; color: rgb(0, 0, 0); line-height: 1.2; pointer-events: all; white-space: normal; overflow-wrap: normal;"><b>PFM:</b></div></div></div></foreignObject><text x="288" y="1454" fill="rgb(0, 0, 0)" font-family="&quot;Georgia&quot;" font-size="12px" text-anchor="end">PFM:</text></switch></g></g></g><g data-cell-id="udTpt-ogcE15AfO5dpks-22"><g><rect x="300" y="1365" width="70" height="20" fill="none" stroke="none" pointer-events="all"/></g><g><g transform="translate(-0.5 -0.5)"><switch><foreignObject pointer-events="none" width="100%" height="100%" requiredFeatures="http://www.w3.org/TR/SVG11/feature#Extensibility" style="overflow: visible; text-align: left;"><div xmlns="http://www.w3.org/1999/xhtml" style="display: flex; align-items: unsafe center; justify-content: unsafe flex-start; width: 68px; height: 1px; padding-top: 1375px; margin-left: 302px;"><div data-drawio-colors="color: rgb(0, 0, 0); " style="box-sizing: border-box; font-size: 0px; text-align: left;"><div style="display: inline-block; font-size: 12px; font-family: Georgia; color: rgb(0, 0, 0); line-height: 1.2; pointer-events: all; white-space: normal; overflow-wrap: normal;">Engineering Qualification Model</div></div></div></foreignObject><text x="302" y="1379" fill="rgb(0, 0, 0)" font-family="&quot;Georgia&quot;" font-size="12px">Engineering...</text></switch></g></g></g><g data-cell-id="udTpt-ogcE15AfO5dpks-23"><g><rect x="300" y="1445" width="70" height="20" fill="none" stroke="none" pointer-events="all"/></g><g><g transform="translate(-0.5 -0.5)"><switch><foreignObject pointer-events="none" width="100%" height="100%" requiredFeatures="http://www.w3.org/TR/SVG11/feature#Extensibility" style="overflow: visible; text-align: left;"><div xmlns="http://www.w3.org/1999/xhtml" style="display: flex; align-items: unsafe center; justify-content: unsafe flex-start; width: 68px; height: 1px; padding-top: 1455px; margin-left: 302px;"><div data-drawio-colors="color: rgb(0, 0, 0); " style="box-sizing: border-box; font-size: 0px; text-align: left;"><div style="display: inline-block; font-size: 12px; font-family: Georgia; color: rgb(0, 0, 0); line-height: 1.2; pointer-events: all; white-space: normal; overflow-wrap: normal;">Protoflight Model</div></div></div></foreignObject><text x="302" y="1459" fill="rgb(0, 0, 0)" font-family="&quot;Georgia&quot;" font-size="12px">Protoflight...</text></switch></g></g></g><g data-cell-id="udTpt-ogcE15AfO5dpks-24"><g><rect x="625" y="935" width="160" height="60" rx="30" ry="30" fill="#dae8fc" stroke="#6c8ebf" stroke-width="2" pointer-events="all"/></g><g><g transform="translate(-0.5 -0.5)"><switch><foreignObject pointer-events="none" width="100%" height="100%" requiredFeatures="http://www.w3.org/TR/SVG11/feature#Extensibility" style="overflow: visible; text-align: left;"><div xmlns="http://www.w3.org/1999/xhtml" style="display: flex; align-items: unsafe center; justify-content: unsafe center; width: 158px; height: 1px; padding-top: 965px; margin-left: 626px;"><div data-drawio-colors="color: rgb(0, 0, 0); " style="box-sizing: border-box; font-size: 0px; text-align: center;"><div style="display: inline-block; font-size: 12px; font-family: Georgia; color: rgb(0, 0, 0); line-height: 1.2; pointer-events: all; white-space: normal; overflow-wrap: normal;">Integration with<br /><b>system flatsat<br /></b></div></div></div></foreignObject><text x="705" y="969" fill="rgb(0, 0, 0)" font-family="&quot;Georgia&quot;" font-size="12px" text-anchor="middle">Integration with...</text></switch></g></g></g><g data-cell-id="fnzB5w1usJaGF9YamlUQ-12"><g><path d="M 170 1150 L 233.63 1150" fill="none" stroke="rgb(0, 0, 0)" stroke-miterlimit="10" pointer-events="stroke"/><path d="M 238.88 1150 L 231.88 1153.5 L 233.63 1150 L 231.88 1146.5 Z" fill="rgb(0, 0, 0)" stroke="rgb(0, 0, 0)" stroke-miterlimit="10" pointer-events="all"/></g></g><g data-cell-id="udTpt-ogcE15AfO5dpks-30"><g><rect x="10" y="1120" width="160" height="60" rx="12" ry="12" fill="#f8cecc" stroke="#b85450" stroke-width="2" pointer-events="all"/></g><g><g transform="translate(-0.5 -0.5)"><switch><foreignObject pointer-events="none" width="100%" height="100%" requiredFeatures="http://www.w3.org/TR/SVG11/feature#Extensibility" style="overflow: visible; text-align: left;"><div xmlns="http://www.w3.org/1999/xhtml" style="display: flex; align-items: unsafe center; justify-content: unsafe center; width: 158px; height: 1px; padding-top: 1150px; margin-left: 11px;"><div data-drawio-colors="color: rgb(0, 0, 0); " style="box-sizing: border-box; font-size: 0px; text-align: center;"><div style="display: inline-block; font-size: 12px; font-family: Georgia; color: rgb(0, 0, 0); line-height: 1.2; pointer-events: all; white-space: normal; overflow-wrap: normal;"><div><span>OBC/ADCS Board</span></div><div><b>FM </b>procurement<br /></div></div></div></div></foreignObject><text x="90" y="1154" fill="rgb(0, 0, 0)" font-family="&quot;Georgia&quot;" font-size="12px" text-anchor="middle">OBC/ADCS Board...</text></switch></g></g></g><g data-cell-id="fnzB5w1usJaGF9YamlUQ-6"><g><path d="M 180 100 L 233.63 100" fill="none" stroke="rgb(0, 0, 0)" stroke-miterlimit="10" pointer-events="stroke"/><path d="M 238.88 100 L 231.88 103.5 L 233.63 100 L 231.88 96.5 Z" fill="rgb(0, 0, 0)" stroke="rgb(0, 0, 0)" stroke-miterlimit="10" pointer-events="all"/></g></g><g data-cell-id="fnzB5w1usJaGF9YamlUQ-3"><g><rect x="20" y="70" width="160" height="60" rx="12" ry="12" fill="#f8cecc" stroke="#b85450" stroke-width="2" pointer-events="all"/></g><g><g transform="translate(-0.5 -0.5)"><switch><foreignObject pointer-events="none" width="100%" height="100%" requiredFeatures="http://www.w3.org/TR/SVG11/feature#Extensibility" style="overflow: visible; text-align: left;"><div xmlns="http://www.w3.org/1999/xhtml" style="display: flex; align-items: unsafe center; justify-content: unsafe center; width: 158px; height: 1px; padding-top: 100px; margin-left: 21px;"><div data-drawio-colors="color: rgb(0, 0, 0); " style="box-sizing: border-box; font-size: 0px; text-align: center;"><div style="display: inline-block; font-size: 12px; font-family: Georgia; color: rgb(0, 0, 0); line-height: 1.2; pointer-events: all; white-space: normal; overflow-wrap: normal;"><div><span>OBC/ADCS Board <br /></span></div><div><b>DM </b>procurement<br /></div></div></div></div></foreignObject><text x="100" y="104" fill="rgb(0, 0, 0)" font-family="&quot;Georgia&quot;" font-size="12px" text-anchor="middle">OBC/ADCS Board...</text></switch></g></g></g><g data-cell-id="fnzB5w1usJaGF9YamlUQ-7"><g><path d="M 380 100 L 433.63 100" fill="none" stroke="rgb(0, 0, 0)" stroke-miterlimit="10" pointer-events="stroke"/><path d="M 438.88 100 L 431.88 103.5 L 433.63 100 L 431.88 96.5 Z" fill="rgb(0, 0, 0)" stroke="rgb(0, 0, 0)" stroke-miterlimit="10" pointer-events="all"/></g></g><g data-cell-id="fnzB5w1usJaGF9YamlUQ-4"><g><path d="M 220 70 L 360 70 L 380 100 L 360 130 L 220 130 L 240 100 Z" fill="#fff2cc" stroke="#d6b656" stroke-width="2" stroke-miterlimit="10" pointer-events="all"/></g><g><g transform="translate(-0.5 -0.5)"><switch><foreignObject pointer-events="none" width="100%" height="100%" requiredFeatures="http://www.w3.org/TR/SVG11/feature#Extensibility" style="overflow: visible; text-align: left;"><div xmlns="http://www.w3.org/1999/xhtml" style="display: flex; align-items: unsafe center; justify-content: unsafe center; width: 158px; height: 1px; padding-top: 100px; margin-left: 221px;"><div data-drawio-colors="color: rgb(0, 0, 0); " style="box-sizing: border-box; font-size: 0px; text-align: center;"><div style="display: inline-block; font-size: 12px; font-family: Georgia; color: rgb(0, 0, 0); line-height: 1.2; pointer-events: all; white-space: normal; overflow-wrap: normal;">Incoming Inspection</div></div></div></foreignObject><text x="300" y="104" fill="rgb(0, 0, 0)" font-family="&quot;Georgia&quot;" font-size="12px" text-anchor="middle">Incoming Inspection</text></switch></g></g></g><g data-cell-id="fnzB5w1usJaGF9YamlUQ-5"><g><path d="M 420 70 L 560 70 L 580 100 L 560 130 L 420 130 L 440 100 Z" fill="#d5e8d4" stroke="#82b366" stroke-width="2" stroke-miterlimit="10" pointer-events="all"/></g><g><g transform="translate(-0.5 -0.5)"><switch><foreignObject pointer-events="none" width="100%" height="100%" requiredFeatures="http://www.w3.org/TR/SVG11/feature#Extensibility" style="overflow: visible; text-align: left;"><div xmlns="http://www.w3.org/1999/xhtml" style="display: flex; align-items: unsafe center; justify-content: unsafe center; width: 158px; height: 1px; padding-top: 100px; margin-left: 421px;"><div data-drawio-colors="color: rgb(0, 0, 0); " style="box-sizing: border-box; font-size: 0px; text-align: center;"><div style="display: inline-block; font-size: 12px; font-family: Georgia; color: rgb(0, 0, 0); line-height: 1.2; pointer-events: all; white-space: normal; overflow-wrap: normal;">Functionality testing</div></div></div></foreignObject><text x="500" y="104" fill="rgb(0, 0, 0)" font-family="&quot;Georgia&quot;" font-size="12px" text-anchor="middle">Functionality testing</text></switch></g></g></g><g data-cell-id="fnzB5w1usJaGF9YamlUQ-13"><g><path d="M 380 1150 L 410 1150 L 433.63 1150" fill="none" stroke="rgb(0, 0, 0)" stroke-miterlimit="10" pointer-events="stroke"/><path d="M 438.88 1150 L 431.88 1153.5 L 433.63 1150 L 431.88 1146.5 Z" fill="rgb(0, 0, 0)" stroke="rgb(0, 0, 0)" stroke-miterlimit="10" pointer-events="all"/></g></g><g data-cell-id="fnzB5w1usJaGF9YamlUQ-9"><g><path d="M 220 1120 L 360 1120 L 380 1150 L 360 1180 L 220 1180 L 240 1150 Z" fill="#fff2cc" stroke="#d6b656" stroke-width="2" stroke-miterlimit="10" pointer-events="all"/></g><g><g transform="translate(-0.5 -0.5)"><switch><foreignObject pointer-events="none" width="100%" height="100%" requiredFeatures="http://www.w3.org/TR/SVG11/feature#Extensibility" style="overflow: visible; text-align: left;"><div xmlns="http://www.w3.org/1999/xhtml" style="display: flex; align-items: unsafe center; justify-content: unsafe center; width: 158px; height: 1px; padding-top: 1150px; margin-left: 221px;"><div data-drawio-colors="color: rgb(0, 0, 0); " style="box-sizing: border-box; font-size: 0px; text-align: center;"><div style="display: inline-block; font-size: 12px; font-family: Georgia; color: rgb(0, 0, 0); line-height: 1.2; pointer-events: all; white-space: normal; overflow-wrap: normal;">Incoming Inspection</div></div></div></foreignObject><text x="300" y="1154" fill="rgb(0, 0, 0)" font-family="&quot;Georgia&quot;" font-size="12px" text-anchor="middle">Incoming Inspection</text></switch></g></g></g><g data-cell-id="IohnI3tezs_w-SwA3S8z-7"><g><path d="M 780 1150 L 800 1150 L 800 1205 L 710 1205 L 710 1223.63" fill="none" stroke="rgb(0, 0, 0)" stroke-miterlimit="10" pointer-events="stroke"/><path d="M 710 1228.88 L 706.5 1221.88 L 710 1223.63 L 713.5 1221.88 Z" fill="rgb(0, 0, 0)" stroke="rgb(0, 0, 0)" stroke-miterlimit="10" pointer-events="all"/></g></g><g data-cell-id="fnzB5w1usJaGF9YamlUQ-27"><g><rect x="620" y="1120" width="160" height="60" rx="30" ry="30" fill="#dae8fc" stroke="#6c8ebf" stroke-width="2" pointer-events="all"/></g><g><g transform="translate(-0.5 -0.5)"><switch><foreignObject pointer-events="none" width="100%" height="100%" requiredFeatures="http://www.w3.org/TR/SVG11/feature#Extensibility" style="overflow: visible; text-align: left;"><div xmlns="http://www.w3.org/1999/xhtml" style="display: flex; align-items: unsafe center; justify-content: unsafe center; width: 158px; height: 1px; padding-top: 1150px; margin-left: 621px;"><div data-drawio-colors="color: rgb(0, 0, 0); " style="box-sizing: border-box; font-size: 0px; text-align: center;"><div style="display: inline-block; font-size: 12px; font-family: Georgia; color: rgb(0, 0, 0); line-height: 1.2; pointer-events: all; white-space: normal; overflow-wrap: normal;">Integration with<br /><b>system flatsat</b></div></div></div></foreignObject><text x="700" y="1154" fill="rgb(0, 0, 0)" font-family="&quot;Georgia&quot;" font-size="12px" text-anchor="middle">Integration with...</text></switch></g></g></g><g data-cell-id="fnzB5w1usJaGF9YamlUQ-29"><g><rect x="620" y="1230" width="160" height="60" rx="30" ry="30" fill="#dae8fc" stroke="#6c8ebf" stroke-width="2" pointer-events="all"/></g><g><g transform="translate(-0.5 -0.5)"><switch><foreignObject pointer-events="none" width="100%" height="100%" requiredFeatures="http://www.w3.org/TR/SVG11/feature#Extensibility" style="overflow: visible; text-align: left;"><div xmlns="http://www.w3.org/1999/xhtml" style="display: flex; align-items: unsafe center; justify-content: unsafe center; width: 158px; height: 1px; padding-top: 1260px; margin-left: 621px;"><div data-drawio-colors="color: rgb(0, 0, 0); " style="box-sizing: border-box; font-size: 0px; text-align: center;"><div style="display: inline-block; font-size: 12px; font-family: Georgia; color: rgb(0, 0, 0); line-height: 1.2; pointer-events: all; white-space: normal; overflow-wrap: normal;">Integration with<br /><b>PFM spacecraft<br /></b></div></div></div></foreignObject><text x="700" y="1264" fill="rgb(0, 0, 0)" font-family="&quot;Georgia&quot;" font-size="12px" text-anchor="middle">Integration with...</text></switch></g></g></g><g data-cell-id="_AOai00gr-lhleaZuruR-2"><g><path d="M 180 965 L 233.63 965" fill="none" stroke="rgb(0, 0, 0)" stroke-miterlimit="10" pointer-events="stroke"/><path d="M 238.88 965 L 231.88 968.5 L 233.63 965 L 231.88 961.5 Z" fill="rgb(0, 0, 0)" stroke="rgb(0, 0, 0)" stroke-miterlimit="10" pointer-events="all"/></g></g><g data-cell-id="IohnI3tezs_w-SwA3S8z-1"><g><path d="M 20 935 L 160 935 L 180 965 L 160 995 L 20 995 L 40 965 Z" fill="#d5e8d4" stroke="#82b366" stroke-width="2" stroke-miterlimit="10" pointer-events="all"/></g><g><g transform="translate(-0.5 -0.5)"><switch><foreignObject pointer-events="none" width="100%" height="100%" requiredFeatures="http://www.w3.org/TR/SVG11/feature#Extensibility" style="overflow: visible; text-align: left;"><div xmlns="http://www.w3.org/1999/xhtml" style="display: flex; align-items: unsafe center; justify-content: unsafe center; width: 158px; height: 1px; padding-top: 965px; margin-left: 21px;"><div data-drawio-colors="color: rgb(0, 0, 0); " style="box-sizing: border-box; font-size: 0px; text-align: center;"><div style="display: inline-block; font-size: 12px; font-family: Georgia; color: rgb(0, 0, 0); line-height: 1.2; pointer-events: all; white-space: normal; overflow-wrap: normal;">Vibration Tests</div></div></div></foreignObject><text x="100" y="969" fill="rgb(0, 0, 0)" font-family="&quot;Georgia&quot;" font-size="12px" text-anchor="middle">Vibration Tests</text></switch></g></g></g><g data-cell-id="IohnI3tezs_w-SwA3S8z-6"><g><path d="M 580 965 L 618.63 965" fill="none" stroke="rgb(0, 0, 0)" stroke-miterlimit="10" pointer-events="stroke"/><path d="M 623.88 965 L 616.88 968.5 L 618.63 965 L 616.88 961.5 Z" fill="rgb(0, 0, 0)" stroke="rgb(0, 0, 0)" stroke-miterlimit="10" pointer-events="all"/></g></g><g data-cell-id="IohnI3tezs_w-SwA3S8z-2"><g><path d="M 420 935 L 560 935 L 580 965 L 560 995 L 420 995 L 440 965 Z" fill="#d5e8d4" stroke="#82b366" stroke-width="2" stroke-miterlimit="10" pointer-events="all"/></g><g><g transform="translate(-0.5 -0.5)"><switch><foreignObject pointer-events="none" width="100%" height="100%" requiredFeatures="http://www.w3.org/TR/SVG11/feature#Extensibility" style="overflow: visible; text-align: left;"><div xmlns="http://www.w3.org/1999/xhtml" style="display: flex; align-items: unsafe center; justify-content: unsafe center; width: 158px; height: 1px; padding-top: 965px; margin-left: 421px;"><div data-drawio-colors="color: rgb(0, 0, 0); " style="box-sizing: border-box; font-size: 0px; text-align: center;"><div style="display: inline-block; font-size: 12px; font-family: Georgia; color: rgb(0, 0, 0); line-height: 1.2; pointer-events: all; white-space: normal; overflow-wrap: normal;">TVAC Tests</div></div></div></foreignObject><text x="500" y="969" fill="rgb(0, 0, 0)" font-family="&quot;Georgia&quot;" font-size="12px" text-anchor="middle">TVAC Tests</text></switch></g></g></g><g data-cell-id="8XXDTQQdH0CVGJyUccaw-2"><g><rect x="250" y="1405" width="40" height="20" fill="none" stroke="none" pointer-events="all"/></g><g><g transform="translate(-0.5 -0.5)"><switch><foreignObject pointer-events="none" width="100%" height="100%" requiredFeatures="http://www.w3.org/TR/SVG11/feature#Extensibility" style="overflow: visible; text-align: left;"><div xmlns="http://www.w3.org/1999/xhtml" style="display: flex; align-items: unsafe center; justify-content: unsafe flex-end; width: 38px; height: 1px; padding-top: 1415px; margin-left: 250px;"><div data-drawio-colors="color: rgb(0, 0, 0); " style="box-sizing: border-box; font-size: 0px; text-align: right;"><div style="display: inline-block; font-size: 12px; font-family: Georgia; color: rgb(0, 0, 0); line-height: 1.2; pointer-events: all; white-space: normal; overflow-wrap: normal;"><b>FM:</b></div></div></div></foreignObject><text x="288" y="1419" fill="rgb(0, 0, 0)" font-family="&quot;Georgia&quot;" font-size="12px" text-anchor="end">FM:</text></switch></g></g></g><g data-cell-id="8XXDTQQdH0CVGJyUccaw-3"><g><rect x="300" y="1410" width="70" height="20" fill="none" stroke="none" pointer-events="all"/></g><g><g transform="translate(-0.5 -0.5)"><switch><foreignObject pointer-events="none" width="100%" height="100%" requiredFeatures="http://www.w3.org/TR/SVG11/feature#Extensibility" style="overflow: visible; text-align: left;"><div xmlns="http://www.w3.org/1999/xhtml" style="display: flex; align-items: unsafe center; justify-content: unsafe flex-start; width: 68px; height: 1px; padding-top: 1420px; margin-left: 302px;"><div data-drawio-colors="color: rgb(0, 0, 0); " style="box-sizing: border-box; font-size: 0px; text-align: left;"><div style="display: inline-block; font-size: 12px; font-family: Georgia; color: rgb(0, 0, 0); line-height: 1.2; pointer-events: all; white-space: normal; overflow-wrap: normal;">Flight Model</div></div></div></foreignObject><text x="302" y="1424" fill="rgb(0, 0, 0)" font-family="&quot;Georgia&quot;" font-size="12px">Flight Model</text></switch></g></g></g><g data-cell-id="ishWGL877BXy5JMq_WcK-5"><g><path d="M 780 855 L 800 855 L 800 910 L 100 910 L 100 928.63" fill="none" stroke="rgb(0, 0, 0)" stroke-miterlimit="10" pointer-events="stroke"/><path d="M 100 933.88 L 96.5 926.88 L 100 928.63 L 103.5 926.88 Z" fill="rgb(0, 0, 0)" stroke="rgb(0, 0, 0)" stroke-miterlimit="10" pointer-events="all"/></g></g><g data-cell-id="ishWGL877BXy5JMq_WcK-3"><g><path d="M 620 825 L 760 825 L 780 855 L 760 885 L 620 885 L 640 855 Z" fill="#d5e8d4" stroke="#82b366" stroke-width="2" stroke-miterlimit="10" pointer-events="all"/></g><g><g transform="translate(-0.5 -0.5)"><switch><foreignObject pointer-events="none" width="100%" height="100%" requiredFeatures="http://www.w3.org/TR/SVG11/feature#Extensibility" style="overflow: visible; text-align: left;"><div xmlns="http://www.w3.org/1999/xhtml" style="display: flex; align-items: unsafe center; justify-content: unsafe center; width: 158px; height: 1px; padding-top: 855px; margin-left: 621px;"><div data-drawio-colors="color: rgb(0, 0, 0); " style="box-sizing: border-box; font-size: 0px; text-align: center;"><div style="display: inline-block; font-size: 12px; font-family: Georgia; color: rgb(0, 0, 0); line-height: 1.2; pointer-events: all; white-space: normal; overflow-wrap: normal;">Ambient Functional<br />Tests</div></div></div></foreignObject><text x="700" y="859" fill="rgb(0, 0, 0)" font-family="&quot;Georgia&quot;" font-size="12px" text-anchor="middle">Ambient Functional...</text></switch></g></g></g><g data-cell-id="ishWGL877BXy5JMq_WcK-11"><g><path d="M 580 1150 L 613.63 1150" fill="none" stroke="rgb(0, 0, 0)" stroke-miterlimit="10" pointer-events="stroke"/><path d="M 618.88 1150 L 611.88 1153.5 L 613.63 1150 L 611.88 1146.5 Z" fill="rgb(0, 0, 0)" stroke="rgb(0, 0, 0)" stroke-miterlimit="10" pointer-events="all"/></g></g><g data-cell-id="ishWGL877BXy5JMq_WcK-6"><g><path d="M 420 1120 L 560 1120 L 580 1150 L 560 1180 L 420 1180 L 440 1150 Z" fill="#d5e8d4" stroke="#82b366" stroke-width="2" stroke-miterlimit="10" pointer-events="all"/></g><g><g transform="translate(-0.5 -0.5)"><switch><foreignObject pointer-events="none" width="100%" height="100%" requiredFeatures="http://www.w3.org/TR/SVG11/feature#Extensibility" style="overflow: visible; text-align: left;"><div xmlns="http://www.w3.org/1999/xhtml" style="display: flex; align-items: unsafe center; justify-content: unsafe center; width: 158px; height: 1px; padding-top: 1150px; margin-left: 421px;"><div data-drawio-colors="color: rgb(0, 0, 0); " style="box-sizing: border-box; font-size: 0px; text-align: center;"><div style="display: inline-block; font-size: 12px; font-family: Georgia; color: rgb(0, 0, 0); line-height: 1.2; pointer-events: all; white-space: normal; overflow-wrap: normal;">Ambient Functional<br />Tests</div></div></div></foreignObject><text x="500" y="1154" fill="rgb(0, 0, 0)" font-family="&quot;Georgia&quot;" font-size="12px" text-anchor="middle">Ambient Functional...</text></switch></g></g></g><g data-cell-id="ishWGL877BXy5JMq_WcK-9"><g><rect x="0" y="740" width="810" height="50" fill="none" stroke="none" pointer-events="all"/></g><g><g transform="translate(-0.5 -0.5)"><switch><foreignObject pointer-events="none" width="100%" height="100%" requiredFeatures="http://www.w3.org/TR/SVG11/feature#Extensibility" style="overflow: visible; text-align: left;"><div xmlns="http://www.w3.org/1999/xhtml" style="display: flex; align-items: unsafe center; justify-content: unsafe center; width: 808px; height: 1px; padding-top: 765px; margin-left: 1px;"><div data-drawio-colors="color: rgb(0, 0, 0); " style="box-sizing: border-box; font-size: 0px; text-align: center;"><div style="display: inline-block; font-size: 12px; font-family: Georgia; color: rgb(0, 0, 0); line-height: 1.2; pointer-events: all; white-space: normal; overflow-wrap: normal;"><font color="#808080" style="font-size: 20px"><b>OBC/ADCS Board<br /></b>In-House (<b>EQM</b>)<br /></font></div></div></div></foreignObject><text x="405" y="769" fill="rgb(0, 0, 0)" font-family="&quot;Georgia&quot;" font-size="12px" text-anchor="middle">OBC/ADCS Board...</text></switch></g></g></g><g data-cell-id="ishWGL877BXy5JMq_WcK-10"><g><rect x="0" y="1040" width="810" height="50" fill="none" stroke="none" pointer-events="all"/></g><g><g transform="translate(-0.5 -0.5)"><switch><foreignObject pointer-events="none" width="100%" height="100%" requiredFeatures="http://www.w3.org/TR/SVG11/feature#Extensibility" style="overflow: visible; text-align: left;"><div xmlns="http://www.w3.org/1999/xhtml" style="display: flex; align-items: unsafe center; justify-content: unsafe center; width: 808px; height: 1px; padding-top: 1065px; margin-left: 1px;"><div data-drawio-colors="color: rgb(0, 0, 0); " style="box-sizing: border-box; font-size: 0px; text-align: center;"><div style="display: inline-block; font-size: 12px; font-family: Georgia; color: rgb(0, 0, 0); line-height: 1.2; pointer-events: all; white-space: normal; overflow-wrap: normal;"><font color="#808080" style="font-size: 20px"><b>OBC/ADCS Board<br /></b>In-House (<b>FM</b>)<br /></font></div></div></div></foreignObject><text x="405" y="1069" fill="rgb(0, 0, 0)" font-family="&quot;Georgia&quot;" font-size="12px" text-anchor="middle">OBC/ADCS Board...</text></switch></g></g></g><g data-cell-id="_AOai00gr-lhleaZuruR-3"><g><path d="M 380 965 L 433.63 965" fill="none" stroke="rgb(0, 0, 0)" stroke-miterlimit="10" pointer-events="stroke"/><path d="M 438.88 965 L 431.88 968.5 L 433.63 965 L 431.88 961.5 Z" fill="rgb(0, 0, 0)" stroke="rgb(0, 0, 0)" stroke-miterlimit="10" pointer-events="all"/></g></g><g data-cell-id="_AOai00gr-lhleaZuruR-1"><g><path d="M 220 935 L 360 935 L 380 965 L 360 995 L 220 995 L 240 965 Z" fill="#d5e8d4" stroke="#82b366" stroke-width="2" stroke-miterlimit="10" pointer-events="all"/></g><g><g transform="translate(-0.5 -0.5)"><switch><foreignObject pointer-events="none" width="100%" height="100%" requiredFeatures="http://www.w3.org/TR/SVG11/feature#Extensibility" style="overflow: visible; text-align: left;"><div xmlns="http://www.w3.org/1999/xhtml" style="display: flex; align-items: unsafe center; justify-content: unsafe center; width: 158px; height: 1px; padding-top: 965px; margin-left: 221px;"><div data-drawio-colors="color: rgb(0, 0, 0); " style="box-sizing: border-box; font-size: 0px; text-align: center;"><div style="display: inline-block; font-size: 12px; font-family: Georgia; color: rgb(0, 0, 0); line-height: 1.2; pointer-events: all; white-space: normal; overflow-wrap: normal;">Shock Test</div></div></div></foreignObject><text x="300" y="969" fill="rgb(0, 0, 0)" font-family="&quot;Georgia&quot;" font-size="12px" text-anchor="middle">Shock Test</text></switch></g></g></g><g data-cell-id="ocxMV6QQNHyHgt8OVnz1-2"><g><path d="M 180 290 L 233.63 290" fill="none" stroke="rgb(0, 0, 0)" stroke-miterlimit="10" pointer-events="stroke"/><path d="M 238.88 290 L 231.88 293.5 L 233.63 290 L 231.88 286.5 Z" fill="rgb(0, 0, 0)" stroke="rgb(0, 0, 0)" stroke-miterlimit="10" pointer-events="all"/></g></g><g data-cell-id="ocxMV6QQNHyHgt8OVnz1-3"><g><rect x="20" y="260" width="160" height="60" rx="12" ry="12" fill="#f8cecc" stroke="#b85450" stroke-width="2" pointer-events="all"/></g><g><g transform="translate(-0.5 -0.5)"><switch><foreignObject pointer-events="none" width="100%" height="100%" requiredFeatures="http://www.w3.org/TR/SVG11/feature#Extensibility" style="overflow: visible; text-align: left;"><div xmlns="http://www.w3.org/1999/xhtml" style="display: flex; align-items: unsafe center; justify-content: unsafe center; width: 158px; height: 1px; padding-top: 290px; margin-left: 21px;"><div data-drawio-colors="color: rgb(0, 0, 0); " style="box-sizing: border-box; font-size: 0px; text-align: center;"><div style="display: inline-block; font-size: 12px; font-family: Georgia; color: rgb(0, 0, 0); line-height: 1.2; pointer-events: all; white-space: normal; overflow-wrap: normal;"><div><span>OBC/ADCS Board <br /></span></div><div><b>EM </b>procurement<br /></div></div></div></div></foreignObject><text x="100" y="294" fill="rgb(0, 0, 0)" font-family="&quot;Georgia&quot;" font-size="12px" text-anchor="middle">OBC/ADCS Board...</text></switch></g></g></g><g data-cell-id="ocxMV6QQNHyHgt8OVnz1-19"><g><path d="M 380 290 L 433.63 290" fill="none" stroke="rgb(0, 0, 0)" stroke-miterlimit="10" pointer-events="stroke"/><path d="M 438.88 290 L 431.88 293.5 L 433.63 290 L 431.88 286.5 Z" fill="rgb(0, 0, 0)" stroke="rgb(0, 0, 0)" stroke-miterlimit="10" pointer-events="all"/></g></g><g data-cell-id="ocxMV6QQNHyHgt8OVnz1-5"><g><path d="M 220 260 L 360 260 L 380 290 L 360 320 L 220 320 L 240 290 Z" fill="#fff2cc" stroke="#d6b656" stroke-width="2" stroke-miterlimit="10" pointer-events="all"/></g><g><g transform="translate(-0.5 -0.5)"><switch><foreignObject pointer-events="none" width="100%" height="100%" requiredFeatures="http://www.w3.org/TR/SVG11/feature#Extensibility" style="overflow: visible; text-align: left;"><div xmlns="http://www.w3.org/1999/xhtml" style="display: flex; align-items: unsafe center; justify-content: unsafe center; width: 158px; height: 1px; padding-top: 290px; margin-left: 221px;"><div data-drawio-colors="color: rgb(0, 0, 0); " style="box-sizing: border-box; font-size: 0px; text-align: center;"><div style="display: inline-block; font-size: 12px; font-family: Georgia; color: rgb(0, 0, 0); line-height: 1.2; pointer-events: all; white-space: normal; overflow-wrap: normal;">Incoming Inspection</div></div></div></foreignObject><text x="300" y="294" fill="rgb(0, 0, 0)" font-family="&quot;Georgia&quot;" font-size="12px" text-anchor="middle">Incoming Inspection</text></switch></g></g></g><g data-cell-id="ocxMV6QQNHyHgt8OVnz1-21"><g><path d="M 770 290 L 790 290 L 790 340 L 101 340 L 101 353.63" fill="none" stroke="rgb(0, 0, 0)" stroke-miterlimit="10" pointer-events="stroke"/><path d="M 101 358.88 L 97.5 351.88 L 101 353.63 L 104.5 351.88 Z" fill="rgb(0, 0, 0)" stroke="rgb(0, 0, 0)" stroke-miterlimit="10" pointer-events="all"/></g></g><g data-cell-id="ocxMV6QQNHyHgt8OVnz1-10"><g><path d="M 610 260 L 750 260 L 770 290 L 750 320 L 610 320 L 630 290 Z" fill="#d5e8d4" stroke="#82b366" stroke-width="2" stroke-miterlimit="10" pointer-events="all"/></g><g><g transform="translate(-0.5 -0.5)"><switch><foreignObject pointer-events="none" width="100%" height="100%" requiredFeatures="http://www.w3.org/TR/SVG11/feature#Extensibility" style="overflow: visible; text-align: left;"><div xmlns="http://www.w3.org/1999/xhtml" style="display: flex; align-items: unsafe center; justify-content: unsafe center; width: 158px; height: 1px; padding-top: 290px; margin-left: 611px;"><div data-drawio-colors="color: rgb(0, 0, 0); " style="box-sizing: border-box; font-size: 0px; text-align: center;"><div style="display: inline-block; font-size: 12px; font-family: Georgia; color: rgb(0, 0, 0); line-height: 1.2; pointer-events: all; white-space: normal; overflow-wrap: normal;">Vibration Tests</div></div></div></foreignObject><text x="690" y="294" fill="rgb(0, 0, 0)" font-family="&quot;Georgia&quot;" font-size="12px" text-anchor="middle">Vibration Tests</text></switch></g></g></g><g data-cell-id="ocxMV6QQNHyHgt8OVnz1-12"><g><path d="M 21.19 360 L 161.19 360 L 181.19 390 L 161.19 420 L 21.19 420 L 41.19 390 Z" fill="#d5e8d4" stroke="#82b366" stroke-width="2" stroke-miterlimit="10" pointer-events="all"/></g><g><g transform="translate(-0.5 -0.5)"><switch><foreignObject pointer-events="none" width="100%" height="100%" requiredFeatures="http://www.w3.org/TR/SVG11/feature#Extensibility" style="overflow: visible; text-align: left;"><div xmlns="http://www.w3.org/1999/xhtml" style="display: flex; align-items: unsafe center; justify-content: unsafe center; width: 158px; height: 1px; padding-top: 390px; margin-left: 22px;"><div data-drawio-colors="color: rgb(0, 0, 0); " style="box-sizing: border-box; font-size: 0px; text-align: center;"><div style="display: inline-block; font-size: 12px; font-family: Georgia; color: rgb(0, 0, 0); line-height: 1.2; pointer-events: all; white-space: normal; overflow-wrap: normal;">TVAC Tests</div></div></div></foreignObject><text x="101" y="394" fill="rgb(0, 0, 0)" font-family="&quot;Georgia&quot;" font-size="12px" text-anchor="middle">TVAC Tests</text></switch></g></g></g><g data-cell-id="ocxMV6QQNHyHgt8OVnz1-20"><g><path d="M 580 290 L 600 290 L 590 290 L 623.63 290" fill="none" stroke="rgb(0, 0, 0)" stroke-miterlimit="10" pointer-events="stroke"/><path d="M 628.88 290 L 621.88 293.5 L 623.63 290 L 621.88 286.5 Z" fill="rgb(0, 0, 0)" stroke="rgb(0, 0, 0)" stroke-miterlimit="10" pointer-events="all"/></g></g><g data-cell-id="ocxMV6QQNHyHgt8OVnz1-14"><g><path d="M 420 260 L 560 260 L 580 290 L 560 320 L 420 320 L 440 290 Z" fill="#d5e8d4" stroke="#82b366" stroke-width="2" stroke-miterlimit="10" pointer-events="all"/></g><g><g transform="translate(-0.5 -0.5)"><switch><foreignObject pointer-events="none" width="100%" height="100%" requiredFeatures="http://www.w3.org/TR/SVG11/feature#Extensibility" style="overflow: visible; text-align: left;"><div xmlns="http://www.w3.org/1999/xhtml" style="display: flex; align-items: unsafe center; justify-content: unsafe center; width: 158px; height: 1px; padding-top: 290px; margin-left: 421px;"><div data-drawio-colors="color: rgb(0, 0, 0); " style="box-sizing: border-box; font-size: 0px; text-align: center;"><div style="display: inline-block; font-size: 12px; font-family: Georgia; color: rgb(0, 0, 0); line-height: 1.2; pointer-events: all; white-space: normal; overflow-wrap: normal;">Ambient Functional<br />Tests</div></div></div></foreignObject><text x="500" y="294" fill="rgb(0, 0, 0)" font-family="&quot;Georgia&quot;" font-size="12px" text-anchor="middle">Ambient Functional...</text></switch></g></g></g><g data-cell-id="ocxMV6QQNHyHgt8OVnz1-15"><g><rect x="10" y="180" width="810" height="50" fill="none" stroke="none" pointer-events="all"/></g><g><g transform="translate(-0.5 -0.5)"><switch><foreignObject pointer-events="none" width="100%" height="100%" requiredFeatures="http://www.w3.org/TR/SVG11/feature#Extensibility" style="overflow: visible; text-align: left;"><div xmlns="http://www.w3.org/1999/xhtml" style="display: flex; align-items: unsafe center; justify-content: unsafe center; width: 808px; height: 1px; padding-top: 205px; margin-left: 11px;"><div data-drawio-colors="color: rgb(0, 0, 0); " style="box-sizing: border-box; font-size: 0px; text-align: center;"><div style="display: inline-block; font-size: 12px; font-family: Georgia; color: rgb(0, 0, 0); line-height: 1.2; pointer-events: all; white-space: normal; overflow-wrap: normal;"><font color="#808080" style="font-size: 20px"><b>OBC/ADCS Board<br /></b>In-House (<b>EM</b>)<br /></font></div></div></div></foreignObject><text x="415" y="209" fill="rgb(0, 0, 0)" font-family="&quot;Georgia&quot;" font-size="12px" text-anchor="middle">OBC/ADCS Board...</text></switch></g></g></g><g data-cell-id="ocxMV6QQNHyHgt8OVnz1-22"><g><path d="M 180 530 L 233.63 530" fill="none" stroke="rgb(0, 0, 0)" stroke-miterlimit="10" pointer-events="stroke"/><path d="M 238.88 530 L 231.88 533.5 L 233.63 530 L 231.88 526.5 Z" fill="rgb(0, 0, 0)" stroke="rgb(0, 0, 0)" stroke-miterlimit="10" pointer-events="all"/></g></g><g data-cell-id="ocxMV6QQNHyHgt8OVnz1-23"><g><rect x="20" y="500" width="160" height="60" rx="12" ry="12" fill="#f8cecc" stroke="#b85450" stroke-width="2" pointer-events="all"/></g><g><g transform="translate(-0.5 -0.5)"><switch><foreignObject pointer-events="none" width="100%" height="100%" requiredFeatures="http://www.w3.org/TR/SVG11/feature#Extensibility" style="overflow: visible; text-align: left;"><div xmlns="http://www.w3.org/1999/xhtml" style="display: flex; align-items: unsafe center; justify-content: unsafe center; width: 158px; height: 1px; padding-top: 530px; margin-left: 21px;"><div data-drawio-colors="color: rgb(0, 0, 0); " style="box-sizing: border-box; font-size: 0px; text-align: center;"><div style="display: inline-block; font-size: 12px; font-family: Georgia; color: rgb(0, 0, 0); line-height: 1.2; pointer-events: all; white-space: normal; overflow-wrap: normal;"><div><span>OBC/ADCS Board <br /></span></div><div><b>EM </b>procurement<br /></div></div></div></div></foreignObject><text x="100" y="534" fill="rgb(0, 0, 0)" font-family="&quot;Georgia&quot;" font-size="12px" text-anchor="middle">OBC/ADCS Board...</text></switch></g></g></g><g data-cell-id="ocxMV6QQNHyHgt8OVnz1-24"><g><path d="M 380 530 L 433.63 530" fill="none" stroke="rgb(0, 0, 0)" stroke-miterlimit="10" pointer-events="stroke"/><path d="M 438.88 530 L 431.88 533.5 L 433.63 530 L 431.88 526.5 Z" fill="rgb(0, 0, 0)" stroke="rgb(0, 0, 0)" stroke-miterlimit="10" pointer-events="all"/></g></g><g data-cell-id="ocxMV6QQNHyHgt8OVnz1-25"><g><path d="M 220 500 L 360 500 L 380 530 L 360 560 L 220 560 L 240 530 Z" fill="#fff2cc" stroke="#d6b656" stroke-width="2" stroke-miterlimit="10" pointer-events="all"/></g><g><g transform="translate(-0.5 -0.5)"><switch><foreignObject pointer-events="none" width="100%" height="100%" requiredFeatures="http://www.w3.org/TR/SVG11/feature#Extensibility" style="overflow: visible; text-align: left;"><div xmlns="http://www.w3.org/1999/xhtml" style="display: flex; align-items: unsafe center; justify-content: unsafe center; width: 158px; height: 1px; padding-top: 530px; margin-left: 221px;"><div data-drawio-colors="color: rgb(0, 0, 0); " style="box-sizing: border-box; font-size: 0px; text-align: center;"><div style="display: inline-block; font-size: 12px; font-family: Georgia; color: rgb(0, 0, 0); line-height: 1.2; pointer-events: all; white-space: normal; overflow-wrap: normal;">Incoming Inspection</div></div></div></foreignObject><text x="300" y="534" fill="rgb(0, 0, 0)" font-family="&quot;Georgia&quot;" font-size="12px" text-anchor="middle">Incoming Inspection</text></switch></g></g></g><g data-cell-id="ocxMV6QQNHyHgt8OVnz1-26"><g><path d="M 770 530 L 790 530 L 790 600 L 90 600 L 90 633.63" fill="none" stroke="rgb(0, 0, 0)" stroke-miterlimit="10" pointer-events="stroke"/><path d="M 90 638.88 L 86.5 631.88 L 90 633.63 L 93.5 631.88 Z" fill="rgb(0, 0, 0)" stroke="rgb(0, 0, 0)" stroke-miterlimit="10" pointer-events="all"/></g></g><g data-cell-id="ocxMV6QQNHyHgt8OVnz1-27"><g><path d="M 610 500 L 750 500 L 770 530 L 750 560 L 610 560 L 630 530 Z" fill="#d5e8d4" stroke="#82b366" stroke-width="2" stroke-miterlimit="10" pointer-events="all"/></g><g><g transform="translate(-0.5 -0.5)"><switch><foreignObject pointer-events="none" width="100%" height="100%" requiredFeatures="http://www.w3.org/TR/SVG11/feature#Extensibility" style="overflow: visible; text-align: left;"><div xmlns="http://www.w3.org/1999/xhtml" style="display: flex; align-items: unsafe center; justify-content: unsafe center; width: 158px; height: 1px; padding-top: 530px; margin-left: 611px;"><div data-drawio-colors="color: rgb(0, 0, 0); " style="box-sizing: border-box; font-size: 0px; text-align: center;"><div style="display: inline-block; font-size: 12px; font-family: Georgia; color: rgb(0, 0, 0); line-height: 1.2; pointer-events: all; white-space: normal; overflow-wrap: normal;">Vibration Tests</div></div></div></foreignObject><text x="690" y="534" fill="rgb(0, 0, 0)" font-family="&quot;Georgia&quot;" font-size="12px" text-anchor="middle">Vibration Tests</text></switch></g></g></g><g data-cell-id="ocxMV6QQNHyHgt8OVnz1-33"><g><path d="M 181.19 670 L 201.2 670 L 200 670 L 233.63 670" fill="none" stroke="rgb(0, 0, 0)" stroke-miterlimit="10" pointer-events="stroke"/><path d="M 238.88 670 L 231.88 673.5 L 233.63 670 L 231.88 666.5 Z" fill="rgb(0, 0, 0)" stroke="rgb(0, 0, 0)" stroke-miterlimit="10" pointer-events="all"/></g></g><g data-cell-id="ocxMV6QQNHyHgt8OVnz1-28"><g><path d="M 21.19 640 L 161.19 640 L 181.19 670 L 161.19 700 L 21.19 700 L 41.19 670 Z" fill="#d5e8d4" stroke="#82b366" stroke-width="2" stroke-miterlimit="10" pointer-events="all"/></g><g><g transform="translate(-0.5 -0.5)"><switch><foreignObject pointer-events="none" width="100%" height="100%" requiredFeatures="http://www.w3.org/TR/SVG11/feature#Extensibility" style="overflow: visible; text-align: left;"><div xmlns="http://www.w3.org/1999/xhtml" style="display: flex; align-items: unsafe center; justify-content: unsafe center; width: 158px; height: 1px; padding-top: 670px; margin-left: 22px;"><div data-drawio-colors="color: rgb(0, 0, 0); " style="box-sizing: border-box; font-size: 0px; text-align: center;"><div style="display: inline-block; font-size: 12px; font-family: Georgia; color: rgb(0, 0, 0); line-height: 1.2; pointer-events: all; white-space: normal; overflow-wrap: normal;">Shock Test</div></div></div></foreignObject><text x="101" y="674" fill="rgb(0, 0, 0)" font-family="&quot;Georgia&quot;" font-size="12px" text-anchor="middle">Shock Test</text></switch></g></g></g><g data-cell-id="ocxMV6QQNHyHgt8OVnz1-29"><g><path d="M 580 530 L 600 530 L 590 530 L 623.63 530" fill="none" stroke="rgb(0, 0, 0)" stroke-miterlimit="10" pointer-events="stroke"/><path d="M 628.88 530 L 621.88 533.5 L 623.63 530 L 621.88 526.5 Z" fill="rgb(0, 0, 0)" stroke="rgb(0, 0, 0)" stroke-miterlimit="10" pointer-events="all"/></g></g><g data-cell-id="ocxMV6QQNHyHgt8OVnz1-30"><g><path d="M 420 500 L 560 500 L 580 530 L 560 560 L 420 560 L 440 530 Z" fill="#d5e8d4" stroke="#82b366" stroke-width="2" stroke-miterlimit="10" pointer-events="all"/></g><g><g transform="translate(-0.5 -0.5)"><switch><foreignObject pointer-events="none" width="100%" height="100%" requiredFeatures="http://www.w3.org/TR/SVG11/feature#Extensibility" style="overflow: visible; text-align: left;"><div xmlns="http://www.w3.org/1999/xhtml" style="display: flex; align-items: unsafe center; justify-content: unsafe center; width: 158px; height: 1px; padding-top: 530px; margin-left: 421px;"><div data-drawio-colors="color: rgb(0, 0, 0); " style="box-sizing: border-box; font-size: 0px; text-align: center;"><div style="display: inline-block; font-size: 12px; font-family: Georgia; color: rgb(0, 0, 0); line-height: 1.2; pointer-events: all; white-space: normal; overflow-wrap: normal;">Ambient Functional<br />Tests</div></div></div></foreignObject><text x="500" y="534" fill="rgb(0, 0, 0)" font-family="&quot;Georgia&quot;" font-size="12px" text-anchor="middle">Ambient Functional...</text></switch></g></g></g><g data-cell-id="ocxMV6QQNHyHgt8OVnz1-31"><g><rect x="10" y="420" width="810" height="50" fill="none" stroke="none" pointer-events="all"/></g><g><g transform="translate(-0.5 -0.5)"><switch><foreignObject pointer-events="none" width="100%" height="100%" requiredFeatures="http://www.w3.org/TR/SVG11/feature#Extensibility" style="overflow: visible; text-align: left;"><div xmlns="http://www.w3.org/1999/xhtml" style="display: flex; align-items: unsafe center; justify-content: unsafe center; width: 808px; height: 1px; padding-top: 445px; margin-left: 11px;"><div data-drawio-colors="color: rgb(0, 0, 0); " style="box-sizing: border-box; font-size: 0px; text-align: center;"><div style="display: inline-block; font-size: 12px; font-family: Georgia; color: rgb(0, 0, 0); line-height: 1.2; pointer-events: all; white-space: normal; overflow-wrap: normal;"><font color="#808080" style="font-size: 20px"><b>OBC/ADCS Board<br /></b>In-House (<b>EM</b>)<br /></font></div></div></div></foreignObject><text x="415" y="449" fill="rgb(0, 0, 0)" font-family="&quot;Georgia&quot;" font-size="12px" text-anchor="middle">OBC/ADCS Board...</text></switch></g></g></g><g data-cell-id="ocxMV6QQNHyHgt8OVnz1-32"><g><path d="M 220 640 L 360 640 L 380 670 L 360 700 L 220 700 L 240 670 Z" fill="#d5e8d4" stroke="#82b366" stroke-width="2" stroke-miterlimit="10" pointer-events="all"/></g><g><g transform="translate(-0.5 -0.5)"><switch><foreignObject pointer-events="none" width="100%" height="100%" requiredFeatures="http://www.w3.org/TR/SVG11/feature#Extensibility" style="overflow: visible; text-align: left;"><div xmlns="http://www.w3.org/1999/xhtml" style="display: flex; align-items: unsafe center; justify-content: unsafe center; width: 158px; height: 1px; padding-top: 670px; margin-left: 221px;"><div data-drawio-colors="color: rgb(0, 0, 0); " style="box-sizing: border-box; font-size: 0px; text-align: center;"><div style="display: inline-block; font-size: 12px; font-family: Georgia; color: rgb(0, 0, 0); line-height: 1.2; pointer-events: all; white-space: normal; overflow-wrap: normal;">TVAC Tests</div></div></div></foreignObject><text x="300" y="674" fill="rgb(0, 0, 0)" font-family="&quot;Georgia&quot;" font-size="12px" text-anchor="middle">TVAC Tests</text></switch></g></g></g></g></g></g><switch><g requiredFeatures="http://www.w3.org/TR/SVG11/feature#Extensibility"/><a transform="translate(0,-5)" xlink:href="https://www.drawio.com/doc/faq/svg-export-text-problems" target="_blank"><text text-anchor="middle" font-size="10px" x="50%" y="100%">Text is not SVG - cannot display</text></a></switch></svg>