PCBNEW-LibModule-V1  2023-02-07 18:06:48
# encoding utf-8
Units mm
$INDEX
2078430003
$EndINDEX
$MODULE 2078430003
Po 0 0 0 15 63e29338 00000000 ~~
Li 2078430003
Cd 207843-0003-3
Kw Connector
Sc 0
At STD
AR 
Op 0 0 0
T0 -2.500 -0 1.27 1.27 0 0.254 N V 21 N "J**"
T1 -2.500 -0 1.27 1.27 0 0.254 N I 21 N "2078430003"
DS -7.45 4.395 2.45 4.395 0.2 24
DS 2.45 4.395 2.45 -4.395 0.2 24
DS 2.45 -4.395 -7.45 -4.395 0.2 24
DS -7.45 -4.395 -7.45 4.395 0.2 24
DS 2.45 -4.395 -7.45 -4.395 0.1 21
DS -7.45 -4.395 -7.45 -4.395 0.1 21
DS -7.45 -4.395 2.45 -4.395 0.1 21
DS 2.45 -4.395 2.45 -4.395 0.1 21
DS -7.45 4.395 2.45 4.395 0.1 21
DS 2.45 4.395 2.45 4.395 0.1 21
DS 2.45 4.395 -7.45 4.395 0.1 21
DS -7.45 4.395 -7.45 4.395 0.1 21
DS -8.45 -5.395 3.45 -5.395 0.1 24
DS 3.45 -5.395 3.45 5.395 0.1 24
DS 3.45 5.395 -8.45 5.395 0.1 24
DS -8.45 5.395 -8.45 -5.395 0.1 24
DS 2.45 -2.75 2.45 -2.75 0.1 21
DS 2.45 -2.75 2.45 -4.395 0.1 21
DS 2.45 -4.395 2.45 -4.395 0.1 21
DS 2.45 -4.395 2.45 -2.75 0.1 21
DS -7.45 -4.395 -7.45 -4.395 0.1 21
DS -7.45 -4.395 -7.45 4.395 0.1 21
DS -7.45 4.395 -7.45 4.395 0.1 21
DS -7.45 4.395 -7.45 -4.395 0.1 21
DS 2.45 4.395 2.45 4.395 0.1 21
DS 2.45 4.395 2.45 -0.25 0.1 21
DS 2.45 -0.25 2.45 -0.25 0.1 21
DS 2.45 -0.25 2.45 4.395 0.1 21
DS 3.1 -0 3.1 -0 0.2 21
DS 3 -0 3 -0 0.2 21
DS 3.1 -0 3.1 -0 0.2 21
DA 3.05 -0 3.100 -0 -1800 0.2 21
DA 3.05 -0 3.000 -0 -1800 0.2 21
DA 3.05 -0 3.100 -0 -1800 0.2 21
$PAD
Po 0.000 -0
Sh "1" C 1.400 1.400 0 0 900
Dr 0.9 0 0
At STD N 00E0FFFF
Ne 0 ""
$EndPAD
$PAD
Po -2.500 -0
Sh "2" C 1.400 1.400 0 0 900
Dr 0.9 0 0
At STD N 00E0FFFF
Ne 0 ""
$EndPAD
$PAD
Po -5.000 -0
Sh "3" C 1.400 1.400 0 0 900
Dr 0.9 0 0
At STD N 00E0FFFF
Ne 0 ""
$EndPAD
$PAD
Po 1.600 -1.6
Sh "MH1" C 0.600 0.600 0 0 900
Dr 1.2 0 0
At STD N 00E0FFFF
Ne 0 ""
$EndPAD
$EndMODULE 2078430003
$EndLIBRARY
