(module "2078430004" (layer F.Cu)
  (descr "207843-0004-2")
  (tags "Connector")
  (fp_text reference J** (at -3.750 0.55) (layer F.SilkS)
    (effects (font (size 1.27 1.27) (thickness 0.254)))
  )
  (fp_text user %R (at -3.750 0.55) (layer F.Fab)
    (effects (font (size 1.27 1.27) (thickness 0.254)))
  )
  (fp_text value "2078430004" (at -3.750 0.55) (layer F.SilkS) hide
    (effects (font (size 1.27 1.27) (thickness 0.254)))
  )
  (fp_line (start -9.95 -3.1) (end 2.45 -3.1) (layer F.Fab) (width 0.2))
  (fp_line (start 2.45 -3.1) (end 2.45 4.2) (layer F.Fab) (width 0.2))
  (fp_line (start 2.45 4.2) (end -9.95 4.2) (layer F.Fab) (width 0.2))
  (fp_line (start -9.95 4.2) (end -9.95 -3.1) (layer F.Fab) (width 0.2))
  (fp_line (start -9.95 -3.1) (end 2.45 -3.1) (layer F.SilkS) (width 0.1))
  (fp_line (start 2.45 -3.1) (end 2.45 4.2) (layer F.SilkS) (width 0.1))
  (fp_line (start 2.45 4.2) (end -9.95 4.2) (layer F.SilkS) (width 0.1))
  (fp_line (start -9.95 4.2) (end -9.95 -3.1) (layer F.SilkS) (width 0.1))
  (fp_line (start -11.25 -4.1) (end 3.75 -4.1) (layer F.CrtYd) (width 0.1))
  (fp_line (start 3.75 -4.1) (end 3.75 5.2) (layer F.CrtYd) (width 0.1))
  (fp_line (start 3.75 5.2) (end -11.25 5.2) (layer F.CrtYd) (width 0.1))
  (fp_line (start -11.25 5.2) (end -11.25 -4.1) (layer F.CrtYd) (width 0.1))
  (fp_line (start 1.6 -0.1) (end 1.6 -0.1) (layer F.SilkS) (width 0.2))
  (fp_line (start 1.6 0.1) (end 1.6 0.1) (layer F.SilkS) (width 0.2))
  (fp_arc (start 1.6 -0) (end 1.600 -0.1) (angle -180) (layer F.SilkS) (width 0.2))
  (fp_arc (start 1.6 -0) (end 1.600 0.1) (angle -180) (layer F.SilkS) (width 0.2))
  (pad 1 thru_hole circle (at 0.000 -0) (size 1.500 1.500) (drill 1) (layers *.Cu *.Mask))
  (pad 2 thru_hole circle (at -2.500 -0) (size 1.500 1.500) (drill 1) (layers *.Cu *.Mask))
  (pad 3 thru_hole circle (at -5.000 -0) (size 1.500 1.500) (drill 1) (layers *.Cu *.Mask))
  (pad 4 thru_hole circle (at -7.500 -0) (size 1.500 1.500) (drill 1) (layers *.Cu *.Mask))
  (pad MH1 np_thru_hole circle (at 1.600 -1.6) (size 1.3 1.3) (drill 1.3) (layers *.Cu *.Mask))
  (model 207843-0004.stp
    (at (xyz -0.14763779527559 -0.021653543776415 0.10118109973397))
    (scale (xyz 1 1 1))
    (rotate (xyz 90 0 -180))
  )
)
