PCBNEW-LibModule-V1  2023-02-07 18:14:35
# encoding utf-8
Units mm
$INDEX
2078430005
$EndINDEX
$MODULE 2078430005
Po 0 0 0 15 63e2950b 00000000 ~~
Li 2078430005
Cd 207843-0005-3
Kw Connector
Sc 0
At STD
AR 
Op 0 0 0
T0 -5.000 0.475 1.27 1.27 0 0.254 N V 21 N "J**"
T1 -5.000 0.475 1.27 1.27 0 0.254 N I 21 N "2078430005"
DS -12.45 -3.65 2.45 -3.65 0.2 24
DS 2.45 -3.65 2.45 3.65 0.2 24
DS 2.45 3.65 -12.45 3.65 0.2 24
DS -12.45 3.65 -12.45 -3.65 0.2 24
DS -12.45 -3.65 2.45 -3.65 0.1 21
DS 2.45 -3.65 2.45 3.65 0.1 21
DS 2.45 3.65 -12.45 3.65 0.1 21
DS -12.45 3.65 -12.45 -3.65 0.1 21
DS -13.45 -4.65 3.45 -4.65 0.1 24
DS 3.45 -4.65 3.45 5.6 0.1 24
DS 3.45 5.6 -13.45 5.6 0.1 24
DS -13.45 5.6 -13.45 -4.65 0.1 24
DS 0.3 4.5 0.3 4.5 0.2 21
DS 0.5 4.5 0.5 4.5 0.2 21
DA 0.4 4.5 0.300 4.5 -1800 0.2 21
DA 0.4 4.5 0.500 4.5 -1800 0.2 21
$PAD
Po 0.000 -0
Sh "1" C 1.400 1.400 0 0 900
Dr 0.9 0 0
At STD N 00E0FFFF
Ne 0 ""
$EndPAD
$PAD
Po -2.500 -0
Sh "2" C 1.400 1.400 0 0 900
Dr 0.9 0 0
At STD N 00E0FFFF
Ne 0 ""
$EndPAD
$PAD
Po -5.000 -0
Sh "3" C 1.400 1.400 0 0 900
Dr 0.9 0 0
At STD N 00E0FFFF
Ne 0 ""
$EndPAD
$PAD
Po -7.500 -0
Sh "4" C 1.400 1.400 0 0 900
Dr 0.9 0 0
At STD N 00E0FFFF
Ne 0 ""
$EndPAD
$PAD
Po -10.000 -0
Sh "5" C 1.400 1.400 0 0 900
Dr 0.9 0 0
At STD N 00E0FFFF
Ne 0 ""
$EndPAD
$PAD
Po 1.600 -1.6
Sh "MH1" C 0.600 0.600 0 0 900
Dr 1.2 0 0
At STD N 00E0FFFF
Ne 0 ""
$EndPAD
$EndMODULE 2078430005
$EndLIBRARY
