PCBNEW-LibModule-V1  2023-02-07 18:08:49
# encoding utf-8
Units mm
$INDEX
2078430004
$EndINDEX
$MODULE 2078430004
Po 0 0 0 15 63e293b1 00000000 ~~
Li 2078430004
Cd 207843-0004-2
Kw Connector
Sc 0
At STD
AR 
Op 0 0 0
T0 -3.750 0.55 1.27 1.27 0 0.254 N V 21 N "J**"
T1 -3.750 0.55 1.27 1.27 0 0.254 N I 21 N "2078430004"
DS -9.95 -3.1 2.45 -3.1 0.2 24
DS 2.45 -3.1 2.45 4.2 0.2 24
DS 2.45 4.2 -9.95 4.2 0.2 24
DS -9.95 4.2 -9.95 -3.1 0.2 24
DS -9.95 -3.1 2.45 -3.1 0.1 21
DS 2.45 -3.1 2.45 4.2 0.1 21
DS 2.45 4.2 -9.95 4.2 0.1 21
DS -9.95 4.2 -9.95 -3.1 0.1 21
DS -11.25 -4.1 3.75 -4.1 0.1 24
DS 3.75 -4.1 3.75 5.2 0.1 24
DS 3.75 5.2 -11.25 5.2 0.1 24
DS -11.25 5.2 -11.25 -4.1 0.1 24
DS 1.6 -0.1 1.6 -0.1 0.2 21
DS 1.6 0.1 1.6 0.1 0.2 21
DA 1.6 -0 1.600 -0.1 -1800 0.2 21
DA 1.6 -0 1.600 0.1 -1800 0.2 21
$PAD
Po 0.000 -0
Sh "1" C 1.500 1.500 0 0 900
Dr 1 0 0
At STD N 00E0FFFF
Ne 0 ""
$EndPAD
$PAD
Po -2.500 -0
Sh "2" C 1.500 1.500 0 0 900
Dr 1 0 0
At STD N 00E0FFFF
Ne 0 ""
$EndPAD
$PAD
Po -5.000 -0
Sh "3" C 1.500 1.500 0 0 900
Dr 1 0 0
At STD N 00E0FFFF
Ne 0 ""
$EndPAD
$PAD
Po -7.500 -0
Sh "4" C 1.500 1.500 0 0 900
Dr 1 0 0
At STD N 00E0FFFF
Ne 0 ""
$EndPAD
$PAD
Po 1.600 -1.6
Sh "MH1" C 0.650 0.650 0 0 900
Dr 1.3 0 0
At STD N 00E0FFFF
Ne 0 ""
$EndPAD
$EndMODULE 2078430004
$EndLIBRARY
