<>,1,2,3,4,5,6,7,8,9,10,11,12
A,0.1166,0.1209,0.1303,0.1278,0.132,0.1195,0.6974,0.6232,0.1229,0.1306,1.054,0.4533
B,0.1212,0.1221,0.1296,0.1276,0.1236,0.1296,0.698,0.6094,0.1283,0.1239,0.4391,0.4976
C,0.1307,0.1277,0.1259,0.1474,0.12,0.1273,0.6768,0.6295,0.1259,0.1371,0.4143,0.6788
D,0.1184,0.1138,0.1269,0.13,0.1256,0.1279,0.703,0.692,0.1306,0.12,0.3697,0.3281
E,0.1179,0.1141,0.1252,0.1301,0.1289,0.1196,0.6857,0.6694,0.127,0.1284,0.4132,0.4447
F,0.115,0.1193,0.128,0.1355,0.1252,0.1257,0.6187,0.5604,0.1274,0.1222,1.1259,0.6495
G,0.1265,0.1219,0.1353,0.1319,0.1307,0.1235,0.5603,0.5321,0.1275,0.13,1.0968,0.5902
H,0.1182,0.115,0.1305,0.1262,0.117,0.1286,0.9073,0.826,0.1246,0.1356,0.9323,0.6092
<>,1,2,3,4,5,6,7,8,9,10,11,12
A,0.1168,0.1163,0.1299,0.1265,0.1298,0.1193,0.6952,0.6143,0.1214,0.1298,1.0518,0.457
B,0.1222,0.121,0.1298,0.128,0.1233,0.1264,0.6939,0.5998,0.1275,0.1231,0.4323,0.4947
C,0.1249,0.1259,0.1256,0.1437,0.1197,0.125,0.6693,0.6242,0.1248,0.1326,0.418,0.6701
D,0.1149,0.1124,0.1263,0.1298,0.1243,0.1255,0.688,0.6869,0.1276,0.1194,0.3946,0.3795
E,0.1174,0.115,0.126,0.1304,0.1277,0.1209,0.6768,0.6606,0.1232,0.1279,0.4111,0.4431
F,0.1141,0.119,0.1291,0.1338,0.1233,0.1261,0.6165,0.5547,0.1253,0.1213,1.1282,0.6459
G,0.1219,0.1206,0.1336,0.1338,0.1282,0.1217,0.5555,0.5211,0.1265,0.1278,1.0963,0.5827
H,0.1166,0.1145,0.1299,0.1256,0.1158,0.1277,0.9052,0.8208,0.1237,0.1335,0.942,0.5998
<>,1,2,3,4,5,6,7,8,9,10,11,12
A,0.1168,0.12,0.1301,0.1268,0.1303,0.1224,0.692,0.6064,0.124,0.1282,1.0528,0.4602
B,0.1198,0.1213,0.1296,0.1271,0.1225,0.127,0.6935,0.6024,0.1275,0.1223,0.4293,0.4917
C,0.1153,0.1254,0.1259,0.1423,0.1207,0.1256,0.6695,0.6246,0.1243,0.1311,0.4192,0.6682
D,0.1171,0.1125,0.1261,0.1297,0.1227,0.124,0.6842,0.6854,0.1265,0.1191,0.4234,0.4123
E,0.1177,0.1144,0.1256,0.1307,0.1241,0.1224,0.6789,0.6495,0.1227,0.1276,0.4097,0.4452
F,0.1143,0.1183,0.1283,0.133,0.1234,0.1255,0.616,0.5538,0.1254,0.1211,1.1325,0.6402
G,0.1184,0.12,0.1338,0.1316,0.1264,0.1203,0.5523,0.5216,0.1262,0.1265,1.0954,0.5805
H,0.1191,0.1159,0.1299,0.1256,0.1148,0.1263,0.901,0.8179,0.1232,0.1322,0.9326,0.5948
<>,1,2,3,4,5,6,7,8,9,10,11,12
A,0.1167,0.1197,0.1299,0.1273,0.1317,0.1165,0.6878,0.6063,0.1226,0.1277,1.054,0.4564
B,0.1204,0.1213,0.1295,0.1278,0.1225,0.1264,0.692,0.6,0.127,0.122,0.4265,0.4886
C,0.1138,0.1251,0.1257,0.1405,0.12,0.124,0.6681,0.6221,0.1238,0.1293,0.4229,0.6664
D,0.1175,0.1134,0.1265,0.1301,0.1231,0.1228,0.6816,0.6858,0.1258,0.1191,0.4491,0.4246
E,0.1176,0.1146,0.1253,0.1305,0.1225,0.1197,0.675,0.6381,0.1214,0.1276,0.4067,0.4453
F,0.1135,0.1182,0.1278,0.1325,0.1219,0.1249,0.6138,0.5534,0.1239,0.1208,1.1324,0.6363
G,0.1276,0.12,0.1339,0.1324,0.1256,0.1202,0.5529,0.5203,0.1258,0.1256,1.0993,0.5818
H,0.1154,0.1153,0.1302,0.1262,0.1171,0.1248,0.8992,0.8146,0.1232,0.131,0.9338,0.5944
<>,1,2,3,4,5,6,7,8,9,10,11,12
A,0.1169,0.1204,0.1298,0.1274,0.1269,0.118,0.6834,0.6024,0.1223,0.1268,1.0533,0.4524
B,0.1202,0.1216,0.1294,0.1267,0.1222,0.1268,0.6921,0.596,0.1268,0.1214,0.4263,0.4884
C,0.1256,0.1242,0.1253,0.1438,0.1206,0.125,0.6671,0.6166,0.1237,0.1279,0.4244,0.6628
D,0.1164,0.1125,0.126,0.1301,0.1237,0.1214,0.6808,0.6839,0.1251,0.1189,0.4633,0.4388
E,0.1197,0.1144,0.1251,0.1308,0.1226,0.1213,0.6763,0.6326,0.1225,0.1275,0.4068,0.4453
F,0.1136,0.1181,0.128,0.1314,0.1215,0.1275,0.6147,0.5502,0.1233,0.1207,1.1307,0.6399
G,0.1318,0.1199,0.1338,0.1319,0.1247,0.1198,0.5473,0.519,0.1254,0.1252,1.098,0.5817
H,0.1163,0.1146,0.1296,0.126,0.1141,0.1239,0.8975,0.8122,0.1227,0.13,0.9238,0.5921
<>,1,2,3,4,5,6,7,8,9,10,11,12
A,0.1152,0.1183,0.1299,0.1272,0.1285,0.118,0.6826,0.6019,0.1195,0.1258,1.0527,0.445
B,0.1191,0.1209,0.1295,0.1278,0.1223,0.1258,0.695,0.5987,0.1266,0.121,0.4224,0.4869
C,0.1385,0.1232,0.1255,0.1384,0.1205,0.1234,0.6637,0.6184,0.1232,0.1265,0.4244,0.664
D,0.1149,0.1129,0.1261,0.1299,0.1216,0.121,0.6764,0.683,0.1243,0.1187,0.46,0.4552
E,0.1197,0.114,0.125,0.1289,0.1213,0.1216,0.6747,0.623,0.1216,0.1266,0.4069,0.4451
F,0.1138,0.1177,0.1278,0.1321,0.1205,0.124,0.6139,0.5493,0.1227,0.1203,1.1303,0.6342
G,0.123,0.12,0.1337,0.1322,0.1249,0.1191,0.5493,0.5185,0.125,0.1243,1.0966,0.5772
H,0.1153,0.1144,0.1299,0.1274,0.1166,0.1228,0.8969,0.8134,0.1217,0.1286,0.931,0.5886
<>,1,2,3,4,5,6,7,8,9,10,11,12
A,0.1165,0.1254,0.1297,0.1273,0.1261,0.1156,0.6798,0.5996,0.1208,0.1257,1.0489,0.4412
B,0.12,0.1211,0.1293,0.1265,0.1222,0.1253,0.6962,0.5989,0.1262,0.1206,0.4254,0.4856
C,0.1341,0.1229,0.1255,0.1371,0.1197,0.1211,0.6643,0.6171,0.123,0.1246,0.4246,0.659
D,0.115,0.1122,0.1258,0.13,0.1221,0.1202,0.6776,0.6813,0.1238,0.1183,0.4491,0.4674
E,0.1208,0.1145,0.1249,0.1303,0.1221,0.119,0.6731,0.6157,0.1213,0.1262,0.4063,0.443
F,0.1136,0.118,0.1277,0.1315,0.1205,0.1241,0.615,0.5491,0.1222,0.1199,1.1283,0.632
G,0.1249,0.1184,0.1335,0.1305,0.1259,0.1176,0.5492,0.5141,0.1243,0.1242,1.0966,0.5738
H,0.1177,0.1162,0.1298,0.1285,0.1164,0.1221,0.8965,0.8139,0.1216,0.1277,0.9298,0.5873
<>,1,2,3,4,5,6,7,8,9,10,11,12
A,0.1162,0.1211,0.1297,0.1262,0.1278,0.1164,0.6766,0.5978,0.1206,0.1247,1.0469,0.4407
B,0.1185,0.121,0.1294,0.1266,0.1218,0.1251,0.6965,0.6004,0.1262,0.1205,0.4197,0.4833
C,0.1315,0.1229,0.1254,0.1369,0.1218,0.1204,0.6644,0.6182,0.1227,0.1225,0.4363,0.658
D,0.1161,0.112,0.1256,0.13,0.1214,0.1197,0.6755,0.6797,0.1228,0.118,0.4381,0.4762
E,0.1228,0.1142,0.1247,0.129,0.1197,0.1178,0.6702,0.6111,0.1207,0.1257,0.4206,0.4443
F,0.1135,0.1176,0.1275,0.131,0.1206,0.1259,0.6121,0.5461,0.1219,0.1196,1.1302,0.632
G,0.1392,0.1187,0.1345,0.1323,0.125,0.1167,0.5472,0.5134,0.1237,0.1241,1.1018,0.5743
H,0.1209,0.1167,0.1295,0.1272,0.1172,0.1209,0.8933,0.808,0.1215,0.127,0.9289,0.5858
<>,1,2,3,4,5,6,7,8,9,10,11,12
A,0.1164,0.1248,0.1296,0.1264,0.1245,0.1166,0.6754,0.596,0.1201,0.1242,1.0465,0.441
B,0.1193,0.1201,0.1293,0.1268,0.1221,0.1254,0.7002,0.6003,0.1259,0.1203,0.4163,0.4793
C,0.1265,0.1224,0.1252,0.1366,0.1202,0.1207,0.6608,0.6179,0.1223,0.1218,0.4349,0.6562
D,0.116,0.1128,0.1257,0.1295,0.1207,0.1187,0.6765,0.6789,0.122,0.1179,0.4301,0.4831
E,0.1188,0.1149,0.1244,0.129,0.1219,0.1208,0.6732,0.6056,0.1204,0.1248,0.4219,0.4455
F,0.1138,0.1175,0.1275,0.1312,0.12,0.1231,0.6106,0.5454,0.1215,0.1194,1.1289,0.6315
G,0.1247,0.1199,0.1334,0.1321,0.1248,0.117,0.5473,0.5156,0.1233,0.1239,1.0946,0.575
H,0.1212,0.1167,0.1296,0.1269,0.1141,0.12,0.8949,0.8085,0.1213,0.1265,0.921,0.5839
<>,1,2,3,4,5,6,7,8,9,10,11,12
A,0.1169,0.1151,0.1296,0.1271,0.1243,0.1166,0.6755,0.5922,0.1188,0.1247,1.046,0.4389
B,0.1185,0.1206,0.1293,0.127,0.1221,0.1251,0.7025,0.5997,0.1259,0.1201,0.4143,0.4807
C,0.1429,0.1219,0.1254,0.1357,0.1194,0.122,0.6599,0.6143,0.1218,0.1211,0.4303,0.6564
D,0.1146,0.1128,0.1257,0.1303,0.1209,0.1185,0.6757,0.6832,0.122,0.1176,0.4201,0.5155
E,0.1216,0.1136,0.125,0.1298,0.1218,0.1185,0.6725,0.5989,0.1202,0.1243,0.4218,0.4537
F,0.1133,0.1172,0.1274,0.1296,0.1198,0.1227,0.6089,0.5448,0.1208,0.119,1.1268,0.6278
G,0.1263,0.1185,0.1334,0.1315,0.1232,0.1172,0.5465,0.5149,0.1227,0.1237,1.0995,0.5727
H,0.1167,0.1168,0.1294,0.1268,0.1174,0.1195,0.895,0.8089,0.1212,0.1262,0.9227,0.5836
<>,1,2,3,4,5,6,7,8,9,10,11,12
A,0.1154,0.1156,0.1296,0.1272,0.1235,0.1168,0.6708,0.588,0.1185,0.1242,1.0455,0.4382
B,0.1196,0.1202,0.1292,0.1269,0.122,0.1251,0.7044,0.5967,0.1255,0.1197,0.4186,0.4787
C,0.1273,0.1214,0.1256,0.1357,0.1208,0.1227,0.6592,0.6136,0.1214,0.1209,0.4256,0.653
D,0.1144,0.1125,0.1255,0.1301,0.1192,0.1177,0.6813,0.6891,0.1219,0.1173,0.4199,0.5353
E,0.1168,0.1138,0.1247,0.1285,0.1198,0.1172,0.6716,0.5966,0.1199,0.124,0.423,0.4677
F,0.1139,0.1167,0.1273,0.1297,0.1193,0.1244,0.6105,0.5451,0.1204,0.1189,1.1267,0.6248
G,0.1224,0.1178,0.1335,0.1299,0.1253,0.1166,0.5455,0.5109,0.1211,0.1232,1.0952,0.5696
H,0.1177,0.1161,0.1294,0.1266,0.1138,0.1186,0.8906,0.8142,0.1211,0.1257,0.9168,0.5812
<>,1,2,3,4,5,6,7,8,9,10,11,12
A,0.1164,0.12,0.1295,0.1268,0.1224,0.1159,0.6716,0.5889,0.1179,0.1235,1.0429,0.4381
B,0.1196,0.121,0.1293,0.1259,0.1222,0.1247,0.7088,0.5979,0.1247,0.119,0.4267,0.4778
C,0.1158,0.1211,0.1257,0.1352,0.121,0.1192,0.6572,0.6149,0.1214,0.1203,0.4267,0.6523
D,0.1144,0.1118,0.1253,0.1301,0.1191,0.1171,0.68,0.6949,0.1215,0.1172,0.4229,0.6105
E,0.1185,0.1141,0.125,0.1298,0.1186,0.1175,0.6715,0.5973,0.1191,0.1235,0.4223,0.4705
F,0.1134,0.117,0.1273,0.1305,0.1188,0.1234,0.611,0.541,0.12,0.1187,1.1242,0.6244
G,0.1276,0.1184,0.1333,0.1309,0.1235,0.1181,0.5426,0.5125,0.1206,0.1231,1.0946,0.5705
H,0.1153,0.1154,0.1295,0.1268,0.1159,0.1186,0.8903,0.8172,0.1208,0.1255,0.923,0.5791
<>,1,2,3,4,5,6,7,8,9,10,11,12
A,0.1148,0.1166,0.1296,0.1271,0.1227,0.1157,0.6715,0.5915,0.1173,0.1237,1.0367,0.4577
B,0.119,0.1202,0.1292,0.1268,0.122,0.1243,0.7099,0.5983,0.1241,0.1187,0.4283,0.4795
C,0.1259,0.1214,0.1257,0.1347,0.1189,0.119,0.6576,0.6144,0.1208,0.1204,0.4289,0.6519
D,0.1153,0.1118,0.1252,0.1295,0.1205,0.1172,0.6803,0.7088,0.1214,0.1169,0.4205,0.6291
E,0.1192,0.1134,0.1248,0.1296,0.1184,0.1197,0.6708,0.6017,0.119,0.1232,0.4298,0.493
F,0.1133,0.1166,0.1272,0.1298,0.1184,0.1225,0.6098,0.5409,0.1196,0.1184,1.1237,0.6224
G,0.1264,0.1182,0.1332,0.1293,0.1225,0.1177,0.5424,0.5106,0.1206,0.1229,1.0883,0.5694
H,0.1159,0.1158,0.1291,0.1271,0.1145,0.1183,0.8889,0.8233,0.1208,0.1252,0.9198,0.5796
<>,1,2,3,4,5,6,7,8,9,10,11,12
A,0.1162,0.1161,0.1296,0.1269,0.1226,0.116,0.6706,0.5926,0.118,0.1237,1.0353,0.4665
B,0.118,0.1207,0.1291,0.127,0.1218,0.1242,0.7128,0.5987,0.1236,0.1186,0.4267,0.4754
C,0.1287,0.1225,0.1259,0.1345,0.1213,0.1217,0.6575,0.615,0.1205,0.1198,0.4369,0.6497
D,0.1141,0.1126,0.1253,0.1293,0.1196,0.1168,0.6809,0.7241,0.121,0.1166,0.421,0.6334
E,0.1185,0.1136,0.1249,0.1295,0.1198,0.1195,0.6694,0.6131,0.1186,0.1228,0.4653,0.5359
F,0.1138,0.1163,0.1277,0.1298,0.1183,0.1216,0.6112,0.5396,0.1198,0.1184,1.1261,0.622
G,0.1247,0.1175,0.1332,0.1311,0.1235,0.1157,0.5415,0.5092,0.1211,0.1225,1.0938,0.5685
H,0.1162,0.1152,0.129,0.1276,0.1139,0.1181,0.8877,0.8358,0.1209,0.125,0.9143,0.5774
<>,1,2,3,4,5,6,7,8,9,10,11,12
A,0.1162,0.1158,0.1296,0.1269,0.1214,0.1161,0.6696,0.5888,0.1177,0.123,1.0365,0.4428
B,0.1187,0.1206,0.129,0.1256,0.1215,0.1242,0.7152,0.5981,0.1234,0.1181,0.5187,0.4592
C,0.1282,0.1205,0.1248,0.1343,0.1222,0.1217,0.6572,0.6158,0.1208,0.1191,0.4318,0.6505
D,0.115,0.1124,0.1249,0.13,0.1204,0.1163,0.6802,0.7406,0.1208,0.1165,0.416,0.6424
E,0.1178,0.1144,0.1248,0.1286,0.119,0.1174,0.6699,0.6296,0.1193,0.1226,0.4688,0.5561
F,0.1132,0.1161,0.1273,0.1297,0.1181,0.1225,0.608,0.5404,0.1196,0.1182,1.1262,0.6208
G,0.1213,0.1182,0.1332,0.1309,0.1225,0.1173,0.5406,0.5063,0.1205,0.1223,1.0922,0.57
H,0.1183,0.1173,0.1292,0.1286,0.1173,0.1179,0.8872,0.8524,0.1209,0.1247,0.9122,0.5754
<>,1,2,3,4,5,6,7,8,9,10,11,12
A,0.1145,0.1181,0.1295,0.1261,0.1224,0.1152,0.669,0.5799,0.1165,0.1233,1.0348,0.4351
B,0.1183,0.1206,0.1286,0.1253,0.1215,0.1242,0.7182,0.6002,0.1231,0.118,0.5127,0.4607
C,0.1375,0.1207,0.1244,0.134,0.1194,0.1187,0.6562,0.6162,0.1203,0.1181,0.4336,0.6476
D,0.1156,0.1124,0.1249,0.13,0.1202,0.1157,0.6806,0.7739,0.1208,0.1163,0.4076,0.6577
E,0.1198,0.1137,0.1246,0.1281,0.119,0.1187,0.6699,0.7108,0.1183,0.1217,0.4717,0.5968
F,0.1122,0.1157,0.1271,0.1297,0.1186,0.1216,0.6078,0.5418,0.1188,0.118,1.1264,0.6209
G,0.1242,0.1175,0.133,0.1299,0.1238,0.1148,0.5399,0.5089,0.1213,0.1219,1.0911,0.5652
H,0.1197,0.1161,0.129,0.1289,0.1136,0.1179,0.8866,0.8803,0.1208,0.1246,0.9187,0.5741
<>,1,2,3,4,5,6,7,8,9,10,11,12
A,0.1161,0.1169,0.1295,0.1268,0.1216,0.1163,0.6691,0.5836,0.1179,0.1229,1.0332,0.4538
B,0.1178,0.1197,0.1287,0.1264,0.1214,0.1238,0.716,0.6068,0.1228,0.1175,0.494,0.4578
C,0.1433,0.1209,0.1243,0.1332,0.1192,0.1204,0.6573,0.6346,0.1208,0.1185,0.4483,0.6459
D,0.1138,0.1124,0.1247,0.1298,0.1188,0.1154,0.679,0.801,0.121,0.1162,0.4234,0.6573
E,0.1176,0.1133,0.1246,0.1292,0.1162,0.1185,0.6689,0.8007,0.1184,0.1214,0.4974,0.6127
F,0.1123,0.1156,0.127,0.1284,0.1182,0.1209,0.6061,0.5398,0.1178,0.1177,1.1223,0.6214
G,0.1166,0.119,0.133,0.1306,0.1227,0.1181,0.5411,0.5051,0.1198,0.1218,1.09,0.5667
H,0.1168,0.1149,0.1288,0.129,0.1153,0.1176,0.8868,0.9344,0.121,0.1243,0.9107,0.576
<>,1,2,3,4,5,6,7,8,9,10,11,12
A,0.1157,0.1194,0.1294,0.126,0.1212,0.1153,0.67,0.5909,0.1184,0.1221,1.0315,0.4632
B,0.118,0.1203,0.1286,0.1251,0.1213,0.1236,0.72,0.6127,0.1226,0.1171,0.4846,0.4724
C,0.1295,0.1202,0.124,0.1333,0.119,0.1199,0.655,0.6952,0.1203,0.1181,0.4552,0.6431
D,0.1144,0.1115,0.1247,0.13,0.1183,0.1145,0.6766,0.8306,0.1209,0.1161,0.4341,0.6909
E,0.1163,0.1126,0.1246,0.1287,0.1186,0.1174,0.6665,0.9316,0.1183,0.1216,0.4706,0.6275
F,0.112,0.1151,0.1268,0.1289,0.118,0.121,0.605,0.5392,0.1183,0.1175,1.1242,0.6182
G,0.1272,0.118,0.1327,0.1291,0.1231,0.1155,0.5418,0.5039,0.1191,0.121,1.0896,0.567
H,0.1172,0.1148,0.1283,0.1289,0.1151,0.1172,0.8857,1.03,0.1203,0.1241,0.9127,0.5765
<>,1,2,3,4,5,6,7,8,9,10,11,12
A,0.1161,0.1179,0.1296,0.1265,0.1214,0.1162,0.6708,0.5952,0.118,0.1225,1.026,0.4472
B,0.1172,0.1201,0.1285,0.1251,0.1214,0.1235,0.7208,0.6164,0.1226,0.1168,0.4476,0.4714
C,0.127,0.1198,0.1241,0.1333,0.1194,0.1197,0.6554,0.8384,0.1202,0.1176,0.4722,0.6429
D,0.1146,0.1115,0.1246,0.1297,0.1199,0.115,0.6781,0.8674,0.1204,0.1159,0.4478,0.698
E,0.1164,0.114,0.1245,0.1289,0.119,0.118,0.6673,1.1098,0.1185,0.1215,0.4394,0.6411
F,0.1132,0.1152,0.127,0.1289,0.1182,0.1201,0.6064,0.5357,0.118,0.1175,1.1234,0.6169
G,0.1171,0.1185,0.1327,0.1303,0.1202,0.1162,0.5422,0.5046,0.119,0.1212,1.0868,0.5678
H,0.1172,0.116,0.1282,0.1281,0.1152,0.117,0.885,1.203,0.1202,0.1238,0.9133,0.5735
<>,1,2,3,4,5,6,7,8,9,10,11,12
A,0.1157,0.1183,0.1298,0.126,0.1206,0.1149,0.6713,0.6,0.1175,0.1222,1.0274,0.4212
B,0.118,0.1198,0.1283,0.1258,0.1212,0.1227,0.722,0.6234,0.1224,0.1169,0.429,0.4745
C,0.1235,0.1196,0.124,0.1331,0.119,0.1183,0.6544,1.0977,0.1193,0.1176,0.4818,0.6397
D,0.1144,0.1114,0.1244,0.1303,0.1201,0.1144,0.6794,0.895,0.1205,0.1157,0.4528,0.7015
E,0.1181,0.1135,0.1241,0.1278,0.1158,0.1177,0.6659,1.365,0.1178,0.1206,0.5073,0.6707
F,0.1129,0.1149,0.1269,0.1284,0.1176,0.12,0.6043,0.5312,0.1175,0.1172,1.1241,0.6153
G,0.1224,0.117,0.1328,0.1287,0.1228,0.1181,0.5419,0.5029,0.1184,0.1207,1.0809,0.5713
H,0.1174,0.1159,0.1283,0.1263,0.1143,0.1165,0.8842,1.501,0.1196,0.1234,0.9103,0.572
<>,1,2,3,4,5,6,7,8,9,10,11,12
A,0.116,0.117,0.1295,0.1262,0.1211,0.1152,0.6731,0.5998,0.117,0.122,1.0241,0.4634
B,0.1173,0.1199,0.1284,0.1259,0.1204,0.1227,0.7222,0.6284,0.1219,0.1166,0.4251,0.4599
C,0.1256,0.1196,0.1239,0.1327,0.1202,0.1175,0.6539,1.4287,0.1195,0.1173,0.4867,0.6402
D,0.1142,0.1116,0.1243,0.13,0.1181,0.1145,0.6765,0.9342,0.12,0.1153,0.4392,0.705
E,0.1181,0.1134,0.1239,0.1284,0.1157,0.1173,0.6637,1.6299,0.118,0.1205,0.4309,0.6942
F,0.1129,0.1148,0.127,0.1288,0.1179,0.1196,0.604,0.5335,0.1169,0.117,1.1252,0.6128
G,0.1178,0.1163,0.1324,0.1302,0.1218,0.1165,0.5386,0.5036,0.1194,0.1206,1.0815,0.5627
H,0.1154,0.1161,0.128,0.1258,0.1147,0.1163,0.8833,1.7238,0.1197,0.1235,0.9118,0.573
<>,1,2,3,4,5,6,7,8,9,10,11,12
A,0.1156,0.1148,0.1298,0.1266,0.1208,0.1155,0.6742,0.6023,0.1175,0.122,1.0243,0.4681
B,0.1176,0.1192,0.1291,0.126,0.1204,0.1219,0.7229,0.6445,0.1218,0.1164,0.4281,0.3803
C,0.1185,0.1195,0.124,0.1322,0.1188,0.1196,0.6826,1.7264,0.1192,0.117,0.4903,0.6387
D,0.1143,0.1115,0.1243,0.1303,0.1199,0.1141,0.6756,0.9613,0.12,0.115,0.483,0.7161
E,0.1181,0.1123,0.1239,0.1286,0.1159,0.1176,0.663,1.7903,0.1175,0.1205,0.4002,0.7285
F,0.1127,0.1151,0.1269,0.1288,0.1177,0.1194,0.6027,0.5337,0.1174,0.1171,1.1485,0.6103
G,0.1218,0.1172,0.1324,0.1299,0.1213,0.1153,0.5394,0.5051,0.1185,0.1204,1.0803,0.56
H,0.1164,0.1148,0.1281,0.1252,0.1133,0.1163,0.8824,1.7992,0.1198,0.1235,0.91,0.5742
<>,1,2,3,4,5,6,7,8,9,10,11,12
A,0.1157,0.1157,0.1295,0.1257,0.1209,0.1147,0.678,0.5959,0.1175,0.1216,1.0217,0.4627
B,0.1175,0.1197,0.1287,0.1261,0.1205,0.1223,0.724,0.6427,0.122,0.1165,0.443,0.4137
C,0.1146,0.1192,0.1238,0.1321,0.1191,0.1168,0.679,1.8439,0.1192,0.1169,0.4927,0.6378
D,0.1133,0.1117,0.1242,0.1295,0.1196,0.114,0.6744,0.9797,0.1198,0.115,0.5003,0.7411
E,0.1167,0.1119,0.1239,0.1285,0.1151,0.1171,0.6611,1.8637,0.1179,0.1207,0.4415,0.757
F,0.1118,0.1145,0.1267,0.1276,0.117,0.1198,0.6019,0.5309,0.1173,0.117,1.1397,0.6126
G,0.1404,0.117,0.1325,0.1302,0.1217,0.1166,0.5407,0.504,0.1212,0.1199,1.0779,0.5612
H,0.1169,0.1158,0.128,0.1244,0.1141,0.1161,0.8807,1.8226,0.1197,0.1233,0.9067,0.5717
<>,1,2,3,4,5,6,7,8,9,10,11,12
A,0.1155,0.1155,0.129,0.1258,0.1204,0.1165,0.6801,0.605,0.1162,0.1218,1.0179,0.4799
B,0.1175,0.1182,0.1288,0.1259,0.1203,0.1215,0.7194,0.6641,0.1217,0.1163,0.5018,0.4637
C,0.1131,0.1196,0.124,0.1315,0.1187,0.1188,0.6638,1.8996,0.1191,0.1169,0.4851,0.6356
D,0.1136,0.1112,0.1242,0.1297,0.1184,0.1134,0.6849,1.0059,0.1193,0.1148,0.4689,0.7597
E,0.1156,0.1136,0.1239,0.1273,0.1167,0.117,0.6626,1.8844,0.1174,0.1203,0.4709,0.7804
F,0.1125,0.1143,0.1266,0.127,0.1172,0.1198,0.6032,0.5323,0.1169,0.1168,1.1398,0.6139
G,0.1282,0.1168,0.1324,0.1295,0.1187,0.1154,0.5346,0.5076,0.1209,0.1198,1.0783,0.5644
H,0.1148,0.1156,0.1278,0.1249,0.1135,0.1161,0.8812,1.8172,0.1191,0.1234,0.9071,0.5724
<>,1,2,3,4,5,6,7,8,9,10,11,12
A,0.1149,0.1141,0.1291,0.1266,0.1204,0.1153,0.6841,0.6122,0.117,0.121,1.0168,0.516
B,0.1165,0.1195,0.1287,0.1257,0.12,0.1221,0.7243,0.6038,0.1215,0.1163,0.54,0.4734
C,0.1254,0.1188,0.1241,0.1319,0.1186,0.1188,0.6489,1.9224,0.119,0.117,0.4987,0.6213
D,0.1134,0.1111,0.1244,0.1297,0.1183,0.1137,0.6951,1.0342,0.1192,0.1146,0.5143,0.7752
E,0.1173,0.1135,0.1237,0.1281,0.1154,0.1172,0.6638,1.8845,0.1174,0.1205,0.4777,0.8115
F,0.1126,0.1143,0.1269,0.1269,0.1172,0.1191,0.6018,0.5301,0.1166,0.1168,1.1474,0.6104
G,0.1237,0.1159,0.1324,0.13,0.1194,0.1137,0.5366,0.5039,0.1191,0.1198,1.0778,0.565
H,0.1157,0.1146,0.1281,0.1244,0.1138,0.116,0.8817,1.8033,0.1193,0.1232,0.9038,0.573
<>,1,2,3,4,5,6,7,8,9,10,11,12
A,0.1144,0.1157,0.1288,0.1264,0.1207,0.1152,0.6842,0.6148,0.1157,0.1215,1.0149,0.5023
B,0.1172,0.1184,0.1286,0.1245,0.12,0.1218,0.7214,0.6462,0.1213,0.1163,0.5433,0.6155
C,0.1129,0.1183,0.1243,0.132,0.1194,0.1188,0.6351,1.9217,0.1181,0.1169,0.5023,0.6142
D,0.1141,0.1111,0.1241,0.1296,0.1179,0.1136,0.7079,1.0661,0.1187,0.1147,0.5276,0.8768
E,0.1169,0.1135,0.1237,0.127,0.1164,0.1156,0.6628,1.8731,0.1173,0.1201,0.4446,0.8437
F,0.1126,0.114,0.1265,0.1269,0.1169,0.119,0.6046,0.5311,0.1169,0.1168,1.1773,0.6087
G,0.1208,0.1156,0.1328,0.1287,0.1182,0.1134,0.5368,0.5075,0.12,0.1198,1.0758,0.5652
H,0.115,0.1156,0.1277,0.1247,0.114,0.1158,0.8811,1.8031,0.1195,0.1234,0.9052,0.5736
<>,1,2,3,4,5,6,7,8,9,10,11,12
A,0.1156,0.1148,0.1286,0.1263,0.1202,0.1154,0.6886,0.639,0.1166,0.1213,1.0139,0.4977
B,0.1169,0.1191,0.1287,0.1256,0.1199,0.1214,0.7219,0.6274,0.1212,0.1163,0.5634,0.618
C,0.1225,0.1189,0.1237,0.1322,0.1185,0.1188,0.6217,1.9176,0.1183,0.1164,0.4758,0.6132
D,0.1132,0.111,0.1239,0.1296,0.1175,0.1135,0.7356,1.084,0.1192,0.1143,0.4839,0.6853
E,0.1157,0.1123,0.1233,0.128,0.1169,0.1156,0.6858,1.8646,0.1171,0.12,0.5169,0.8554
F,0.112,0.1137,0.127,0.1291,0.1164,0.1197,0.6027,0.5315,0.117,0.1167,1.1782,0.6098
G,0.1151,0.1179,0.1323,0.1287,0.1204,0.1154,0.5353,0.5066,0.1198,0.1194,1.0769,0.5604
H,0.1161,0.1145,0.1278,0.1241,0.114,0.116,0.8855,1.799,0.119,0.1233,0.9038,0.5725
<>,1,2,3,4,5,6,7,8,9,10,11,12
A,0.1148,0.1153,0.1289,0.1265,0.1202,0.1155,0.6944,0.6513,0.116,0.1212,1.0128,0.5414
B,0.117,0.1192,0.1286,0.1255,0.1197,0.1215,0.7251,0.6556,0.1207,0.1162,0.6093,0.6065
C,0.1124,0.1186,0.1239,0.1321,0.1188,0.1174,0.6189,1.9169,0.119,0.117,0.428,0.6265
D,0.1141,0.1111,0.1242,0.1298,0.1183,0.1136,0.7894,1.095,0.1191,0.1144,0.5158,0.6623
E,0.1166,0.1117,0.1233,0.1272,0.1163,0.1154,0.6852,1.8588,0.1172,0.1197,0.486,0.6176
F,0.1128,0.1136,0.1268,0.1279,0.1164,0.1191,0.6011,0.5371,0.1164,0.1167,1.1545,0.616
G,0.1201,0.1156,0.1323,0.1286,0.1209,0.1154,0.532,0.5114,0.1181,0.1194,1.0778,0.5615
H,0.1149,0.1149,0.1278,0.1247,0.1137,0.1156,0.8866,1.7944,0.1192,0.1232,0.9018,0.5731
<>,1,2,3,4,5,6,7,8,9,10,11,12
A,0.1142,0.1145,0.1287,0.1257,0.1194,0.115,0.6973,0.668,0.1153,0.1211,1.011,0.5404
B,0.1168,0.118,0.1286,0.1242,0.1199,0.1208,0.7273,0.65,0.1209,0.1161,0.6519,0.6927
C,0.114,0.1183,0.1236,0.1319,0.1193,0.1184,0.6116,1.9143,0.1186,0.117,0.4528,0.6241
D,0.1136,0.1109,0.1241,0.1303,0.1187,0.1135,0.8277,1.1152,0.1184,0.1142,0.4951,0.9825
E,0.1175,0.1136,0.1232,0.1283,0.1147,0.1153,0.6795,1.8513,0.117,0.1198,0.5372,0.8752
F,0.1124,0.1137,0.1267,0.1311,0.1167,0.119,0.5841,0.5342,0.1164,0.1166,1.1632,0.605
G,0.1198,0.1155,0.1321,0.1288,0.1204,0.1132,0.5351,0.5193,0.1189,0.1191,1.0759,0.5435
H,0.1155,0.1145,0.1278,0.1248,0.1137,0.116,0.891,1.7974,0.1191,0.1229,0.9012,0.5755
<>,1,2,3,4,5,6,7,8,9,10,11,12
A,0.1157,0.1151,0.1287,0.1262,0.12,0.1154,0.7006,0.662,0.1155,0.1205,1.0067,0.5009
B,0.1168,0.1177,0.1282,0.1254,0.1196,0.1212,0.725,0.6296,0.1207,0.116,0.7129,0.7938
C,0.1154,0.1182,0.124,0.132,0.1191,0.1166,0.6198,1.912,0.118,0.1166,0.4563,0.6228
D,0.1135,0.1109,0.1242,0.1298,0.1191,0.1135,0.8753,1.1192,0.1184,0.1141,0.5168,0.9166
E,0.1157,0.1133,0.1234,0.1279,0.1151,0.1169,0.683,1.8456,0.1171,0.1196,0.5999,0.7927
F,0.1128,0.1138,0.1267,0.1305,0.1167,0.1188,0.5794,0.5385,0.1167,0.1167,1.197,0.6063
G,0.1171,0.1154,0.1323,0.1288,0.1188,0.1153,0.5338,0.5075,0.1171,0.1193,1.0776,0.538
H,0.1155,0.1148,0.1276,0.1249,0.1138,0.1157,0.8888,1.7956,0.119,0.1231,0.8985,0.5754
<>,1,2,3,4,5,6,7,8,9,10,11,12
A,0.1138,0.1136,0.1286,0.1261,0.1196,0.115,0.7062,0.6487,0.1166,0.1204,1.0072,0.5937
B,0.1168,0.1176,0.1283,0.1242,0.1193,0.1205,0.7244,0.6424,0.1209,0.116,0.8412,0.729
C,0.1127,0.1176,0.1238,0.1312,0.1187,0.1177,0.6339,1.9095,0.1185,0.1161,0.3968,0.5674
D,0.1134,0.1107,0.1243,0.1297,0.1174,0.1134,0.9275,1.1473,0.1187,0.1142,0.4844,0.8401
E,0.1168,0.1129,0.1236,0.1282,0.1162,0.1163,0.6813,1.8404,0.1166,0.1198,0.6413,0.8386
F,0.1125,0.1137,0.1266,0.1307,0.1164,0.1185,0.5776,0.5363,0.1157,0.1165,1.1804,0.6046
G,0.1169,0.1155,0.1321,0.1286,0.1179,0.115,0.5315,0.5137,0.1166,0.1188,1.0811,0.5285
H,0.1149,0.1152,0.1276,0.1249,0.1135,0.1154,0.8892,1.7969,0.1188,0.1231,0.8958,0.5847