(kicad_sch (version 20230121) (generator eeschema)

  (uuid 63aa6def-ef9c-46b1-a1e0-5e11e06f19e3)

  (paper "A4")

  (title_block
    (title "Science Unit Main Board (Payload Board)")
    (date "2022-03-13")
    (rev "2.0 (EM)")
    (company "SpaceDot")
    (comment 1 "AcubeSAT")
  )

  (lib_symbols
  )

)
