{
  "board": {
    "3dviewports": [],
    "design_settings": {
      "defaults": {
        "apply_defaults_to_fp_fields": false,
        "apply_defaults_to_fp_shapes": false,
        "apply_defaults_to_fp_text": false,
        "board_outline_line_width": 0.05,
        "copper_line_width": 0.2,
        "copper_text_italic": false,
        "copper_text_size_h": 1.5,
        "copper_text_size_v": 1.5,
        "copper_text_thickness": 0.3,
        "copper_text_upright": false,
        "courtyard_line_width": 0.05,
        "dimension_precision": 4,
        "dimension_units": 3,
        "dimensions": {
          "arrow_length": 1270000,
          "extension_offset": 500000,
          "keep_text_aligned": true,
          "suppress_zeroes": false,
          "text_position": 0,
          "units_format": 1
        },
        "fab_line_width": 0.1,
        "fab_text_italic": false,
        "fab_text_size_h": 1.0,
        "fab_text_size_v": 1.0,
        "fab_text_thickness": 0.15,
        "fab_text_upright": false,
        "other_line_width": 0.1,
        "other_text_italic": false,
        "other_text_size_h": 1.0,
        "other_text_size_v": 1.0,
        "other_text_thickness": 0.15,
        "other_text_upright": false,
        "pads": {
          "drill": 3.2,
          "height": 4.6,
          "width": 4.6
        },
        "silk_line_width": 0.1,
        "silk_text_italic": false,
        "silk_text_size_h": 1.0,
        "silk_text_size_v": 1.0,
        "silk_text_thickness": 0.1,
        "silk_text_upright": false,
        "zones": {
          "min_clearance": 0.0
        }
      },
      "diff_pair_dimensions": [
        {
          "gap": 0.0,
          "via_gap": 0.0,
          "width": 0.0
        },
        {
          "gap": 0.25,
          "via_gap": 0.2,
          "width": 0.193
        },
        {
          "gap": 0.25,
          "via_gap": 0.2,
          "width": 0.222
        }
      ],
      "drc_exclusions": [],
      "meta": {
        "version": 2
      },
      "rule_severities": {
        "annular_width": "error",
        "clearance": "error",
        "connection_width": "error",
        "copper_edge_clearance": "error",
        "copper_sliver": "warning",
        "courtyards_overlap": "error",
        "diff_pair_gap_out_of_range": "error",
        "diff_pair_uncoupled_length_too_long": "error",
        "drill_out_of_range": "error",
        "duplicate_footprints": "warning",
        "extra_footprint": "warning",
        "footprint": "error",
        "footprint_symbol_mismatch": "warning",
        "footprint_type_mismatch": "ignore",
        "hole_clearance": "error",
        "hole_near_hole": "error",
        "holes_co_located": "warning",
        "invalid_outline": "error",
        "isolated_copper": "warning",
        "item_on_disabled_layer": "error",
        "items_not_allowed": "error",
        "length_out_of_range": "error",
        "lib_footprint_issues": "warning",
        "lib_footprint_mismatch": "warning",
        "malformed_courtyard": "error",
        "microvia_drill_out_of_range": "error",
        "missing_courtyard": "ignore",
        "missing_footprint": "warning",
        "net_conflict": "warning",
        "npth_inside_courtyard": "ignore",
        "padstack": "warning",
        "pth_inside_courtyard": "ignore",
        "shorting_items": "error",
        "silk_edge_clearance": "ignore",
        "silk_over_copper": "ignore",
        "silk_overlap": "ignore",
        "skew_out_of_range": "error",
        "solder_mask_bridge": "error",
        "starved_thermal": "error",
        "text_height": "ignore",
        "text_thickness": "ignore",
        "through_hole_pad_without_hole": "error",
        "too_many_vias": "error",
        "track_dangling": "warning",
        "track_width": "error",
        "tracks_crossing": "error",
        "unconnected_items": "error",
        "unresolved_variable": "error",
        "via_dangling": "warning",
        "zones_intersect": "error"
      },
      "rules": {
        "max_error": 0.005,
        "min_clearance": 0.2,
        "min_connection": 0.115,
        "min_copper_edge_clearance": 0.508,
        "min_hole_clearance": 0.35,
        "min_hole_to_hole": 0.25,
        "min_microvia_diameter": 0.2,
        "min_microvia_drill": 0.1,
        "min_resolved_spokes": 2,
        "min_silk_clearance": 0.16,
        "min_text_height": 1.22,
        "min_text_thickness": 0.18,
        "min_through_hole_diameter": 0.3,
        "min_track_width": 0.115,
        "min_via_annular_width": 0.15,
        "min_via_diameter": 0.5,
        "solder_mask_to_copper_clearance": 0.005,
        "use_height_for_length_calcs": true
      },
      "teardrop_options": [
        {
          "td_onpadsmd": true,
          "td_onroundshapesonly": false,
          "td_ontrackend": false,
          "td_onviapad": true
        }
      ],
      "teardrop_parameters": [
        {
          "td_allow_use_two_tracks": true,
          "td_curve_segcount": 0,
          "td_height_ratio": 1.0,
          "td_length_ratio": 0.5,
          "td_maxheight": 2.0,
          "td_maxlen": 1.0,
          "td_on_pad_in_zone": false,
          "td_target_name": "td_round_shape",
          "td_width_to_size_filter_ratio": 0.9
        },
        {
          "td_allow_use_two_tracks": true,
          "td_curve_segcount": 0,
          "td_height_ratio": 1.0,
          "td_length_ratio": 0.5,
          "td_maxheight": 2.0,
          "td_maxlen": 1.0,
          "td_on_pad_in_zone": false,
          "td_target_name": "td_rect_shape",
          "td_width_to_size_filter_ratio": 0.9
        },
        {
          "td_allow_use_two_tracks": true,
          "td_curve_segcount": 0,
          "td_height_ratio": 1.0,
          "td_length_ratio": 0.5,
          "td_maxheight": 2.0,
          "td_maxlen": 1.0,
          "td_on_pad_in_zone": false,
          "td_target_name": "td_track_end",
          "td_width_to_size_filter_ratio": 0.9
        }
      ],
      "track_widths": [
        0.0,
        0.1151,
        0.1184,
        0.1234,
        0.125,
        0.13,
        0.15,
        0.1516,
        0.1816,
        0.1862,
        0.2,
        0.2126,
        0.222,
        0.25,
        0.3,
        0.3553,
        0.4,
        0.5,
        0.56,
        0.6,
        0.65,
        0.7,
        0.8
      ],
      "tuning_pattern_settings": {
        "diff_pair_defaults": {
          "corner_radius_percentage": 80,
          "corner_style": 1,
          "max_amplitude": 1.0,
          "min_amplitude": 0.2,
          "single_sided": false,
          "spacing": 1.0
        },
        "diff_pair_skew_defaults": {
          "corner_radius_percentage": 80,
          "corner_style": 1,
          "max_amplitude": 1.0,
          "min_amplitude": 0.2,
          "single_sided": false,
          "spacing": 0.6
        },
        "single_track_defaults": {
          "corner_radius_percentage": 80,
          "corner_style": 1,
          "max_amplitude": 1.0,
          "min_amplitude": 0.2,
          "single_sided": false,
          "spacing": 0.6
        }
      },
      "via_dimensions": [
        {
          "diameter": 0.0,
          "drill": 0.0
        },
        {
          "diameter": 0.4,
          "drill": 0.2
        },
        {
          "diameter": 0.5,
          "drill": 0.25
        },
        {
          "diameter": 0.6,
          "drill": 0.3
        },
        {
          "diameter": 0.8,
          "drill": 0.4
        }
      ],
      "zones_allow_external_fillets": false
    },
    "ipc2581": {
      "dist": "",
      "distpn": "",
      "internal_id": "",
      "mfg": "",
      "mpn": ""
    },
    "layer_presets": [],
    "viewports": []
  },
  "boards": [],
  "cvpcb": {
    "equivalence_files": []
  },
  "erc": {
    "erc_exclusions": [],
    "meta": {
      "version": 0
    },
    "pin_map": [
      [
        0,
        0,
        0,
        0,
        0,
        0,
        0,
        0,
        0,
        0,
        0,
        2
      ],
      [
        0,
        0,
        0,
        1,
        0,
        0,
        0,
        0,
        0,
        2,
        2,
        2
      ],
      [
        0,
        0,
        0,
        0,
        0,
        0,
        0,
        0,
        1,
        0,
        1,
        2
      ],
      [
        0,
        1,
        0,
        0,
        0,
        0,
        0,
        1,
        2,
        1,
        1,
        2
      ],
      [
        0,
        0,
        0,
        0,
        0,
        0,
        0,
        0,
        0,
        0,
        0,
        2
      ],
      [
        0,
        0,
        0,
        0,
        0,
        0,
        0,
        0,
        0,
        0,
        0,
        2
      ],
      [
        0,
        0,
        0,
        0,
        0,
        0,
        0,
        0,
        0,
        0,
        0,
        2
      ],
      [
        0,
        0,
        0,
        1,
        0,
        0,
        0,
        0,
        0,
        0,
        0,
        2
      ],
      [
        0,
        0,
        1,
        2,
        0,
        0,
        0,
        0,
        0,
        2,
        2,
        2
      ],
      [
        0,
        2,
        0,
        1,
        0,
        0,
        0,
        0,
        2,
        0,
        0,
        2
      ],
      [
        0,
        2,
        1,
        1,
        0,
        0,
        0,
        0,
        2,
        0,
        0,
        2
      ],
      [
        2,
        2,
        2,
        2,
        2,
        2,
        2,
        2,
        2,
        2,
        2,
        2
      ]
    ],
    "rule_severities": {
      "bus_definition_conflict": "error",
      "bus_entry_needed": "error",
      "bus_label_syntax": "error",
      "bus_to_bus_conflict": "error",
      "bus_to_net_conflict": "error",
      "conflicting_netclasses": "error",
      "different_unit_footprint": "error",
      "different_unit_net": "error",
      "duplicate_reference": "error",
      "duplicate_sheet_names": "error",
      "endpoint_off_grid": "warning",
      "extra_units": "error",
      "global_label_dangling": "warning",
      "hier_label_mismatch": "error",
      "label_dangling": "error",
      "lib_symbol_issues": "warning",
      "missing_bidi_pin": "warning",
      "missing_input_pin": "warning",
      "missing_power_pin": "error",
      "missing_unit": "warning",
      "multiple_net_names": "warning",
      "net_not_bus_member": "warning",
      "no_connect_connected": "warning",
      "no_connect_dangling": "warning",
      "pin_not_connected": "error",
      "pin_not_driven": "error",
      "pin_to_pin": "error",
      "power_pin_not_driven": "error",
      "similar_labels": "warning",
      "simulation_model_issue": "ignore",
      "unannotated": "error",
      "unit_value_mismatch": "error",
      "unresolved_variable": "error",
      "wire_dangling": "error"
    }
  },
  "libraries": {
    "pinned_footprint_libs": [
      "SU-PCB-IC",
      "SU-PCB-Connectors",
      "SU-PCB-Passives",
      "Silkscreen"
    ],
    "pinned_symbol_libs": [
      "SU-PCB-IC",
      "SU-PCB-Connectors",
      "Passives"
    ]
  },
  "meta": {
    "filename": "EQM-SU-PCB.kicad_pro",
    "version": 1
  },
  "net_settings": {
    "classes": [
      {
        "bus_width": 12,
        "clearance": 0.2,
        "diff_pair_gap": 0.25,
        "diff_pair_via_gap": 0.25,
        "diff_pair_width": 0.2,
        "line_style": 0,
        "microvia_diameter": 0.3,
        "microvia_drill": 0.1,
        "name": "Default",
        "pcb_color": "rgba(0, 0, 0, 0.000)",
        "schematic_color": "rgba(0, 0, 0, 0.000)",
        "track_width": 0.2,
        "via_diameter": 0.6,
        "via_drill": 0.3,
        "wire_width": 6
      },
      {
        "bus_width": 12,
        "clearance": 0.2,
        "diff_pair_gap": 0.25,
        "diff_pair_via_gap": 0.25,
        "diff_pair_width": 0.5324,
        "line_style": 0,
        "microvia_diameter": 0.3,
        "microvia_drill": 0.1,
        "name": "50Ohm (Non-coplanar) - L1",
        "pcb_color": "rgba(0, 0, 0, 0.000)",
        "schematic_color": "rgba(0, 0, 0, 0.000)",
        "track_width": 0.1862,
        "via_diameter": 0.6,
        "via_drill": 0.3,
        "wire_width": 6
      },
      {
        "bus_width": 12,
        "clearance": 0.2,
        "diff_pair_gap": 0.25,
        "diff_pair_via_gap": 0.25,
        "diff_pair_width": 0.6132,
        "line_style": 0,
        "microvia_diameter": 0.3,
        "microvia_drill": 0.1,
        "name": "50Ohm (Non-coplanar) - L3",
        "pcb_color": "rgba(0, 0, 0, 0.000)",
        "schematic_color": "rgba(0, 0, 0, 0.000)",
        "track_width": 0.2126,
        "via_diameter": 0.6,
        "via_drill": 0.3,
        "wire_width": 6
      },
      {
        "bus_width": 12,
        "clearance": 0.2,
        "diff_pair_gap": 0.508,
        "diff_pair_via_gap": 0.25,
        "diff_pair_width": 0.1151,
        "line_style": 0,
        "microvia_diameter": 0.3,
        "microvia_drill": 0.1,
        "name": "CAN Diff. Pair (Non co-planar) - L1",
        "pcb_color": "rgba(0, 0, 0, 0.000)",
        "schematic_color": "rgba(0, 0, 0, 0.000)",
        "track_width": 0.1234,
        "via_diameter": 0.6,
        "via_drill": 0.3,
        "wire_width": 6
      },
      {
        "bus_width": 12,
        "clearance": 0.2,
        "diff_pair_gap": 0.25,
        "diff_pair_via_gap": 0.25,
        "diff_pair_width": 0.2,
        "line_style": 0,
        "microvia_diameter": 0.3,
        "microvia_drill": 0.1,
        "name": "GND",
        "pcb_color": "rgba(0, 0, 0, 0.000)",
        "schematic_color": "rgba(0, 0, 0, 0.000)",
        "track_width": 0.4,
        "via_diameter": 0.6,
        "via_drill": 0.3,
        "wire_width": 6
      },
      {
        "bus_width": 12,
        "clearance": 0.2,
        "diff_pair_gap": 0.25,
        "diff_pair_via_gap": 0.25,
        "diff_pair_width": 0.1931,
        "line_style": 0,
        "microvia_diameter": 0.3,
        "microvia_drill": 0.1,
        "name": "USB Diff. Pair (Non-coplanar) - L1",
        "pcb_color": "rgba(0, 0, 0, 0.000)",
        "schematic_color": "rgba(0, 0, 0, 0.000)",
        "track_width": 0.1931,
        "via_diameter": 0.6,
        "via_drill": 0.3,
        "wire_width": 6
      },
      {
        "bus_width": 12,
        "clearance": 0.2,
        "diff_pair_gap": 0.25,
        "diff_pair_via_gap": 0.25,
        "diff_pair_width": 0.222,
        "line_style": 0,
        "microvia_diameter": 0.3,
        "microvia_drill": 0.1,
        "name": "USB Diff. Pair (Non-coplanar) - L3",
        "pcb_color": "rgba(0, 0, 0, 0.000)",
        "schematic_color": "rgba(0, 0, 0, 0.000)",
        "track_width": 0.222,
        "via_diameter": 0.6,
        "via_drill": 0.3,
        "wire_width": 6
      }
    ],
    "meta": {
      "version": 3
    },
    "net_colors": null,
    "netclass_assignments": null,
    "netclass_patterns": [
      {
        "netclass": "USB Diff. Pair (Non-coplanar) - L3",
        "pattern": ""
      },
      {
        "netclass": "Default",
        "pattern": "/MCU/ATSAM_USBHS_HSD+"
      },
      {
        "netclass": "USB Diff. Pair (Non-coplanar) - L3",
        "pattern": "/MCU/ATSAM_USBHS_HSD-"
      },
      {
        "netclass": "CAN Diff. Pair (Non co-planar) - L1",
        "pattern": "/MCU/CAN0_-"
      },
      {
        "netclass": "CAN Diff. Pair (Non co-planar) - L1",
        "pattern": "/MCU/CAN0_+"
      },
      {
        "netclass": "CAN Diff. Pair (Non co-planar) - L1",
        "pattern": "/MCU/CAN1_-"
      },
      {
        "netclass": "CAN Diff. Pair (Non co-planar) - L1",
        "pattern": "/MCU/CAN1_+"
      },
      {
        "netclass": "GND",
        "pattern": "GND"
      }
    ]
  },
  "pcbnew": {
    "last_paths": {
      "gencad": "",
      "idf": "",
      "netlist": "EQM-SU-PCB.net",
      "plot": "Gerber/",
      "pos_files": "",
      "specctra_dsn": "",
      "step": "EQM-SU-PCB.step",
      "svg": "",
      "vrml": ""
    },
    "page_layout_descr_file": ""
  },
  "schematic": {
    "annotate_start_num": 0,
    "bom_export_filename": "bom/EQM-SU-PCB.csv",
    "bom_fmt_presets": [],
    "bom_fmt_settings": {
      "field_delimiter": ",",
      "keep_line_breaks": false,
      "keep_tabs": false,
      "name": "CSV",
      "ref_delimiter": ",",
      "ref_range_delimiter": "",
      "string_delimiter": "\""
    },
    "bom_presets": [],
    "bom_settings": {
      "exclude_dnp": false,
      "fields_ordered": [
        {
          "group_by": false,
          "label": "Reference",
          "name": "Reference",
          "show": true
        },
        {
          "group_by": true,
          "label": "Value",
          "name": "Value",
          "show": false
        },
        {
          "group_by": false,
          "label": "Datasheet",
          "name": "Datasheet",
          "show": false
        },
        {
          "group_by": false,
          "label": "Footprint",
          "name": "Footprint",
          "show": false
        },
        {
          "group_by": false,
          "label": "Qty",
          "name": "${QUANTITY}",
          "show": true
        },
        {
          "group_by": true,
          "label": "DNP",
          "name": "${DNP}",
          "show": true
        },
        {
          "group_by": false,
          "label": "#",
          "name": "${ITEM_NUMBER}",
          "show": false
        },
        {
          "group_by": false,
          "label": "Arrow Part Number",
          "name": "Arrow Part Number",
          "show": false
        },
        {
          "group_by": false,
          "label": "Arrow Price/Stock",
          "name": "Arrow Price/Stock",
          "show": false
        },
        {
          "group_by": false,
          "label": "Availability",
          "name": "Availability",
          "show": false
        },
        {
          "group_by": false,
          "label": "Check_prices",
          "name": "Check_prices",
          "show": false
        },
        {
          "group_by": false,
          "label": "Description_1",
          "name": "Description_1",
          "show": false
        },
        {
          "group_by": false,
          "label": "Height",
          "name": "Height",
          "show": false
        },
        {
          "group_by": false,
          "label": "MANUFACTURER",
          "name": "MANUFACTURER",
          "show": false
        },
        {
          "group_by": false,
          "label": "MAXIMUM_PACKAGE_HEIGHT",
          "name": "MAXIMUM_PACKAGE_HEIGHT",
          "show": false
        },
        {
          "group_by": false,
          "label": "MF",
          "name": "MF",
          "show": false
        },
        {
          "group_by": false,
          "label": "MP",
          "name": "MP",
          "show": false
        },
        {
          "group_by": false,
          "label": "MPN",
          "name": "MPN",
          "show": false
        },
        {
          "group_by": false,
          "label": "Manufacturer_Name",
          "name": "Manufacturer_Name",
          "show": false
        },
        {
          "group_by": false,
          "label": "Manufacturer_Part_Number",
          "name": "Manufacturer_Part_Number",
          "show": true
        },
        {
          "group_by": false,
          "label": "Mouser Part Number",
          "name": "Mouser Part Number",
          "show": false
        },
        {
          "group_by": false,
          "label": "Mouser Price/Stock",
          "name": "Mouser Price/Stock",
          "show": false
        },
        {
          "group_by": false,
          "label": "PARTREV",
          "name": "PARTREV",
          "show": false
        },
        {
          "group_by": false,
          "label": "Package",
          "name": "Package",
          "show": false
        },
        {
          "group_by": false,
          "label": "Price",
          "name": "Price",
          "show": false
        },
        {
          "group_by": false,
          "label": "Purchase-URL",
          "name": "Purchase-URL",
          "show": false
        },
        {
          "group_by": false,
          "label": "STANDARD",
          "name": "STANDARD",
          "show": false
        },
        {
          "group_by": false,
          "label": "SnapEDA_Link",
          "name": "SnapEDA_Link",
          "show": false
        },
        {
          "group_by": false,
          "label": "Description",
          "name": "Description",
          "show": false
        },
        {
          "group_by": false,
          "label": "Manfacturer_Part_Number",
          "name": "Manfacturer_Part_Number",
          "show": false
        }
      ],
      "filter_string": "",
      "group_symbols": true,
      "name": "",
      "sort_asc": true,
      "sort_field": "Reference"
    },
    "connection_grid_size": 50.0,
    "drawing": {
      "dashed_lines_dash_length_ratio": 12.0,
      "dashed_lines_gap_length_ratio": 3.0,
      "default_line_thickness": 6.0,
      "default_text_size": 50.0,
      "field_names": [],
      "intersheets_ref_own_page": false,
      "intersheets_ref_prefix": "",
      "intersheets_ref_short": false,
      "intersheets_ref_show": false,
      "intersheets_ref_suffix": "",
      "junction_size_choice": 3,
      "label_size_ratio": 0.375,
      "operating_point_overlay_i_precision": 3,
      "operating_point_overlay_i_range": "~A",
      "operating_point_overlay_v_precision": 3,
      "operating_point_overlay_v_range": "~V",
      "overbar_offset_ratio": 1.23,
      "pin_symbol_size": 25.0,
      "text_offset_ratio": 0.15
    },
    "legacy_lib_dir": "",
    "legacy_lib_list": [],
    "meta": {
      "version": 1
    },
    "net_format_name": "KiCad",
    "ngspice": {
      "fix_include_paths": true,
      "fix_passive_vals": false,
      "meta": {
        "version": 0
      },
      "model_mode": 0,
      "workbook_filename": ""
    },
    "page_layout_descr_file": "",
    "plot_directory": "./",
    "spice_adjust_passive_values": false,
    "spice_current_sheet_as_root": false,
    "spice_external_command": "spice \"%I\"",
    "spice_model_current_sheet_as_root": true,
    "spice_save_all_currents": false,
    "spice_save_all_dissipations": false,
    "spice_save_all_voltages": false,
    "subpart_first_id": 65,
    "subpart_id_separator": 0
  },
  "sheets": [
    [
      "ab60d743-7d21-44ca-af12-9d3ffcf1b44a",
      "Root"
    ],
    [
      "9b57da43-2558-4feb-ba22-740f28b2e717",
      "MCU"
    ],
    [
      "6e3e3895-e943-420a-a2c0-edb4a4a12c60",
      "NAND Flash"
    ],
    [
      "7b2c92a5-0e04-48b1-86e8-0ed36fb5c8f5",
      "Dosimeter"
    ],
    [
      "7ece7641-c949-474d-a8a5-24e5b298bf42",
      "Digital Sensors"
    ],
    [
      "ac0cb693-f0c7-4bec-a5c5-fb3521b53123",
      "Fluidics-Valves"
    ],
    [
      "eb8e223d-61af-4dc5-9ae5-d06ca2e47a71",
      "Fluidics-Pump"
    ],
    [
      "11793565-cc15-4654-afa6-19e8131d926c",
      "Thermal"
    ],
    [
      "f59aa786-1427-47f3-a6dc-804329baa107",
      "Imaging"
    ],
    [
      "d7796427-58fb-4ef1-bea3-cbb182a5446a",
      "LCL"
    ]
  ],
  "text_variables": {}
}
