(module 5040500291 (layer F.Cu) (tedit 0)
  (descr 504050-0291-1)
  (tags Connector)
  (attr smd)
  (fp_text reference J** (at 0 -2.8) (layer F.SilkS)
    (effects (font (size 1.27 1.27) (thickness 0.254)))
  )
  (fp_text value 5040500291 (at 0 -2.8) (layer F.SilkS) hide
    (effects (font (size 1.27 1.27) (thickness 0.254)))
  )
  (fp_arc (start 0.75 0.8) (end 0.8 0.8) (angle -180) (layer F.SilkS) (width 0.1))
  (fp_arc (start 0.75 0.8) (end 0.7 0.8) (angle -180) (layer F.SilkS) (width 0.1))
  (fp_text user %R (at 0 -2.8) (layer F.Fab)
    (effects (font (size 1.27 1.27) (thickness 0.254)))
  )
  (fp_line (start -3.375 -6.1) (end 3.375 -6.1) (layer F.Fab) (width 0.2))
  (fp_line (start 3.375 -6.1) (end 3.375 0) (layer F.Fab) (width 0.2))
  (fp_line (start 3.375 0) (end -3.375 0) (layer F.Fab) (width 0.2))
  (fp_line (start -3.375 0) (end -3.375 -6.1) (layer F.Fab) (width 0.2))
  (fp_line (start -5.005 -7.1) (end 5.005 -7.1) (layer F.CrtYd) (width 0.1))
  (fp_line (start 5.005 -7.1) (end 5.005 1.5) (layer F.CrtYd) (width 0.1))
  (fp_line (start 5.005 1.5) (end -5.005 1.5) (layer F.CrtYd) (width 0.1))
  (fp_line (start -5.005 1.5) (end -5.005 -7.1) (layer F.CrtYd) (width 0.1))
  (fp_line (start -1.5 0) (end -3.375 0) (layer F.SilkS) (width 0.1))
  (fp_line (start -3.375 0) (end -3.375 -4) (layer F.SilkS) (width 0.1))
  (fp_line (start -2.5 -6.1) (end 2.5 -6.1) (layer F.SilkS) (width 0.1))
  (fp_line (start 3.375 -4) (end 3.375 0) (layer F.SilkS) (width 0.1))
  (fp_line (start 3.375 0) (end 1.5 0) (layer F.SilkS) (width 0.1))
  (fp_line (start 0.7 0.8) (end 0.7 0.8) (layer F.SilkS) (width 0.1))
  (fp_line (start 0.8 0.8) (end 0.8 0.8) (layer F.SilkS) (width 0.1))
  (pad 4 smd rect (at 3.38 -5.19) (size 1.25 1.8) (layers F.Cu F.Paste F.Mask))
  (pad 3 smd rect (at -3.38 -5.19) (size 1.25 1.8) (layers F.Cu F.Paste F.Mask))
  (pad 2 smd rect (at -0.75 0) (size 0.6 1) (layers F.Cu F.Paste F.Mask))
  (pad 1 smd rect (at 0.75 0) (size 0.6 1) (layers F.Cu F.Paste F.Mask))
  (model 504050-0291.stp
    (at (xyz 0 0 0))
    (scale (xyz 1 1 1))
    (rotate (xyz 0 0 0))
  )
)
