(kicad_sch (version 20230121) (generator eeschema)

  (uuid dfa334af-6cc9-4bc7-b1a5-7e9e03db5a98)

  (paper "A4")

  (title_block
    (title "Science Unit Main Board (Payload Board)")
    (date "2022-03-13")
    (rev "2.0 (EM)")
    (company "SpaceDot")
    (comment 1 "AcubeSAT")
  )

  (lib_symbols
    (symbol "Components:203556-0407" (pin_names (offset 0.762)) (in_bom yes) (on_board yes)
      (property "Reference" "J" (at 16.51 7.62 0)
        (effects (font (size 1.27 1.27)) (justify left))
      )
      (property "Value" "203556-0407" (at 16.51 5.08 0)
        (effects (font (size 1.27 1.27)) (justify left))
      )
      (property "Footprint" "2035560407" (at 16.51 2.54 0)
        (effects (font (size 1.27 1.27)) (justify left) hide)
      )
      (property "Datasheet" "https://www.molex.com/webdocs/datasheets/pdf/en-us/2035560407_PCB_HEADERS.pdf" (at 16.51 0 0)
        (effects (font (size 1.27 1.27)) (justify left) hide)
      )
      (property "Description" "Headers & Wire Housings PicoClasp Hdr SMT SR Vrt 4Ckt W/FL Au0.38" (at 16.51 -2.54 0)
        (effects (font (size 1.27 1.27)) (justify left) hide)
      )
      (property "Height" "5.41" (at 16.51 -5.08 0)
        (effects (font (size 1.27 1.27)) (justify left) hide)
      )
      (property "Mouser Part Number" "538-203556-0407" (at 16.51 -7.62 0)
        (effects (font (size 1.27 1.27)) (justify left) hide)
      )
      (property "Mouser Price/Stock" "https://www.mouser.co.uk/ProductDetail/Molex/203556-0407?qs=F5EMLAvA7IDG5KHyS4NlWw%3D%3D" (at 16.51 -10.16 0)
        (effects (font (size 1.27 1.27)) (justify left) hide)
      )
      (property "Manufacturer_Name" "Molex" (at 16.51 -12.7 0)
        (effects (font (size 1.27 1.27)) (justify left) hide)
      )
      (property "Manufacturer_Part_Number" "203556-0407" (at 16.51 -15.24 0)
        (effects (font (size 1.27 1.27)) (justify left) hide)
      )
      (property "ki_description" "Headers & Wire Housings PicoClasp Hdr SMT SR Vrt 4Ckt W/FL Au0.38" (at 0 0 0)
        (effects (font (size 1.27 1.27)) hide)
      )
      (symbol "203556-0407_0_0"
        (pin passive line (at 20.32 -7.62 180) (length 5.08)
          (name "1" (effects (font (size 1.27 1.27))))
          (number "1" (effects (font (size 1.27 1.27))))
        )
        (pin passive line (at 20.32 -5.08 180) (length 5.08)
          (name "2" (effects (font (size 1.27 1.27))))
          (number "2" (effects (font (size 1.27 1.27))))
        )
        (pin passive line (at 20.32 -2.54 180) (length 5.08)
          (name "3" (effects (font (size 1.27 1.27))))
          (number "3" (effects (font (size 1.27 1.27))))
        )
        (pin passive line (at 20.32 0 180) (length 5.08)
          (name "4" (effects (font (size 1.27 1.27))))
          (number "4" (effects (font (size 1.27 1.27))))
        )
        (pin passive line (at 0 -2.54 0) (length 5.08)
          (name "5" (effects (font (size 1.27 1.27))))
          (number "5" (effects (font (size 1.27 1.27))))
        )
        (pin passive line (at 0 0 0) (length 5.08)
          (name "6" (effects (font (size 1.27 1.27))))
          (number "6" (effects (font (size 1.27 1.27))))
        )
      )
      (symbol "203556-0407_0_1"
        (polyline
          (pts
            (xy 5.08 2.54)
            (xy 15.24 2.54)
            (xy 15.24 -10.16)
            (xy 5.08 -10.16)
            (xy 5.08 2.54)
          )
          (stroke (width 0.1524) (type default))
          (fill (type background))
        )
      )
    )
    (symbol "Components:USBLC6-2P6" (pin_names (offset 0.762)) (in_bom yes) (on_board yes)
      (property "Reference" "IC" (at 26.67 7.62 0)
        (effects (font (size 1.27 1.27)) (justify left))
      )
      (property "Value" "USBLC6-2P6" (at 26.67 5.08 0)
        (effects (font (size 1.27 1.27)) (justify left))
      )
      (property "Footprint" "SOTFL50P160X60-6N" (at 26.67 2.54 0)
        (effects (font (size 1.27 1.27)) (justify left) hide)
      )
      (property "Datasheet" "http://www.st.com/st-web-ui/static/active/en/resource/technical/document/datasheet/CD00050750.pdf" (at 26.67 0 0)
        (effects (font (size 1.27 1.27)) (justify left) hide)
      )
      (property "Description" "TVS Diode Array Uni-Directional USBLC6-2P6 17V, SOT-666 6-Pin" (at 26.67 -2.54 0)
        (effects (font (size 1.27 1.27)) (justify left) hide)
      )
      (property "Height" "0.6" (at 26.67 -5.08 0)
        (effects (font (size 1.27 1.27)) (justify left) hide)
      )
      (property "Manufacturer_Name" "STMicroelectronics" (at 26.67 -7.62 0)
        (effects (font (size 1.27 1.27)) (justify left) hide)
      )
      (property "Manufacturer_Part_Number" "USBLC6-2P6" (at 26.67 -10.16 0)
        (effects (font (size 1.27 1.27)) (justify left) hide)
      )
      (property "Mouser Part Number" "511-USBLC6-2P6" (at 26.67 -12.7 0)
        (effects (font (size 1.27 1.27)) (justify left) hide)
      )
      (property "Mouser Price/Stock" "https://www.mouser.com/Search/Refine.aspx?Keyword=511-USBLC6-2P6" (at 26.67 -15.24 0)
        (effects (font (size 1.27 1.27)) (justify left) hide)
      )
      (property "RS Part Number" "6247687P" (at 26.67 -17.78 0)
        (effects (font (size 1.27 1.27)) (justify left) hide)
      )
      (property "RS Price/Stock" "http://uk.rs-online.com/web/p/products/6247687P" (at 26.67 -20.32 0)
        (effects (font (size 1.27 1.27)) (justify left) hide)
      )
      (property "Allied_Number" "70389688" (at 26.67 -22.86 0)
        (effects (font (size 1.27 1.27)) (justify left) hide)
      )
      (property "Allied Price/Stock" "http://www.alliedelec.com/stmicroelectronics-usblc6-2p6/70389688/" (at 26.67 -25.4 0)
        (effects (font (size 1.27 1.27)) (justify left) hide)
      )
      (property "ki_description" "TVS Diode Array Uni-Directional USBLC6-2P6 17V, SOT-666 6-Pin" (at 0 0 0)
        (effects (font (size 1.27 1.27)) hide)
      )
      (symbol "USBLC6-2P6_0_0"
        (pin bidirectional line (at 0 0 0) (length 5.08)
          (name "I/O1" (effects (font (size 1.27 1.27))))
          (number "1" (effects (font (size 1.27 1.27))))
        )
        (pin bidirectional line (at 0 -2.54 0) (length 5.08)
          (name "GND" (effects (font (size 1.27 1.27))))
          (number "2" (effects (font (size 1.27 1.27))))
        )
        (pin bidirectional line (at 0 -5.08 0) (length 5.08)
          (name "I/O2" (effects (font (size 1.27 1.27))))
          (number "3" (effects (font (size 1.27 1.27))))
        )
        (pin bidirectional line (at 30.48 0 180) (length 5.08)
          (name "I/O2_1" (effects (font (size 1.27 1.27))))
          (number "4" (effects (font (size 1.27 1.27))))
        )
        (pin bidirectional line (at 30.48 -2.54 180) (length 5.08)
          (name "VBUS" (effects (font (size 1.27 1.27))))
          (number "5" (effects (font (size 1.27 1.27))))
        )
        (pin bidirectional line (at 30.48 -5.08 180) (length 5.08)
          (name "I/O1_1" (effects (font (size 1.27 1.27))))
          (number "6" (effects (font (size 1.27 1.27))))
        )
      )
      (symbol "USBLC6-2P6_0_1"
        (polyline
          (pts
            (xy 5.08 2.54)
            (xy 25.4 2.54)
            (xy 25.4 -7.62)
            (xy 5.08 -7.62)
            (xy 5.08 2.54)
          )
          (stroke (width 0.1524) (type default))
          (fill (type background))
        )
      )
    )
    (symbol "Device:C" (pin_numbers hide) (pin_names (offset 0.254)) (in_bom yes) (on_board yes)
      (property "Reference" "C" (at 0.635 2.54 0)
        (effects (font (size 1.27 1.27)) (justify left))
      )
      (property "Value" "C" (at 0.635 -2.54 0)
        (effects (font (size 1.27 1.27)) (justify left))
      )
      (property "Footprint" "" (at 0.9652 -3.81 0)
        (effects (font (size 1.27 1.27)) hide)
      )
      (property "Datasheet" "~" (at 0 0 0)
        (effects (font (size 1.27 1.27)) hide)
      )
      (property "ki_keywords" "cap capacitor" (at 0 0 0)
        (effects (font (size 1.27 1.27)) hide)
      )
      (property "ki_description" "Unpolarized capacitor" (at 0 0 0)
        (effects (font (size 1.27 1.27)) hide)
      )
      (property "ki_fp_filters" "C_*" (at 0 0 0)
        (effects (font (size 1.27 1.27)) hide)
      )
      (symbol "C_0_1"
        (polyline
          (pts
            (xy -2.032 -0.762)
            (xy 2.032 -0.762)
          )
          (stroke (width 0.508) (type default))
          (fill (type none))
        )
        (polyline
          (pts
            (xy -2.032 0.762)
            (xy 2.032 0.762)
          )
          (stroke (width 0.508) (type default))
          (fill (type none))
        )
      )
      (symbol "C_1_1"
        (pin passive line (at 0 3.81 270) (length 2.794)
          (name "~" (effects (font (size 1.27 1.27))))
          (number "1" (effects (font (size 1.27 1.27))))
        )
        (pin passive line (at 0 -3.81 90) (length 2.794)
          (name "~" (effects (font (size 1.27 1.27))))
          (number "2" (effects (font (size 1.27 1.27))))
        )
      )
    )
    (symbol "power:GND" (power) (pin_names (offset 0)) (in_bom yes) (on_board yes)
      (property "Reference" "#PWR" (at 0 -6.35 0)
        (effects (font (size 1.27 1.27)) hide)
      )
      (property "Value" "GND" (at 0 -3.81 0)
        (effects (font (size 1.27 1.27)))
      )
      (property "Footprint" "" (at 0 0 0)
        (effects (font (size 1.27 1.27)) hide)
      )
      (property "Datasheet" "" (at 0 0 0)
        (effects (font (size 1.27 1.27)) hide)
      )
      (property "ki_keywords" "power-flag" (at 0 0 0)
        (effects (font (size 1.27 1.27)) hide)
      )
      (property "ki_description" "Power symbol creates a global label with name \"GND\" , ground" (at 0 0 0)
        (effects (font (size 1.27 1.27)) hide)
      )
      (symbol "GND_0_1"
        (polyline
          (pts
            (xy 0 0)
            (xy 0 -1.27)
            (xy 1.27 -1.27)
            (xy 0 -2.54)
            (xy -1.27 -1.27)
            (xy 0 -1.27)
          )
          (stroke (width 0) (type default))
          (fill (type none))
        )
      )
      (symbol "GND_1_1"
        (pin power_in line (at 0 0 270) (length 0) hide
          (name "GND" (effects (font (size 1.27 1.27))))
          (number "1" (effects (font (size 1.27 1.27))))
        )
      )
    )
  )

  (junction (at 154.94 111.76) (diameter 0) (color 0 0 0 0)
    (uuid c47caa78-2bf9-49a7-9c0f-295cecf7ff40)
  )
  (junction (at 176.53 111.76) (diameter 0) (color 0 0 0 0)
    (uuid f2233a8c-9ab7-4528-9005-7e7bed1fc39b)
  )

  (no_connect (at 226.441 111.76) (uuid 265edce4-e3a3-4429-a9ef-d5a0ee73ad34))
  (no_connect (at 226.441 109.22) (uuid 9a7d2769-ab6d-420b-b9e8-5d312c7c2233))

  (wire (pts (xy 148.59 109.22) (xy 206.121 109.22))
    (stroke (width 0) (type default))
    (uuid 1557c51e-0af9-4a78-92b0-936234019dff)
  )
  (wire (pts (xy 148.59 111.76) (xy 154.94 111.76))
    (stroke (width 0) (type default))
    (uuid 283a372b-794c-470c-9168-53e6b202c87f)
  )
  (wire (pts (xy 176.53 111.76) (xy 206.121 111.76))
    (stroke (width 0) (type default))
    (uuid 34364330-eec2-4298-a58a-8a9bef250167)
  )
  (wire (pts (xy 154.94 111.76) (xy 176.53 111.76))
    (stroke (width 0) (type default))
    (uuid 37b8b99a-91af-4803-bec6-379bfffdb074)
  )
  (wire (pts (xy 111.76 114.3) (xy 118.11 114.3))
    (stroke (width 0) (type default))
    (uuid 571b49cd-974c-4f2a-aebb-1228b59fc601)
  )
  (wire (pts (xy 148.59 127.508) (xy 148.59 114.3))
    (stroke (width 0) (type default))
    (uuid 5a7dc924-e6e7-4a9f-951a-deea37f445d7)
  )
  (wire (pts (xy 193.04 104.14) (xy 206.121 104.14))
    (stroke (width 0) (type default))
    (uuid 5ce26fac-4773-4af4-9fb4-171ec8ab2c00)
  )
  (wire (pts (xy 191.77 127.508) (xy 191.77 106.68))
    (stroke (width 0) (type default))
    (uuid 9923db32-bce9-4fba-929c-4afa369e17d8)
  )
  (wire (pts (xy 176.53 105.41) (xy 176.53 111.76))
    (stroke (width 0) (type default))
    (uuid 9ee515ad-5a28-454a-9ef9-6c6ad90d8ea4)
  )
  (wire (pts (xy 191.77 106.68) (xy 206.121 106.68))
    (stroke (width 0) (type default))
    (uuid a67d6b59-f63c-4c86-9f1b-f99047bb68df)
  )
  (wire (pts (xy 111.76 109.22) (xy 118.11 109.22))
    (stroke (width 0) (type default))
    (uuid aed9d453-412c-4318-8917-96333842a36e)
  )
  (wire (pts (xy 148.59 127.508) (xy 191.77 127.508))
    (stroke (width 0) (type default))
    (uuid e2853ebf-56b5-4f34-a06f-958de35e92a6)
  )

  (text "OK" (at 168.656 97.028 0)
    (effects (font (size 1.27 1.27)) (justify left bottom))
    (uuid b70e7904-4237-41f9-b76e-dc15f838b266)
  )
  (text "remove OCP IC and connecto usb_en to lcl set..Maybe use usb_fault as lcl reset"
    (at 128.143 93.98 0)
    (effects (font (size 1.27 1.27)) (justify left bottom))
    (uuid d8df518e-4c1e-4ded-a4b7-6b3afee6e481)
  )
  (text "ESD Protection IC" (at 124.46 119.38 0)
    (effects (font (size 1.27 1.27)) (justify left bottom))
    (uuid f1831090-0821-4b9a-a049-71970df4cf29)
  )

  (label "USB_DEVICE_D+" (at 148.59 109.22 0) (fields_autoplaced)
    (effects (font (size 1.27 1.27)) (justify left bottom))
    (uuid 1e244f2b-5e2a-4aa9-af93-be508b7aff18)
  )
  (label "USB_DEVICE_D-" (at 148.59 127.508 180) (fields_autoplaced)
    (effects (font (size 1.27 1.27)) (justify right bottom))
    (uuid 7f44001c-dd59-44bf-b837-dc41caf5eae6)
  )

  (hierarchical_label "USB_D-" (shape bidirectional) (at 111.76 114.3 180) (fields_autoplaced)
    (effects (font (size 1.27 1.27)) (justify right))
    (uuid 403eb998-f3a5-4b1b-993e-71745aa86e65)
  )
  (hierarchical_label "USB_D+" (shape bidirectional) (at 111.76 109.22 180) (fields_autoplaced)
    (effects (font (size 1.27 1.27)) (justify right))
    (uuid 9e895669-8fee-40c9-924c-1a1b3b819667)
  )
  (hierarchical_label "lclprotecteddvc2" (shape input) (at 176.53 105.41 180) (fields_autoplaced)
    (effects (font (size 1.27 1.27)) (justify right))
    (uuid bc9fb3b3-c74f-4e68-ac07-3c112cd2942b)
  )

  (symbol (lib_id "power:GND") (at 118.11 111.76 270) (unit 1)
    (in_bom yes) (on_board yes) (dnp no)
    (uuid 00000000-0000-0000-0000-00005f78dca0)
    (property "Reference" "#PWR0115" (at 111.76 111.76 0)
      (effects (font (size 1.27 1.27)) hide)
    )
    (property "Value" "GND" (at 115.57 111.76 90)
      (effects (font (size 1.27 1.27)) (justify right))
    )
    (property "Footprint" "" (at 118.11 111.76 0)
      (effects (font (size 1.27 1.27)) hide)
    )
    (property "Datasheet" "" (at 118.11 111.76 0)
      (effects (font (size 1.27 1.27)) hide)
    )
    (pin "1" (uuid 66193360-9fbc-45a7-b00b-a4a75ae0e6c0))
    (instances
      (project "su-pcb"
        (path "/046f7539-ad1f-4625-bbfa-b19dd2678d47/00000000-0000-0000-0000-00005f784c18"
          (reference "#PWR0115") (unit 1)
        )
      )
    )
  )

  (symbol (lib_id "Components:USBLC6-2P6") (at 118.11 109.22 0) (unit 1)
    (in_bom yes) (on_board yes) (dnp no)
    (uuid 00000000-0000-0000-0000-00005f78dcb6)
    (property "Reference" "IC8" (at 133.35 102.489 0)
      (effects (font (size 1.27 1.27)))
    )
    (property "Value" "USBLC6-2M6" (at 133.35 104.8004 0)
      (effects (font (size 1.27 1.27)))
    )
    (property "Footprint" "SamacSys_Parts:SON50P100X145X60-6N-D" (at 144.78 106.68 0)
      (effects (font (size 1.27 1.27)) (justify left) hide)
    )
    (property "Datasheet" "http://www.st.com/st-web-ui/static/active/en/resource/technical/document/datasheet/CD00050750.pdf" (at 144.78 109.22 0)
      (effects (font (size 1.27 1.27)) (justify left) hide)
    )
    (property "Description" "TVS Diode Array Uni-Directional USBLC6-2P6 17V, SOT-666 6-Pin" (at 144.78 111.76 0)
      (effects (font (size 1.27 1.27)) (justify left) hide)
    )
    (property "Height" "0.6" (at 144.78 114.3 0)
      (effects (font (size 1.27 1.27)) (justify left) hide)
    )
    (property "Manufacturer_Name" "STMicroelectronics" (at 144.78 116.84 0)
      (effects (font (size 1.27 1.27)) (justify left) hide)
    )
    (property "Manufacturer_Part_Number" "USBLC6-2P6" (at 144.78 119.38 0)
      (effects (font (size 1.27 1.27)) (justify left) hide)
    )
    (property "Mouser Part Number" "511-USBLC6-2P6" (at 144.78 121.92 0)
      (effects (font (size 1.27 1.27)) (justify left) hide)
    )
    (property "Mouser Price/Stock" "https://www.mouser.com/Search/Refine.aspx?Keyword=511-USBLC6-2P6" (at 144.78 124.46 0)
      (effects (font (size 1.27 1.27)) (justify left) hide)
    )
    (property "RS Part Number" "6247687P" (at 144.78 127 0)
      (effects (font (size 1.27 1.27)) (justify left) hide)
    )
    (property "RS Price/Stock" "http://uk.rs-online.com/web/p/products/6247687P" (at 144.78 129.54 0)
      (effects (font (size 1.27 1.27)) (justify left) hide)
    )
    (property "Allied_Number" "70389688" (at 144.78 132.08 0)
      (effects (font (size 1.27 1.27)) (justify left) hide)
    )
    (property "Allied Price/Stock" "http://www.alliedelec.com/stmicroelectronics-usblc6-2p6/70389688/" (at 144.78 134.62 0)
      (effects (font (size 1.27 1.27)) (justify left) hide)
    )
    (pin "1" (uuid 4f707e97-6111-4e77-b0c4-6659c529c7fa))
    (pin "2" (uuid 1889c814-5d0a-4c13-acb4-999a66845e69))
    (pin "3" (uuid 28076bab-32e7-49e1-8ed3-119804f1f1e9))
    (pin "4" (uuid 7759c0d4-7f4b-4fda-8fc4-229865985eec))
    (pin "5" (uuid d590415d-7db4-4054-b7b3-96033696415c))
    (pin "6" (uuid 3f6b55ca-9bd1-4f3b-920d-5ead561b8a9e))
    (instances
      (project "su-pcb"
        (path "/046f7539-ad1f-4625-bbfa-b19dd2678d47/00000000-0000-0000-0000-00005f784c18"
          (reference "IC8") (unit 1)
        )
      )
    )
  )

  (symbol (lib_id "Components:203556-0407") (at 226.441 111.76 180) (unit 1)
    (in_bom yes) (on_board yes) (dnp no)
    (uuid 00000000-0000-0000-0000-00005f78dccf)
    (property "Reference" "J17" (at 215.011 118.491 0)
      (effects (font (size 1.27 1.27)))
    )
    (property "Value" "2035560-407" (at 215.011 116.1796 0)
      (effects (font (size 1.27 1.27)))
    )
    (property "Footprint" "Components:2035560407" (at 207.391 114.3 0)
      (effects (font (size 1.27 1.27)) (justify left) hide)
    )
    (property "Datasheet" "https://www.molex.com/pdm_docs/sd/5040500591_sd.pdf" (at 207.391 111.76 0)
      (effects (font (size 1.27 1.27)) (justify left) hide)
    )
    (property "Description" "Headers & Wire Housings Pico-Lock 1.5 SMT HDR RA POSLCK 5CKT" (at 207.391 109.22 0)
      (effects (font (size 1.27 1.27)) (justify left) hide)
    )
    (property "Height" "2.15" (at 207.391 106.68 0)
      (effects (font (size 1.27 1.27)) (justify left) hide)
    )
    (property "Mouser Part Number" "538-504050-0591" (at 207.391 104.14 0)
      (effects (font (size 1.27 1.27)) (justify left) hide)
    )
    (property "Mouser Price/Stock" "https://www.mouser.co.uk/ProductDetail/Molex/504050-0591?qs=OAhjpuo3Vu7FoUIT4KH7%2Fg%3D%3D" (at 207.391 101.6 0)
      (effects (font (size 1.27 1.27)) (justify left) hide)
    )
    (property "Manufacturer_Name" "Molex" (at 207.391 99.06 0)
      (effects (font (size 1.27 1.27)) (justify left) hide)
    )
    (property "Manufacturer_Part_Number" "504050-0591" (at 207.391 96.52 0)
      (effects (font (size 1.27 1.27)) (justify left) hide)
    )
    (pin "1" (uuid db0b2c99-5a31-49d0-8ed3-0b5a4e3b4725))
    (pin "2" (uuid c7080bec-02ec-4c36-9088-0fc54126cd4b))
    (pin "3" (uuid 0383e032-cee2-421f-80e1-55b608f7b078))
    (pin "4" (uuid 66e3e975-162c-4378-b424-bdcf9be00312))
    (pin "5" (uuid 86880ccc-d0f4-45f4-a38c-e17cf56de1fb))
    (pin "6" (uuid 62729758-f93e-4acf-8a54-aaf4c22e1d34))
    (instances
      (project "su-pcb"
        (path "/046f7539-ad1f-4625-bbfa-b19dd2678d47/00000000-0000-0000-0000-00005f784c18"
          (reference "J17") (unit 1)
        )
      )
    )
  )

  (symbol (lib_id "power:GND") (at 193.04 104.14 270) (unit 1)
    (in_bom yes) (on_board yes) (dnp no)
    (uuid 00000000-0000-0000-0000-00005f78dce0)
    (property "Reference" "#PWR0117" (at 186.69 104.14 0)
      (effects (font (size 1.27 1.27)) hide)
    )
    (property "Value" "GND" (at 190.5 104.14 90)
      (effects (font (size 1.27 1.27)) (justify right))
    )
    (property "Footprint" "" (at 193.04 104.14 0)
      (effects (font (size 1.27 1.27)) hide)
    )
    (property "Datasheet" "" (at 193.04 104.14 0)
      (effects (font (size 1.27 1.27)) hide)
    )
    (pin "1" (uuid 1efd9462-f03b-4c1e-b803-794be4422cdc))
    (instances
      (project "su-pcb"
        (path "/046f7539-ad1f-4625-bbfa-b19dd2678d47/00000000-0000-0000-0000-00005f784c18"
          (reference "#PWR0117") (unit 1)
        )
      )
    )
  )

  (symbol (lib_id "Device:C") (at 154.94 115.57 0) (unit 1)
    (in_bom yes) (on_board yes) (dnp no) (fields_autoplaced)
    (uuid 42073a3d-00ef-4c97-a293-771bf354b81b)
    (property "Reference" "C38" (at 158.75 114.935 0)
      (effects (font (size 1.27 1.27)) (justify left))
    )
    (property "Value" "100n" (at 158.75 117.475 0)
      (effects (font (size 1.27 1.27)) (justify left))
    )
    (property "Footprint" "Capacitor_SMD:C_0402_1005Metric" (at 155.9052 119.38 0)
      (effects (font (size 1.27 1.27)) hide)
    )
    (property "Datasheet" "~" (at 154.94 115.57 0)
      (effects (font (size 1.27 1.27)) hide)
    )
    (pin "1" (uuid 797c58c1-5296-4ecf-bf40-0a6f7d2dfe65))
    (pin "2" (uuid afc4aa29-81d0-45c7-9718-382c8a311817))
    (instances
      (project "su-pcb"
        (path "/046f7539-ad1f-4625-bbfa-b19dd2678d47/00000000-0000-0000-0000-00005f784c18"
          (reference "C38") (unit 1)
        )
      )
    )
  )

  (symbol (lib_id "power:GND") (at 154.94 119.38 0) (unit 1)
    (in_bom yes) (on_board yes) (dnp no)
    (uuid 8587057b-caa9-47bb-b631-c211a13a603c)
    (property "Reference" "#PWR02" (at 154.94 125.73 0)
      (effects (font (size 1.27 1.27)) hide)
    )
    (property "Value" "GND" (at 154.94 121.92 90)
      (effects (font (size 1.27 1.27)) (justify right))
    )
    (property "Footprint" "" (at 154.94 119.38 0)
      (effects (font (size 1.27 1.27)) hide)
    )
    (property "Datasheet" "" (at 154.94 119.38 0)
      (effects (font (size 1.27 1.27)) hide)
    )
    (pin "1" (uuid f4688380-721e-4a23-b7bb-bc7cb720e25d))
    (instances
      (project "su-pcb"
        (path "/046f7539-ad1f-4625-bbfa-b19dd2678d47/00000000-0000-0000-0000-00005f784c18"
          (reference "#PWR02") (unit 1)
        )
      )
    )
  )
)
