(module "504050-0491" (layer F.Cu)
  (descr "504050-0491")
  (tags "Connector")
  (attr smd)
  (fp_text reference J** (at -0.221 -3.458) (layer F.SilkS)
    (effects (font (size 1.27 1.27) (thickness 0.254)))
  )
  (fp_text user %R (at -0.221 -3.458) (layer F.Fab)
    (effects (font (size 1.27 1.27) (thickness 0.254)))
  )
  (fp_text value "504050-0491" (at -0.221 -3.458) (layer F.SilkS) hide
    (effects (font (size 1.27 1.27) (thickness 0.254)))
  )
  (fp_line (start -4.875 -6.1) (end 4.875 -6.1) (layer F.Fab) (width 0.254))
  (fp_line (start 4.875 -6.1) (end 4.875 0) (layer F.Fab) (width 0.254))
  (fp_line (start 4.875 0) (end -4.875 0) (layer F.Fab) (width 0.254))
  (fp_line (start -4.875 0) (end -4.875 -6.1) (layer F.Fab) (width 0.254))
  (fp_line (start -4.875 0) (end -4.875 -3.013) (layer F.SilkS) (width 0.254))
  (fp_line (start 4.875 0) (end 4.875 -3.013) (layer F.SilkS) (width 0.254))
  (fp_line (start -3.75 -6.1) (end 3.75 -6.1) (layer F.SilkS) (width 0.254))
  (fp_circle (center 2.227 0.775) (end 2.227 0.80854) (layer F.SilkS) (width 0.254))
  (pad 1 smd rect (at 2.25 0 0) (size 0.6 1) (layers F.Cu F.Paste F.Mask))
  (pad 2 smd rect (at 0.75 0 0) (size 0.6 1) (layers F.Cu F.Paste F.Mask))
  (pad 3 smd rect (at -0.75 0 0) (size 0.6 1) (layers F.Cu F.Paste F.Mask))
  (pad 4 smd rect (at -2.25 0 0) (size 0.6 1) (layers F.Cu F.Paste F.Mask))
  (pad 5 smd rect (at -4.855 -5.19 0) (size 1.25 1.8) (layers F.Cu F.Paste F.Mask))
  (pad 6 smd rect (at 4.855 -5.19 0) (size 1.25 1.8) (layers F.Cu F.Paste F.Mask))
)
