(footprint "TLC555"
	(version 20240108)
	(generator "pcbnew")
	(generator_version "8.0")
	(layer "F.Cu")
	(descr "D0008A  SOIC")
	(tags "Integrated Circuit")
	(property "Reference" "IC**"
		(at 0 0 90)
		(layer "F.SilkS")
		(uuid "c24134e0-7634-4a16-b63a-25d4688c1df0")
		(effects
			(font
				(size 1.27 1.27)
				(thickness 0.254)
			)
		)
	)
	(property "Value" "TLC555"
		(at 0 -3.45 0)
		(layer "F.SilkS")
		(hide yes)
		(uuid "527335e3-87b9-4d4f-9ea1-c87bcc59cf0c")
		(effects
			(font
				(size 1 1)
				(thickness 0.25)
			)
		)
	)
	(property "Footprint" ""
		(at 0 0 0)
		(layer "F.Fab")
		(hide yes)
		(uuid "af86852f-b2fd-4074-bbc2-11a83a0eaad3")
		(effects
			(font
				(size 1.27 1.27)
				(thickness 0.15)
			)
		)
	)
	(property "Datasheet" ""
		(at 0 0 0)
		(layer "F.Fab")
		(hide yes)
		(uuid "614a4816-e3b2-464d-96ac-77989da0887d")
		(effects
			(font
				(size 1.27 1.27)
				(thickness 0.15)
			)
		)
	)
	(property "Description" ""
		(at 0 0 0)
		(layer "F.Fab")
		(hide yes)
		(uuid "95777cc3-e9c9-4c84-a78a-145cb8a87a9f")
		(effects
			(font
				(size 1.27 1.27)
				(thickness 0.15)
			)
		)
	)
	(attr smd)
	(fp_line
		(start -3.475 -2.58)
		(end -1.948 -2.58)
		(stroke
			(width 0.2)
			(type solid)
		)
		(layer "F.SilkS")
		(uuid "583b03c4-ecab-46f3-af28-ab8ab28b91d4")
	)
	(fp_line
		(start -1.598 -2.452)
		(end 1.598 -2.452)
		(stroke
			(width 0.2)
			(type solid)
		)
		(layer "F.SilkS")
		(uuid "2d27d21b-7104-4583-8713-a49bf905dc80")
	)
	(fp_line
		(start -1.598 2.452)
		(end -1.598 -2.452)
		(stroke
			(width 0.2)
			(type solid)
		)
		(layer "F.SilkS")
		(uuid "8b052c32-e8f6-4d87-8962-54f88d88003c")
	)
	(fp_line
		(start 1.598 -2.452)
		(end 1.598 2.452)
		(stroke
			(width 0.2)
			(type solid)
		)
		(layer "F.SilkS")
		(uuid "88ce700a-700a-45f2-82ac-c37455281975")
	)
	(fp_line
		(start 1.598 2.452)
		(end -1.598 2.452)
		(stroke
			(width 0.2)
			(type solid)
		)
		(layer "F.SilkS")
		(uuid "675fa4a2-0b88-4bcb-a3c3-8e4160d2c872")
	)
	(fp_line
		(start -3.725 -2.75)
		(end 3.725 -2.75)
		(stroke
			(width 0.05)
			(type solid)
		)
		(layer "F.CrtYd")
		(uuid "568e80bb-fd56-42ae-9cc7-0992a4b5b893")
	)
	(fp_line
		(start -3.725 2.75)
		(end -3.725 -2.75)
		(stroke
			(width 0.05)
			(type solid)
		)
		(layer "F.CrtYd")
		(uuid "2b4669aa-5118-46b2-abaf-e1dab91cf4a3")
	)
	(fp_line
		(start 3.725 -2.75)
		(end 3.725 2.75)
		(stroke
			(width 0.05)
			(type solid)
		)
		(layer "F.CrtYd")
		(uuid "aa899479-2a8c-43a6-94eb-c78c4fe1e17c")
	)
	(fp_line
		(start 3.725 2.75)
		(end -3.725 2.75)
		(stroke
			(width 0.05)
			(type solid)
		)
		(layer "F.CrtYd")
		(uuid "4d252eed-78f7-48b8-95a4-1d183ce120ea")
	)
	(fp_line
		(start -1.948 -2.452)
		(end 1.948 -2.452)
		(stroke
			(width 0.1)
			(type solid)
		)
		(layer "F.Fab")
		(uuid "4968ca74-be20-470c-bf88-3044e374e484")
	)
	(fp_line
		(start -1.948 -1.182)
		(end -0.678 -2.452)
		(stroke
			(width 0.1)
			(type solid)
		)
		(layer "F.Fab")
		(uuid "4fa996f9-89b5-4e7f-b484-398f077e02fc")
	)
	(fp_line
		(start -1.948 2.452)
		(end -1.948 -2.452)
		(stroke
			(width 0.1)
			(type solid)
		)
		(layer "F.Fab")
		(uuid "9f7eca1a-54ee-4cd8-997e-57258dd0be05")
	)
	(fp_line
		(start 1.948 -2.452)
		(end 1.948 2.452)
		(stroke
			(width 0.1)
			(type solid)
		)
		(layer "F.Fab")
		(uuid "f2dc323a-03cb-406b-b6f5-1d0cd019163c")
	)
	(fp_line
		(start 1.948 2.452)
		(end -1.948 2.452)
		(stroke
			(width 0.1)
			(type solid)
		)
		(layer "F.Fab")
		(uuid "097b7b6a-8f2a-4ac0-b65b-c4b69ab539af")
	)
	(pad "1" smd rect
		(at -2.711 -1.905 90)
		(size 0.65 1.528)
		(layers "F.Cu" "F.Paste" "F.Mask")
		(uuid "a66830f5-8adf-46af-aae5-a2e62fe328ee")
	)
	(pad "2" smd rect
		(at -2.711 -0.635 90)
		(size 0.65 1.528)
		(layers "F.Cu" "F.Paste" "F.Mask")
		(uuid "cd946148-61ef-4376-a4a8-3d1211f0e6bc")
	)
	(pad "3" smd rect
		(at -2.711 0.635 90)
		(size 0.65 1.528)
		(layers "F.Cu" "F.Paste" "F.Mask")
		(uuid "254fef73-7a3c-41dd-9cb1-ba5a2e8b32a3")
	)
	(pad "4" smd rect
		(at -2.711 1.905 90)
		(size 0.65 1.528)
		(layers "F.Cu" "F.Paste" "F.Mask")
		(uuid "133629ce-7467-4e82-a52f-7d28100dc7cf")
	)
	(pad "5" smd rect
		(at 2.711 1.905 90)
		(size 0.65 1.528)
		(layers "F.Cu" "F.Paste" "F.Mask")
		(uuid "404b6008-e44e-444f-bf14-1a4ad4a52ed3")
	)
	(pad "6" smd rect
		(at 2.711 0.635 90)
		(size 0.65 1.528)
		(layers "F.Cu" "F.Paste" "F.Mask")
		(uuid "dec45a0f-9872-4f8d-bb64-0038009da04d")
	)
	(pad "7" smd rect
		(at 2.711 -0.635 90)
		(size 0.65 1.528)
		(layers "F.Cu" "F.Paste" "F.Mask")
		(uuid "ea4c90bf-1cdd-4be2-91f6-de8de22122a2")
	)
	(pad "8" smd rect
		(at 2.711 -1.905 90)
		(size 0.65 1.528)
		(layers "F.Cu" "F.Paste" "F.Mask")
		(uuid "6593c630-7eda-490c-869e-3ba99999b8e8")
	)
	(model "${KIPRJMOD}/3D/TLC555QDRQ1.stp"
		(offset
			(xyz 0 0 0)
		)
		(scale
			(xyz 1 1 1)
		)
		(rotate
			(xyz 0 0 0)
		)
	)
)
