PCBNEW-LibModule-V1  2022-06-03 11:49:20
# encoding utf-8
Units mm
$INDEX
501568-0407
$EndINDEX
$MODULE 501568-0407
Po 0 0 0 15 6299e730 00000000 ~~
Li 501568-0407
Cd 501568-0407
Kw Connector
Sc 0
At SMD
AR 
Op 0 0 0
T0 -0.394 2.109 1.27 1.27 0 0.254 N V 21 N "J**"
T1 -0.394 2.109 1.27 1.27 0 0.254 N I 21 N "501568-0407"
DS -3 0 3 0 0.2 24
DS 3 0 3 5.35 0.2 24
DS 3 5.35 -3 5.35 0.2 24
DS -3 5.35 -3 0 0.2 24
DS -3 0 -3 2.448 0.2 21
DS -3 5.35 3 5.35 0.2 21
DS 3 0 3 2.448 0.2 21
DC -1.478 -1.574 -1.53 -1.574 0.254 21
$PAD
Po -1.5 -0.3
Sh "1" R 0.6 1.5 0 0 0
At SMD N 00888000
Ne 0 ""
$EndPAD
$PAD
Po -0.5 -0.3
Sh "2" R 0.6 1.5 0 0 0
At SMD N 00888000
Ne 0 ""
$EndPAD
$PAD
Po 0.5 -0.3
Sh "3" R 0.6 1.5 0 0 0
At SMD N 00888000
Ne 0 ""
$EndPAD
$PAD
Po 1.5 -0.3
Sh "4" R 0.6 1.5 0 0 0
At SMD N 00888000
Ne 0 ""
$EndPAD
$PAD
Po -2.8 3.6
Sh "5" R 1.2 1.8 0 0 0
At SMD N 00888000
Ne 0 ""
$EndPAD
$PAD
Po 2.8 3.6
Sh "6" R 1.2 1.8 0 0 0
At SMD N 00888000
Ne 0 ""
$EndPAD
$EndMODULE 501568-0407
$EndLIBRARY
