(module "JJCHLUJ100NCNMRTR" (layer F.Cu)
  (descr "JJCHLUJ100NCNMRTR-3")
  (tags "Switch")
  (attr smd)
  (fp_text reference S** (at -0.000 1.095) (layer F.SilkS)
    (effects (font (size 1.27 1.27) (thickness 0.254)))
  )
  (fp_text user %R (at -0.000 1.095) (layer F.Fab)
    (effects (font (size 1.27 1.27) (thickness 0.254)))
  )
  (fp_text value "JJCHLUJ100NCNMRTR" (at -0.000 1.095) (layer F.SilkS) hide
    (effects (font (size 1.27 1.27) (thickness 0.254)))
  )
  (fp_line (start -1.75 3.3) (end 1.75 3.3) (layer F.Fab) (width 0.1))
  (fp_line (start 1.75 3.3) (end 1.75 -0) (layer F.Fab) (width 0.1))
  (fp_line (start 1.75 -0) (end -1.75 -0) (layer F.Fab) (width 0.1))
  (fp_line (start -1.75 -0) (end -1.75 3.3) (layer F.Fab) (width 0.1))
  (fp_line (start -0.39 -0) (end 0.39 -0) (layer F.Fab) (width 0.1))
  (fp_line (start 0.39 -0) (end 0.39 -1.15) (layer F.Fab) (width 0.1))
  (fp_line (start 0.39 -1.15) (end -0.39 -1.15) (layer F.Fab) (width 0.1))
  (fp_line (start -0.39 -1.15) (end -0.39 -0) (layer F.Fab) (width 0.1))
  (fp_line (start -0.39 -0) (end 0.39 -0) (layer F.SilkS) (width 0.2))
  (fp_line (start 0.39 -0) (end 0.39 -1.15) (layer F.SilkS) (width 0.2))
  (fp_line (start 0.39 -1.15) (end -0.39 -1.15) (layer F.SilkS) (width 0.2))
  (fp_line (start -0.39 -1.15) (end -0.39 -0) (layer F.SilkS) (width 0.2))
  (fp_line (start -0.5 -0) (end -1.75 -0) (layer F.SilkS) (width 0.2))
  (fp_line (start -1.75 -0) (end -1.75 -0) (layer F.SilkS) (width 0.2))
  (fp_line (start -1.75 -0) (end -0.5 -0) (layer F.SilkS) (width 0.2))
  (fp_line (start -0.5 -0) (end -0.5 -0) (layer F.SilkS) (width 0.2))
  (fp_line (start -1.75 -0) (end -1.75 -0) (layer F.SilkS) (width 0.2))
  (fp_line (start -1.75 -0) (end -1.75 0.25) (layer F.SilkS) (width 0.2))
  (fp_line (start -1.75 0.25) (end -1.75 0.25) (layer F.SilkS) (width 0.2))
  (fp_line (start -1.75 0.25) (end -1.75 -0) (layer F.SilkS) (width 0.2))
  (fp_line (start 0.39 -0) (end 1.75 -0) (layer F.SilkS) (width 0.2))
  (fp_line (start 1.75 -0) (end 1.75 -0) (layer F.SilkS) (width 0.2))
  (fp_line (start 1.75 -0) (end 0.39 -0) (layer F.SilkS) (width 0.2))
  (fp_line (start 0.39 -0) (end 0.39 -0) (layer F.SilkS) (width 0.2))
  (fp_line (start 1.75 -0) (end 1.75 -0) (layer F.SilkS) (width 0.2))
  (fp_line (start 1.75 -0) (end 1.75 0.25) (layer F.SilkS) (width 0.2))
  (fp_line (start 1.75 0.25) (end 1.75 0.25) (layer F.SilkS) (width 0.2))
  (fp_line (start 1.75 0.25) (end 1.75 -0) (layer F.SilkS) (width 0.2))
  (fp_line (start 1.75 1.75) (end 1.75 1.75) (layer F.SilkS) (width 0.2))
  (fp_line (start 1.75 1.75) (end 1.75 2) (layer F.SilkS) (width 0.2))
  (fp_line (start 1.75 2) (end 1.75 2) (layer F.SilkS) (width 0.2))
  (fp_line (start 1.75 2) (end 1.75 1.75) (layer F.SilkS) (width 0.2))
  (fp_line (start 1 3.3) (end -0.75 3.3) (layer F.SilkS) (width 0.2))
  (fp_line (start -0.75 3.3) (end -0.75 3.3) (layer F.SilkS) (width 0.2))
  (fp_line (start -0.75 3.3) (end 1 3.3) (layer F.SilkS) (width 0.2))
  (fp_line (start 1 3.3) (end 1 3.3) (layer F.SilkS) (width 0.2))
  (fp_line (start -1.75 1.75) (end -1.75 1.75) (layer F.SilkS) (width 0.2))
  (fp_line (start -1.75 1.75) (end -1.75 2) (layer F.SilkS) (width 0.2))
  (fp_line (start -1.75 2) (end -1.75 2) (layer F.SilkS) (width 0.2))
  (fp_line (start -1.75 2) (end -1.75 1.75) (layer F.SilkS) (width 0.2))
  (fp_line (start -3.25 -2.15) (end 3.25 -2.15) (layer F.CrtYd) (width 0.1))
  (fp_line (start 3.25 -2.15) (end 3.25 4.34) (layer F.CrtYd) (width 0.1))
  (fp_line (start 3.25 4.34) (end -3.25 4.34) (layer F.CrtYd) (width 0.1))
  (fp_line (start -3.25 4.34) (end -3.25 -2.15) (layer F.CrtYd) (width 0.1))
  (pad 1 smd rect (at -1.825 2.79 0) (size 0.850 1.100) (layers F.Cu F.Paste F.Mask))
  (pad 2 smd rect (at 1.825 2.79 0) (size 0.850 1.100) (layers F.Cu F.Paste F.Mask))
  (pad A1 smd rect (at -1.975 1 0) (size 0.550 0.600) (layers F.Cu F.Paste F.Mask))
  (pad B1 smd rect (at 1.975 1 0) (size 0.550 0.600) (layers F.Cu F.Paste F.Mask))
)
