EESchema Schematic File Version 4
EELAYER 30 0
EELAYER END
$Descr A3 16535 11693
encoding utf-8
Sheet 1 14
Title "Science Unit Main Board (Payload Board)"
Date "2022-03-13"
Rev "2.1 (EM)"
Comp "SpaceDot"
Comment1 "AcubeSAT"
Comment2 ""
Comment3 ""
Comment4 ""
$EndDescr
Wire Notes Line
	2900 1000 2900 1650
Text Notes 1500 1000 0    50   ~ 0
PWR for KiCad
Wire Notes Line
	2900 1650 700  1650
Wire Notes Line
	700  1650 700  1000
Wire Notes Line
	700  1000 2900 1000
$Sheet
S 9100 5850 2200 800 
U 5F938AED
F0 "Control Valve Driver" 50
F1 "control_valve_driver.sch" 50
F2 "CONTROL_VALVE_1_SIGNAL" I L 9100 6000 50 
F3 "CONTROL_VALVE_2_SIGNAL" I L 9100 6100 50 
F4 "CONTROL_VALVE_3_SIGNAL" I L 9100 6200 50 
F5 "CONTROL_VALVE_4_SIGNAL" I L 9100 6300 50 
F6 "CONTROL_VALVE_5_SIGNAL" I L 9100 6400 50 
F7 "CONTROL_VALVE_6_SIGNAL" I L 9100 6500 50 
F8 "CONTROL_VALVE_POSITIVE_1" I R 11300 6000 50 
F9 "CONTROL_VALVE_POSITIVE_4" I R 11300 6300 50 
F10 "CONTROL_VALVE_POSITIVE_2" I R 11300 6100 50 
F11 "CONTROL_VALVE_POSITIVE_5" I R 11300 6400 50 
F12 "CONTROL_VALVE_POSITIVE_3" I R 11300 6200 50 
F13 "CONTROL_VALVE_POSITIVE_6" I R 11300 6500 50 
$EndSheet
$Sheet
S 9100 4800 2200 800 
U 5FFAB9B8
F0 "Flow Pump Driver" 50
F1 "flow_pump_driver.sch" 50
F2 "FLOW_PUMP_PHASE_A-" O R 11300 5050 50 
F3 "FLOW_PUMP_PHASE_A+" O R 11300 4950 50 
F4 "FLOW_PUMP_PHASE_B+" O R 11300 5200 50 
F5 "FLOW_PUMP_PHASE_B-" O R 11300 5300 50 
F6 "FLOW_PUMP_PWM_A1" I L 9100 4950 50 
F7 "FLOW_PUMP_PWM_A2" I L 9100 5050 50 
F8 "FLOW_PUMP_PWM_B1" I L 9100 5200 50 
F9 "FLOW_PUMP_PWM_B2" I L 9100 5300 50 
F10 "VCC" I L 9100 5450 50 
$EndSheet
$Sheet
S 9100 6900 2200 800 
U 6009AF74
F0 "Control Pump Driver" 50
F1 "control_pump_driver.sch" 50
F2 "CONTROL_PUMP_PHASE_A-" O R 11300 7150 50 
F3 "CONTROL_PUMP_PHASE_A+" O R 11300 7050 50 
F4 "CONTROL_PUMP_PHASE_B+" O R 11300 7300 50 
F5 "CONTROL_PUMP_PHASE_B-" O R 11300 7400 50 
F6 "CONTROL_PUMP_PWM_B2" I L 9100 7400 50 
F7 "CONTROL_PUMP_PWM_B1" I L 9100 7300 50 
F8 "CONTROL_PUMP_PWM_A2" I L 9100 7150 50 
F9 "CONTROL_PUMP_PWM_A1" I L 9100 7050 50 
F10 "VCC" I L 9100 7550 50 
$EndSheet
$Sheet
S 3800 1050 1050 3000
U 5FB89B52
F0 "Sensors" 50
F1 "sensors.sch" 50
F2 "I2C_SDA_HUM_1" B R 4850 1200 50 
F3 "I2C_SCL_HUM_1" I R 4850 1300 50 
F4 "HUMIDITY_RST1" I R 4850 3800 50 
F5 "I2C_SDA_HUM_2" B R 4850 1450 50 
F6 "I2C_SCL_HUM_2" I R 4850 1550 50 
F7 "HUMIDITY_RST2" I R 4850 3900 50 
F8 "I2C_SDA_TMP_1" B R 4850 1750 50 
F9 "I2C_SCL_TMP_1" I R 4850 1850 50 
F10 "I2C_SDA_TMP_2" B R 4850 2000 50 
F11 "I2C_SCL_TMP_2" I R 4850 2100 50 
F12 "SPI_SCK_1" I R 4850 2900 50 
F13 "SPI_MOSI_1" I R 4850 3000 50 
F14 "SPI_SCK_2" I R 4850 3400 50 
F15 "SPI_MOSI_2" I R 4850 3500 50 
F16 "FG_VB" I R 4850 2610 50 
F17 "I2C_SCL_FG" I R 4850 2400 50 
F18 "I2C_SDA_FG" B R 4850 2300 50 
F19 "FG_VDOSE" O R 4850 2500 50 
F20 "SPI_MISO_1" O R 4850 3100 50 
F21 "SPI_MISO_2" O R 4850 3600 50 
F22 "SPI_NSS_1" I R 4850 2800 50 
F23 "SPI_NSS_2" I R 4850 3300 50 
$EndSheet
$Sheet
S 9100 2400 2200 2150
U 5F9F1786
F0 "Flow Valve Driver" 50
F1 "flow_valve_driver.sch" 50
F2 "FLOW_VALVE_1+" O R 11300 2550 50 
F3 "FLOW_VALVE_1-" O R 11300 2650 50 
F4 "FLOW_VALVE_2+" O R 11300 2800 50 
F5 "FLOW_VALVE_2-" O R 11300 2900 50 
F6 "FLOW_VALVE_3+" O R 11300 3050 50 
F7 "FLOW_VALVE_3-" O R 11300 3150 50 
F8 "FLOW_VALVE_4+" O R 11300 3300 50 
F9 "FLOW_VALVE_4-" O R 11300 3400 50 
F10 "FLOW_VALVE_5+" O R 11300 3550 50 
F11 "FLOW_VALVE_5-" O R 11300 3650 50 
F12 "FLOW_VALVE_6+" O R 11300 3800 50 
F13 "FLOW_VALVE_6-" O R 11300 3900 50 
F14 "FLOW_VALVE_7+" O R 11300 4050 50 
F15 "FLOW_VALVE_7-" O R 11300 4150 50 
F16 "FLOW_VALVE_8+" O R 11300 4300 50 
F17 "FLOW_VALVE_8-" O R 11300 4400 50 
F18 "FLOW_VALVE_1_OPEN" I L 9100 2550 50 
F19 "FLOW_VALVE_1_CLOSE" I L 9100 2650 50 
F20 "FLOW_VALVE_2_OPEN" I L 9100 2800 50 
F21 "FLOW_VALVE_2_CLOSE" I L 9100 2900 50 
F22 "FLOW_VALVE_3_OPEN" I L 9100 3050 50 
F23 "FLOW_VALVE_3_CLOSE" I L 9100 3150 50 
F24 "FLOW_VALVE_4_OPEN" I L 9100 3300 50 
F25 "FLOW_VALVE_4_CLOSE" I L 9100 3400 50 
F26 "FLOW_VALVE_5_OPEN" I L 9100 3550 50 
F27 "FLOW_VALVE_5_CLOSE" I L 9100 3650 50 
F28 "FLOW_VALVE_6_OPEN" I L 9100 3800 50 
F29 "FLOW_VALVE_6_CLOSE" I L 9100 3900 50 
F30 "FLOW_VALVE_7_OPEN" I L 9100 4050 50 
F31 "FLOW_VALVE_7_CLOSE" I L 9100 4150 50 
F32 "FLOW_VALVE_8_OPEN" I L 9100 4300 50 
F33 "FLOW_VALVE_8_CLOSE" I L 9100 4400 50 
$EndSheet
$Sheet
S 9100 7950 2200 600 
U 5F714E00
F0 "LED Driver" 50
F1 "led_driver.sch" 50
F2 "LED_1_SIGNAL" I L 9100 8100 50 
F3 "LED_2_SIGNAL" I L 9100 8200 50 
F4 "LED_3_SIGNAL" I L 9100 8300 50 
F5 "LED_4_SIGNAL" I L 9100 8400 50 
F6 "LED_CONTROL_1" O R 11300 8100 50 
F7 "LED_CONTROL_2" O R 11300 8200 50 
F8 "LED_CONTROL_3" O R 11300 8300 50 
F9 "LED_CONTROL_4" O R 11300 8400 50 
$EndSheet
Wire Wire Line
	11300 1200 12050 1200
Wire Wire Line
	11300 1300 12050 1300
Wire Wire Line
	11300 1900 12050 1900
Wire Wire Line
	11300 2000 12050 2000
Wire Wire Line
	11300 2550 12050 2550
Wire Wire Line
	11300 2650 12050 2650
Wire Wire Line
	11300 2800 12050 2800
Wire Wire Line
	11300 2900 12050 2900
Wire Wire Line
	11300 3050 12050 3050
Wire Wire Line
	11300 3150 12050 3150
Wire Wire Line
	11300 3300 12050 3300
Wire Wire Line
	11300 3400 12050 3400
Wire Wire Line
	11300 3550 12050 3550
Wire Wire Line
	11300 3650 12050 3650
Wire Wire Line
	11300 3800 12050 3800
Wire Wire Line
	11300 3900 12050 3900
Wire Wire Line
	11300 4050 12050 4050
Wire Wire Line
	11300 4150 12050 4150
Wire Wire Line
	11300 4950 12050 4950
Wire Wire Line
	11300 5050 12050 5050
Wire Wire Line
	11300 5200 12050 5200
Wire Wire Line
	11300 5300 12050 5300
Wire Wire Line
	11300 4300 12050 4300
Wire Wire Line
	11300 4400 12050 4400
Wire Wire Line
	4850 1200 5500 1200
Wire Wire Line
	4850 1300 5500 1300
Wire Wire Line
	4850 1450 5500 1450
Wire Wire Line
	4850 1550 5500 1550
Wire Wire Line
	4850 1750 5500 1750
Wire Wire Line
	4850 1850 5500 1850
Wire Wire Line
	4850 2000 5500 2000
Wire Wire Line
	4850 2100 5500 2100
Wire Wire Line
	4850 2300 5500 2300
Wire Wire Line
	4850 2400 5500 2400
Wire Wire Line
	4850 2800 5500 2800
Wire Wire Line
	4850 2900 5500 2900
Wire Wire Line
	4850 3000 5500 3000
Wire Wire Line
	4850 3100 5500 3100
Wire Wire Line
	4850 3300 5500 3300
Wire Wire Line
	4850 3400 5500 3400
Wire Wire Line
	4850 3500 5500 3500
Wire Wire Line
	4850 3600 5500 3600
Wire Wire Line
	4850 3800 5500 3800
Wire Wire Line
	4850 3900 5500 3900
Wire Wire Line
	4850 2500 5500 2500
Wire Wire Line
	8350 4950 9100 4950
Wire Wire Line
	8350 5050 9100 5050
Wire Wire Line
	8350 5200 9100 5200
Wire Wire Line
	8350 5300 9100 5300
Wire Wire Line
	8350 4300 9100 4300
Wire Wire Line
	8350 4400 9100 4400
Wire Wire Line
	8350 4050 9100 4050
Wire Wire Line
	8350 4150 9100 4150
Wire Wire Line
	8350 3900 9100 3900
Wire Wire Line
	8350 3800 9100 3800
Wire Wire Line
	8350 3650 9100 3650
Wire Wire Line
	9100 3550 8350 3550
Wire Wire Line
	8350 3400 9100 3400
Wire Wire Line
	9100 3300 8350 3300
Wire Wire Line
	8350 3150 9100 3150
Wire Wire Line
	9100 3050 8350 3050
Wire Wire Line
	8350 2900 9100 2900
Wire Wire Line
	9100 2800 8350 2800
Wire Wire Line
	8350 2650 9100 2650
Wire Wire Line
	9100 2550 8350 2550
Wire Wire Line
	9100 2000 8350 2000
Wire Wire Line
	8350 1900 9100 1900
Wire Wire Line
	9100 1800 8350 1800
Wire Wire Line
	8350 1700 9100 1700
Wire Wire Line
	8350 1500 9100 1500
Wire Wire Line
	9100 1400 8350 1400
Wire Wire Line
	8350 1300 9100 1300
Wire Wire Line
	9100 1200 8350 1200
$Sheet
S 3800 5400 1050 1050
U 5F73FF05
F0 "Current Sensing" 50
F1 "current_sensing.sch" 50
F2 "FLOW_PUMP_ALERT" O R 4850 5650 50 
F3 "I2C_SDA_FLOW_PUMP" B R 4850 5750 50 
F4 "CONTROL_PUMP_ALERT" O R 4850 6100 50 
F5 "I2C_SDA_CONTROL_PUMP" B R 4850 6200 50 
F6 "I2C_SCL_CONTROL_PUMP" I R 4850 6300 50 
F7 "I2C_SCL_FLOW_PUMP" I R 4850 5850 50 
F8 "FLOW_VCC" O R 4850 5550 50 
F9 "CONTROL_VCC" O R 4850 6000 50 
$EndSheet
Text Label 5000 5550 0    50   ~ 0
FLOW_VCC
Text Label 4900 6000 0    50   ~ 0
CONTROL_VCC
Text Label 8950 5450 2    50   ~ 0
FLOW_VCC
Text Label 9000 7550 2    50   ~ 0
CONTROL_VCC
Wire Wire Line
	4850 5650 5500 5650
Wire Wire Line
	5500 5750 4850 5750
Wire Wire Line
	4850 5850 5500 5850
Wire Wire Line
	4850 6100 5500 6100
Wire Wire Line
	5500 6200 4850 6200
Wire Wire Line
	4850 6300 5500 6300
Wire Wire Line
	8350 6000 9100 6000
Wire Wire Line
	8350 6100 9100 6100
Wire Wire Line
	8350 6200 9100 6200
Wire Wire Line
	8350 6300 9100 6300
Wire Wire Line
	8350 6400 9100 6400
Wire Wire Line
	9100 6500 8350 6500
Wire Wire Line
	8350 7050 9100 7050
Wire Wire Line
	8350 7150 9100 7150
Wire Wire Line
	8350 7300 9100 7300
Wire Wire Line
	8350 7400 9100 7400
Wire Wire Line
	8350 8100 9100 8100
Wire Wire Line
	9100 8200 8350 8200
Wire Wire Line
	8350 8300 9100 8300
Wire Wire Line
	9100 8400 8350 8400
Wire Wire Line
	11300 6000 12050 6000
Wire Wire Line
	11300 6100 12050 6100
Wire Wire Line
	11300 6200 12050 6200
Wire Wire Line
	11300 6300 12050 6300
Wire Wire Line
	12050 6400 11300 6400
Wire Wire Line
	11300 6500 12050 6500
Wire Wire Line
	11300 7050 12050 7050
Wire Wire Line
	12050 7150 11300 7150
Wire Wire Line
	11300 7300 12050 7300
Wire Wire Line
	12050 7400 11300 7400
Wire Wire Line
	11300 8100 12050 8100
Wire Wire Line
	12050 8200 11300 8200
Wire Wire Line
	11300 8300 12050 8300
Wire Wire Line
	12050 8400 11300 8400
Wire Wire Line
	8350 9350 12050 9350
Wire Wire Line
	12050 9450 8350 9450
Wire Wire Line
	9100 7550 9000 7550
Wire Wire Line
	9100 5450 8950 5450
Wire Wire Line
	4850 5550 5000 5550
Wire Wire Line
	4900 6000 4850 6000
$Sheet
S 3800 6950 1050 2650
U 60E3C945
F0 "LatchUp Current Limiters" 50
F1 "LCLs.sch" 50
F2 "lclset1" I R 4850 8550 63 
F3 "lclprotecteddvc1" O R 4850 9200 63 
F4 "lclprotecteddvc2" O L 3800 8900 63 
F5 "lclset3" I R 4850 8800 63 
F6 "lclprotecteddvc3" O R 4850 9300 63 
F7 "DAC1.1" I R 4850 7350 63 
F8 "DAC2.1" I R 4850 7490 63 
F9 "OUT_MANIFOLD_1" I R 4850 9450 50 
F10 "OUT_MANIFOLD_2" I R 4850 9550 50 
F11 "ADC_MANIFOLD_2" O R 4850 7250 50 
F12 "ADC_MANIFOLD_1" O R 4850 7150 50 
F13 "DAC_PWM_1" I R 4850 8300 50 
F14 "USB_EN" I R 4850 8680 50 
F15 "USB_FAULT" I R 4850 7960 50 
$EndSheet
Wire Wire Line
	4850 9200 5500 9200
Wire Wire Line
	5500 8550 4850 8550
Wire Wire Line
	5500 7490 4850 7490
Wire Wire Line
	4850 7350 5500 7350
Wire Wire Line
	5500 8680 4850 8680
Wire Wire Line
	4850 8800 5500 8800
Wire Wire Line
	8350 9250 12050 9250
Wire Wire Line
	3800 4900 3650 4900
Wire Wire Line
	3650 4900 3650 8900
Wire Wire Line
	3650 8900 3800 8900
Text Label 4945 9300 0    63   ~ 0
lcl3
Text Label 8985 1100 2    63   ~ 0
lcl3
Wire Wire Line
	4945 9300 4850 9300
Wire Wire Line
	9100 1100 8985 1100
Wire Wire Line
	4850 8300 5500 8300
Wire Wire Line
	5500 7150 4850 7150
Wire Wire Line
	4850 7250 5500 7250
Text Notes 10410 5770 0    50   ~ 0
non-latching are the control ones
Wire Wire Line
	5500 7960 4850 7960
$Sheet
S 3800 4300 1050 650 
U 5F784C18
F0 "USB FS Downstream" 50
F1 "usb_fs_downstream.sch" 50
F2 "lclprotecteddvc2" I L 3800 4900 63 
F3 "USB_D-" B R 4850 4515 50 
F4 "USB_D+" B R 4850 4595 50 
$EndSheet
Wire Wire Line
	5500 2610 4850 2610
Text Label 4950 9450 0    50   ~ 0
out_mani1
Text Label 4950 9550 0    50   ~ 0
out_mani2
Wire Wire Line
	4850 9450 4950 9450
Wire Wire Line
	4850 9550 4950 9550
Text Label 13300 9150 0    50   ~ 0
out_mani1
Text Label 13300 9050 0    50   ~ 0
out_mani2
Wire Wire Line
	13300 9050 13200 9050
Wire Wire Line
	13200 9150 13300 9150
$Sheet
S 5500 1050 2850 8550
U 5FBFE149
F0 "MCU" 50
F1 "mcu.sch" 50
F2 "CAN_SILENT_1" O R 8350 1200 50 
F3 "CAN_FAULT_1" I R 8350 1300 50 
F4 "CAN_TX_1" I R 8350 1500 50 
F5 "CAN_SILENT_2" O R 8350 1700 50 
F6 "CAN_FAULT_2" I R 8350 1800 50 
F7 "CAN_RX_2" O R 8350 1900 50 
F8 "CAN_RX_1" O R 8350 1400 50 
F9 "CAN_TX_2" I R 8350 2000 50 
F10 "CHIP_TEMP_1_IN" I R 8350 9250 50 
F11 "CHIP_TEMP_2_IN" I R 8350 9350 50 
F12 "CHIP_TEMP_3_IN" I R 8350 9450 50 
F13 "HUMIDITY_RST1" O L 5500 3800 50 
F14 "HUMIDITY_RST2" O L 5500 3900 50 
F15 "SPI_NSS_1" O L 5500 2800 50 
F16 "SPI_NSS_2" O L 5500 3300 50 
F17 "SPI_MOSI_1" O L 5500 3000 50 
F18 "SPI_MISO_1" I L 5500 3100 50 
F19 "SPI_MOSI_2" O L 5500 3500 50 
F20 "SPI_MISO_2" I L 5500 3600 50 
F21 "I2C_SDA_HUM_2" B L 5500 1450 50 
F22 "I2C_SDA_TMP_2" B L 5500 2000 50 
F23 "LED_1_SIGNAL" O R 8350 8100 50 
F24 "LED_2_SIGNAL" O R 8350 8200 50 
F25 "LED_3_SIGNAL" O R 8350 8300 50 
F26 "LED_4_SIGNAL" O R 8350 8400 50 
F27 "FLOW_VALVE_1_OPEN" O R 8350 2550 50 
F28 "FLOW_VALVE_1_CLOSE" O R 8350 2650 50 
F29 "FLOW_VALVE_2_OPEN" O R 8350 2800 50 
F30 "FLOW_VALVE_2_CLOSE" O R 8350 2900 50 
F31 "FLOW_VALVE_3_OPEN" O R 8350 3050 50 
F32 "FLOW_VALVE_3_CLOSE" O R 8350 3150 50 
F33 "FLOW_VALVE_4_OPEN" O R 8350 3300 50 
F34 "FLOW_VALVE_4_CLOSE" O R 8350 3400 50 
F35 "FLOW_VALVE_5_OPEN" O R 8350 3550 50 
F36 "FLOW_VALVE_5_CLOSE" O R 8350 3650 50 
F37 "FLOW_VALVE_6_OPEN" O R 8350 3800 50 
F38 "FLOW_VALVE_6_CLOSE" O R 8350 3900 50 
F39 "FLOW_VALVE_7_OPEN" O R 8350 4050 50 
F40 "FLOW_VALVE_7_CLOSE" O R 8350 4150 50 
F41 "FLOW_VALVE_8_OPEN" O R 8350 4300 50 
F42 "FLOW_VALVE_8_CLOSE" O R 8350 4400 50 
F43 "CONTROL_VALVE_1_SIGNAL" O R 8350 6000 50 
F44 "CONTROL_VALVE_2_SIGNAL" O R 8350 6100 50 
F45 "CONTROL_VALVE_3_SIGNAL" O R 8350 6200 50 
F46 "CONTROL_VALVE_4_SIGNAL" O R 8350 6300 50 
F47 "CONTROL_VALVE_5_SIGNAL" O R 8350 6400 50 
F48 "CONTROL_VALVE_6_SIGNAL" O R 8350 6500 50 
F49 "FLOW_PUMP_PWM_A2" O R 8350 5050 50 
F50 "FLOW_PUMP_PWM_A1" O R 8350 4950 50 
F51 "FLOW_PUMP_PWM_B1" O R 8350 5200 50 
F52 "FLOW_PUMP_PWM_B2" O R 8350 5300 50 
F53 "CONTROL_PUMP_PWM_A2" O R 8350 7150 50 
F54 "CONTROL_PUMP_PWM_A1" O R 8350 7050 50 
F55 "CONTROL_PUMP_PWM_B1" O R 8350 7300 50 
F56 "CONTROL_PUMP_PWM_B2" O R 8350 7400 50 
F57 "I2C_SDA_FG" B L 5500 2300 50 
F58 "I2C_SDA_TMP_1" B L 5500 1750 50 
F59 "I2C_SDA_HUM_1" B L 5500 1200 50 
F60 "I2C_SCL_HUM_2" O L 5500 1550 50 
F61 "I2C_SCL_TMP_2" O L 5500 2100 50 
F62 "I2C_SCL_FG" O L 5500 2400 50 
F63 "I2C_SCL_TMP_1" O L 5500 1850 50 
F64 "I2C_SCL_HUM_1" O L 5500 1300 50 
F65 "SPI_SCK_1" O L 5500 2900 50 
F66 "SPI_SCK_2" O L 5500 3400 50 
F67 "FG_VDOSE" I L 5500 2500 50 
F68 "FGD_VB" I L 5500 2610 50 
F69 "I2C_SCL_FLOW" O L 5500 5850 50 
F70 "I2C_SDA_FLOW" B L 5500 5750 50 
F71 "I2C_SCL_CONTROL" O L 5500 6300 50 
F72 "I2C_SDA_CONTROL" B L 5500 6200 50 
F73 "FLOW_PUMP_CURRENT_ALERT" I L 5500 5650 50 
F74 "CONTROL_PUMP_CURRENT_ALERT" I L 5500 6100 50 
F75 "MEM_VCC" I L 5500 9200 63 
F76 "lclset3" O L 5500 8800 63 
F77 "DAC1.1" O L 5500 7350 63 
F78 "DAC2.1" O L 5500 7490 63 
F79 "lclset1" O L 5500 8550 63 
F80 "ADC_MANIFOLD_1" I L 5500 7150 50 
F81 "ADC_MANIFOLD_2" I L 5500 7250 50 
F82 "DAC_PWM_1" O L 5500 8300 50 
F83 "USB_EN" O L 5500 8680 50 
F84 "USB_FAULT" O L 5500 7960 50 
F85 "HEATER_CONTROL_1" O R 8350 9050 50 
F86 "HEATER_CONTROL_CHIP" O R 8350 8950 50 
F87 "VALVES_TEMP_IN" I R 8350 9550 50 
F88 "USB_D+" B L 5500 4595 50 
F89 "USB_D-" B L 5500 4515 50 
$EndSheet
$Sheet
S 9100 8750 2200 450 
U 5F700CE8
F0 "Heater Driver" 50
F1 "heater_driver.sch" 50
F2 "HEATER_GND_CHIP" O R 11300 8850 50 
F3 "HEATER_CONTROL_CHIP" I L 9100 8950 50 
F4 "HEATER_GND_1" O R 11300 9050 50 
F5 "HEATER_CONTROL_1" I L 9100 9050 50 
$EndSheet
Wire Wire Line
	9100 8950 8350 8950
Wire Wire Line
	8350 9050 9100 9050
Wire Wire Line
	12050 8850 11300 8850
Wire Wire Line
	12050 9050 11300 9050
Wire Wire Line
	12050 9550 8350 9550
Wire Wire Line
	4850 4515 5500 4515
Wire Wire Line
	4850 4595 5500 4595
$Sheet
S 12050 1050 1150 8550
U 5FB2AE1D
F0 "Connectors" 50
F1 "connectors.sch" 50
F2 "LED_CONTROL_1" I L 12050 8100 50 
F3 "LED_CONTROL_3" I L 12050 8300 50 
F4 "LED_CONTROL_2" I L 12050 8200 50 
F5 "LED_CONTROL_4" I L 12050 8400 50 
F6 "FLOW_VALVE_1+" I L 12050 2550 50 
F7 "FLOW_VALVE_1-" I L 12050 2650 50 
F8 "FLOW_VALVE_2+" I L 12050 2800 50 
F9 "FLOW_VALVE_2-" I L 12050 2900 50 
F10 "FLOW_VALVE_3+" I L 12050 3050 50 
F11 "FLOW_VALVE_3-" I L 12050 3150 50 
F12 "FLOW_VALVE_4+" I L 12050 3300 50 
F13 "FLOW_VALVE_4-" I L 12050 3400 50 
F14 "FLOW_VALVE_5+" I L 12050 3550 50 
F15 "FLOW_VALVE_5-" I L 12050 3650 50 
F16 "FLOW_VALVE_6+" I L 12050 3800 50 
F17 "FLOW_VALVE_6-" I L 12050 3900 50 
F18 "FLOW_VALVE_7+" I L 12050 4050 50 
F19 "FLOW_VALVE_7-" I L 12050 4150 50 
F20 "FLOW_VALVE_8+" I L 12050 4300 50 
F21 "FLOW_VALVE_8-" I L 12050 4400 50 
F22 "FLOW_PUMP_PHASE_A-" I L 12050 5050 50 
F23 "FLOW_PUMP_PHASE_A+" I L 12050 4950 50 
F24 "FLOW_PUMP_PHASE_B-" I L 12050 5300 50 
F25 "FLOW_PUMP_PHASE_B+" I L 12050 5200 50 
F26 "CONTROL_PUMP_PHASE_B+" I L 12050 7300 50 
F27 "CONTROL_PUMP_PHASE_B-" I L 12050 7400 50 
F28 "CONTROL_PUMP_PHASE_A+" I L 12050 7050 50 
F29 "CONTROL_PUMP_PHASE_A-" I L 12050 7150 50 
F30 "CHIP_TEMP_1_IN" O L 12050 9250 50 
F31 "CHIP_TEMP_2_IN" O L 12050 9350 50 
F32 "CHIP_TEMP_3_IN" O L 12050 9450 50 
F33 "OUT_MANIFOLD_1" O R 13200 9150 50 
F34 "OUT_MANIFOLD_2" O R 13200 9050 50 
F35 "HEATER_GND_1" I L 12050 9050 50 
F36 "HEATER_GND_CHIP" I L 12050 8850 50 
F37 "VALVES_TEMP_IN" O L 12050 9550 50 
F38 "CAN1_P" B L 12050 1200 50 
F39 "CAN1_N" B L 12050 1300 50 
F40 "CAN2_P" B L 12050 1900 50 
F41 "CAN2_N" B L 12050 2000 50 
F42 "CONTROL_VALVE_POSITIVE_3" I L 12050 6200 50 
F43 "CONTROL_VALVE_POSITIVE_4" I L 12050 6300 50 
F44 "CONTROL_VALVE_POSITIVE_2" I L 12050 6100 50 
F45 "CONTROL_VALVE_POSITIVE_1" I L 12050 6000 50 
F46 "CONTROL_VALVE_POSITIVE_6" I L 12050 6500 50 
F47 "CONTROL_VALVE_POSITIVE_5" I L 12050 6400 50 
$EndSheet
$Sheet
S 9100 1050 2200 1100
U 5FC54D9F
F0 "CAN" 50
F1 "can.sch" 50
F2 "CAN_SILENT_1" I L 9100 1200 50 
F3 "CAN_FAULT_1" O L 9100 1300 50 
F4 "CAN_RX_1" I L 9100 1400 50 
F5 "CAN_TX_1" O L 9100 1500 50 
F6 "CAN_RX_2" I L 9100 1900 50 
F7 "CAN_TX_2" O L 9100 2000 50 
F8 "CAN_SILENT_2" I L 9100 1700 50 
F9 "CAN_FAULT_2" O L 9100 1800 50 
F10 "lclprotecteddvc3" O L 9100 1100 63 
F11 "CAN1_P" B R 11300 1200 50 
F12 "CAN1_N" B R 11300 1300 50 
F13 "CAN2_P" B R 11300 1900 50 
F14 "CAN2_N" B R 11300 2000 50 
$EndSheet
$EndSCHEMATC
