(module G8327A047 (layer F.Cu) (tedit 0)
  (descr G8327A047-2)
  (tags "Crystal or Oscillator")
  (attr smd)
  (fp_text reference Y** (at 0 0) (layer F.SilkS)
    (effects (font (size 1.27 1.27) (thickness 0.254)))
  )
  (fp_text value G8327A047 (at 0 0) (layer F.SilkS) hide
    (effects (font (size 1.27 1.27) (thickness 0.254)))
  )
  (fp_text user %R (at 0 0) (layer F.Fab)
    (effects (font (size 1.27 1.27) (thickness 0.254)))
  )
  (fp_line (start -1.6 -0.75) (end 1.6 -0.75) (layer F.Fab) (width 0.2))
  (fp_line (start 1.6 -0.75) (end 1.6 0.75) (layer F.Fab) (width 0.2))
  (fp_line (start 1.6 0.75) (end -1.6 0.75) (layer F.Fab) (width 0.2))
  (fp_line (start -1.6 0.75) (end -1.6 -0.75) (layer F.Fab) (width 0.2))
  (fp_line (start -2.8 -1.95) (end 2.8 -1.95) (layer F.CrtYd) (width 0.1))
  (fp_line (start 2.8 -1.95) (end 2.8 1.95) (layer F.CrtYd) (width 0.1))
  (fp_line (start 2.8 1.95) (end -2.8 1.95) (layer F.CrtYd) (width 0.1))
  (fp_line (start -2.8 1.95) (end -2.8 -1.95) (layer F.CrtYd) (width 0.1))
  (fp_line (start -0.4 -0.75) (end 0.4 -0.75) (layer F.SilkS) (width 0.1))
  (fp_line (start -0.4 0.75) (end 0.4 0.75) (layer F.SilkS) (width 0.1))
  (pad 2 smd rect (at 1.25 0) (size 1.1 1.9) (layers F.Cu F.Paste F.Mask))
  (pad 1 smd rect (at -1.25 0) (size 1.1 1.9) (layers F.Cu F.Paste F.Mask))
)
