(footprint "RTC-Crystal-Oscillator"
	(version 20240108)
	(generator "pcbnew")
	(generator_version "8.0")
	(layer "F.Cu")
	(descr "FC-135 32.7680KA-AG3-3")
	(tags "Crystal or Oscillator")
	(property "Reference" "Y**"
		(at 0 -1.35 0)
		(layer "F.SilkS")
		(uuid "846934e7-a41c-44f2-a855-de8a762e70e1")
		(effects
			(font
				(size 0.7 0.7)
				(thickness 0.175)
			)
		)
	)
	(property "Value" "RTC-Crystal-Oscillator"
		(at 0 0 0)
		(layer "F.SilkS")
		(hide yes)
		(uuid "04239e0c-5421-499a-8459-af30f21de08e")
		(effects
			(font
				(size 1.27 1.27)
				(thickness 0.254)
			)
		)
	)
	(property "Footprint" ""
		(at 0 0 0)
		(layer "F.Fab")
		(hide yes)
		(uuid "9e1bda3b-6dfe-40ca-bb6a-eac395142e49")
		(effects
			(font
				(size 1.27 1.27)
				(thickness 0.15)
			)
		)
	)
	(property "Datasheet" ""
		(at 0 0 0)
		(layer "F.Fab")
		(hide yes)
		(uuid "a9f203bc-2fe4-46f4-b27d-8e49feb9ff98")
		(effects
			(font
				(size 1.27 1.27)
				(thickness 0.15)
			)
		)
	)
	(property "Description" ""
		(at 0 0 0)
		(layer "F.Fab")
		(hide yes)
		(uuid "e5a79652-17a2-4ae8-ae9f-250bfea66212")
		(effects
			(font
				(size 1.27 1.27)
				(thickness 0.15)
			)
		)
	)
	(attr smd)
	(fp_line
		(start -2.2 0)
		(end -2.2 0)
		(stroke
			(width 0.1)
			(type solid)
		)
		(layer "F.SilkS")
		(uuid "af5b8b46-753b-4a6b-91d7-9e784e9359e1")
	)
	(fp_line
		(start -2.2 0.1)
		(end -2.2 0.1)
		(stroke
			(width 0.1)
			(type solid)
		)
		(layer "F.SilkS")
		(uuid "40e4dfe0-0a48-40bd-b40c-17ecc42f094d")
	)
	(fp_line
		(start -0.4 -0.75)
		(end 0.4 -0.75)
		(stroke
			(width 0.1)
			(type solid)
		)
		(layer "F.SilkS")
		(uuid "e31cc2d5-d0f9-47b0-98d5-3154be5ea977")
	)
	(fp_line
		(start -0.4 0.75)
		(end 0.4 0.75)
		(stroke
			(width 0.1)
			(type solid)
		)
		(layer "F.SilkS")
		(uuid "3757aa5c-06dc-46b5-a585-b6455c6a0da6")
	)
	(fp_arc
		(start -2.2 0)
		(mid -2.15 0.05)
		(end -2.2 0.1)
		(stroke
			(width 0.1)
			(type solid)
		)
		(layer "F.SilkS")
		(uuid "58cbb546-d695-4101-aa85-8ce79995e64c")
	)
	(fp_arc
		(start -2.2 0.1)
		(mid -2.25 0.05)
		(end -2.2 0)
		(stroke
			(width 0.1)
			(type solid)
		)
		(layer "F.SilkS")
		(uuid "38043f14-a5e8-48c5-a1d7-d8044cf54fce")
	)
	(fp_line
		(start -2.75 -1.9)
		(end 2.75 -1.9)
		(stroke
			(width 0.1)
			(type solid)
		)
		(layer "F.CrtYd")
		(uuid "ba9dfead-b929-4269-a901-cb9cef23dcd0")
	)
	(fp_line
		(start -2.75 1.9)
		(end -2.75 -1.9)
		(stroke
			(width 0.1)
			(type solid)
		)
		(layer "F.CrtYd")
		(uuid "8c556f7c-3102-4424-be35-58bc88f1ca79")
	)
	(fp_line
		(start 2.75 -1.9)
		(end 2.75 1.9)
		(stroke
			(width 0.1)
			(type solid)
		)
		(layer "F.CrtYd")
		(uuid "1ed66d0c-17fb-41b8-8ecd-534071766d9b")
	)
	(fp_line
		(start 2.75 1.9)
		(end -2.75 1.9)
		(stroke
			(width 0.1)
			(type solid)
		)
		(layer "F.CrtYd")
		(uuid "0827a7fa-2a4b-441a-b8ad-04ad542f5325")
	)
	(fp_line
		(start -1.6 -0.75)
		(end 1.6 -0.75)
		(stroke
			(width 0.2)
			(type solid)
		)
		(layer "F.Fab")
		(uuid "88ea3f50-5662-46ae-8253-23c9439e22da")
	)
	(fp_line
		(start -1.6 0.75)
		(end -1.6 -0.75)
		(stroke
			(width 0.2)
			(type solid)
		)
		(layer "F.Fab")
		(uuid "197f01b2-cc77-45c1-a200-e22d19f5925f")
	)
	(fp_line
		(start 1.6 -0.75)
		(end 1.6 0.75)
		(stroke
			(width 0.2)
			(type solid)
		)
		(layer "F.Fab")
		(uuid "c2347e61-3355-487a-91c7-17d34b63749e")
	)
	(fp_line
		(start 1.6 0.75)
		(end -1.6 0.75)
		(stroke
			(width 0.2)
			(type solid)
		)
		(layer "F.Fab")
		(uuid "aeebca27-0bde-4115-9b9f-f333536fabc9")
	)
	(fp_text user "${REFERENCE}"
		(at 0 0 0)
		(layer "F.Fab")
		(uuid "dc704086-981c-4b14-80c2-31a8b44287cd")
		(effects
			(font
				(size 1.27 1.27)
				(thickness 0.254)
			)
		)
	)
	(pad "1" smd rect
		(at -1.25 0)
		(size 1 1.8)
		(layers "F.Cu" "F.Paste" "F.Mask")
		(uuid "e01406ab-fad8-4912-ae1b-12a899ee945b")
	)
	(pad "2" smd rect
		(at 1.25 0)
		(size 1 1.8)
		(layers "F.Cu" "F.Paste" "F.Mask")
		(uuid "05a3ee8b-ad9b-4868-973a-70df765232b1")
	)
	(model "${KIPRJMOD}/3D/Crystal-32k768Hz.stp"
		(offset
			(xyz 0 0 0)
		)
		(scale
			(xyz 1 1 1)
		)
		(rotate
			(xyz -90 0 0)
		)
	)
)
