(module "SON50P200X200X95-9N-D" (layer F.Cu)
  (descr "2x2 mm MLF1")
  (tags "Integrated Circuit")
  (attr smd)
  (fp_text reference IC** (at 0 0) (layer F.SilkS)
    (effects (font (size 1.27 1.27) (thickness 0.254)))
  )
  (fp_text user %R (at 0 0) (layer F.Fab)
    (effects (font (size 1.27 1.27) (thickness 0.254)))
  )
  (fp_text value "SON50P200X200X95-9N-D" (at 0 0) (layer F.SilkS) hide
    (effects (font (size 1.27 1.27) (thickness 0.254)))
  )
  (fp_line (start -1.65 -1.25) (end 1.65 -1.25) (layer F.CrtYd) (width 0.05))
  (fp_line (start 1.65 -1.25) (end 1.65 1.25) (layer F.CrtYd) (width 0.05))
  (fp_line (start 1.65 1.25) (end -1.65 1.25) (layer F.CrtYd) (width 0.05))
  (fp_line (start -1.65 1.25) (end -1.65 -1.25) (layer F.CrtYd) (width 0.05))
  (fp_line (start -1 -1) (end 1 -1) (layer F.Fab) (width 0.1))
  (fp_line (start 1 -1) (end 1 1) (layer F.Fab) (width 0.1))
  (fp_line (start 1 1) (end -1 1) (layer F.Fab) (width 0.1))
  (fp_line (start -1 1) (end -1 -1) (layer F.Fab) (width 0.1))
  (fp_line (start -1 -0.5) (end -0.5 -1) (layer F.Fab) (width 0.1))
  (fp_circle (center -1.4 -1.4) (end -1.4 -1.275) (layer F.SilkS) (width 0.25))
  (pad 1 smd rect (at -1 -0.75 90) (size 0.3 0.8) (layers F.Cu F.Paste F.Mask))
  (pad 2 smd rect (at -1 -0.25 90) (size 0.3 0.8) (layers F.Cu F.Paste F.Mask))
  (pad 3 smd rect (at -1 0.25 90) (size 0.3 0.8) (layers F.Cu F.Paste F.Mask))
  (pad 4 smd rect (at -1 0.75 90) (size 0.3 0.8) (layers F.Cu F.Paste F.Mask))
  (pad 5 smd rect (at 1 0.75 90) (size 0.3 0.8) (layers F.Cu F.Paste F.Mask))
  (pad 6 smd rect (at 1 0.25 90) (size 0.3 0.8) (layers F.Cu F.Paste F.Mask))
  (pad 7 smd rect (at 1 -0.25 90) (size 0.3 0.8) (layers F.Cu F.Paste F.Mask))
  (pad 8 smd rect (at 1 -0.75 90) (size 0.3 0.8) (layers F.Cu F.Paste F.Mask))
  (pad 9 smd rect (at 0 0 0) (size 0.7 1.3) (layers F.Cu F.Paste F.Mask))
  (model "C:\\Users\\boupa\\Desktop\\AcubeSAT\\Libraries\\SamacSys_Parts.3dshapes\\MIC94067YML-TR.stp"
    (at (xyz 0 0 0))
    (scale (xyz 1 1 1))
    (rotate (xyz 0 0 0))
  )
)
