(footprint "Humidity-Sensor"
	(version 20240108)
	(generator "pcbnew")
	(generator_version "8.0")
	(layer "F.Cu")
	(tags "SHT30-DIS-F2.5KS ")
	(property "Reference" "REF**"
		(at 0 0 0)
		(unlocked yes)
		(layer "F.SilkS")
		(uuid "7bbc20cd-a653-4f63-bafb-4b36ce6b0d88")
		(effects
			(font
				(size 1 1)
				(thickness 0.15)
			)
		)
	)
	(property "Value" "Humidity-Sensor"
		(at 0 0 0)
		(unlocked yes)
		(layer "F.Fab")
		(uuid "0d2594c0-12eb-4233-9a0b-6733638cf975")
		(effects
			(font
				(size 1 1)
				(thickness 0.15)
			)
		)
	)
	(property "Footprint" ""
		(at 0 0 0)
		(layer "F.Fab")
		(hide yes)
		(uuid "e695aa15-11d4-4cb1-9b46-38fc04bd54b8")
		(effects
			(font
				(size 1.27 1.27)
				(thickness 0.15)
			)
		)
	)
	(property "Datasheet" ""
		(at 0 0 0)
		(layer "F.Fab")
		(hide yes)
		(uuid "f20daad9-c538-4eb9-bdf3-3aeec8029c17")
		(effects
			(font
				(size 1.27 1.27)
				(thickness 0.15)
			)
		)
	)
	(property "Description" ""
		(at 0 0 0)
		(layer "F.Fab")
		(hide yes)
		(uuid "0ba028cc-13c9-40be-8a45-14d98fec5535")
		(effects
			(font
				(size 1.27 1.27)
				(thickness 0.15)
			)
		)
	)
	(attr smd)
	(fp_line
		(start -0.875 -1)
		(end -1.6 -1)
		(stroke
			(width 0.1)
			(type default)
		)
		(layer "F.SilkS")
		(uuid "a6d54e9e-705d-4e12-943a-eb6dd82b2525")
	)
	(fp_line
		(start -1.8542 -1.131)
		(end -1.5494 -1.131)
		(stroke
			(width 0.1524)
			(type solid)
		)
		(layer "F.CrtYd")
		(uuid "efaf5c31-2082-4069-b9b9-85456231e7d8")
	)
	(fp_line
		(start -1.8542 1.131)
		(end -1.8542 -1.131)
		(stroke
			(width 0.1524)
			(type solid)
		)
		(layer "F.CrtYd")
		(uuid "a02f2b4c-e30d-490b-b663-e3b14e25e68e")
	)
	(fp_line
		(start -1.8542 1.131)
		(end -1.5494 1.131)
		(stroke
			(width 0.1524)
			(type solid)
		)
		(layer "F.CrtYd")
		(uuid "ef6942c2-e3b9-41a7-b6b5-9d1923ce9ae7")
	)
	(fp_line
		(start -1.5494 -1.5494)
		(end 1.5494 -1.5494)
		(stroke
			(width 0.1524)
			(type solid)
		)
		(layer "F.CrtYd")
		(uuid "cc399c96-abb8-49af-b335-c6557a0e87d9")
	)
	(fp_line
		(start -1.5494 -1.131)
		(end -1.5494 -1.5494)
		(stroke
			(width 0.1524)
			(type solid)
		)
		(layer "F.CrtYd")
		(uuid "294fab6c-3617-4cd9-9aa0-0f0f08db6387")
	)
	(fp_line
		(start -1.5494 1.5494)
		(end -1.5494 1.131)
		(stroke
			(width 0.1524)
			(type solid)
		)
		(layer "F.CrtYd")
		(uuid "731021ae-6032-479a-a51d-3dbe19320a8e")
	)
	(fp_line
		(start 1.5494 -1.5494)
		(end 1.5494 -1.131)
		(stroke
			(width 0.1524)
			(type solid)
		)
		(layer "F.CrtYd")
		(uuid "08c5a296-1388-46e7-b6af-47d116475be8")
	)
	(fp_line
		(start 1.5494 1.131)
		(end 1.5494 1.5494)
		(stroke
			(width 0.1524)
			(type solid)
		)
		(layer "F.CrtYd")
		(uuid "a45e8abe-d8a0-45dc-affd-95c20f915cf5")
	)
	(fp_line
		(start 1.5494 1.5494)
		(end -1.5494 1.5494)
		(stroke
			(width 0.1524)
			(type solid)
		)
		(layer "F.CrtYd")
		(uuid "6964555d-9436-4f74-8fc4-ad41109df41b")
	)
	(fp_line
		(start 1.8542 -1.131)
		(end 1.5494 -1.131)
		(stroke
			(width 0.1524)
			(type solid)
		)
		(layer "F.CrtYd")
		(uuid "028328a9-8025-4bca-b734-f2f45160ac06")
	)
	(fp_line
		(start 1.8542 -1.131)
		(end 1.8542 1.131)
		(stroke
			(width 0.1524)
			(type solid)
		)
		(layer "F.CrtYd")
		(uuid "d7148cf0-9a0a-4419-b45c-be5d4e99b4da")
	)
	(fp_line
		(start 1.8542 1.131)
		(end 1.5494 1.131)
		(stroke
			(width 0.1524)
			(type solid)
		)
		(layer "F.CrtYd")
		(uuid "596faea3-c6f6-414d-8e70-66a7362b3ac1")
	)
	(fp_line
		(start -1.2954 -1.2954)
		(end -1.2954 1.2954)
		(stroke
			(width 0.0254)
			(type solid)
		)
		(layer "F.Fab")
		(uuid "c35539ea-e4f7-4ade-a6fc-9444a61b4c47")
	)
	(fp_line
		(start -1.2954 1.2954)
		(end 1.2954 1.2954)
		(stroke
			(width 0.0254)
			(type solid)
		)
		(layer "F.Fab")
		(uuid "658e3713-d398-4502-92e4-0a49af69d6ae")
	)
	(fp_line
		(start 1.2954 -1.2954)
		(end -1.2954 -1.2954)
		(stroke
			(width 0.0254)
			(type solid)
		)
		(layer "F.Fab")
		(uuid "09023be8-9500-4c8a-89f2-500348ca394d")
	)
	(fp_line
		(start 1.2954 1.2954)
		(end 1.2954 -1.2954)
		(stroke
			(width 0.0254)
			(type solid)
		)
		(layer "F.Fab")
		(uuid "0002ac61-554a-457d-8255-a4090e26c7bf")
	)
	(fp_arc
		(start 0.3048 -1.2954)
		(mid 0 -0.9906)
		(end -0.3048 -1.2954)
		(stroke
			(width 0.0254)
			(type solid)
		)
		(layer "F.Fab")
		(uuid "27395c2f-8aa3-4f11-9953-0c9041dfb592")
	)
	(fp_circle
		(center -0.8382 -0.75)
		(end -0.8382 -0.75)
		(stroke
			(width 0.1524)
			(type solid)
		)
		(fill none)
		(layer "F.Fab")
		(uuid "e7346803-b9f5-46c4-acf4-6e36ca43f985")
	)
	(fp_text user "${REFERENCE}"
		(at 0 0 0)
		(unlocked yes)
		(layer "F.Fab")
		(uuid "64907bab-451f-491b-92ad-9ab7ba8262f8")
		(effects
			(font
				(size 1 1)
				(thickness 0.15)
			)
		)
	)
	(pad "1" smd rect
		(at -1.2192 -0.750001)
		(size 0.762 0.254)
		(layers "F.Cu" "F.Paste" "F.Mask")
		(uuid "c9e61bff-b547-4697-9dfd-d7cef5eae049")
	)
	(pad "2" smd rect
		(at -1.2192 -0.25)
		(size 0.762 0.254)
		(layers "F.Cu" "F.Paste" "F.Mask")
		(uuid "fe594990-c092-49b9-85da-7abc00d937b4")
	)
	(pad "3" smd rect
		(at -1.2192 0.25)
		(size 0.762 0.254)
		(layers "F.Cu" "F.Paste" "F.Mask")
		(uuid "a51cce5e-07f2-4523-abea-14e368b510cc")
	)
	(pad "4" smd rect
		(at -1.2192 0.750001)
		(size 0.762 0.254)
		(layers "F.Cu" "F.Paste" "F.Mask")
		(uuid "f549fa8b-ea4c-4e06-aaf2-7ee99a9f3afb")
	)
	(pad "5" smd rect
		(at 1.2192 0.750001)
		(size 0.762 0.254)
		(layers "F.Cu" "F.Paste" "F.Mask")
		(uuid "1a9ad423-7856-4fd7-8077-c9d92a3e215b")
	)
	(pad "6" smd rect
		(at 1.2192 0.25)
		(size 0.762 0.254)
		(layers "F.Cu" "F.Paste" "F.Mask")
		(uuid "57db2594-c681-4dcd-9644-40829a17fef4")
	)
	(pad "7" smd rect
		(at 1.2192 -0.25)
		(size 0.762 0.254)
		(layers "F.Cu" "F.Paste" "F.Mask")
		(uuid "e7852a14-d2e3-44c6-85f7-cbb2aefb849f")
	)
	(pad "8" smd rect
		(at 1.2192 -0.750001)
		(size 0.762 0.254)
		(layers "F.Cu" "F.Paste" "F.Mask")
		(uuid "0624f598-a590-4dca-afba-30414b3bca6b")
	)
	(pad "9" smd rect
		(at 0 0)
		(size 1.1938 1.905)
		(layers "F.Cu" "F.Paste" "F.Mask")
		(uuid "a407713b-243b-48f9-9148-49dd0fa62f24")
	)
	(model "${KIPRJMOD}/3D/Humidity-Sensor.step"
		(offset
			(xyz 0 0 0)
		)
		(scale
			(xyz 1 1 1)
		)
		(rotate
			(xyz -90 0 0)
		)
	)
)
