0
SECTION
2
HEADER
9
$INSUNITS
70
4
9
$ACADVER
1
AC1014
9
$HANDSEED
5
FFFF
0
ENDSEC
0
SECTION
2
TABLES
0
TABLE
2
VPORT
5
8
100
AcDbSymbolTable
0
ENDTAB
0
TABLE
2
LTYPE
5
5
100
AcDbSymbolTable
0
LTYPE
5
14
100
AcDbSymbolTableRecord
100
AcDbLinetypeTableRecord
2
BYBLOCK
70
0
0
LTYPE
5
15
100
AcDbSymbolTableRecord
100
AcDbLinetypeTableRecord
2
BYLAYER
70
0
0
ENDTAB
0
TABLE
2
LAYER
5
2
100
AcDbSymbolTable
70
2
0
LAYER
5
50
100
AcDbSymbolTableRecord
100
AcDbLayerTableRecord
2
0
70
0
6
CONTINUOUS
0
ENDTAB
0
TABLE
2
STYLE
5
3
100
AcDbSymbolTable
70
1
0
STYLE
5
11
100
AcDbSymbolTableRecord
100
AcDbTextStyleTableRecord
2
STANDARD
70
0
0
ENDTAB
0
TABLE
2
VIEW
5
6
100
AcDbSymbolTable
70
0
0
ENDTAB
0
TABLE
2
UCS
5
7
100
AcDbSymbolTable
70
0
0
ENDTAB
0
TABLE
2
APPID
5
9
100
AcDbSymbolTable
70
2
0
APPID
5
12
100
AcDbSymbolTableRecord
100
AcDbRegAppTableRecord
2
ACAD
70
0
0
ENDTAB
0
TABLE
2
DIMSTYLE
5
A
100
AcDbSymbolTable
70
1
0
ENDTAB
0
TABLE
2
BLOCK_RECORD
5
1
100
AcDbSymbolTable
70
1
0
BLOCK_RECORD
5
1F
100
AcDbSymbolTableRecord
100
AcDbBlockTableRecord
2
*MODEL_SPACE
0
BLOCK_RECORD
5
1B
100
AcDbSymbolTableRecord
100
AcDbBlockTableRecord
2
*PAPER_SPACE
0
ENDTAB
0
ENDSEC
0
SECTION
2
BLOCKS
0
BLOCK
5
20
100
AcDbEntity
100
AcDbBlockBegin
2
*MODEL_SPACE
0
ENDBLK
5
21
100
AcDbEntity
100
AcDbBlockEnd
0
BLOCK
5
1C
100
AcDbEntity
100
AcDbBlockBegin
2
*PAPER_SPACE
0
ENDBLK
5
1D
100
AcDbEntity
100
AcDbBlockEnd
0
ENDSEC
0
SECTION
2
ENTITIES
0
LWPOLYLINE
5
100
100
AcDbEntity
8
0
100
AcDbPolyline
90
8
70
1
43
0.0
10
-45.663690122662274
20
18.994244877341995
42
0.41421356237309331
10
-42.663690122662274
20
15.994244877341997
10
5.3363098773377455
20
15.994244877342014
42
0.41421356237309465
10
8.3363098773377402
20
18.994244877342013
10
8.3363098773377224
20
77.994244877342013
42
0.41421356237309853
10
5.3363098773377242
20
80.994244877341998
10
-42.663690122662281
20
80.994244877341998
42
0.41421356237309853
10
-45.663690122662288
20
77.994244877341998
0
CIRCLE
5
101
100
AcDbEntity
8
0
100
AcDbCircle
10
27.663690122662267
20
71.494244877341998
30
7.2325685836985359e-15
40
1.8950000000000022
210
-2.4137983912405612e-16
220
1.0947644252537633e-47
230
-1
0
CIRCLE
5
102
100
AcDbEntity
8
0
100
AcDbCircle
10
27.663690122662267
20
25.494244877341998
30
2.2365649728853322e-15
40
1.8949999999999978
210
-2.4137983912405612e-16
220
2.1895288505075267e-47
230
-1
0
CIRCLE
5
103
100
AcDbEntity
8
0
100
AcDbCircle
10
32.999999262392514
20
78.299998249858618
30
9.6308690499880113e-15
40
1.8749999999999956
210
-2.4137983912405612e-16
220
2.1895288505075267e-47
230
-1
0
CIRCLE
5
104
100
AcDbEntity
8
0
100
AcDbCircle
10
9.8884048572603227
20
75.50000112503767
30
-9.1902840085525376e-16
40
1.8749999999999989
210
-1.9335234199024803e-17
220
0
230
-1
0
CIRCLE
5
105
100
AcDbEntity
8
0
100
AcDbCircle
10
10.00000014901161
20
21.000000312924392
30
7.4846389027122431e-16
40
1.875
210
-2.4137983912405607e-16
220
0
230
-1
0
CIRCLE
5
106
100
AcDbEntity
8
0
100
AcDbCircle
10
32.500000484287739
20
18.500000275671482
30
7.3283716053023208e-17
40
1.875
210
-2.4137983912405607e-16
220
0
230
-1
0
CIRCLE
5
107
100
AcDbEntity
8
0
100
AcDbCircle
10
-4.1963098773377165
20
71.354244877342012
30
-5.5511151231257827e-15
40
2.1500000000000012
210
0
220
0
230
-1
0
CIRCLE
5
108
100
AcDbEntity
8
0
100
AcDbCircle
10
41.523690122662288
20
71.354244877341998
30
-3.8857805861880495e-15
40
2.1499999999999981
210
9.2437441827066259e-48
220
-2.8665003823437953e-32
230
-1
0
CIRCLE
5
109
100
AcDbEntity
8
0
100
AcDbCircle
10
41.523690122662273
20
25.634244877341988
30
2.7755575615628914e-15
40
2.1500000000000012
210
0
220
0
230
-1
0
CIRCLE
5
110
100
AcDbEntity
8
0
100
AcDbCircle
10
-4.1963098773377432
20
25.63424487734202
30
1.6653345369377348e-15
40
2.1499999999999999
210
0
220
0
230
-1
0
CIRCLE
5
111
100
AcDbEntity
8
0
100
AcDbCircle
10
37.98219012266226
20
21.994244877342002
30
3.3306690738754688e-15
40
0.44500000000000012
210
1.1165196625179339e-47
220
-3.4623459674377265e-32
230
-1
0
CIRCLE
5
112
100
AcDbEntity
8
0
100
AcDbCircle
10
9.4444901226622662
20
29.444244877342001
30
1.6653345369377338e-15
40
1.8950000000000018
210
1.0487625326025968e-47
220
-3.2522299852449337e-32
230
-1
0
CIRCLE
5
113
100
AcDbEntity
8
0
100
AcDbCircle
10
9.4444901226622715
20
37.064244877342006
30
1.1102230246251554e-15
40
1.8950000000000033
210
1.048762532602596e-47
220
-3.2522299852449309e-32
230
-1
0
CIRCLE
5
114
100
AcDbEntity
8
0
100
AcDbCircle
10
9.4444901226622733
20
44.68424487734196
30
-1.4532344105811872e-30
40
1.8950000000000033
210
1.048762532602596e-47
220
-3.2522299852449309e-32
230
-1
0
CIRCLE
5
115
100
AcDbEntity
8
0
100
AcDbCircle
10
9.4444901226622751
20
52.304244877341965
30
-5.5511151231258005e-16
40
1.8950000000000033
210
1.048762532602596e-47
220
-3.2522299852449309e-32
230
-1
0
CIRCLE
5
116
100
AcDbEntity
8
0
100
AcDbCircle
10
9.4444901226622786
20
59.924244877341977
30
-1.6653345369377368e-15
40
1.8950000000000033
210
1.048762532602596e-47
220
-3.2522299852449309e-32
230
-1
0
CIRCLE
5
117
100
AcDbEntity
8
0
100
AcDbCircle
10
9.4444901226622804
20
67.544244877341967
30
-2.2204460492503151e-15
40
1.8950000000000033
210
1.048762532602596e-47
220
-3.2522299852449309e-32
230
-1
0
CIRCLE
5
118
100
AcDbEntity
8
0
100
AcDbCircle
10
-3.8363098773377335
20
36.494244877342013
30
5.5511151231257709e-16
40
1.8950000000000033
210
1.048762532602596e-47
220
-3.2522299852449309e-32
230
-1
0
CIRCLE
5
119
100
AcDbEntity
8
0
100
AcDbCircle
10
-3.8363098773377291
20
44.494244877342013
30
-1.4470551736092235e-30
40
1.8950000000000033
210
1.048762532602596e-47
220
-3.2522299852449309e-32
230
-1
0
CIRCLE
5
120
100
AcDbEntity
8
0
100
AcDbCircle
10
-3.8363098773377291
20
52.494244877342013
30
-1.1102230246251583e-15
40
1.8950000000000033
210
1.048762532602596e-47
220
-3.2522299852449309e-32
230
-1
0
CIRCLE
5
121
100
AcDbEntity
8
0
100
AcDbCircle
10
-3.8363098773377247
20
60.494244877342013
30
-1.6653345369377348e-15
40
1.8950000000000065
210
0
220
0
230
-1
0
CIRCLE
5
122
100
AcDbEntity
8
0
100
AcDbCircle
10
41.163690122662274
20
36.494244877341998
30
1.6653345369377348e-15
40
1.8950000000000049
210
0
220
0
230
-1
0
CIRCLE
5
123
100
AcDbEntity
8
0
100
AcDbCircle
10
41.163690122662274
20
44.49424487734197
30
1.1102230246251565e-15
40
1.8950000000000009
210
0
220
0
230
-1
0
CIRCLE
5
124
100
AcDbEntity
8
0
100
AcDbCircle
10
41.163690122662274
20
52.494244877341963
30
-1.7072335724288168e-30
40
1.8950000000000033
210
1.048762532602596e-47
220
-3.2522299852449309e-32
230
-1
0
CIRCLE
5
125
100
AcDbEntity
8
0
100
AcDbCircle
10
41.163690122662295
20
60.494244877341963
30
-5.5511151231257827e-16
40
1.895
210
0
220
0
230
-1
0
CIRCLE
5
126
100
AcDbEntity
8
0
100
AcDbCircle
10
27.663690122662274
20
78.244244877341998
30
-2.7755575615628914e-15
40
1.895
210
0
220
0
230
-1
0
CIRCLE
5
127
100
AcDbEntity
8
0
100
AcDbCircle
10
27.663690122662263
20
18.744244877341995
30
3.3306690738754692e-15
40
1.8950000000000033
210
1.048762532602596e-47
220
-3.2522299852449309e-32
230
-1
0
CIRCLE
5
128
100
AcDbEntity
8
0
100
AcDbCircle
10
5.2026901226622631
20
20.494244877341995
30
2.2204460492503123e-15
40
1.8950000000000018
210
1.0487625326025968e-47
220
-3.2522299852449337e-32
230
-1
0
LWPOLYLINE
5
129
100
AcDbEntity
8
0
100
AcDbPolyline
90
8
70
1
43
0.0
10
-27.997999999999923
20
29.732000000000038
10
-14.027999999999921
20
29.732000000000038
42
0.41421356237309503
10
-13.011999999999922
20
30.748000000000051
10
-13.011999999999944
20
66.562000000000026
42
0.41421356237309764
10
-14.027999999999921
20
67.578000000000046
10
-27.743999999999929
20
67.578000000000046
42
0.41421356237309503
10
-29.013999999999925
20
66.30800000000005
10
-29.013999999999953
20
30.748000000000062
42
0.41421356237309764
0
CIRCLE
5
130
100
AcDbEntity
8
0
100
AcDbCircle
10
-27.489999999999952
20
36.590000000000046
30
-3.903127820947816e-17
40
0.40000000000000002
210
-4.9303806576313238e-32
220
-1.2325951644078312e-32
230
1
0
CIRCLE
5
131
100
AcDbEntity
8
0
100
AcDbCircle
10
-27.489999999999952
20
39.130000000000038
30
-4.3368086899420177e-17
40
0.40000000000000002
210
-4.9303806576313238e-32
220
-1.2325951644078312e-32
230
1
0
CIRCLE
5
132
100
AcDbEntity
8
0
100
AcDbCircle
10
-27.438199999999924
20
63.260000000000048
30
5.2041704279304213e-17
40
0.40000000000000002
210
-4.9303806576313238e-32
220
-1.2325951644078312e-32
230
1
0
CIRCLE
5
133
100
AcDbEntity
8
0
100
AcDbCircle
10
-27.438199999999924
20
60.720000000000041
30
5.6378512969246231e-17
40
0.40000000000000002
210
-4.9303806576313238e-32
220
-1.2325951644078312e-32
230
1
0
CIRCLE
5
134
100
AcDbEntity
8
0
100
AcDbCircle
10
-27.438199999999924
20
58.180000000000049
30
6.0715321659188248e-17
40
0.40000000000000002
210
-4.9303806576313238e-32
220
-1.2325951644078312e-32
230
1
0
CIRCLE
5
135
100
AcDbEntity
8
0
100
AcDbCircle
10
-14.358199999999943
20
60.720000000000041
30
-1.3010426069826053e-16
40
0.40000000000000002
210
-4.9303806576313238e-32
220
-1.2325951644078312e-32
230
1
0
CIRCLE
5
136
100
AcDbEntity
8
0
100
AcDbCircle
10
-14.358199999999943
20
58.180000000000049
30
-1.3010426069826053e-16
40
0.40000000000000002
210
-4.9303806576313238e-32
220
-1.2325951644078312e-32
230
1
0
CIRCLE
5
137
100
AcDbEntity
8
0
100
AcDbCircle
10
-14.409999999999936
20
39.130000000000038
30
4.7704895589362195e-17
40
0.40000000000000002
210
-4.9303806576313238e-32
220
-1.2325951644078312e-32
230
1
0
CIRCLE
5
138
100
AcDbEntity
8
0
100
AcDbCircle
10
-14.409999999999936
20
36.590000000000046
30
5.2041704279304213e-17
40
0.40000000000000002
210
-4.9303806576313238e-32
220
-1.2325951644078312e-32
230
1
0
CIRCLE
5
139
100
AcDbEntity
8
0
100
AcDbCircle
10
-14.358199999999943
20
63.260000000000048
30
-1.3444106938820255e-16
40
0.40000000000000002
210
-4.9303806576313238e-32
220
-1.2325951644078312e-32
230
1
0
CIRCLE
5
140
100
AcDbEntity
8
0
100
AcDbCircle
10
-14.358199999999943
20
65.80000000000004
30
-1.3877787807814457e-16
40
0.40000000000000002
210
-4.9303806576313238e-32
220
-1.2325951644078312e-32
230
1
0
CIRCLE
5
141
100
AcDbEntity
8
0
100
AcDbCircle
10
-27.438199999999924
20
65.80000000000004
30
4.7704895589362195e-17
40
0.40000000000000002
210
-4.9303806576313238e-32
220
-1.2325951644078312e-32
230
1
0
CIRCLE
5
142
100
AcDbEntity
8
0
100
AcDbCircle
10
-27.489999999999952
20
34.050000000000026
30
-3.4694469519536142e-17
40
0.40000000000000002
210
-4.9303806576313238e-32
220
-1.2325951644078312e-32
230
1
0
CIRCLE
5
143
100
AcDbEntity
8
0
100
AcDbCircle
10
-14.409999999999936
20
34.050000000000026
30
5.2041704279304213e-17
40
0.40000000000000002
210
-4.9303806576313238e-32
220
-1.2325951644078312e-32
230
1
0
CIRCLE
5
144
100
AcDbEntity
8
0
100
AcDbCircle
10
-27.489999999999952
20
31.510000000000051
30
-3.4694469519536142e-17
40
0.40000000000000002
210
-4.9303806576313238e-32
220
-1.2325951644078312e-32
230
1
0
CIRCLE
5
145
100
AcDbEntity
8
0
100
AcDbCircle
10
-14.409999999999936
20
31.510000000000051
30
5.6378512969246231e-17
40
0.40000000000000002
210
-4.9303806576313238e-32
220
-1.2325951644078312e-32
230
1
0
LINE
5
146
100
AcDbEntity
8
0
100
AcDbLine
10
-13.011999999999922
20
30.748000000000051
30
5.6378512969246231e-17
11
-12.511999999999921
21
30.748000000000051
31
5.6378512969246231e-17
0
LINE
5
147
100
AcDbEntity
8
0
100
AcDbLine
10
-14.027999999999921
20
29.732000000000038
30
0
11
-14.027999999999921
21
29.232000000000042
31
0
0
LINE
5
148
100
AcDbEntity
8
0
100
AcDbLine
10
-29.013999999999953
20
30.748000000000062
30
7.3725747729014302e-17
11
-29.513999999999953
21
30.748000000000062
31
7.3725747729014302e-17
0
LINE
5
149
100
AcDbEntity
8
0
100
AcDbLine
10
-27.743999999999929
20
67.578000000000046
30
-1.3010426069826103e-16
11
-27.743999999999929
21
68.078000000000046
31
-1.3010426069826103e-16
0
LWPOLYLINE
5
150
100
AcDbEntity
8
0
100
AcDbPolyline
90
8
70
1
43
0.0
10
-14.511999999999926
20
29.232000000000042
10
-27.51399999999995
20
29.232000000000042
42
-0.4142135623730937
10
-29.513999999999953
20
31.232000000000042
10
-29.513999999999946
20
66.078000000000046
42
-0.4142135623730957
10
-27.51399999999995
20
68.078000000000031
10
-14.511999999999926
20
68.078000000000046
42
-0.41421356237309825
10
-12.511999999999919
20
66.078000000000046
10
-12.511999999999919
20
31.232000000000038
42
-0.41421356237309503
0
CIRCLE
5
151
100
AcDbEntity
8
0
100
AcDbCircle
10
-15.700000000000029
20
54.835219958543597
30
0
40
1.8999999999999984
210
-9.8607613152626804e-32
220
3.9443045261050625e-31
230
1
0
CIRCLE
5
152
100
AcDbEntity
8
0
100
AcDbCircle
10
-15.700000000000029
20
54.835219958543597
30
0
40
1.8999999999999984
210
-9.8607613152626804e-32
220
3.9443045261050625e-31
230
1
0
CIRCLE
5
153
100
AcDbEntity
8
0
100
AcDbCircle
10
-26.699999999999996
20
42.33521995854364
30
0
40
1.8999999999999977
210
-4.9303806576313402e-32
220
1.6249719547081242e-62
230
1
0
ENDSEC
0
SECTION
2
OBJECTS
0
DICTIONARY
5
C
100
AcDbDictionary
3
ACAD_GROUP
350
D
3
ACAD_MLINESTYLE
350
17
0
DICTIONARY
5
D
100
AcDbDictionary
0
DICTIONARY
5
1A
330
C
100
AcDbDictionary
0
DICTIONARY
5
17
100
AcDbDictionary
0
ENDSEC
0
EOF
