(module 5040501291 (layer F.Cu) (tedit 0)
  (descr 504050-1291-1)
  (tags Connector)
  (attr smd)
  (fp_text reference J** (at 0 0.75) (layer F.SilkS)
    (effects (font (size 1.27 1.27) (thickness 0.254)))
  )
  (fp_text value 5040501291 (at 0 0.75) (layer F.SilkS) hide
    (effects (font (size 1.27 1.27) (thickness 0.254)))
  )
  (fp_arc (start 8.55 4.5) (end 8.6 4.5) (angle 180) (layer F.SilkS) (width 0.5))
  (fp_arc (start 8.55 4.5) (end 8.5 4.5) (angle 180) (layer F.SilkS) (width 0.5))
  (fp_text user %R (at 0 0.75) (layer F.Fab)
    (effects (font (size 1.27 1.27) (thickness 0.254)))
  )
  (fp_line (start -11.275 -3.05) (end 11.275 -3.05) (layer F.Fab) (width 0.2))
  (fp_line (start 11.275 -3.05) (end 11.275 3.05) (layer F.Fab) (width 0.2))
  (fp_line (start 11.275 3.05) (end -11.275 3.05) (layer F.Fab) (width 0.2))
  (fp_line (start -11.275 3.05) (end -11.275 -3.05) (layer F.Fab) (width 0.2))
  (fp_line (start -12.48 -4.05) (end 12.48 -4.05) (layer F.CrtYd) (width 0.1))
  (fp_line (start 12.48 -4.05) (end 12.48 5.55) (layer F.CrtYd) (width 0.1))
  (fp_line (start 12.48 5.55) (end -12.48 5.55) (layer F.CrtYd) (width 0.1))
  (fp_line (start -12.48 5.55) (end -12.48 -4.05) (layer F.CrtYd) (width 0.1))
  (fp_line (start -11.275 -1) (end -11.275 3) (layer F.SilkS) (width 0.1))
  (fp_line (start -11.275 3) (end -8.7 3) (layer F.SilkS) (width 0.1))
  (fp_line (start 11.275 -1) (end 11.275 3.05) (layer F.SilkS) (width 0.1))
  (fp_line (start 11.275 3.05) (end 8.7 3.05) (layer F.SilkS) (width 0.1))
  (fp_line (start -10 -3.05) (end 10 -3.05) (layer F.SilkS) (width 0.1))
  (fp_line (start 8.5 4.5) (end 8.5 4.5) (layer F.SilkS) (width 0.5))
  (fp_line (start 8.6 4.5) (end 8.6 4.5) (layer F.SilkS) (width 0.5))
  (pad MP2 smd rect (at 10.855 -2.14) (size 1.25 1.8) (layers F.Cu F.Paste F.Mask))
  (pad MP1 smd rect (at -10.855 -2.14) (size 1.25 1.8) (layers F.Cu F.Paste F.Mask))
  (pad 12 smd rect (at -8.25 3.05) (size 0.6 1) (layers F.Cu F.Paste F.Mask))
  (pad 11 smd rect (at -6.75 3.05) (size 0.6 1) (layers F.Cu F.Paste F.Mask))
  (pad 10 smd rect (at -5.25 3.05) (size 0.6 1) (layers F.Cu F.Paste F.Mask))
  (pad 9 smd rect (at -3.75 3.05) (size 0.6 1) (layers F.Cu F.Paste F.Mask))
  (pad 8 smd rect (at -2.25 3.05) (size 0.6 1) (layers F.Cu F.Paste F.Mask))
  (pad 7 smd rect (at -0.75 3.05) (size 0.6 1) (layers F.Cu F.Paste F.Mask))
  (pad 6 smd rect (at 0.75 3.05) (size 0.6 1) (layers F.Cu F.Paste F.Mask))
  (pad 5 smd rect (at 2.25 3.05) (size 0.6 1) (layers F.Cu F.Paste F.Mask))
  (pad 4 smd rect (at 3.75 3.05) (size 0.6 1) (layers F.Cu F.Paste F.Mask))
  (pad 3 smd rect (at 5.25 3.05) (size 0.6 1) (layers F.Cu F.Paste F.Mask))
  (pad 2 smd rect (at 6.75 3.05) (size 0.6 1) (layers F.Cu F.Paste F.Mask))
  (pad 1 smd rect (at 8.25 3.05) (size 0.6 1) (layers F.Cu F.Paste F.Mask))
  (model 504050-1291.stp
    (at (xyz 0 0 0))
    (scale (xyz 1 1 1))
    (rotate (xyz 0 0 0))
  )
)
