(footprint "BLM18SP221SN1B"
	(version 20240108)
	(generator "pcbnew")
	(generator_version "8.0")
	(layer "F.Cu")
	(descr "BLM18_3 L=1.6 W=0.8 T=0.8")
	(tags "Ferrite Bead")
	(property "Reference" "FB**"
		(at 0 -0.9 0)
		(layer "F.SilkS")
		(uuid "a6e008a9-ebc2-4a84-88c2-8cb3bf4e3ce6")
		(effects
			(font
				(size 0.7 0.7)
				(thickness 0.175)
			)
		)
	)
	(property "Value" "BLM18SP221SN1B"
		(at 0 0 0)
		(layer "F.SilkS")
		(hide yes)
		(uuid "5f43aeee-a4c5-4e75-bec5-08e34ba5c7f9")
		(effects
			(font
				(size 1.27 1.27)
				(thickness 0.254)
			)
		)
	)
	(property "Footprint" ""
		(at 0 0 0)
		(layer "F.Fab")
		(hide yes)
		(uuid "a9cea45f-4b98-4e1d-9a95-b6458680db87")
		(effects
			(font
				(size 1.27 1.27)
				(thickness 0.15)
			)
		)
	)
	(property "Datasheet" ""
		(at 0 0 0)
		(layer "F.Fab")
		(hide yes)
		(uuid "1dc6fce3-7889-4ba5-9870-bcfc17776276")
		(effects
			(font
				(size 1.27 1.27)
				(thickness 0.15)
			)
		)
	)
	(property "Description" ""
		(at 0 0 0)
		(layer "F.Fab")
		(hide yes)
		(uuid "2fc6283e-ea94-44de-8474-d35fdac54cdd")
		(effects
			(font
				(size 1.27 1.27)
				(thickness 0.15)
			)
		)
	)
	(attr smd)
	(fp_line
		(start 0 -0.3)
		(end 0 0.3)
		(stroke
			(width 0.2)
			(type solid)
		)
		(layer "F.SilkS")
		(uuid "b8970297-5570-46e0-9f81-0726c2630249")
	)
	(fp_line
		(start -1.475 -0.75)
		(end 1.475 -0.75)
		(stroke
			(width 0.05)
			(type solid)
		)
		(layer "F.CrtYd")
		(uuid "7671c65d-34f4-43b3-8876-6e825db76357")
	)
	(fp_line
		(start -1.475 0.75)
		(end -1.475 -0.75)
		(stroke
			(width 0.05)
			(type solid)
		)
		(layer "F.CrtYd")
		(uuid "204fe6f5-fd79-4c57-92a4-abfa686463dc")
	)
	(fp_line
		(start 1.475 -0.75)
		(end 1.475 0.75)
		(stroke
			(width 0.05)
			(type solid)
		)
		(layer "F.CrtYd")
		(uuid "8ec8cf27-5c56-4317-9d55-13785bbe87b9")
	)
	(fp_line
		(start 1.475 0.75)
		(end -1.475 0.75)
		(stroke
			(width 0.05)
			(type solid)
		)
		(layer "F.CrtYd")
		(uuid "b8f203e7-1d2c-4e8a-8c40-bf4cb09f6511")
	)
	(fp_line
		(start -0.8 -0.4)
		(end 0.8 -0.4)
		(stroke
			(width 0.1)
			(type solid)
		)
		(layer "F.Fab")
		(uuid "f78c0d8c-e3c0-400f-8c9a-1eb6d577d9d9")
	)
	(fp_line
		(start -0.8 0.4)
		(end -0.8 -0.4)
		(stroke
			(width 0.1)
			(type solid)
		)
		(layer "F.Fab")
		(uuid "f8e9b3de-c46d-48a2-a8bf-270827351b00")
	)
	(fp_line
		(start 0.8 -0.4)
		(end 0.8 0.4)
		(stroke
			(width 0.1)
			(type solid)
		)
		(layer "F.Fab")
		(uuid "6e6a7154-37ac-4866-878f-fa45824d2393")
	)
	(fp_line
		(start 0.8 0.4)
		(end -0.8 0.4)
		(stroke
			(width 0.1)
			(type solid)
		)
		(layer "F.Fab")
		(uuid "538a7e08-14df-43d0-b9a6-766a34f8e90f")
	)
	(fp_text user "${REFERENCE}"
		(at 0 0 0)
		(layer "F.Fab")
		(uuid "28a2d23c-25bd-4a99-bc5c-72efe9e3758e")
		(effects
			(font
				(size 1.27 1.27)
				(thickness 0.254)
			)
		)
	)
	(pad "1" smd rect
		(at -0.675 0)
		(size 0.65 0.7)
		(layers "F.Cu" "F.Paste" "F.Mask")
		(uuid "0ca4ada3-d88f-4e55-a598-eac3fb232de4")
	)
	(pad "2" smd rect
		(at 0.675 0)
		(size 0.65 0.7)
		(layers "F.Cu" "F.Paste" "F.Mask")
		(uuid "1d366758-7281-4cd7-bfda-a912730fb071")
	)
	(model "${KIPRJMOD}/3D/BLM18PG471SH1D.stp"
		(offset
			(xyz 0 0.4 0.4)
		)
		(scale
			(xyz 1 1 1)
		)
		(rotate
			(xyz -180 0 0)
		)
	)
)
