(module 5040500891 (layer F.Cu) (tedit 0)
  (descr 5040500891)
  (tags Connector)
  (attr smd)
  (fp_text reference J** (at 0 0) (layer F.SilkS)
    (effects (font (size 1.27 1.27) (thickness 0.254)))
  )
  (fp_text value 5040500891 (at 0 0) (layer F.SilkS) hide
    (effects (font (size 1.27 1.27) (thickness 0.254)))
  )
  (fp_arc (start 5.3 3.4) (end 5.4 3.4) (angle 180) (layer F.SilkS) (width 0.2))
  (fp_arc (start 5.3 3.4) (end 5.2 3.4) (angle 180) (layer F.SilkS) (width 0.2))
  (fp_text user %R (at 0 0) (layer F.Fab)
    (effects (font (size 1.27 1.27) (thickness 0.254)))
  )
  (fp_line (start -7.875 -3.5) (end 7.875 -3.5) (layer F.Fab) (width 0.2))
  (fp_line (start 7.875 -3.5) (end 7.875 2.6) (layer F.Fab) (width 0.2))
  (fp_line (start 7.875 2.6) (end -7.875 2.6) (layer F.Fab) (width 0.2))
  (fp_line (start -7.875 2.6) (end -7.875 -3.5) (layer F.Fab) (width 0.2))
  (fp_line (start -9.48 -4.5) (end 9.48 -4.5) (layer F.CrtYd) (width 0.1))
  (fp_line (start 9.48 -4.5) (end 9.48 4.5) (layer F.CrtYd) (width 0.1))
  (fp_line (start 9.48 4.5) (end -9.48 4.5) (layer F.CrtYd) (width 0.1))
  (fp_line (start -9.48 4.5) (end -9.48 -4.5) (layer F.CrtYd) (width 0.1))
  (fp_line (start -7 -3.5) (end 7 -3.5) (layer F.SilkS) (width 0.1))
  (fp_line (start -7.855 -1.4) (end -7.875 2.59) (layer F.SilkS) (width 0.1))
  (fp_line (start -7.875 2.59) (end -6 2.6) (layer F.SilkS) (width 0.1))
  (fp_line (start 7.875 -1.4) (end 7.855 2.6) (layer F.SilkS) (width 0.1))
  (fp_line (start 7.855 2.6) (end 6 2.6) (layer F.SilkS) (width 0.1))
  (fp_line (start 5.2 3.4) (end 5.2 3.4) (layer F.SilkS) (width 0.2))
  (fp_line (start 5.4 3.4) (end 5.4 3.4) (layer F.SilkS) (width 0.2))
  (pad 10 smd rect (at 7.855 -2.6) (size 1.25 1.8) (layers F.Cu F.Paste F.Mask))
  (pad 9 smd rect (at -7.855 -2.6) (size 1.25 1.8) (layers F.Cu F.Paste F.Mask))
  (pad 8 smd rect (at -5.25 2.59) (size 0.6 1) (layers F.Cu F.Paste F.Mask))
  (pad 7 smd rect (at -3.75 2.59) (size 0.6 1) (layers F.Cu F.Paste F.Mask))
  (pad 6 smd rect (at -2.25 2.59) (size 0.6 1) (layers F.Cu F.Paste F.Mask))
  (pad 5 smd rect (at -0.75 2.59) (size 0.6 1) (layers F.Cu F.Paste F.Mask))
  (pad 4 smd rect (at 0.75 2.59) (size 0.6 1) (layers F.Cu F.Paste F.Mask))
  (pad 3 smd rect (at 2.25 2.59) (size 0.6 1) (layers F.Cu F.Paste F.Mask))
  (pad 2 smd rect (at 3.75 2.59) (size 0.6 1) (layers F.Cu F.Paste F.Mask))
  (pad 1 smd rect (at 5.25 2.59) (size 0.6 1) (layers F.Cu F.Paste F.Mask))
  (model 504050-0891.stp
    (offset (xyz 0 -2.599999865584585 0.9999999849814947))
    (scale (xyz 1 1 1))
    (rotate (xyz 0 0 0))
  )
)
