ISO-10303-21;
HEADER;
/* Generated by software containing ST-Developer
 * from STEP Tools, Inc. (www.steptools.com) 
 */
/* OPTION: strings as raw bytes, not using required /X/ escapes */

FILE_DESCRIPTION(
/* description */ ('Unknown'),
/* implementation_level */ '2;1');

FILE_NAME(
/* name */ 'JB2835AWT-W-U57EA0000-N0000001',
/* time_stamp */ '2024-01-04T14:56:56+02:00',
/* author */ ('Unknown'),
/* organization */ ('Unknown'),
/* preprocessor_version */ 'ST-DEVELOPER v18.102',
/* originating_system */ 'Solid Edge',
/* authorisation */ 'Unknown');

FILE_SCHEMA (('AUTOMOTIVE_DESIGN {1 0 10303 214 3 1 1}'));
ENDSEC;

DATA;
#10=PROPERTY_DEFINITION_REPRESENTATION(#14,#12);
#11=PROPERTY_DEFINITION_REPRESENTATION(#15,#13);
#12=REPRESENTATION('',(#16),#2027);
#13=REPRESENTATION('',(#17),#2027);
#14=PROPERTY_DEFINITION('pmi validation property','',#2032);
#15=PROPERTY_DEFINITION('pmi validation property','',#2032);
#16=VALUE_REPRESENTATION_ITEM('number of annotations',COUNT_MEASURE(0.));
#17=VALUE_REPRESENTATION_ITEM('number of views',COUNT_MEASURE(0.));
#18=SHAPE_REPRESENTATION_RELATIONSHIP('','',#1389,#19);
#19=ADVANCED_BREP_SHAPE_REPRESENTATION('',(#1387),#2027);
#20=CIRCLE('',#1396,0.138433195762531);
#21=CIRCLE('',#1397,0.11490405809515);
#22=CIRCLE('',#1398,0.0653056715222632);
#23=CIRCLE('',#1399,0.349933159265836);
#24=CIRCLE('',#1400,0.0750596862091951);
#25=CIRCLE('',#1401,0.113888900301804);
#26=CIRCLE('',#1402,0.171939356104846);
#27=CIRCLE('',#1404,0.171939356104846);
#28=CIRCLE('',#1405,0.113888900301804);
#29=CIRCLE('',#1406,0.0750596862091951);
#30=CIRCLE('',#1407,0.349933159265836);
#31=CIRCLE('',#1408,0.0653056715222632);
#32=CIRCLE('',#1409,0.11490405809515);
#33=CIRCLE('',#1410,0.138433195762531);
#34=CIRCLE('',#1412,0.113975370879302);
#35=CIRCLE('',#1413,0.113975370879302);
#36=CIRCLE('',#1415,0.113975370879302);
#37=CIRCLE('',#1416,0.113975370879302);
#38=DRAUGHTING_PRE_DEFINED_COLOUR('white');
#39=ORIENTED_EDGE('',*,*,#339,.T.);
#40=ORIENTED_EDGE('',*,*,#340,.T.);
#41=ORIENTED_EDGE('',*,*,#341,.T.);
#42=ORIENTED_EDGE('',*,*,#342,.T.);
#43=ORIENTED_EDGE('',*,*,#343,.T.);
#44=ORIENTED_EDGE('',*,*,#344,.T.);
#45=ORIENTED_EDGE('',*,*,#345,.T.);
#46=ORIENTED_EDGE('',*,*,#346,.T.);
#47=ORIENTED_EDGE('',*,*,#347,.T.);
#48=ORIENTED_EDGE('',*,*,#348,.T.);
#49=ORIENTED_EDGE('',*,*,#349,.F.);
#50=ORIENTED_EDGE('',*,*,#350,.T.);
#51=ORIENTED_EDGE('',*,*,#351,.F.);
#52=ORIENTED_EDGE('',*,*,#352,.T.);
#53=ORIENTED_EDGE('',*,*,#353,.F.);
#54=ORIENTED_EDGE('',*,*,#354,.T.);
#55=ORIENTED_EDGE('',*,*,#355,.F.);
#56=ORIENTED_EDGE('',*,*,#356,.T.);
#57=ORIENTED_EDGE('',*,*,#357,.T.);
#58=ORIENTED_EDGE('',*,*,#358,.F.);
#59=ORIENTED_EDGE('',*,*,#359,.F.);
#60=ORIENTED_EDGE('',*,*,#360,.F.);
#61=ORIENTED_EDGE('',*,*,#361,.T.);
#62=ORIENTED_EDGE('',*,*,#362,.F.);
#63=ORIENTED_EDGE('',*,*,#363,.F.);
#64=ORIENTED_EDGE('',*,*,#364,.F.);
#65=ORIENTED_EDGE('',*,*,#365,.F.);
#66=ORIENTED_EDGE('',*,*,#366,.T.);
#67=ORIENTED_EDGE('',*,*,#367,.T.);
#68=ORIENTED_EDGE('',*,*,#368,.T.);
#69=ORIENTED_EDGE('',*,*,#369,.F.);
#70=ORIENTED_EDGE('',*,*,#370,.T.);
#71=ORIENTED_EDGE('',*,*,#371,.T.);
#72=ORIENTED_EDGE('',*,*,#372,.T.);
#73=ORIENTED_EDGE('',*,*,#373,.F.);
#74=ORIENTED_EDGE('',*,*,#374,.F.);
#75=ORIENTED_EDGE('',*,*,#356,.F.);
#76=ORIENTED_EDGE('',*,*,#355,.T.);
#77=ORIENTED_EDGE('',*,*,#364,.T.);
#78=ORIENTED_EDGE('',*,*,#363,.T.);
#79=ORIENTED_EDGE('',*,*,#362,.T.);
#80=ORIENTED_EDGE('',*,*,#361,.F.);
#81=ORIENTED_EDGE('',*,*,#360,.T.);
#82=ORIENTED_EDGE('',*,*,#359,.T.);
#83=ORIENTED_EDGE('',*,*,#358,.T.);
#84=ORIENTED_EDGE('',*,*,#357,.F.);
#85=ORIENTED_EDGE('',*,*,#375,.F.);
#86=ORIENTED_EDGE('',*,*,#376,.T.);
#87=ORIENTED_EDGE('',*,*,#377,.T.);
#88=ORIENTED_EDGE('',*,*,#378,.T.);
#89=ORIENTED_EDGE('',*,*,#379,.T.);
#90=ORIENTED_EDGE('',*,*,#380,.F.);
#91=ORIENTED_EDGE('',*,*,#381,.F.);
#92=ORIENTED_EDGE('',*,*,#382,.F.);
#93=ORIENTED_EDGE('',*,*,#383,.F.);
#94=ORIENTED_EDGE('',*,*,#384,.F.);
#95=ORIENTED_EDGE('',*,*,#339,.F.);
#96=ORIENTED_EDGE('',*,*,#385,.F.);
#97=ORIENTED_EDGE('',*,*,#386,.F.);
#98=ORIENTED_EDGE('',*,*,#387,.T.);
#99=ORIENTED_EDGE('',*,*,#388,.T.);
#100=ORIENTED_EDGE('',*,*,#389,.T.);
#101=ORIENTED_EDGE('',*,*,#390,.F.);
#102=ORIENTED_EDGE('',*,*,#391,.F.);
#103=ORIENTED_EDGE('',*,*,#366,.F.);
#104=ORIENTED_EDGE('',*,*,#365,.T.);
#105=ORIENTED_EDGE('',*,*,#374,.T.);
#106=ORIENTED_EDGE('',*,*,#373,.T.);
#107=ORIENTED_EDGE('',*,*,#372,.F.);
#108=ORIENTED_EDGE('',*,*,#371,.F.);
#109=ORIENTED_EDGE('',*,*,#370,.F.);
#110=ORIENTED_EDGE('',*,*,#369,.T.);
#111=ORIENTED_EDGE('',*,*,#368,.F.);
#112=ORIENTED_EDGE('',*,*,#367,.F.);
#113=ORIENTED_EDGE('',*,*,#392,.F.);
#114=ORIENTED_EDGE('',*,*,#393,.T.);
#115=ORIENTED_EDGE('',*,*,#394,.T.);
#116=ORIENTED_EDGE('',*,*,#395,.T.);
#117=ORIENTED_EDGE('',*,*,#396,.T.);
#118=ORIENTED_EDGE('',*,*,#397,.T.);
#119=ORIENTED_EDGE('',*,*,#398,.T.);
#120=ORIENTED_EDGE('',*,*,#399,.F.);
#121=ORIENTED_EDGE('',*,*,#400,.F.);
#122=ORIENTED_EDGE('',*,*,#401,.F.);
#123=ORIENTED_EDGE('',*,*,#351,.T.);
#124=ORIENTED_EDGE('',*,*,#402,.T.);
#125=ORIENTED_EDGE('',*,*,#403,.F.);
#126=ORIENTED_EDGE('',*,*,#404,.T.);
#127=ORIENTED_EDGE('',*,*,#405,.T.);
#128=ORIENTED_EDGE('',*,*,#406,.T.);
#129=ORIENTED_EDGE('',*,*,#407,.F.);
#130=ORIENTED_EDGE('',*,*,#408,.F.);
#131=ORIENTED_EDGE('',*,*,#409,.F.);
#132=ORIENTED_EDGE('',*,*,#410,.F.);
#133=ORIENTED_EDGE('',*,*,#411,.T.);
#134=ORIENTED_EDGE('',*,*,#412,.T.);
#135=ORIENTED_EDGE('',*,*,#413,.T.);
#136=ORIENTED_EDGE('',*,*,#414,.T.);
#137=ORIENTED_EDGE('',*,*,#415,.T.);
#138=ORIENTED_EDGE('',*,*,#416,.T.);
#139=ORIENTED_EDGE('',*,*,#417,.T.);
#140=ORIENTED_EDGE('',*,*,#418,.T.);
#141=ORIENTED_EDGE('',*,*,#419,.T.);
#142=ORIENTED_EDGE('',*,*,#420,.T.);
#143=ORIENTED_EDGE('',*,*,#421,.T.);
#144=ORIENTED_EDGE('',*,*,#422,.T.);
#145=ORIENTED_EDGE('',*,*,#423,.T.);
#146=ORIENTED_EDGE('',*,*,#413,.F.);
#147=ORIENTED_EDGE('',*,*,#424,.F.);
#148=ORIENTED_EDGE('',*,*,#425,.F.);
#149=ORIENTED_EDGE('',*,*,#426,.T.);
#150=ORIENTED_EDGE('',*,*,#350,.F.);
#151=ORIENTED_EDGE('',*,*,#427,.T.);
#152=ORIENTED_EDGE('',*,*,#428,.T.);
#153=ORIENTED_EDGE('',*,*,#429,.T.);
#154=ORIENTED_EDGE('',*,*,#430,.T.);
#155=ORIENTED_EDGE('',*,*,#346,.F.);
#156=ORIENTED_EDGE('',*,*,#431,.F.);
#157=ORIENTED_EDGE('',*,*,#411,.F.);
#158=ORIENTED_EDGE('',*,*,#390,.T.);
#159=ORIENTED_EDGE('',*,*,#432,.T.);
#160=ORIENTED_EDGE('',*,*,#433,.F.);
#161=ORIENTED_EDGE('',*,*,#434,.T.);
#162=ORIENTED_EDGE('',*,*,#435,.F.);
#163=ORIENTED_EDGE('',*,*,#436,.T.);
#164=ORIENTED_EDGE('',*,*,#386,.T.);
#165=ORIENTED_EDGE('',*,*,#437,.F.);
#166=ORIENTED_EDGE('',*,*,#438,.F.);
#167=ORIENTED_EDGE('',*,*,#439,.T.);
#168=ORIENTED_EDGE('',*,*,#440,.T.);
#169=ORIENTED_EDGE('',*,*,#407,.T.);
#170=ORIENTED_EDGE('',*,*,#441,.T.);
#171=ORIENTED_EDGE('',*,*,#442,.T.);
#172=ORIENTED_EDGE('',*,*,#403,.T.);
#173=ORIENTED_EDGE('',*,*,#443,.F.);
#174=ORIENTED_EDGE('',*,*,#376,.F.);
#175=ORIENTED_EDGE('',*,*,#343,.F.);
#176=ORIENTED_EDGE('',*,*,#430,.F.);
#177=ORIENTED_EDGE('',*,*,#444,.T.);
#178=ORIENTED_EDGE('',*,*,#401,.T.);
#179=ORIENTED_EDGE('',*,*,#400,.T.);
#180=ORIENTED_EDGE('',*,*,#399,.T.);
#181=ORIENTED_EDGE('',*,*,#398,.F.);
#182=ORIENTED_EDGE('',*,*,#397,.F.);
#183=ORIENTED_EDGE('',*,*,#396,.F.);
#184=ORIENTED_EDGE('',*,*,#395,.F.);
#185=ORIENTED_EDGE('',*,*,#394,.F.);
#186=ORIENTED_EDGE('',*,*,#393,.F.);
#187=ORIENTED_EDGE('',*,*,#347,.F.);
#188=ORIENTED_EDGE('',*,*,#426,.F.);
#189=ORIENTED_EDGE('',*,*,#445,.F.);
#190=ORIENTED_EDGE('',*,*,#384,.T.);
#191=ORIENTED_EDGE('',*,*,#383,.T.);
#192=ORIENTED_EDGE('',*,*,#382,.T.);
#193=ORIENTED_EDGE('',*,*,#381,.T.);
#194=ORIENTED_EDGE('',*,*,#380,.T.);
#195=ORIENTED_EDGE('',*,*,#379,.F.);
#196=ORIENTED_EDGE('',*,*,#378,.F.);
#197=ORIENTED_EDGE('',*,*,#377,.F.);
#198=ORIENTED_EDGE('',*,*,#446,.F.);
#199=ORIENTED_EDGE('',*,*,#447,.T.);
#200=ORIENTED_EDGE('',*,*,#448,.T.);
#201=ORIENTED_EDGE('',*,*,#433,.T.);
#202=ORIENTED_EDGE('',*,*,#449,.F.);
#203=ORIENTED_EDGE('',*,*,#435,.T.);
#204=ORIENTED_EDGE('',*,*,#450,.T.);
#205=ORIENTED_EDGE('',*,*,#451,.T.);
#206=ORIENTED_EDGE('',*,*,#452,.F.);
#207=ORIENTED_EDGE('',*,*,#453,.T.);
#208=ORIENTED_EDGE('',*,*,#441,.F.);
#209=ORIENTED_EDGE('',*,*,#454,.T.);
#210=ORIENTED_EDGE('',*,*,#439,.F.);
#211=ORIENTED_EDGE('',*,*,#455,.T.);
#212=ORIENTED_EDGE('',*,*,#456,.F.);
#213=ORIENTED_EDGE('',*,*,#457,.F.);
#214=ORIENTED_EDGE('',*,*,#424,.T.);
#215=ORIENTED_EDGE('',*,*,#412,.F.);
#216=ORIENTED_EDGE('',*,*,#431,.T.);
#217=ORIENTED_EDGE('',*,*,#345,.F.);
#218=ORIENTED_EDGE('',*,*,#458,.F.);
#219=ORIENTED_EDGE('',*,*,#447,.F.);
#220=ORIENTED_EDGE('',*,*,#459,.F.);
#221=ORIENTED_EDGE('',*,*,#451,.F.);
#222=ORIENTED_EDGE('',*,*,#341,.F.);
#223=ORIENTED_EDGE('',*,*,#460,.F.);
#224=ORIENTED_EDGE('',*,*,#410,.T.);
#225=ORIENTED_EDGE('',*,*,#461,.T.);
#226=ORIENTED_EDGE('',*,*,#462,.T.);
#227=ORIENTED_EDGE('',*,*,#427,.F.);
#228=ORIENTED_EDGE('',*,*,#349,.T.);
#229=ORIENTED_EDGE('',*,*,#463,.T.);
#230=ORIENTED_EDGE('',*,*,#456,.T.);
#231=ORIENTED_EDGE('',*,*,#464,.T.);
#232=ORIENTED_EDGE('',*,*,#452,.T.);
#233=ORIENTED_EDGE('',*,*,#353,.T.);
#234=ORIENTED_EDGE('',*,*,#465,.T.);
#235=ORIENTED_EDGE('',*,*,#428,.F.);
#236=ORIENTED_EDGE('',*,*,#408,.T.);
#237=ORIENTED_EDGE('',*,*,#440,.F.);
#238=ORIENTED_EDGE('',*,*,#457,.T.);
#239=ORIENTED_EDGE('',*,*,#466,.T.);
#240=ORIENTED_EDGE('',*,*,#348,.F.);
#241=ORIENTED_EDGE('',*,*,#392,.T.);
#242=ORIENTED_EDGE('',*,*,#466,.F.);
#243=ORIENTED_EDGE('',*,*,#463,.F.);
#244=ORIENTED_EDGE('',*,*,#354,.F.);
#245=ORIENTED_EDGE('',*,*,#454,.F.);
#246=ORIENTED_EDGE('',*,*,#443,.T.);
#247=ORIENTED_EDGE('',*,*,#402,.F.);
#248=ORIENTED_EDGE('',*,*,#352,.F.);
#249=ORIENTED_EDGE('',*,*,#444,.F.);
#250=ORIENTED_EDGE('',*,*,#429,.F.);
#251=ORIENTED_EDGE('',*,*,#465,.F.);
#252=ORIENTED_EDGE('',*,*,#442,.F.);
#253=ORIENTED_EDGE('',*,*,#453,.F.);
#254=ORIENTED_EDGE('',*,*,#467,.T.);
#255=ORIENTED_EDGE('',*,*,#404,.F.);
#256=ORIENTED_EDGE('',*,*,#468,.F.);
#257=ORIENTED_EDGE('',*,*,#455,.F.);
#258=ORIENTED_EDGE('',*,*,#438,.T.);
#259=ORIENTED_EDGE('',*,*,#406,.F.);
#260=ORIENTED_EDGE('',*,*,#467,.F.);
#261=ORIENTED_EDGE('',*,*,#464,.F.);
#262=ORIENTED_EDGE('',*,*,#468,.T.);
#263=ORIENTED_EDGE('',*,*,#405,.F.);
#264=ORIENTED_EDGE('',*,*,#385,.T.);
#265=ORIENTED_EDGE('',*,*,#342,.F.);
#266=ORIENTED_EDGE('',*,*,#450,.F.);
#267=ORIENTED_EDGE('',*,*,#437,.T.);
#268=ORIENTED_EDGE('',*,*,#340,.F.);
#269=ORIENTED_EDGE('',*,*,#445,.T.);
#270=ORIENTED_EDGE('',*,*,#425,.T.);
#271=ORIENTED_EDGE('',*,*,#460,.T.);
#272=ORIENTED_EDGE('',*,*,#391,.T.);
#273=ORIENTED_EDGE('',*,*,#434,.F.);
#274=ORIENTED_EDGE('',*,*,#448,.F.);
#275=ORIENTED_EDGE('',*,*,#469,.T.);
#276=ORIENTED_EDGE('',*,*,#344,.F.);
#277=ORIENTED_EDGE('',*,*,#375,.T.);
#278=ORIENTED_EDGE('',*,*,#469,.F.);
#279=ORIENTED_EDGE('',*,*,#458,.T.);
#280=ORIENTED_EDGE('',*,*,#470,.F.);
#281=ORIENTED_EDGE('',*,*,#446,.T.);
#282=ORIENTED_EDGE('',*,*,#432,.F.);
#283=ORIENTED_EDGE('',*,*,#389,.F.);
#284=ORIENTED_EDGE('',*,*,#436,.F.);
#285=ORIENTED_EDGE('',*,*,#449,.T.);
#286=ORIENTED_EDGE('',*,*,#471,.T.);
#287=ORIENTED_EDGE('',*,*,#387,.F.);
#288=ORIENTED_EDGE('',*,*,#471,.F.);
#289=ORIENTED_EDGE('',*,*,#459,.T.);
#290=ORIENTED_EDGE('',*,*,#470,.T.);
#291=ORIENTED_EDGE('',*,*,#388,.F.);
#292=ORIENTED_EDGE('',*,*,#472,.T.);
#293=ORIENTED_EDGE('',*,*,#461,.F.);
#294=ORIENTED_EDGE('',*,*,#409,.T.);
#295=ORIENTED_EDGE('',*,*,#423,.F.);
#296=ORIENTED_EDGE('',*,*,#462,.F.);
#297=ORIENTED_EDGE('',*,*,#472,.F.);
#298=ORIENTED_EDGE('',*,*,#422,.F.);
#299=ORIENTED_EDGE('',*,*,#415,.F.);
#300=ORIENTED_EDGE('',*,*,#473,.F.);
#301=ORIENTED_EDGE('',*,*,#474,.T.);
#302=ORIENTED_EDGE('',*,*,#475,.T.);
#303=ORIENTED_EDGE('',*,*,#416,.F.);
#304=ORIENTED_EDGE('',*,*,#475,.F.);
#305=ORIENTED_EDGE('',*,*,#476,.T.);
#306=ORIENTED_EDGE('',*,*,#477,.T.);
#307=ORIENTED_EDGE('',*,*,#417,.F.);
#308=ORIENTED_EDGE('',*,*,#477,.F.);
#309=ORIENTED_EDGE('',*,*,#478,.T.);
#310=ORIENTED_EDGE('',*,*,#479,.T.);
#311=ORIENTED_EDGE('',*,*,#418,.F.);
#312=ORIENTED_EDGE('',*,*,#479,.F.);
#313=ORIENTED_EDGE('',*,*,#480,.T.);
#314=ORIENTED_EDGE('',*,*,#481,.T.);
#315=ORIENTED_EDGE('',*,*,#419,.F.);
#316=ORIENTED_EDGE('',*,*,#481,.F.);
#317=ORIENTED_EDGE('',*,*,#482,.T.);
#318=ORIENTED_EDGE('',*,*,#483,.T.);
#319=ORIENTED_EDGE('',*,*,#420,.F.);
#320=ORIENTED_EDGE('',*,*,#483,.F.);
#321=ORIENTED_EDGE('',*,*,#484,.T.);
#322=ORIENTED_EDGE('',*,*,#485,.T.);
#323=ORIENTED_EDGE('',*,*,#421,.F.);
#324=ORIENTED_EDGE('',*,*,#485,.F.);
#325=ORIENTED_EDGE('',*,*,#486,.T.);
#326=ORIENTED_EDGE('',*,*,#487,.T.);
#327=ORIENTED_EDGE('',*,*,#414,.F.);
#328=ORIENTED_EDGE('',*,*,#487,.F.);
#329=ORIENTED_EDGE('',*,*,#488,.T.);
#330=ORIENTED_EDGE('',*,*,#473,.T.);
#331=ORIENTED_EDGE('',*,*,#474,.F.);
#332=ORIENTED_EDGE('',*,*,#488,.F.);
#333=ORIENTED_EDGE('',*,*,#486,.F.);
#334=ORIENTED_EDGE('',*,*,#484,.F.);
#335=ORIENTED_EDGE('',*,*,#482,.F.);
#336=ORIENTED_EDGE('',*,*,#480,.F.);
#337=ORIENTED_EDGE('',*,*,#478,.F.);
#338=ORIENTED_EDGE('',*,*,#476,.F.);
#339=EDGE_CURVE('',#489,#490,#597,.T.);
#340=EDGE_CURVE('',#490,#491,#598,.T.);
#341=EDGE_CURVE('',#491,#492,#599,.T.);
#342=EDGE_CURVE('',#492,#489,#600,.T.);
#343=EDGE_CURVE('',#493,#494,#601,.T.);
#344=EDGE_CURVE('',#494,#495,#602,.T.);
#345=EDGE_CURVE('',#495,#496,#603,.T.);
#346=EDGE_CURVE('',#496,#493,#604,.T.);
#347=EDGE_CURVE('',#497,#498,#605,.T.);
#348=EDGE_CURVE('',#498,#499,#606,.T.);
#349=EDGE_CURVE('',#500,#499,#607,.T.);
#350=EDGE_CURVE('',#500,#497,#608,.T.);
#351=EDGE_CURVE('',#501,#502,#609,.T.);
#352=EDGE_CURVE('',#501,#503,#610,.T.);
#353=EDGE_CURVE('',#504,#503,#611,.T.);
#354=EDGE_CURVE('',#504,#502,#612,.T.);
#355=EDGE_CURVE('',#505,#506,#613,.T.);
#356=EDGE_CURVE('',#505,#507,#20,.T.);
#357=EDGE_CURVE('',#507,#508,#614,.T.);
#358=EDGE_CURVE('',#509,#508,#21,.T.);
#359=EDGE_CURVE('',#510,#509,#22,.T.);
#360=EDGE_CURVE('',#511,#510,#23,.T.);
#361=EDGE_CURVE('',#511,#512,#24,.T.);
#362=EDGE_CURVE('',#513,#512,#25,.T.);
#363=EDGE_CURVE('',#514,#513,#615,.T.);
#364=EDGE_CURVE('',#506,#514,#26,.T.);
#365=EDGE_CURVE('',#515,#516,#616,.T.);
#366=EDGE_CURVE('',#515,#517,#27,.T.);
#367=EDGE_CURVE('',#517,#518,#617,.T.);
#368=EDGE_CURVE('',#518,#519,#28,.T.);
#369=EDGE_CURVE('',#520,#519,#29,.T.);
#370=EDGE_CURVE('',#520,#521,#30,.T.);
#371=EDGE_CURVE('',#521,#522,#31,.T.);
#372=EDGE_CURVE('',#522,#523,#32,.T.);
#373=EDGE_CURVE('',#524,#523,#618,.T.);
#374=EDGE_CURVE('',#516,#524,#33,.T.);
#375=EDGE_CURVE('',#494,#525,#619,.T.);
#376=EDGE_CURVE('',#494,#526,#620,.T.);
#377=EDGE_CURVE('',#526,#527,#621,.T.);
#378=EDGE_CURVE('',#527,#528,#34,.T.);
#379=EDGE_CURVE('',#528,#529,#622,.T.);
#380=EDGE_CURVE('',#530,#529,#623,.T.);
#381=EDGE_CURVE('',#531,#530,#624,.T.);
#382=EDGE_CURVE('',#532,#531,#35,.T.);
#383=EDGE_CURVE('',#533,#532,#625,.T.);
#384=EDGE_CURVE('',#490,#533,#626,.T.);
#385=EDGE_CURVE('',#534,#489,#627,.T.);
#386=EDGE_CURVE('',#535,#534,#628,.T.);
#387=EDGE_CURVE('',#535,#536,#629,.T.);
#388=EDGE_CURVE('',#536,#537,#630,.T.);
#389=EDGE_CURVE('',#537,#538,#631,.T.);
#390=EDGE_CURVE('',#539,#538,#632,.T.);
#391=EDGE_CURVE('',#525,#539,#633,.T.);
#392=EDGE_CURVE('',#498,#540,#634,.T.);
#393=EDGE_CURVE('',#498,#541,#635,.T.);
#394=EDGE_CURVE('',#541,#542,#636,.T.);
#395=EDGE_CURVE('',#542,#543,#36,.T.);
#396=EDGE_CURVE('',#543,#544,#637,.T.);
#397=EDGE_CURVE('',#544,#545,#638,.T.);
#398=EDGE_CURVE('',#545,#546,#639,.T.);
#399=EDGE_CURVE('',#547,#546,#37,.T.);
#400=EDGE_CURVE('',#548,#547,#640,.T.);
#401=EDGE_CURVE('',#501,#548,#641,.T.);
#402=EDGE_CURVE('',#502,#549,#642,.T.);
#403=EDGE_CURVE('',#550,#549,#643,.T.);
#404=EDGE_CURVE('',#550,#551,#644,.T.);
#405=EDGE_CURVE('',#551,#552,#645,.T.);
#406=EDGE_CURVE('',#552,#553,#646,.T.);
#407=EDGE_CURVE('',#554,#553,#647,.T.);
#408=EDGE_CURVE('',#540,#554,#648,.T.);
#409=EDGE_CURVE('',#555,#556,#649,.T.);
#410=EDGE_CURVE('',#557,#555,#650,.T.);
#411=EDGE_CURVE('',#557,#558,#651,.T.);
#412=EDGE_CURVE('',#558,#559,#652,.T.);
#413=EDGE_CURVE('',#559,#556,#653,.T.);
#414=EDGE_CURVE('',#560,#561,#654,.F.);
#415=EDGE_CURVE('',#561,#562,#655,.F.);
#416=EDGE_CURVE('',#562,#563,#656,.F.);
#417=EDGE_CURVE('',#563,#564,#657,.F.);
#418=EDGE_CURVE('',#564,#565,#658,.F.);
#419=EDGE_CURVE('',#565,#566,#659,.F.);
#420=EDGE_CURVE('',#566,#567,#660,.F.);
#421=EDGE_CURVE('',#567,#560,#661,.F.);
#422=EDGE_CURVE('',#568,#569,#662,.T.);
#423=EDGE_CURVE('',#569,#556,#663,.T.);
#424=EDGE_CURVE('',#570,#559,#664,.T.);
#425=EDGE_CURVE('',#571,#570,#665,.T.);
#426=EDGE_CURVE('',#571,#497,#666,.T.);
#427=EDGE_CURVE('',#500,#568,#667,.T.);
#428=EDGE_CURVE('',#557,#572,#668,.T.);
#429=EDGE_CURVE('',#572,#573,#669,.T.);
#430=EDGE_CURVE('',#573,#493,#670,.T.);
#431=EDGE_CURVE('',#558,#496,#671,.T.);
#432=EDGE_CURVE('',#538,#574,#672,.T.);
#433=EDGE_CURVE('',#575,#574,#673,.T.);
#434=EDGE_CURVE('',#575,#539,#674,.T.);
#435=EDGE_CURVE('',#576,#577,#675,.T.);
#436=EDGE_CURVE('',#576,#535,#676,.T.);
#437=EDGE_CURVE('',#577,#534,#677,.T.);
#438=EDGE_CURVE('',#578,#553,#678,.T.);
#439=EDGE_CURVE('',#578,#579,#679,.T.);
#440=EDGE_CURVE('',#579,#554,#680,.T.);
#441=EDGE_CURVE('',#580,#581,#681,.T.);
#442=EDGE_CURVE('',#581,#550,#682,.T.);
#443=EDGE_CURVE('',#580,#549,#683,.T.);
#444=EDGE_CURVE('',#573,#501,#684,.T.);
#445=EDGE_CURVE('',#490,#571,#685,.T.);
#446=EDGE_CURVE('',#582,#574,#686,.T.);
#447=EDGE_CURVE('',#582,#583,#687,.T.);
#448=EDGE_CURVE('',#583,#575,#688,.T.);
#449=EDGE_CURVE('',#576,#584,#689,.T.);
#450=EDGE_CURVE('',#577,#492,#690,.T.);
#451=EDGE_CURVE('',#492,#584,#691,.T.);
#452=EDGE_CURVE('',#585,#504,#692,.T.);
#453=EDGE_CURVE('',#585,#581,#693,.T.);
#454=EDGE_CURVE('',#580,#504,#694,.T.);
#455=EDGE_CURVE('',#578,#586,#695,.T.);
#456=EDGE_CURVE('',#587,#586,#696,.T.);
#457=EDGE_CURVE('',#579,#587,#697,.T.);
#458=EDGE_CURVE('',#583,#495,#698,.T.);
#459=EDGE_CURVE('',#584,#582,#699,.T.);
#460=EDGE_CURVE('',#570,#491,#700,.T.);
#461=EDGE_CURVE('',#555,#588,#701,.T.);
#462=EDGE_CURVE('',#588,#568,#702,.T.);
#463=EDGE_CURVE('',#499,#587,#703,.T.);
#464=EDGE_CURVE('',#586,#585,#704,.T.);
#465=EDGE_CURVE('',#503,#572,#705,.T.);
#466=EDGE_CURVE('',#587,#540,#706,.T.);
#467=EDGE_CURVE('',#585,#551,#707,.T.);
#468=EDGE_CURVE('',#586,#552,#708,.T.);
#469=EDGE_CURVE('',#583,#525,#709,.T.);
#470=EDGE_CURVE('',#582,#537,#710,.T.);
#471=EDGE_CURVE('',#584,#536,#711,.T.);
#472=EDGE_CURVE('',#569,#588,#712,.T.);
#473=EDGE_CURVE('',#589,#561,#713,.T.);
#474=EDGE_CURVE('',#589,#590,#714,.F.);
#475=EDGE_CURVE('',#590,#562,#715,.T.);
#476=EDGE_CURVE('',#590,#591,#716,.F.);
#477=EDGE_CURVE('',#591,#563,#717,.T.);
#478=EDGE_CURVE('',#591,#592,#718,.F.);
#479=EDGE_CURVE('',#592,#564,#719,.T.);
#480=EDGE_CURVE('',#592,#593,#720,.F.);
#481=EDGE_CURVE('',#593,#565,#721,.T.);
#482=EDGE_CURVE('',#593,#594,#722,.F.);
#483=EDGE_CURVE('',#594,#566,#723,.T.);
#484=EDGE_CURVE('',#594,#595,#724,.F.);
#485=EDGE_CURVE('',#595,#567,#725,.T.);
#486=EDGE_CURVE('',#595,#596,#726,.F.);
#487=EDGE_CURVE('',#596,#560,#727,.T.);
#488=EDGE_CURVE('',#596,#589,#728,.F.);
#489=VERTEX_POINT('',#1723);
#490=VERTEX_POINT('',#1724);
#491=VERTEX_POINT('',#1726);
#492=VERTEX_POINT('',#1728);
#493=VERTEX_POINT('',#1732);
#494=VERTEX_POINT('',#1733);
#495=VERTEX_POINT('',#1735);
#496=VERTEX_POINT('',#1737);
#497=VERTEX_POINT('',#1741);
#498=VERTEX_POINT('',#1742);
#499=VERTEX_POINT('',#1744);
#500=VERTEX_POINT('',#1746);
#501=VERTEX_POINT('',#1750);
#502=VERTEX_POINT('',#1751);
#503=VERTEX_POINT('',#1753);
#504=VERTEX_POINT('',#1755);
#505=VERTEX_POINT('',#1759);
#506=VERTEX_POINT('',#1760);
#507=VERTEX_POINT('',#1762);
#508=VERTEX_POINT('',#1764);
#509=VERTEX_POINT('',#1766);
#510=VERTEX_POINT('',#1768);
#511=VERTEX_POINT('',#1770);
#512=VERTEX_POINT('',#1772);
#513=VERTEX_POINT('',#1774);
#514=VERTEX_POINT('',#1776);
#515=VERTEX_POINT('',#1780);
#516=VERTEX_POINT('',#1781);
#517=VERTEX_POINT('',#1783);
#518=VERTEX_POINT('',#1785);
#519=VERTEX_POINT('',#1787);
#520=VERTEX_POINT('',#1789);
#521=VERTEX_POINT('',#1791);
#522=VERTEX_POINT('',#1793);
#523=VERTEX_POINT('',#1795);
#524=VERTEX_POINT('',#1797);
#525=VERTEX_POINT('',#1801);
#526=VERTEX_POINT('',#1803);
#527=VERTEX_POINT('',#1805);
#528=VERTEX_POINT('',#1807);
#529=VERTEX_POINT('',#1809);
#530=VERTEX_POINT('',#1811);
#531=VERTEX_POINT('',#1813);
#532=VERTEX_POINT('',#1815);
#533=VERTEX_POINT('',#1817);
#534=VERTEX_POINT('',#1820);
#535=VERTEX_POINT('',#1822);
#536=VERTEX_POINT('',#1824);
#537=VERTEX_POINT('',#1826);
#538=VERTEX_POINT('',#1828);
#539=VERTEX_POINT('',#1830);
#540=VERTEX_POINT('',#1834);
#541=VERTEX_POINT('',#1836);
#542=VERTEX_POINT('',#1838);
#543=VERTEX_POINT('',#1840);
#544=VERTEX_POINT('',#1842);
#545=VERTEX_POINT('',#1844);
#546=VERTEX_POINT('',#1846);
#547=VERTEX_POINT('',#1848);
#548=VERTEX_POINT('',#1850);
#549=VERTEX_POINT('',#1853);
#550=VERTEX_POINT('',#1855);
#551=VERTEX_POINT('',#1857);
#552=VERTEX_POINT('',#1859);
#553=VERTEX_POINT('',#1861);
#554=VERTEX_POINT('',#1863);
#555=VERTEX_POINT('',#1867);
#556=VERTEX_POINT('',#1868);
#557=VERTEX_POINT('',#1870);
#558=VERTEX_POINT('',#1872);
#559=VERTEX_POINT('',#1874);
#560=VERTEX_POINT('',#1877);
#561=VERTEX_POINT('',#1878);
#562=VERTEX_POINT('',#1880);
#563=VERTEX_POINT('',#1882);
#564=VERTEX_POINT('',#1884);
#565=VERTEX_POINT('',#1886);
#566=VERTEX_POINT('',#1888);
#567=VERTEX_POINT('',#1890);
#568=VERTEX_POINT('',#1894);
#569=VERTEX_POINT('',#1895);
#570=VERTEX_POINT('',#1898);
#571=VERTEX_POINT('',#1900);
#572=VERTEX_POINT('',#1905);
#573=VERTEX_POINT('',#1907);
#574=VERTEX_POINT('',#1912);
#575=VERTEX_POINT('',#1914);
#576=VERTEX_POINT('',#1918);
#577=VERTEX_POINT('',#1919);
#578=VERTEX_POINT('',#1924);
#579=VERTEX_POINT('',#1926);
#580=VERTEX_POINT('',#1930);
#581=VERTEX_POINT('',#1931);
#582=VERTEX_POINT('',#1939);
#583=VERTEX_POINT('',#1941);
#584=VERTEX_POINT('',#1945);
#585=VERTEX_POINT('',#1950);
#586=VERTEX_POINT('',#1955);
#587=VERTEX_POINT('',#1957);
#588=VERTEX_POINT('',#1965);
#589=VERTEX_POINT('',#1995);
#590=VERTEX_POINT('',#1997);
#591=VERTEX_POINT('',#2001);
#592=VERTEX_POINT('',#2005);
#593=VERTEX_POINT('',#2009);
#594=VERTEX_POINT('',#2013);
#595=VERTEX_POINT('',#2017);
#596=VERTEX_POINT('',#2021);
#597=LINE('',#1722,#729);
#598=LINE('',#1725,#730);
#599=LINE('',#1727,#731);
#600=LINE('',#1729,#732);
#601=LINE('',#1731,#733);
#602=LINE('',#1734,#734);
#603=LINE('',#1736,#735);
#604=LINE('',#1738,#736);
#605=LINE('',#1740,#737);
#606=LINE('',#1743,#738);
#607=LINE('',#1745,#739);
#608=LINE('',#1747,#740);
#609=LINE('',#1749,#741);
#610=LINE('',#1752,#742);
#611=LINE('',#1754,#743);
#612=LINE('',#1756,#744);
#613=LINE('',#1758,#745);
#614=LINE('',#1763,#746);
#615=LINE('',#1775,#747);
#616=LINE('',#1779,#748);
#617=LINE('',#1784,#749);
#618=LINE('',#1796,#750);
#619=LINE('',#1800,#751);
#620=LINE('',#1802,#752);
#621=LINE('',#1804,#753);
#622=LINE('',#1808,#754);
#623=LINE('',#1810,#755);
#624=LINE('',#1812,#756);
#625=LINE('',#1816,#757);
#626=LINE('',#1818,#758);
#627=LINE('',#1819,#759);
#628=LINE('',#1821,#760);
#629=LINE('',#1823,#761);
#630=LINE('',#1825,#762);
#631=LINE('',#1827,#763);
#632=LINE('',#1829,#764);
#633=LINE('',#1831,#765);
#634=LINE('',#1833,#766);
#635=LINE('',#1835,#767);
#636=LINE('',#1837,#768);
#637=LINE('',#1841,#769);
#638=LINE('',#1843,#770);
#639=LINE('',#1845,#771);
#640=LINE('',#1849,#772);
#641=LINE('',#1851,#773);
#642=LINE('',#1852,#774);
#643=LINE('',#1854,#775);
#644=LINE('',#1856,#776);
#645=LINE('',#1858,#777);
#646=LINE('',#1860,#778);
#647=LINE('',#1862,#779);
#648=LINE('',#1864,#780);
#649=LINE('',#1866,#781);
#650=LINE('',#1869,#782);
#651=LINE('',#1871,#783);
#652=LINE('',#1873,#784);
#653=LINE('',#1875,#785);
#654=LINE('',#1876,#786);
#655=LINE('',#1879,#787);
#656=LINE('',#1881,#788);
#657=LINE('',#1883,#789);
#658=LINE('',#1885,#790);
#659=LINE('',#1887,#791);
#660=LINE('',#1889,#792);
#661=LINE('',#1891,#793);
#662=LINE('',#1893,#794);
#663=LINE('',#1896,#795);
#664=LINE('',#1897,#796);
#665=LINE('',#1899,#797);
#666=LINE('',#1901,#798);
#667=LINE('',#1902,#799);
#668=LINE('',#1904,#800);
#669=LINE('',#1906,#801);
#670=LINE('',#1908,#802);
#671=LINE('',#1909,#803);
#672=LINE('',#1911,#804);
#673=LINE('',#1913,#805);
#674=LINE('',#1915,#806);
#675=LINE('',#1917,#807);
#676=LINE('',#1920,#808);
#677=LINE('',#1921,#809);
#678=LINE('',#1923,#810);
#679=LINE('',#1925,#811);
#680=LINE('',#1927,#812);
#681=LINE('',#1929,#813);
#682=LINE('',#1932,#814);
#683=LINE('',#1933,#815);
#684=LINE('',#1935,#816);
#685=LINE('',#1936,#817);
#686=LINE('',#1938,#818);
#687=LINE('',#1940,#819);
#688=LINE('',#1942,#820);
#689=LINE('',#1944,#821);
#690=LINE('',#1946,#822);
#691=LINE('',#1947,#823);
#692=LINE('',#1949,#824);
#693=LINE('',#1951,#825);
#694=LINE('',#1952,#826);
#695=LINE('',#1954,#827);
#696=LINE('',#1956,#828);
#697=LINE('',#1958,#829);
#698=LINE('',#1960,#830);
#699=LINE('',#1961,#831);
#700=LINE('',#1962,#832);
#701=LINE('',#1964,#833);
#702=LINE('',#1966,#834);
#703=LINE('',#1967,#835);
#704=LINE('',#1968,#836);
#705=LINE('',#1969,#837);
#706=LINE('',#1971,#838);
#707=LINE('',#1976,#839);
#708=LINE('',#1978,#840);
#709=LINE('',#1983,#841);
#710=LINE('',#1986,#842);
#711=LINE('',#1988,#843);
#712=LINE('',#1991,#844);
#713=LINE('',#1994,#845);
#714=LINE('',#1996,#846);
#715=LINE('',#1998,#847);
#716=LINE('',#2000,#848);
#717=LINE('',#2002,#849);
#718=LINE('',#2004,#850);
#719=LINE('',#2006,#851);
#720=LINE('',#2008,#852);
#721=LINE('',#2010,#853);
#722=LINE('',#2012,#854);
#723=LINE('',#2014,#855);
#724=LINE('',#2016,#856);
#725=LINE('',#2018,#857);
#726=LINE('',#2020,#858);
#727=LINE('',#2022,#859);
#728=LINE('',#2024,#860);
#729=VECTOR('',#1460,1000.);
#730=VECTOR('',#1461,1000.);
#731=VECTOR('',#1462,1000.);
#732=VECTOR('',#1463,1000.);
#733=VECTOR('',#1466,1000.);
#734=VECTOR('',#1467,1000.);
#735=VECTOR('',#1468,1000.);
#736=VECTOR('',#1469,1000.);
#737=VECTOR('',#1472,1000.);
#738=VECTOR('',#1473,1000.);
#739=VECTOR('',#1474,1000.);
#740=VECTOR('',#1475,1000.);
#741=VECTOR('',#1478,1000.);
#742=VECTOR('',#1479,1000.);
#743=VECTOR('',#1480,1000.);
#744=VECTOR('',#1481,1000.);
#745=VECTOR('',#1484,1000.);
#746=VECTOR('',#1487,1000.);
#747=VECTOR('',#1498,1000.);
#748=VECTOR('',#1503,1000.);
#749=VECTOR('',#1506,1000.);
#750=VECTOR('',#1517,1000.);
#751=VECTOR('',#1522,1000.);
#752=VECTOR('',#1523,1000.);
#753=VECTOR('',#1524,1000.);
#754=VECTOR('',#1527,1000.);
#755=VECTOR('',#1528,1000.);
#756=VECTOR('',#1529,1000.);
#757=VECTOR('',#1532,1000.);
#758=VECTOR('',#1533,1000.);
#759=VECTOR('',#1534,1000.);
#760=VECTOR('',#1535,1000.);
#761=VECTOR('',#1536,1000.);
#762=VECTOR('',#1537,1000.);
#763=VECTOR('',#1538,1000.);
#764=VECTOR('',#1539,1000.);
#765=VECTOR('',#1540,1000.);
#766=VECTOR('',#1543,1000.);
#767=VECTOR('',#1544,1000.);
#768=VECTOR('',#1545,1000.);
#769=VECTOR('',#1548,1000.);
#770=VECTOR('',#1549,1000.);
#771=VECTOR('',#1550,1000.);
#772=VECTOR('',#1553,1000.);
#773=VECTOR('',#1554,1000.);
#774=VECTOR('',#1555,1000.);
#775=VECTOR('',#1556,1000.);
#776=VECTOR('',#1557,1000.);
#777=VECTOR('',#1558,1000.);
#778=VECTOR('',#1559,1000.);
#779=VECTOR('',#1560,1000.);
#780=VECTOR('',#1561,1000.);
#781=VECTOR('',#1564,1000.);
#782=VECTOR('',#1565,1000.);
#783=VECTOR('',#1566,1000.);
#784=VECTOR('',#1567,1000.);
#785=VECTOR('',#1568,1000.);
#786=VECTOR('',#1569,1000.);
#787=VECTOR('',#1570,1000.);
#788=VECTOR('',#1571,1000.);
#789=VECTOR('',#1572,1000.);
#790=VECTOR('',#1573,1000.);
#791=VECTOR('',#1574,1000.);
#792=VECTOR('',#1575,1000.);
#793=VECTOR('',#1576,1000.);
#794=VECTOR('',#1579,1000.);
#795=VECTOR('',#1580,1000.);
#796=VECTOR('',#1581,1000.);
#797=VECTOR('',#1582,1000.);
#798=VECTOR('',#1583,1000.);
#799=VECTOR('',#1584,1000.);
#800=VECTOR('',#1587,1000.);
#801=VECTOR('',#1588,1000.);
#802=VECTOR('',#1589,1000.);
#803=VECTOR('',#1590,1000.);
#804=VECTOR('',#1593,1000.);
#805=VECTOR('',#1594,1000.);
#806=VECTOR('',#1595,1000.);
#807=VECTOR('',#1598,1000.);
#808=VECTOR('',#1599,1000.);
#809=VECTOR('',#1600,1000.);
#810=VECTOR('',#1603,1000.);
#811=VECTOR('',#1604,1000.);
#812=VECTOR('',#1605,1000.);
#813=VECTOR('',#1608,1000.);
#814=VECTOR('',#1609,1000.);
#815=VECTOR('',#1610,1000.);
#816=VECTOR('',#1613,1000.);
#817=VECTOR('',#1614,1000.);
#818=VECTOR('',#1617,1000.);
#819=VECTOR('',#1618,1000.);
#820=VECTOR('',#1619,1000.);
#821=VECTOR('',#1622,1000.);
#822=VECTOR('',#1623,1000.);
#823=VECTOR('',#1624,1000.);
#824=VECTOR('',#1627,1000.);
#825=VECTOR('',#1628,1000.);
#826=VECTOR('',#1629,1000.);
#827=VECTOR('',#1632,1000.);
#828=VECTOR('',#1633,1000.);
#829=VECTOR('',#1634,1000.);
#830=VECTOR('',#1637,1000.);
#831=VECTOR('',#1638,1000.);
#832=VECTOR('',#1639,1000.);
#833=VECTOR('',#1642,1000.);
#834=VECTOR('',#1643,1000.);
#835=VECTOR('',#1644,1000.);
#836=VECTOR('',#1645,1000.);
#837=VECTOR('',#1646,1000.);
#838=VECTOR('',#1649,1000.);
#839=VECTOR('',#1658,1000.);
#840=VECTOR('',#1661,1000.);
#841=VECTOR('',#1670,1000.);
#842=VECTOR('',#1675,1000.);
#843=VECTOR('',#1678,1000.);
#844=VECTOR('',#1683,1000.);
#845=VECTOR('',#1688,1000.);
#846=VECTOR('',#1689,1000.);
#847=VECTOR('',#1690,1000.);
#848=VECTOR('',#1693,1000.);
#849=VECTOR('',#1694,1000.);
#850=VECTOR('',#1697,1000.);
#851=VECTOR('',#1698,1000.);
#852=VECTOR('',#1701,1000.);
#853=VECTOR('',#1702,1000.);
#854=VECTOR('',#1705,1000.);
#855=VECTOR('',#1706,1000.);
#856=VECTOR('',#1709,1000.);
#857=VECTOR('',#1710,1000.);
#858=VECTOR('',#1713,1000.);
#859=VECTOR('',#1714,1000.);
#860=VECTOR('',#1717,1000.);
#861=EDGE_LOOP('',(#39,#40,#41,#42));
#862=EDGE_LOOP('',(#43,#44,#45,#46));
#863=EDGE_LOOP('',(#47,#48,#49,#50));
#864=EDGE_LOOP('',(#51,#52,#53,#54));
#865=EDGE_LOOP('',(#55,#56,#57,#58,#59,#60,#61,#62,#63,#64));
#866=EDGE_LOOP('',(#65,#66,#67,#68,#69,#70,#71,#72,#73,#74));
#867=EDGE_LOOP('',(#75,#76,#77,#78,#79,#80,#81,#82,#83,#84));
#868=EDGE_LOOP('',(#85,#86,#87,#88,#89,#90,#91,#92,#93,#94,#95,#96,#97,
#98,#99,#100,#101,#102));
#869=EDGE_LOOP('',(#103,#104,#105,#106,#107,#108,#109,#110,#111,#112));
#870=EDGE_LOOP('',(#113,#114,#115,#116,#117,#118,#119,#120,#121,#122,#123,
#124,#125,#126,#127,#128,#129,#130));
#871=EDGE_LOOP('',(#131,#132,#133,#134,#135));
#872=EDGE_LOOP('',(#136,#137,#138,#139,#140,#141,#142,#143));
#873=EDGE_LOOP('',(#144,#145,#146,#147,#148,#149,#150,#151));
#874=EDGE_LOOP('',(#152,#153,#154,#155,#156,#157));
#875=EDGE_LOOP('',(#158,#159,#160,#161));
#876=EDGE_LOOP('',(#162,#163,#164,#165));
#877=EDGE_LOOP('',(#166,#167,#168,#169));
#878=EDGE_LOOP('',(#170,#171,#172,#173));
#879=EDGE_LOOP('',(#174,#175,#176,#177,#178,#179,#180,#181,#182,#183,#184,
#185,#186,#187,#188,#189,#190,#191,#192,#193,#194,#195,#196,#197));
#880=EDGE_LOOP('',(#198,#199,#200,#201));
#881=EDGE_LOOP('',(#202,#203,#204,#205));
#882=EDGE_LOOP('',(#206,#207,#208,#209));
#883=EDGE_LOOP('',(#210,#211,#212,#213));
#884=EDGE_LOOP('',(#214,#215,#216,#217,#218,#219,#220,#221,#222,#223));
#885=EDGE_LOOP('',(#224,#225,#226,#227,#228,#229,#230,#231,#232,#233,#234,
#235));
#886=EDGE_LOOP('',(#236,#237,#238,#239));
#887=EDGE_LOOP('',(#240,#241,#242,#243));
#888=EDGE_LOOP('',(#244,#245,#246,#247));
#889=EDGE_LOOP('',(#248,#249,#250,#251));
#890=EDGE_LOOP('',(#252,#253,#254,#255));
#891=EDGE_LOOP('',(#256,#257,#258,#259));
#892=EDGE_LOOP('',(#260,#261,#262,#263));
#893=EDGE_LOOP('',(#264,#265,#266,#267));
#894=EDGE_LOOP('',(#268,#269,#270,#271));
#895=EDGE_LOOP('',(#272,#273,#274,#275));
#896=EDGE_LOOP('',(#276,#277,#278,#279));
#897=EDGE_LOOP('',(#280,#281,#282,#283));
#898=EDGE_LOOP('',(#284,#285,#286,#287));
#899=EDGE_LOOP('',(#288,#289,#290,#291));
#900=EDGE_LOOP('',(#292,#293,#294,#295));
#901=EDGE_LOOP('',(#296,#297,#298));
#902=EDGE_LOOP('',(#299,#300,#301,#302));
#903=EDGE_LOOP('',(#303,#304,#305,#306));
#904=EDGE_LOOP('',(#307,#308,#309,#310));
#905=EDGE_LOOP('',(#311,#312,#313,#314));
#906=EDGE_LOOP('',(#315,#316,#317,#318));
#907=EDGE_LOOP('',(#319,#320,#321,#322));
#908=EDGE_LOOP('',(#323,#324,#325,#326));
#909=EDGE_LOOP('',(#327,#328,#329,#330));
#910=EDGE_LOOP('',(#331,#332,#333,#334,#335,#336,#337,#338));
#911=FACE_BOUND('',#861,.T.);
#912=FACE_BOUND('',#862,.T.);
#913=FACE_BOUND('',#863,.T.);
#914=FACE_BOUND('',#864,.T.);
#915=FACE_BOUND('',#865,.T.);
#916=FACE_BOUND('',#866,.T.);
#917=FACE_BOUND('',#867,.T.);
#918=FACE_BOUND('',#868,.T.);
#919=FACE_BOUND('',#869,.T.);
#920=FACE_BOUND('',#870,.T.);
#921=FACE_BOUND('',#871,.T.);
#922=FACE_BOUND('',#872,.T.);
#923=FACE_BOUND('',#873,.T.);
#924=FACE_BOUND('',#874,.T.);
#925=FACE_BOUND('',#875,.T.);
#926=FACE_BOUND('',#876,.T.);
#927=FACE_BOUND('',#877,.T.);
#928=FACE_BOUND('',#878,.T.);
#929=FACE_BOUND('',#879,.T.);
#930=FACE_BOUND('',#880,.T.);
#931=FACE_BOUND('',#881,.T.);
#932=FACE_BOUND('',#882,.T.);
#933=FACE_BOUND('',#883,.T.);
#934=FACE_BOUND('',#884,.T.);
#935=FACE_BOUND('',#885,.T.);
#936=FACE_BOUND('',#886,.T.);
#937=FACE_BOUND('',#887,.T.);
#938=FACE_BOUND('',#888,.T.);
#939=FACE_BOUND('',#889,.T.);
#940=FACE_BOUND('',#890,.T.);
#941=FACE_BOUND('',#891,.T.);
#942=FACE_BOUND('',#892,.T.);
#943=FACE_BOUND('',#893,.T.);
#944=FACE_BOUND('',#894,.T.);
#945=FACE_BOUND('',#895,.T.);
#946=FACE_BOUND('',#896,.T.);
#947=FACE_BOUND('',#897,.T.);
#948=FACE_BOUND('',#898,.T.);
#949=FACE_BOUND('',#899,.T.);
#950=FACE_BOUND('',#900,.T.);
#951=FACE_BOUND('',#901,.T.);
#952=FACE_BOUND('',#902,.T.);
#953=FACE_BOUND('',#903,.T.);
#954=FACE_BOUND('',#904,.T.);
#955=FACE_BOUND('',#905,.T.);
#956=FACE_BOUND('',#906,.T.);
#957=FACE_BOUND('',#907,.T.);
#958=FACE_BOUND('',#908,.T.);
#959=FACE_BOUND('',#909,.T.);
#960=FACE_BOUND('',#910,.T.);
#961=PLANE('',#1391);
#962=PLANE('',#1392);
#963=PLANE('',#1393);
#964=PLANE('',#1394);
#965=PLANE('',#1395);
#966=PLANE('',#1403);
#967=PLANE('',#1411);
#968=PLANE('',#1414);
#969=PLANE('',#1417);
#970=PLANE('',#1418);
#971=PLANE('',#1419);
#972=PLANE('',#1420);
#973=PLANE('',#1421);
#974=PLANE('',#1422);
#975=PLANE('',#1423);
#976=PLANE('',#1424);
#977=PLANE('',#1425);
#978=PLANE('',#1426);
#979=PLANE('',#1427);
#980=PLANE('',#1428);
#981=PLANE('',#1429);
#982=PLANE('',#1430);
#983=PLANE('',#1431);
#984=PLANE('',#1432);
#985=PLANE('',#1433);
#986=PLANE('',#1434);
#987=PLANE('',#1435);
#988=PLANE('',#1436);
#989=PLANE('',#1437);
#990=PLANE('',#1438);
#991=PLANE('',#1439);
#992=PLANE('',#1440);
#993=PLANE('',#1441);
#994=PLANE('',#1442);
#995=PLANE('',#1443);
#996=PLANE('',#1444);
#997=PLANE('',#1445);
#998=PLANE('',#1446);
#999=PLANE('',#1447);
#1000=PLANE('',#1448);
#1001=PLANE('',#1449);
#1002=PLANE('',#1450);
#1003=PLANE('',#1451);
#1004=PLANE('',#1452);
#1005=PLANE('',#1453);
#1006=PLANE('',#1454);
#1007=PLANE('',#1455);
#1008=STYLED_ITEM('',(#1055),#1339);
#1009=STYLED_ITEM('',(#1056),#1340);
#1010=STYLED_ITEM('',(#1057),#1341);
#1011=STYLED_ITEM('',(#1058),#1342);
#1012=STYLED_ITEM('',(#1059),#1343);
#1013=STYLED_ITEM('',(#1060),#1344);
#1014=STYLED_ITEM('',(#1061),#1345);
#1015=STYLED_ITEM('',(#1062),#1346);
#1016=STYLED_ITEM('',(#1063),#1347);
#1017=STYLED_ITEM('',(#1064),#1348);
#1018=STYLED_ITEM('',(#1065),#1349);
#1019=STYLED_ITEM('',(#1066),#1350);
#1020=STYLED_ITEM('',(#1067),#1351);
#1021=STYLED_ITEM('',(#1068),#1352);
#1022=STYLED_ITEM('',(#1069),#1353);
#1023=STYLED_ITEM('',(#1070),#1354);
#1024=STYLED_ITEM('',(#1071),#1355);
#1025=STYLED_ITEM('',(#1072),#1356);
#1026=STYLED_ITEM('',(#1073),#1357);
#1027=STYLED_ITEM('',(#1074),#1358);
#1028=STYLED_ITEM('',(#1075),#1359);
#1029=STYLED_ITEM('',(#1076),#1360);
#1030=STYLED_ITEM('',(#1077),#1361);
#1031=STYLED_ITEM('',(#1078),#1362);
#1032=STYLED_ITEM('',(#1079),#1363);
#1033=STYLED_ITEM('',(#1080),#1364);
#1034=STYLED_ITEM('',(#1081),#1365);
#1035=STYLED_ITEM('',(#1082),#1366);
#1036=STYLED_ITEM('',(#1083),#1367);
#1037=STYLED_ITEM('',(#1084),#1368);
#1038=STYLED_ITEM('',(#1085),#1369);
#1039=STYLED_ITEM('',(#1086),#1370);
#1040=STYLED_ITEM('',(#1087),#1371);
#1041=STYLED_ITEM('',(#1088),#1372);
#1042=STYLED_ITEM('',(#1089),#1373);
#1043=STYLED_ITEM('',(#1090),#1374);
#1044=STYLED_ITEM('',(#1091),#1375);
#1045=STYLED_ITEM('',(#1092),#1376);
#1046=STYLED_ITEM('',(#1093),#1377);
#1047=STYLED_ITEM('',(#1094),#1378);
#1048=STYLED_ITEM('',(#1095),#1379);
#1049=STYLED_ITEM('',(#1096),#1380);
#1050=STYLED_ITEM('',(#1097),#1381);
#1051=STYLED_ITEM('',(#1098),#1382);
#1052=STYLED_ITEM('',(#1099),#1383);
#1053=STYLED_ITEM('',(#1100),#1384);
#1054=STYLED_ITEM('',(#1101),#1385);
#1055=PRESENTATION_STYLE_ASSIGNMENT((#1102));
#1056=PRESENTATION_STYLE_ASSIGNMENT((#1103));
#1057=PRESENTATION_STYLE_ASSIGNMENT((#1104));
#1058=PRESENTATION_STYLE_ASSIGNMENT((#1105));
#1059=PRESENTATION_STYLE_ASSIGNMENT((#1106));
#1060=PRESENTATION_STYLE_ASSIGNMENT((#1107));
#1061=PRESENTATION_STYLE_ASSIGNMENT((#1108));
#1062=PRESENTATION_STYLE_ASSIGNMENT((#1109));
#1063=PRESENTATION_STYLE_ASSIGNMENT((#1110));
#1064=PRESENTATION_STYLE_ASSIGNMENT((#1111));
#1065=PRESENTATION_STYLE_ASSIGNMENT((#1112));
#1066=PRESENTATION_STYLE_ASSIGNMENT((#1113));
#1067=PRESENTATION_STYLE_ASSIGNMENT((#1114));
#1068=PRESENTATION_STYLE_ASSIGNMENT((#1115));
#1069=PRESENTATION_STYLE_ASSIGNMENT((#1116));
#1070=PRESENTATION_STYLE_ASSIGNMENT((#1117));
#1071=PRESENTATION_STYLE_ASSIGNMENT((#1118));
#1072=PRESENTATION_STYLE_ASSIGNMENT((#1119));
#1073=PRESENTATION_STYLE_ASSIGNMENT((#1120));
#1074=PRESENTATION_STYLE_ASSIGNMENT((#1121));
#1075=PRESENTATION_STYLE_ASSIGNMENT((#1122));
#1076=PRESENTATION_STYLE_ASSIGNMENT((#1123));
#1077=PRESENTATION_STYLE_ASSIGNMENT((#1124));
#1078=PRESENTATION_STYLE_ASSIGNMENT((#1125));
#1079=PRESENTATION_STYLE_ASSIGNMENT((#1126));
#1080=PRESENTATION_STYLE_ASSIGNMENT((#1127));
#1081=PRESENTATION_STYLE_ASSIGNMENT((#1128));
#1082=PRESENTATION_STYLE_ASSIGNMENT((#1129));
#1083=PRESENTATION_STYLE_ASSIGNMENT((#1130));
#1084=PRESENTATION_STYLE_ASSIGNMENT((#1131));
#1085=PRESENTATION_STYLE_ASSIGNMENT((#1132));
#1086=PRESENTATION_STYLE_ASSIGNMENT((#1133));
#1087=PRESENTATION_STYLE_ASSIGNMENT((#1134));
#1088=PRESENTATION_STYLE_ASSIGNMENT((#1135));
#1089=PRESENTATION_STYLE_ASSIGNMENT((#1136));
#1090=PRESENTATION_STYLE_ASSIGNMENT((#1137));
#1091=PRESENTATION_STYLE_ASSIGNMENT((#1138));
#1092=PRESENTATION_STYLE_ASSIGNMENT((#1139));
#1093=PRESENTATION_STYLE_ASSIGNMENT((#1140));
#1094=PRESENTATION_STYLE_ASSIGNMENT((#1141));
#1095=PRESENTATION_STYLE_ASSIGNMENT((#1142));
#1096=PRESENTATION_STYLE_ASSIGNMENT((#1143));
#1097=PRESENTATION_STYLE_ASSIGNMENT((#1144));
#1098=PRESENTATION_STYLE_ASSIGNMENT((#1145));
#1099=PRESENTATION_STYLE_ASSIGNMENT((#1146));
#1100=PRESENTATION_STYLE_ASSIGNMENT((#1147));
#1101=PRESENTATION_STYLE_ASSIGNMENT((#1148));
#1102=SURFACE_STYLE_USAGE(.BOTH.,#1149);
#1103=SURFACE_STYLE_USAGE(.BOTH.,#1150);
#1104=SURFACE_STYLE_USAGE(.BOTH.,#1151);
#1105=SURFACE_STYLE_USAGE(.BOTH.,#1152);
#1106=SURFACE_STYLE_USAGE(.BOTH.,#1153);
#1107=SURFACE_STYLE_USAGE(.BOTH.,#1154);
#1108=SURFACE_STYLE_USAGE(.BOTH.,#1155);
#1109=SURFACE_STYLE_USAGE(.BOTH.,#1156);
#1110=SURFACE_STYLE_USAGE(.BOTH.,#1157);
#1111=SURFACE_STYLE_USAGE(.BOTH.,#1158);
#1112=SURFACE_STYLE_USAGE(.BOTH.,#1159);
#1113=SURFACE_STYLE_USAGE(.BOTH.,#1160);
#1114=SURFACE_STYLE_USAGE(.BOTH.,#1161);
#1115=SURFACE_STYLE_USAGE(.BOTH.,#1162);
#1116=SURFACE_STYLE_USAGE(.BOTH.,#1163);
#1117=SURFACE_STYLE_USAGE(.BOTH.,#1164);
#1118=SURFACE_STYLE_USAGE(.BOTH.,#1165);
#1119=SURFACE_STYLE_USAGE(.BOTH.,#1166);
#1120=SURFACE_STYLE_USAGE(.BOTH.,#1167);
#1121=SURFACE_STYLE_USAGE(.BOTH.,#1168);
#1122=SURFACE_STYLE_USAGE(.BOTH.,#1169);
#1123=SURFACE_STYLE_USAGE(.BOTH.,#1170);
#1124=SURFACE_STYLE_USAGE(.BOTH.,#1171);
#1125=SURFACE_STYLE_USAGE(.BOTH.,#1172);
#1126=SURFACE_STYLE_USAGE(.BOTH.,#1173);
#1127=SURFACE_STYLE_USAGE(.BOTH.,#1174);
#1128=SURFACE_STYLE_USAGE(.BOTH.,#1175);
#1129=SURFACE_STYLE_USAGE(.BOTH.,#1176);
#1130=SURFACE_STYLE_USAGE(.BOTH.,#1177);
#1131=SURFACE_STYLE_USAGE(.BOTH.,#1178);
#1132=SURFACE_STYLE_USAGE(.BOTH.,#1179);
#1133=SURFACE_STYLE_USAGE(.BOTH.,#1180);
#1134=SURFACE_STYLE_USAGE(.BOTH.,#1181);
#1135=SURFACE_STYLE_USAGE(.BOTH.,#1182);
#1136=SURFACE_STYLE_USAGE(.BOTH.,#1183);
#1137=SURFACE_STYLE_USAGE(.BOTH.,#1184);
#1138=SURFACE_STYLE_USAGE(.BOTH.,#1185);
#1139=SURFACE_STYLE_USAGE(.BOTH.,#1186);
#1140=SURFACE_STYLE_USAGE(.BOTH.,#1187);
#1141=SURFACE_STYLE_USAGE(.BOTH.,#1188);
#1142=SURFACE_STYLE_USAGE(.BOTH.,#1189);
#1143=SURFACE_STYLE_USAGE(.BOTH.,#1190);
#1144=SURFACE_STYLE_USAGE(.BOTH.,#1191);
#1145=SURFACE_STYLE_USAGE(.BOTH.,#1192);
#1146=SURFACE_STYLE_USAGE(.BOTH.,#1193);
#1147=SURFACE_STYLE_USAGE(.BOTH.,#1194);
#1148=SURFACE_STYLE_USAGE(.BOTH.,#1195);
#1149=SURFACE_SIDE_STYLE('',(#1196));
#1150=SURFACE_SIDE_STYLE('',(#1197));
#1151=SURFACE_SIDE_STYLE('',(#1198));
#1152=SURFACE_SIDE_STYLE('',(#1199));
#1153=SURFACE_SIDE_STYLE('',(#1200));
#1154=SURFACE_SIDE_STYLE('',(#1201));
#1155=SURFACE_SIDE_STYLE('',(#1202));
#1156=SURFACE_SIDE_STYLE('',(#1203));
#1157=SURFACE_SIDE_STYLE('',(#1204));
#1158=SURFACE_SIDE_STYLE('',(#1205));
#1159=SURFACE_SIDE_STYLE('',(#1206));
#1160=SURFACE_SIDE_STYLE('',(#1207));
#1161=SURFACE_SIDE_STYLE('',(#1208));
#1162=SURFACE_SIDE_STYLE('',(#1209));
#1163=SURFACE_SIDE_STYLE('',(#1210));
#1164=SURFACE_SIDE_STYLE('',(#1211));
#1165=SURFACE_SIDE_STYLE('',(#1212));
#1166=SURFACE_SIDE_STYLE('',(#1213));
#1167=SURFACE_SIDE_STYLE('',(#1214));
#1168=SURFACE_SIDE_STYLE('',(#1215));
#1169=SURFACE_SIDE_STYLE('',(#1216));
#1170=SURFACE_SIDE_STYLE('',(#1217));
#1171=SURFACE_SIDE_STYLE('',(#1218));
#1172=SURFACE_SIDE_STYLE('',(#1219));
#1173=SURFACE_SIDE_STYLE('',(#1220));
#1174=SURFACE_SIDE_STYLE('',(#1221));
#1175=SURFACE_SIDE_STYLE('',(#1222));
#1176=SURFACE_SIDE_STYLE('',(#1223));
#1177=SURFACE_SIDE_STYLE('',(#1224));
#1178=SURFACE_SIDE_STYLE('',(#1225));
#1179=SURFACE_SIDE_STYLE('',(#1226));
#1180=SURFACE_SIDE_STYLE('',(#1227));
#1181=SURFACE_SIDE_STYLE('',(#1228));
#1182=SURFACE_SIDE_STYLE('',(#1229));
#1183=SURFACE_SIDE_STYLE('',(#1230));
#1184=SURFACE_SIDE_STYLE('',(#1231));
#1185=SURFACE_SIDE_STYLE('',(#1232));
#1186=SURFACE_SIDE_STYLE('',(#1233));
#1187=SURFACE_SIDE_STYLE('',(#1234));
#1188=SURFACE_SIDE_STYLE('',(#1235));
#1189=SURFACE_SIDE_STYLE('',(#1236));
#1190=SURFACE_SIDE_STYLE('',(#1237));
#1191=SURFACE_SIDE_STYLE('',(#1238));
#1192=SURFACE_SIDE_STYLE('',(#1239));
#1193=SURFACE_SIDE_STYLE('',(#1240));
#1194=SURFACE_SIDE_STYLE('',(#1241));
#1195=SURFACE_SIDE_STYLE('',(#1242));
#1196=SURFACE_STYLE_FILL_AREA(#1243);
#1197=SURFACE_STYLE_FILL_AREA(#1244);
#1198=SURFACE_STYLE_FILL_AREA(#1245);
#1199=SURFACE_STYLE_FILL_AREA(#1246);
#1200=SURFACE_STYLE_FILL_AREA(#1247);
#1201=SURFACE_STYLE_FILL_AREA(#1248);
#1202=SURFACE_STYLE_FILL_AREA(#1249);
#1203=SURFACE_STYLE_FILL_AREA(#1250);
#1204=SURFACE_STYLE_FILL_AREA(#1251);
#1205=SURFACE_STYLE_FILL_AREA(#1252);
#1206=SURFACE_STYLE_FILL_AREA(#1253);
#1207=SURFACE_STYLE_FILL_AREA(#1254);
#1208=SURFACE_STYLE_FILL_AREA(#1255);
#1209=SURFACE_STYLE_FILL_AREA(#1256);
#1210=SURFACE_STYLE_FILL_AREA(#1257);
#1211=SURFACE_STYLE_FILL_AREA(#1258);
#1212=SURFACE_STYLE_FILL_AREA(#1259);
#1213=SURFACE_STYLE_FILL_AREA(#1260);
#1214=SURFACE_STYLE_FILL_AREA(#1261);
#1215=SURFACE_STYLE_FILL_AREA(#1262);
#1216=SURFACE_STYLE_FILL_AREA(#1263);
#1217=SURFACE_STYLE_FILL_AREA(#1264);
#1218=SURFACE_STYLE_FILL_AREA(#1265);
#1219=SURFACE_STYLE_FILL_AREA(#1266);
#1220=SURFACE_STYLE_FILL_AREA(#1267);
#1221=SURFACE_STYLE_FILL_AREA(#1268);
#1222=SURFACE_STYLE_FILL_AREA(#1269);
#1223=SURFACE_STYLE_FILL_AREA(#1270);
#1224=SURFACE_STYLE_FILL_AREA(#1271);
#1225=SURFACE_STYLE_FILL_AREA(#1272);
#1226=SURFACE_STYLE_FILL_AREA(#1273);
#1227=SURFACE_STYLE_FILL_AREA(#1274);
#1228=SURFACE_STYLE_FILL_AREA(#1275);
#1229=SURFACE_STYLE_FILL_AREA(#1276);
#1230=SURFACE_STYLE_FILL_AREA(#1277);
#1231=SURFACE_STYLE_FILL_AREA(#1278);
#1232=SURFACE_STYLE_FILL_AREA(#1279);
#1233=SURFACE_STYLE_FILL_AREA(#1280);
#1234=SURFACE_STYLE_FILL_AREA(#1281);
#1235=SURFACE_STYLE_FILL_AREA(#1282);
#1236=SURFACE_STYLE_FILL_AREA(#1283);
#1237=SURFACE_STYLE_FILL_AREA(#1284);
#1238=SURFACE_STYLE_FILL_AREA(#1285);
#1239=SURFACE_STYLE_FILL_AREA(#1286);
#1240=SURFACE_STYLE_FILL_AREA(#1287);
#1241=SURFACE_STYLE_FILL_AREA(#1288);
#1242=SURFACE_STYLE_FILL_AREA(#1289);
#1243=FILL_AREA_STYLE('',(#1290));
#1244=FILL_AREA_STYLE('',(#1291));
#1245=FILL_AREA_STYLE('',(#1292));
#1246=FILL_AREA_STYLE('',(#1293));
#1247=FILL_AREA_STYLE('',(#1294));
#1248=FILL_AREA_STYLE('',(#1295));
#1249=FILL_AREA_STYLE('',(#1296));
#1250=FILL_AREA_STYLE('',(#1297));
#1251=FILL_AREA_STYLE('',(#1298));
#1252=FILL_AREA_STYLE('',(#1299));
#1253=FILL_AREA_STYLE('',(#1300));
#1254=FILL_AREA_STYLE('',(#1301));
#1255=FILL_AREA_STYLE('',(#1302));
#1256=FILL_AREA_STYLE('',(#1303));
#1257=FILL_AREA_STYLE('',(#1304));
#1258=FILL_AREA_STYLE('',(#1305));
#1259=FILL_AREA_STYLE('',(#1306));
#1260=FILL_AREA_STYLE('',(#1307));
#1261=FILL_AREA_STYLE('',(#1308));
#1262=FILL_AREA_STYLE('',(#1309));
#1263=FILL_AREA_STYLE('',(#1310));
#1264=FILL_AREA_STYLE('',(#1311));
#1265=FILL_AREA_STYLE('',(#1312));
#1266=FILL_AREA_STYLE('',(#1313));
#1267=FILL_AREA_STYLE('',(#1314));
#1268=FILL_AREA_STYLE('',(#1315));
#1269=FILL_AREA_STYLE('',(#1316));
#1270=FILL_AREA_STYLE('',(#1317));
#1271=FILL_AREA_STYLE('',(#1318));
#1272=FILL_AREA_STYLE('',(#1319));
#1273=FILL_AREA_STYLE('',(#1320));
#1274=FILL_AREA_STYLE('',(#1321));
#1275=FILL_AREA_STYLE('',(#1322));
#1276=FILL_AREA_STYLE('',(#1323));
#1277=FILL_AREA_STYLE('',(#1324));
#1278=FILL_AREA_STYLE('',(#1325));
#1279=FILL_AREA_STYLE('',(#1326));
#1280=FILL_AREA_STYLE('',(#1327));
#1281=FILL_AREA_STYLE('',(#1328));
#1282=FILL_AREA_STYLE('',(#1329));
#1283=FILL_AREA_STYLE('',(#1330));
#1284=FILL_AREA_STYLE('',(#1331));
#1285=FILL_AREA_STYLE('',(#1332));
#1286=FILL_AREA_STYLE('',(#1333));
#1287=FILL_AREA_STYLE('',(#1334));
#1288=FILL_AREA_STYLE('',(#1335));
#1289=FILL_AREA_STYLE('',(#1336));
#1290=FILL_AREA_STYLE_COLOUR('',#1337);
#1291=FILL_AREA_STYLE_COLOUR('',#38);
#1292=FILL_AREA_STYLE_COLOUR('',#38);
#1293=FILL_AREA_STYLE_COLOUR('',#1337);
#1294=FILL_AREA_STYLE_COLOUR('',#38);
#1295=FILL_AREA_STYLE_COLOUR('',#38);
#1296=FILL_AREA_STYLE_COLOUR('',#1337);
#1297=FILL_AREA_STYLE_COLOUR('',#1337);
#1298=FILL_AREA_STYLE_COLOUR('',#38);
#1299=FILL_AREA_STYLE_COLOUR('',#38);
#1300=FILL_AREA_STYLE_COLOUR('',#38);
#1301=FILL_AREA_STYLE_COLOUR('',#1337);
#1302=FILL_AREA_STYLE_COLOUR('',#1337);
#1303=FILL_AREA_STYLE_COLOUR('',#1337);
#1304=FILL_AREA_STYLE_COLOUR('',#1337);
#1305=FILL_AREA_STYLE_COLOUR('',#38);
#1306=FILL_AREA_STYLE_COLOUR('',#1337);
#1307=FILL_AREA_STYLE_COLOUR('',#1337);
#1308=FILL_AREA_STYLE_COLOUR('',#1337);
#1309=FILL_AREA_STYLE_COLOUR('',#1337);
#1310=FILL_AREA_STYLE_COLOUR('',#38);
#1311=FILL_AREA_STYLE_COLOUR('',#38);
#1312=FILL_AREA_STYLE_COLOUR('',#1337);
#1313=FILL_AREA_STYLE_COLOUR('',#1337);
#1314=FILL_AREA_STYLE_COLOUR('',#1337);
#1315=FILL_AREA_STYLE_COLOUR('',#38);
#1316=FILL_AREA_STYLE_COLOUR('',#1337);
#1317=FILL_AREA_STYLE_COLOUR('',#1337);
#1318=FILL_AREA_STYLE_COLOUR('',#1337);
#1319=FILL_AREA_STYLE_COLOUR('',#1337);
#1320=FILL_AREA_STYLE_COLOUR('',#38);
#1321=FILL_AREA_STYLE_COLOUR('',#1337);
#1322=FILL_AREA_STYLE_COLOUR('',#1337);
#1323=FILL_AREA_STYLE_COLOUR('',#1337);
#1324=FILL_AREA_STYLE_COLOUR('',#1337);
#1325=FILL_AREA_STYLE_COLOUR('',#1337);
#1326=FILL_AREA_STYLE_COLOUR('',#38);
#1327=FILL_AREA_STYLE_COLOUR('',#38);
#1328=FILL_AREA_STYLE_COLOUR('',#1338);
#1329=FILL_AREA_STYLE_COLOUR('',#1338);
#1330=FILL_AREA_STYLE_COLOUR('',#1338);
#1331=FILL_AREA_STYLE_COLOUR('',#1338);
#1332=FILL_AREA_STYLE_COLOUR('',#1338);
#1333=FILL_AREA_STYLE_COLOUR('',#1338);
#1334=FILL_AREA_STYLE_COLOUR('',#1338);
#1335=FILL_AREA_STYLE_COLOUR('',#1338);
#1336=FILL_AREA_STYLE_COLOUR('',#1338);
#1337=COLOUR_RGB('',0.699999988079071,0.699999988079071,0.699999988079071);
#1338=COLOUR_RGB('',0.800000011920929,0.760330617427826,0.);
#1339=ADVANCED_FACE('',(#911),#961,.T.);
#1340=ADVANCED_FACE('',(#912),#962,.T.);
#1341=ADVANCED_FACE('',(#913),#963,.T.);
#1342=ADVANCED_FACE('',(#914),#964,.F.);
#1343=ADVANCED_FACE('',(#915),#965,.F.);
#1344=ADVANCED_FACE('',(#916),#966,.F.);
#1345=ADVANCED_FACE('',(#917,#918),#967,.F.);
#1346=ADVANCED_FACE('',(#919,#920),#968,.F.);
#1347=ADVANCED_FACE('',(#921,#922),#969,.T.);
#1348=ADVANCED_FACE('',(#923),#970,.F.);
#1349=ADVANCED_FACE('',(#924),#971,.F.);
#1350=ADVANCED_FACE('',(#925),#972,.F.);
#1351=ADVANCED_FACE('',(#926),#973,.F.);
#1352=ADVANCED_FACE('',(#927),#974,.F.);
#1353=ADVANCED_FACE('',(#928),#975,.F.);
#1354=ADVANCED_FACE('',(#929),#976,.F.);
#1355=ADVANCED_FACE('',(#930),#977,.T.);
#1356=ADVANCED_FACE('',(#931),#978,.T.);
#1357=ADVANCED_FACE('',(#932),#979,.F.);
#1358=ADVANCED_FACE('',(#933),#980,.F.);
#1359=ADVANCED_FACE('',(#934),#981,.T.);
#1360=ADVANCED_FACE('',(#935),#982,.F.);
#1361=ADVANCED_FACE('',(#936),#983,.T.);
#1362=ADVANCED_FACE('',(#937),#984,.T.);
#1363=ADVANCED_FACE('',(#938),#985,.F.);
#1364=ADVANCED_FACE('',(#939),#986,.F.);
#1365=ADVANCED_FACE('',(#940),#987,.F.);
#1366=ADVANCED_FACE('',(#941),#988,.F.);
#1367=ADVANCED_FACE('',(#942),#989,.F.);
#1368=ADVANCED_FACE('',(#943),#990,.T.);
#1369=ADVANCED_FACE('',(#944),#991,.T.);
#1370=ADVANCED_FACE('',(#945),#992,.T.);
#1371=ADVANCED_FACE('',(#946),#993,.T.);
#1372=ADVANCED_FACE('',(#947),#994,.F.);
#1373=ADVANCED_FACE('',(#948),#995,.F.);
#1374=ADVANCED_FACE('',(#949),#996,.F.);
#1375=ADVANCED_FACE('',(#950),#997,.F.);
#1376=ADVANCED_FACE('',(#951),#998,.F.);
#1377=ADVANCED_FACE('',(#952),#999,.F.);
#1378=ADVANCED_FACE('',(#953),#1000,.F.);
#1379=ADVANCED_FACE('',(#954),#1001,.F.);
#1380=ADVANCED_FACE('',(#955),#1002,.F.);
#1381=ADVANCED_FACE('',(#956),#1003,.F.);
#1382=ADVANCED_FACE('',(#957),#1004,.F.);
#1383=ADVANCED_FACE('',(#958),#1005,.F.);
#1384=ADVANCED_FACE('',(#959),#1006,.F.);
#1385=ADVANCED_FACE('',(#960),#1007,.T.);
#1386=CLOSED_SHELL('',(#1339,#1340,#1341,#1342,#1343,#1344,#1345,#1346,
#1347,#1348,#1349,#1350,#1351,#1352,#1353,#1354,#1355,#1356,#1357,#1358,
#1359,#1360,#1361,#1362,#1363,#1364,#1365,#1366,#1367,#1368,#1369,#1370,
#1371,#1372,#1373,#1374,#1375,#1376,#1377,#1378,#1379,#1380,#1381,#1382,
#1383,#1384,#1385));
#1387=MANIFOLD_SOLID_BREP('',#1386);
#1388=SHAPE_DEFINITION_REPRESENTATION(#2032,#1389);
#1389=SHAPE_REPRESENTATION('JB2835AWT-W-U57EA0000-N0000001',(#1390),#2027);
#1390=AXIS2_PLACEMENT_3D('',#1720,#1456,#1457);
#1391=AXIS2_PLACEMENT_3D('',#1721,#1458,#1459);
#1392=AXIS2_PLACEMENT_3D('',#1730,#1464,#1465);
#1393=AXIS2_PLACEMENT_3D('',#1739,#1470,#1471);
#1394=AXIS2_PLACEMENT_3D('',#1748,#1476,#1477);
#1395=AXIS2_PLACEMENT_3D('',#1757,#1482,#1483);
#1396=AXIS2_PLACEMENT_3D('',#1761,#1485,#1486);
#1397=AXIS2_PLACEMENT_3D('',#1765,#1488,#1489);
#1398=AXIS2_PLACEMENT_3D('',#1767,#1490,#1491);
#1399=AXIS2_PLACEMENT_3D('',#1769,#1492,#1493);
#1400=AXIS2_PLACEMENT_3D('',#1771,#1494,#1495);
#1401=AXIS2_PLACEMENT_3D('',#1773,#1496,#1497);
#1402=AXIS2_PLACEMENT_3D('',#1777,#1499,#1500);
#1403=AXIS2_PLACEMENT_3D('',#1778,#1501,#1502);
#1404=AXIS2_PLACEMENT_3D('',#1782,#1504,#1505);
#1405=AXIS2_PLACEMENT_3D('',#1786,#1507,#1508);
#1406=AXIS2_PLACEMENT_3D('',#1788,#1509,#1510);
#1407=AXIS2_PLACEMENT_3D('',#1790,#1511,#1512);
#1408=AXIS2_PLACEMENT_3D('',#1792,#1513,#1514);
#1409=AXIS2_PLACEMENT_3D('',#1794,#1515,#1516);
#1410=AXIS2_PLACEMENT_3D('',#1798,#1518,#1519);
#1411=AXIS2_PLACEMENT_3D('',#1799,#1520,#1521);
#1412=AXIS2_PLACEMENT_3D('',#1806,#1525,#1526);
#1413=AXIS2_PLACEMENT_3D('',#1814,#1530,#1531);
#1414=AXIS2_PLACEMENT_3D('',#1832,#1541,#1542);
#1415=AXIS2_PLACEMENT_3D('',#1839,#1546,#1547);
#1416=AXIS2_PLACEMENT_3D('',#1847,#1551,#1552);
#1417=AXIS2_PLACEMENT_3D('',#1865,#1562,#1563);
#1418=AXIS2_PLACEMENT_3D('',#1892,#1577,#1578);
#1419=AXIS2_PLACEMENT_3D('',#1903,#1585,#1586);
#1420=AXIS2_PLACEMENT_3D('',#1910,#1591,#1592);
#1421=AXIS2_PLACEMENT_3D('',#1916,#1596,#1597);
#1422=AXIS2_PLACEMENT_3D('',#1922,#1601,#1602);
#1423=AXIS2_PLACEMENT_3D('',#1928,#1606,#1607);
#1424=AXIS2_PLACEMENT_3D('',#1934,#1611,#1612);
#1425=AXIS2_PLACEMENT_3D('',#1937,#1615,#1616);
#1426=AXIS2_PLACEMENT_3D('',#1943,#1620,#1621);
#1427=AXIS2_PLACEMENT_3D('',#1948,#1625,#1626);
#1428=AXIS2_PLACEMENT_3D('',#1953,#1630,#1631);
#1429=AXIS2_PLACEMENT_3D('',#1959,#1635,#1636);
#1430=AXIS2_PLACEMENT_3D('',#1963,#1640,#1641);
#1431=AXIS2_PLACEMENT_3D('',#1970,#1647,#1648);
#1432=AXIS2_PLACEMENT_3D('',#1972,#1650,#1651);
#1433=AXIS2_PLACEMENT_3D('',#1973,#1652,#1653);
#1434=AXIS2_PLACEMENT_3D('',#1974,#1654,#1655);
#1435=AXIS2_PLACEMENT_3D('',#1975,#1656,#1657);
#1436=AXIS2_PLACEMENT_3D('',#1977,#1659,#1660);
#1437=AXIS2_PLACEMENT_3D('',#1979,#1662,#1663);
#1438=AXIS2_PLACEMENT_3D('',#1980,#1664,#1665);
#1439=AXIS2_PLACEMENT_3D('',#1981,#1666,#1667);
#1440=AXIS2_PLACEMENT_3D('',#1982,#1668,#1669);
#1441=AXIS2_PLACEMENT_3D('',#1984,#1671,#1672);
#1442=AXIS2_PLACEMENT_3D('',#1985,#1673,#1674);
#1443=AXIS2_PLACEMENT_3D('',#1987,#1676,#1677);
#1444=AXIS2_PLACEMENT_3D('',#1989,#1679,#1680);
#1445=AXIS2_PLACEMENT_3D('',#1990,#1681,#1682);
#1446=AXIS2_PLACEMENT_3D('',#1992,#1684,#1685);
#1447=AXIS2_PLACEMENT_3D('',#1993,#1686,#1687);
#1448=AXIS2_PLACEMENT_3D('',#1999,#1691,#1692);
#1449=AXIS2_PLACEMENT_3D('',#2003,#1695,#1696);
#1450=AXIS2_PLACEMENT_3D('',#2007,#1699,#1700);
#1451=AXIS2_PLACEMENT_3D('',#2011,#1703,#1704);
#1452=AXIS2_PLACEMENT_3D('',#2015,#1707,#1708);
#1453=AXIS2_PLACEMENT_3D('',#2019,#1711,#1712);
#1454=AXIS2_PLACEMENT_3D('',#2023,#1715,#1716);
#1455=AXIS2_PLACEMENT_3D('',#2025,#1718,#1719);
#1456=DIRECTION('',(0.,0.,1.));
#1457=DIRECTION('',(1.,0.,0.));
#1458=DIRECTION('',(-1.,0.,0.));
#1459=DIRECTION('',(0.,0.,1.));
#1460=DIRECTION('',(0.,-1.,0.));
#1461=DIRECTION('',(0.,2.10741474605738E-16,1.));
#1462=DIRECTION('',(0.,1.,0.));
#1463=DIRECTION('',(0.,0.,-1.));
#1464=DIRECTION('',(-1.,0.,0.));
#1465=DIRECTION('',(0.,0.,1.));
#1466=DIRECTION('',(0.,-1.,0.));
#1467=DIRECTION('',(0.,-2.10741474605738E-16,1.));
#1468=DIRECTION('',(0.,1.,0.));
#1469=DIRECTION('',(0.,0.,-1.));
#1470=DIRECTION('',(1.,0.,0.));
#1471=DIRECTION('',(0.,0.,-1.));
#1472=DIRECTION('',(0.,1.,0.));
#1473=DIRECTION('',(0.,1.05370737302869E-16,1.));
#1474=DIRECTION('',(0.,1.,0.));
#1475=DIRECTION('',(0.,0.,-1.));
#1476=DIRECTION('',(-1.,0.,0.));
#1477=DIRECTION('',(0.,0.,1.));
#1478=DIRECTION('',(0.,-1.,0.));
#1479=DIRECTION('',(0.,-1.05370737302869E-16,1.));
#1480=DIRECTION('',(0.,1.,0.));
#1481=DIRECTION('',(0.,0.,-1.));
#1482=DIRECTION('',(0.,0.,1.));
#1483=DIRECTION('',(1.,0.,0.));
#1484=DIRECTION('',(0.,1.,0.));
#1485=DIRECTION('',(0.,0.,-1.));
#1486=DIRECTION('',(1.,0.,0.));
#1487=DIRECTION('',(-1.,7.23596483003716E-16,0.));
#1488=DIRECTION('',(0.,0.,1.));
#1489=DIRECTION('',(1.,0.,0.));
#1490=DIRECTION('',(0.,0.,1.));
#1491=DIRECTION('',(1.,0.,0.));
#1492=DIRECTION('',(0.,0.,-1.));
#1493=DIRECTION('',(-1.,0.,0.));
#1494=DIRECTION('',(0.,0.,-1.));
#1495=DIRECTION('',(1.,0.,0.));
#1496=DIRECTION('',(0.,0.,1.));
#1497=DIRECTION('',(1.,0.,0.));
#1498=DIRECTION('',(-1.,-1.27773864679063E-15,0.));
#1499=DIRECTION('',(0.,0.,1.));
#1500=DIRECTION('',(1.,0.,0.));
#1501=DIRECTION('',(0.,0.,1.));
#1502=DIRECTION('',(1.,0.,0.));
#1503=DIRECTION('',(0.,-1.,0.));
#1504=DIRECTION('',(0.,0.,-1.));
#1505=DIRECTION('',(1.,0.,0.));
#1506=DIRECTION('',(1.,-1.27773864679063E-15,0.));
#1507=DIRECTION('',(0.,0.,-1.));
#1508=DIRECTION('',(1.,0.,0.));
#1509=DIRECTION('',(0.,0.,1.));
#1510=DIRECTION('',(-1.,0.,0.));
#1511=DIRECTION('',(0.,0.,1.));
#1512=DIRECTION('',(1.,0.,0.));
#1513=DIRECTION('',(0.,0.,-1.));
#1514=DIRECTION('',(-1.,0.,0.));
#1515=DIRECTION('',(0.,0.,-1.));
#1516=DIRECTION('',(1.,0.,0.));
#1517=DIRECTION('',(1.,7.23596483003716E-16,0.));
#1518=DIRECTION('',(0.,0.,1.));
#1519=DIRECTION('',(1.,0.,0.));
#1520=DIRECTION('',(0.,0.,1.));
#1521=DIRECTION('',(1.,0.,0.));
#1522=DIRECTION('',(0.,-1.,0.));
#1523=DIRECTION('',(1.,0.,0.));
#1524=DIRECTION('',(0.,-1.,0.));
#1525=DIRECTION('',(0.,0.,1.));
#1526=DIRECTION('',(1.,0.,0.));
#1527=DIRECTION('',(1.,0.,0.));
#1528=DIRECTION('',(2.3967051493781E-16,1.,0.));
#1529=DIRECTION('',(1.,0.,0.));
#1530=DIRECTION('',(0.,0.,-1.));
#1531=DIRECTION('',(1.,0.,0.));
#1532=DIRECTION('',(0.,1.,0.));
#1533=DIRECTION('',(1.,0.,0.));
#1534=DIRECTION('',(0.824177400937713,-0.56633171532553,0.));
#1535=DIRECTION('',(0.,-1.,0.));
#1536=DIRECTION('',(0.837927183931833,0.545782039305132,0.));
#1537=DIRECTION('',(0.,1.,0.));
#1538=DIRECTION('',(-0.837927183931835,0.545782039305129,0.));
#1539=DIRECTION('',(0.,-1.,0.));
#1540=DIRECTION('',(-0.824177400937713,-0.56633171532553,0.));
#1541=DIRECTION('',(0.,0.,1.));
#1542=DIRECTION('',(1.,0.,0.));
#1543=DIRECTION('',(0.,1.,0.));
#1544=DIRECTION('',(-1.,0.,0.));
#1545=DIRECTION('',(0.,1.,0.));
#1546=DIRECTION('',(0.,0.,1.));
#1547=DIRECTION('',(1.,0.,0.));
#1548=DIRECTION('',(-1.,0.,0.));
#1549=DIRECTION('',(1.79752886203357E-16,1.,0.));
#1550=DIRECTION('',(1.,0.,0.));
#1551=DIRECTION('',(0.,0.,-1.));
#1552=DIRECTION('',(1.,0.,0.));
#1553=DIRECTION('',(0.,-1.,0.));
#1554=DIRECTION('',(-1.,0.,0.));
#1555=DIRECTION('',(0.824177400937712,-0.566331715325531,0.));
#1556=DIRECTION('',(0.,1.,0.));
#1557=DIRECTION('',(-0.837927183931835,-0.545782039305129,0.));
#1558=DIRECTION('',(0.,-1.,0.));
#1559=DIRECTION('',(0.837927183931834,-0.54578203930513,0.));
#1560=DIRECTION('',(0.,1.,0.));
#1561=DIRECTION('',(0.824177400937712,0.566331715325531,0.));
#1562=DIRECTION('',(0.,0.,1.));
#1563=DIRECTION('',(1.,0.,0.));
#1564=DIRECTION('',(-0.749622914390888,-0.66186515712803,0.));
#1565=DIRECTION('',(0.,-1.,0.));
#1566=DIRECTION('',(-1.,0.,0.));
#1567=DIRECTION('',(0.,-1.,0.));
#1568=DIRECTION('',(1.,0.,0.));
#1569=DIRECTION('',(0.,-1.,0.));
#1570=DIRECTION('',(-0.675724628517346,-0.737154140200741,0.));
#1571=DIRECTION('',(-1.,-2.08015661210943E-16,0.));
#1572=DIRECTION('',(-0.675724628517346,0.737154140200741,0.));
#1573=DIRECTION('',(0.,1.,0.));
#1574=DIRECTION('',(0.698927038750662,0.71519297710704,0.));
#1575=DIRECTION('',(1.,-2.08015661210943E-16,0.));
#1576=DIRECTION('',(0.698927038750662,-0.71519297710704,0.));
#1577=DIRECTION('',(0.,1.,0.));
#1578=DIRECTION('',(0.,0.,1.));
#1579=DIRECTION('',(-1.,0.,0.));
#1580=DIRECTION('',(0.,0.,1.));
#1581=DIRECTION('',(0.123567894198511,0.,0.992336120235148));
#1582=DIRECTION('',(0.,0.,1.));
#1583=DIRECTION('',(1.,0.,0.));
#1584=DIRECTION('',(-0.123567894198511,0.,0.992336120235148));
#1585=DIRECTION('',(0.,-1.,0.));
#1586=DIRECTION('',(0.,0.,-1.));
#1587=DIRECTION('',(0.123567894198511,0.,-0.992336120235148));
#1588=DIRECTION('',(0.,0.,-1.));
#1589=DIRECTION('',(-1.,0.,0.));
#1590=DIRECTION('',(-0.123567894198511,0.,-0.992336120235148));
#1591=DIRECTION('',(1.,0.,0.));
#1592=DIRECTION('',(0.,0.,-1.));
#1593=DIRECTION('',(0.,0.,1.));
#1594=DIRECTION('',(0.,-1.,0.));
#1595=DIRECTION('',(0.,0.,-1.));
#1596=DIRECTION('',(1.,0.,0.));
#1597=DIRECTION('',(0.,0.,-1.));
#1598=DIRECTION('',(0.,-1.,0.));
#1599=DIRECTION('',(0.,0.,-1.));
#1600=DIRECTION('',(0.,0.,-1.));
#1601=DIRECTION('',(-1.,0.,0.));
#1602=DIRECTION('',(0.,0.,1.));
#1603=DIRECTION('',(0.,0.,-1.));
#1604=DIRECTION('',(0.,-1.,0.));
#1605=DIRECTION('',(0.,0.,-1.));
#1606=DIRECTION('',(-1.,0.,0.));
#1607=DIRECTION('',(0.,0.,1.));
#1608=DIRECTION('',(0.,-1.,0.));
#1609=DIRECTION('',(0.,0.,-1.));
#1610=DIRECTION('',(0.,0.,-1.));
#1611=DIRECTION('',(0.,0.,1.));
#1612=DIRECTION('',(1.,0.,0.));
#1613=DIRECTION('',(0.,-1.,0.));
#1614=DIRECTION('',(0.,-1.,0.));
#1615=DIRECTION('',(0.,0.,1.));
#1616=DIRECTION('',(1.,0.,0.));
#1617=DIRECTION('',(-0.837927183931835,0.545782039305129,0.));
#1618=DIRECTION('',(0.,1.,0.));
#1619=DIRECTION('',(-0.824177400937713,-0.56633171532553,0.));
#1620=DIRECTION('',(0.,0.,1.));
#1621=DIRECTION('',(1.,0.,0.));
#1622=DIRECTION('',(0.837927183931833,0.545782039305132,0.));
#1623=DIRECTION('',(0.824177400937713,-0.56633171532553,0.));
#1624=DIRECTION('',(0.,1.,0.));
#1625=DIRECTION('',(0.,0.,-1.));
#1626=DIRECTION('',(-1.,0.,0.));
#1627=DIRECTION('',(0.,1.,0.));
#1628=DIRECTION('',(0.837927183931835,0.545782039305129,0.));
#1629=DIRECTION('',(-0.824177400937712,0.566331715325531,0.));
#1630=DIRECTION('',(0.,0.,-1.));
#1631=DIRECTION('',(-1.,0.,0.));
#1632=DIRECTION('',(-0.837927183931834,0.54578203930513,0.));
#1633=DIRECTION('',(0.,1.,0.));
#1634=DIRECTION('',(-0.824177400937712,-0.566331715325531,0.));
#1635=DIRECTION('',(-0.992336120235148,0.,0.123567894198511));
#1636=DIRECTION('',(0.123567894198511,0.,0.992336120235148));
#1637=DIRECTION('',(0.,1.,0.));
#1638=DIRECTION('',(0.,1.,0.));
#1639=DIRECTION('',(0.,1.,0.));
#1640=DIRECTION('',(-0.992336120235148,0.,-0.123567894198511));
#1641=DIRECTION('',(-0.123567894198511,0.,0.992336120235148));
#1642=DIRECTION('',(0.122838967031055,0.108458307042971,-0.986482328180346));
#1643=DIRECTION('',(0.,-1.,0.));
#1644=DIRECTION('',(0.,1.,0.));
#1645=DIRECTION('',(0.,1.,0.));
#1646=DIRECTION('',(0.,1.,0.));
#1647=DIRECTION('',(0.566331715325531,-0.824177400937712,0.));
#1648=DIRECTION('',(0.824177400937712,0.566331715325531,0.));
#1649=DIRECTION('',(0.,0.,-1.));
#1650=DIRECTION('',(1.,0.,0.));
#1651=DIRECTION('',(0.,0.,-1.));
#1652=DIRECTION('',(-0.566331715325531,-0.824177400937712,0.));
#1653=DIRECTION('',(0.824177400937712,-0.566331715325531,0.));
#1654=DIRECTION('',(-1.,0.,0.));
#1655=DIRECTION('',(0.,0.,1.));
#1656=DIRECTION('',(-0.545782039305129,0.837927183931835,0.));
#1657=DIRECTION('',(-0.837927183931835,-0.545782039305129,0.));
#1658=DIRECTION('',(0.,0.,-1.));
#1659=DIRECTION('',(-0.54578203930513,-0.837927183931834,0.));
#1660=DIRECTION('',(0.837927183931834,-0.54578203930513,0.));
#1661=DIRECTION('',(0.,0.,-1.));
#1662=DIRECTION('',(-1.,0.,0.));
#1663=DIRECTION('',(0.,0.,1.));
#1664=DIRECTION('',(-0.56633171532553,-0.824177400937713,0.));
#1665=DIRECTION('',(0.824177400937713,-0.56633171532553,0.));
#1666=DIRECTION('',(-1.,0.,0.));
#1667=DIRECTION('',(0.,0.,1.));
#1668=DIRECTION('',(-0.56633171532553,0.824177400937713,0.));
#1669=DIRECTION('',(-0.824177400937713,-0.56633171532553,0.));
#1670=DIRECTION('',(0.,0.,-1.));
#1671=DIRECTION('',(-1.,0.,0.));
#1672=DIRECTION('',(0.,0.,1.));
#1673=DIRECTION('',(0.545782039305129,0.837927183931835,0.));
#1674=DIRECTION('',(-0.837927183931835,0.545782039305129,0.));
#1675=DIRECTION('',(0.,0.,-1.));
#1676=DIRECTION('',(0.545782039305132,-0.837927183931833,0.));
#1677=DIRECTION('',(0.837927183931833,0.545782039305132,0.));
#1678=DIRECTION('',(0.,0.,-1.));
#1679=DIRECTION('',(1.,0.,0.));
#1680=DIRECTION('',(0.,0.,-1.));
#1681=DIRECTION('',(-0.66186515712803,0.749622914390888,0.));
#1682=DIRECTION('',(-0.749622914390888,-0.66186515712803,0.));
#1683=DIRECTION('',(0.749622914390888,0.66186515712803,0.));
#1684=DIRECTION('',(0.,0.,-1.));
#1685=DIRECTION('',(-1.,0.,0.));
#1686=DIRECTION('',(-0.712036221975809,0.652699870144491,-0.258819045102521));
#1687=DIRECTION('',(-0.675724628517346,-0.737154140200741,0.));
#1688=DIRECTION('',(-0.257517271983508,0.100170018837677,0.961067542868987));
#1689=DIRECTION('',(-0.675724628517346,-0.737154140200741,0.));
#1690=DIRECTION('',(-0.11312409217477,0.257157651294349,0.959725420185591));
#1691=DIRECTION('',(-2.00927699436247E-16,0.965925826289068,-0.258819045102521));
#1692=DIRECTION('',(0.,0.258819045102521,0.965925826289068));
#1693=DIRECTION('',(-1.,2.08015661210943E-16,0.));
#1694=DIRECTION('',(0.11312409217477,0.257157651294349,0.959725420185591));
#1695=DIRECTION('',(0.712036221975809,0.652699870144491,-0.258819045102521));
#1696=DIRECTION('',(-0.675724628517346,0.737154140200741,0.));
#1697=DIRECTION('',(-0.675724628517346,0.737154140200741,0.));
#1698=DIRECTION('',(0.257517271983508,0.100170018837677,0.961067542868987));
#1699=DIRECTION('',(0.965925826289068,0.,-0.258819045102521));
#1700=DIRECTION('',(-0.258819045102521,0.,-0.965925826289068));
#1701=DIRECTION('',(0.,1.,0.));
#1702=DIRECTION('',(0.257391493947469,-0.104884917945351,0.960598132848012));
#1703=DIRECTION('',(0.690823367368256,-0.675111677421005,-0.258819045102521));
#1704=DIRECTION('',(0.698927038750662,0.71519297710704,0.));
#1705=DIRECTION('',(0.698927038750662,0.71519297710704,0.));
#1706=DIRECTION('',(0.108313391853419,-0.257296360519251,0.960243090060405));
#1707=DIRECTION('',(-2.00927699436247E-16,-0.965925826289068,-0.258819045102521));
#1708=DIRECTION('',(0.,0.258819045102521,-0.965925826289068));
#1709=DIRECTION('',(1.,2.08015661210943E-16,0.));
#1710=DIRECTION('',(-0.108313391853419,-0.257296360519251,0.960243090060405));
#1711=DIRECTION('',(-0.690823367368256,-0.675111677421005,-0.258819045102521));
#1712=DIRECTION('',(0.698927038750662,-0.71519297710704,0.));
#1713=DIRECTION('',(0.698927038750662,-0.71519297710704,0.));
#1714=DIRECTION('',(-0.257391493947469,-0.104884917945351,0.960598132848012));
#1715=DIRECTION('',(-0.965925826289068,0.,-0.258819045102521));
#1716=DIRECTION('',(-0.258819045102521,0.,0.965925826289068));
#1717=DIRECTION('',(0.,-1.,0.));
#1718=DIRECTION('',(0.,0.,1.));
#1719=DIRECTION('',(1.,0.,0.));
#1720=CARTESIAN_POINT('',(0.,0.,0.));
#1721=CARTESIAN_POINT('',(-1.64413081641889,-1.4,0.846926504465291));
#1722=CARTESIAN_POINT('',(-1.64413081641889,0.,0.));
#1723=CARTESIAN_POINT('',(-1.64413081641889,-0.898063031693446,0.));
#1724=CARTESIAN_POINT('',(-1.64413081641889,-1.05,0.));
#1725=CARTESIAN_POINT('',(-1.64413081641889,-1.05,0.));
#1726=CARTESIAN_POINT('',(-1.64413081641889,-1.05,0.257235120546125));
#1727=CARTESIAN_POINT('',(-1.64413081641889,-2.33617359637842,0.257235120546125));
#1728=CARTESIAN_POINT('',(-1.64413081641889,-0.898063031693446,0.257235120546125));
#1729=CARTESIAN_POINT('',(-1.64413081641889,-0.898063031693446,0.846926504465291));
#1730=CARTESIAN_POINT('',(-1.64413081641889,1.4,0.846926504465291));
#1731=CARTESIAN_POINT('',(-1.64413081641889,0.,0.));
#1732=CARTESIAN_POINT('',(-1.64413081641889,1.4,0.));
#1733=CARTESIAN_POINT('',(-1.64413081641889,1.05,0.));
#1734=CARTESIAN_POINT('',(-1.64413081641889,1.05,0.));
#1735=CARTESIAN_POINT('',(-1.64413081641889,1.05,0.257235120546125));
#1736=CARTESIAN_POINT('',(-1.64413081641889,-2.33617359637842,0.257235120546125));
#1737=CARTESIAN_POINT('',(-1.64413081641889,1.4,0.257235120546125));
#1738=CARTESIAN_POINT('',(-1.64413081641889,1.4,0.7));
#1739=CARTESIAN_POINT('',(1.64413081641889,-1.4,0.846926504465291));
#1740=CARTESIAN_POINT('',(1.64413081641889,0.,0.));
#1741=CARTESIAN_POINT('',(1.64413081641889,-1.4,0.));
#1742=CARTESIAN_POINT('',(1.64413081641889,-1.05,0.));
#1743=CARTESIAN_POINT('',(1.64413081641889,-1.05,0.));
#1744=CARTESIAN_POINT('',(1.64413081641889,-1.05,0.257235120546125));
#1745=CARTESIAN_POINT('',(1.64413081641889,-2.33617359637842,0.257235120546125));
#1746=CARTESIAN_POINT('',(1.64413081641889,-1.4,0.257235120546125));
#1747=CARTESIAN_POINT('',(1.64413081641889,-1.4,0.7));
#1748=CARTESIAN_POINT('',(1.64413081641889,1.4,0.846926504465291));
#1749=CARTESIAN_POINT('',(1.64413081641889,0.,0.));
#1750=CARTESIAN_POINT('',(1.64413081641889,1.05,0.));
#1751=CARTESIAN_POINT('',(1.64413081641889,0.898063031693446,0.));
#1752=CARTESIAN_POINT('',(1.64413081641889,1.05,0.));
#1753=CARTESIAN_POINT('',(1.64413081641889,1.05,0.257235120546125));
#1754=CARTESIAN_POINT('',(1.64413081641889,-2.33617359637842,0.257235120546125));
#1755=CARTESIAN_POINT('',(1.64413081641889,0.898063031693446,0.257235120546125));
#1756=CARTESIAN_POINT('',(1.64413081641889,0.898063031693446,0.846926504465291));
#1757=CARTESIAN_POINT('',(0.,0.,0.));
#1758=CARTESIAN_POINT('',(-1.14163814901307,0.,0.));
#1759=CARTESIAN_POINT('',(-1.14163814901307,-0.159222434663488,0.));
#1760=CARTESIAN_POINT('',(-1.14163814901307,0.125716274321173,0.));
#1761=CARTESIAN_POINT('',(-1.2800713447756,-0.159222434663488,0.));
#1762=CARTESIAN_POINT('',(-1.2800713447756,-0.297655630426019,0.));
#1763=CARTESIAN_POINT('',(-1.2800713447756,-0.297655630426019,0.));
#1764=CARTESIAN_POINT('',(-1.35498894028303,-0.297655630426019,0.));
#1765=CARTESIAN_POINT('',(-1.35498894028303,-0.182751572330869,0.));
#1766=CARTESIAN_POINT('',(-1.46642050025403,-0.210786372297394,0.));
#1767=CARTESIAN_POINT('',(-1.40308842153273,-0.194852805910294,0.));
#1768=CARTESIAN_POINT('',(-1.46075743239707,-0.164207807641378,0.));
#1769=CARTESIAN_POINT('',(-1.76977039701556,-1.33649928418193E-9,0.));
#1770=CARTESIAN_POINT('',(-1.45936505850101,0.16156033344724,0.));
#1771=CARTESIAN_POINT('',(-1.39278397954455,0.196214574440467,0.));
#1772=CARTESIAN_POINT('',(-1.46388214033284,0.220277160052693,0.));
#1773=CARTESIAN_POINT('',(-1.35600410680241,0.183766730124215,0.));
#1774=CARTESIAN_POINT('',(-1.35600410680241,0.297655630426019,0.));
#1775=CARTESIAN_POINT('',(-1.31357750511791,0.297655630426019,0.));
#1776=CARTESIAN_POINT('',(-1.31357750511791,0.297655630426019,0.));
#1777=CARTESIAN_POINT('',(-1.31357750511791,0.125716274321173,0.));
#1778=CARTESIAN_POINT('',(0.,0.,0.));
#1779=CARTESIAN_POINT('',(1.14163814901307,0.,0.));
#1780=CARTESIAN_POINT('',(1.14163814901307,0.125716274321173,0.));
#1781=CARTESIAN_POINT('',(1.14163814901307,-0.159222434663488,0.));
#1782=CARTESIAN_POINT('',(1.31357750511791,0.125716274321173,0.));
#1783=CARTESIAN_POINT('',(1.31357750511791,0.297655630426019,0.));
#1784=CARTESIAN_POINT('',(1.31357750511791,0.297655630426019,0.));
#1785=CARTESIAN_POINT('',(1.35600410680241,0.297655630426019,0.));
#1786=CARTESIAN_POINT('',(1.35600410680241,0.183766730124215,0.));
#1787=CARTESIAN_POINT('',(1.46388214033284,0.220277160052693,0.));
#1788=CARTESIAN_POINT('',(1.39278397954455,0.196214574440467,0.));
#1789=CARTESIAN_POINT('',(1.45936505850101,0.16156033344724,0.));
#1790=CARTESIAN_POINT('',(1.76977039701556,-1.33649928418193E-9,0.));
#1791=CARTESIAN_POINT('',(1.46075743239707,-0.164207807641378,0.));
#1792=CARTESIAN_POINT('',(1.40308842153273,-0.194852805910294,0.));
#1793=CARTESIAN_POINT('',(1.46642050025403,-0.210786372297394,0.));
#1794=CARTESIAN_POINT('',(1.35498894028303,-0.182751572330869,0.));
#1795=CARTESIAN_POINT('',(1.35498894028303,-0.297655630426019,0.));
#1796=CARTESIAN_POINT('',(1.2800713447756,-0.297655630426019,0.));
#1797=CARTESIAN_POINT('',(1.2800713447756,-0.297655630426019,0.));
#1798=CARTESIAN_POINT('',(1.2800713447756,-0.159222434663488,0.));
#1799=CARTESIAN_POINT('',(0.,0.,0.));
#1800=CARTESIAN_POINT('',(-1.64413081641889,0.,0.));
#1801=CARTESIAN_POINT('',(-1.64413081641889,0.898063031693446,0.));
#1802=CARTESIAN_POINT('',(-1.64413081641889,1.05,0.));
#1803=CARTESIAN_POINT('',(-1.50605266477866,1.05,0.));
#1804=CARTESIAN_POINT('',(-1.50605266477866,1.05,0.));
#1805=CARTESIAN_POINT('',(-1.50605266477866,1.01871926294031,0.));
#1806=CARTESIAN_POINT('',(-1.39207729389936,1.01871926294031,0.));
#1807=CARTESIAN_POINT('',(-1.39207729389936,0.904743892061013,0.));
#1808=CARTESIAN_POINT('',(-1.39207729389936,0.904743892061013,0.));
#1809=CARTESIAN_POINT('',(0.331147486479097,0.904743892061013,0.));
#1810=CARTESIAN_POINT('',(0.331147486479097,-0.904743892061013,0.));
#1811=CARTESIAN_POINT('',(0.331147486479097,-0.904743892061013,0.));
#1812=CARTESIAN_POINT('',(-1.39207729389936,-0.904743892061013,0.));
#1813=CARTESIAN_POINT('',(-1.39207729389936,-0.904743892061013,0.));
#1814=CARTESIAN_POINT('',(-1.39207729389936,-1.01871926294031,0.));
#1815=CARTESIAN_POINT('',(-1.50605266477866,-1.01871926294031,0.));
#1816=CARTESIAN_POINT('',(-1.50605266477866,-1.05,0.));
#1817=CARTESIAN_POINT('',(-1.50605266477866,-1.05,0.));
#1818=CARTESIAN_POINT('',(-1.64413081641889,-1.05,0.));
#1819=CARTESIAN_POINT('',(-1.04787227171762,-1.30778079878337,0.));
#1820=CARTESIAN_POINT('',(-1.75,-0.825315251580343,0.));
#1821=CARTESIAN_POINT('',(-1.75,1.61717819971189,0.));
#1822=CARTESIAN_POINT('',(-1.75,-0.520437583238589,0.));
#1823=CARTESIAN_POINT('',(-0.183955974404786,0.499601769011984,0.));
#1824=CARTESIAN_POINT('',(-1.64413081641889,-0.451479921973395,0.));
#1825=CARTESIAN_POINT('',(-1.64413081641889,0.,0.));
#1826=CARTESIAN_POINT('',(-1.64413081641889,0.451479921973388,0.));
#1827=CARTESIAN_POINT('',(-0.283277126466342,-0.434909153761181,0.));
#1828=CARTESIAN_POINT('',(-1.75,0.520437583238581,0.));
#1829=CARTESIAN_POINT('',(-1.75,1.4,0.));
#1830=CARTESIAN_POINT('',(-1.75,0.825315251580343,0.));
#1831=CARTESIAN_POINT('',(-0.946502652750305,1.37743671282121,0.));
#1832=CARTESIAN_POINT('',(0.,0.,0.));
#1833=CARTESIAN_POINT('',(1.64413081641889,0.,0.));
#1834=CARTESIAN_POINT('',(1.64413081641889,-0.898063031693446,0.));
#1835=CARTESIAN_POINT('',(1.64413081641889,-1.05,0.));
#1836=CARTESIAN_POINT('',(1.50605266477866,-1.05,0.));
#1837=CARTESIAN_POINT('',(1.50605266477866,-1.05,0.));
#1838=CARTESIAN_POINT('',(1.50605266477866,-1.01871926294031,0.));
#1839=CARTESIAN_POINT('',(1.39207729389936,-1.01871926294031,0.));
#1840=CARTESIAN_POINT('',(1.39207729389936,-0.904743892061013,0.));
#1841=CARTESIAN_POINT('',(1.39207729389936,-0.904743892061013,0.));
#1842=CARTESIAN_POINT('',(0.764548590664263,-0.904743892061013,0.));
#1843=CARTESIAN_POINT('',(0.764548590664263,-0.904743892061013,0.));
#1844=CARTESIAN_POINT('',(0.764548590664263,0.904743892061013,0.));
#1845=CARTESIAN_POINT('',(0.764548590664263,0.904743892061013,0.));
#1846=CARTESIAN_POINT('',(1.39207729389936,0.904743892061013,0.));
#1847=CARTESIAN_POINT('',(1.39207729389936,1.01871926294031,0.));
#1848=CARTESIAN_POINT('',(1.50605266477866,1.01871926294031,0.));
#1849=CARTESIAN_POINT('',(1.50605266477866,1.05,0.));
#1850=CARTESIAN_POINT('',(1.50605266477866,1.05,0.));
#1851=CARTESIAN_POINT('',(1.64413081641889,1.05,0.));
#1852=CARTESIAN_POINT('',(0.946502652750307,1.37743671282121,0.));
#1853=CARTESIAN_POINT('',(1.75,0.825315251580343,0.));
#1854=CARTESIAN_POINT('',(1.75,-1.4,0.));
#1855=CARTESIAN_POINT('',(1.75,0.520437583238582,0.));
#1856=CARTESIAN_POINT('',(0.283277126466343,-0.434909153761181,0.));
#1857=CARTESIAN_POINT('',(1.64413081641889,0.451479921973388,0.));
#1858=CARTESIAN_POINT('',(1.64413081641889,0.,0.));
#1859=CARTESIAN_POINT('',(1.64413081641889,-0.45147992197339,0.));
#1860=CARTESIAN_POINT('',(0.283277126466343,0.43490915376118,0.));
#1861=CARTESIAN_POINT('',(1.75,-0.520437583238584,0.));
#1862=CARTESIAN_POINT('',(1.75,-1.4,0.));
#1863=CARTESIAN_POINT('',(1.75,-0.825315251580342,0.));
#1864=CARTESIAN_POINT('',(0.946502652750307,-1.37743671282121,0.));
#1865=CARTESIAN_POINT('',(0.,0.,0.7));
#1866=CARTESIAN_POINT('',(1.22225938261455,-1.38432070440579,0.7));
#1867=CARTESIAN_POINT('',(1.58899675179751,-1.06051698680435,0.7));
#1868=CARTESIAN_POINT('',(1.20450114419945,-1.4,0.7));
#1869=CARTESIAN_POINT('',(1.58899675179751,0.,0.7));
#1870=CARTESIAN_POINT('',(1.58899675179751,1.4,0.7));
#1871=CARTESIAN_POINT('',(1.75,1.4,0.7));
#1872=CARTESIAN_POINT('',(-1.58899675179751,1.4,0.7));
#1873=CARTESIAN_POINT('',(-1.58899675179751,0.,0.7));
#1874=CARTESIAN_POINT('',(-1.58899675179751,-1.4,0.7));
#1875=CARTESIAN_POINT('',(-1.75,-1.4,0.7));
#1876=CARTESIAN_POINT('',(-1.46989299192673,0.,0.7));
#1877=CARTESIAN_POINT('',(-1.46989299192673,-0.803775883310465,0.7));
#1878=CARTESIAN_POINT('',(-1.46989299192673,0.783042312544073,0.7));
#1879=CARTESIAN_POINT('',(-1.18877802299346,1.089713187744,0.7));
#1880=CARTESIAN_POINT('',(-1.0424236003904,1.24937255785643,0.7));
#1881=CARTESIAN_POINT('',(-2.59889058721312E-16,1.24937255785643,0.7));
#1882=CARTESIAN_POINT('',(1.0424236003904,1.24937255785643,0.7));
#1883=CARTESIAN_POINT('',(1.18877802299346,1.089713187744,0.7));
#1884=CARTESIAN_POINT('',(1.46989299192673,0.783042312544073,0.7));
#1885=CARTESIAN_POINT('',(1.46989299192673,0.,0.7));
#1886=CARTESIAN_POINT('',(1.46989299192673,-0.803775883310465,0.7));
#1887=CARTESIAN_POINT('',(1.15363333702582,-1.12739576290725,0.7));
#1888=CARTESIAN_POINT('',(1.0424236003904,-1.24119365341345,0.7));
#1889=CARTESIAN_POINT('',(-2.58187718505625E-16,-1.24119365341345,0.7));
#1890=CARTESIAN_POINT('',(-1.0424236003904,-1.24119365341345,0.7));
#1891=CARTESIAN_POINT('',(-1.15363333702582,-1.12739576290725,0.7));
#1892=CARTESIAN_POINT('',(-1.75,-1.4,0.7));
#1893=CARTESIAN_POINT('',(-1.75,-1.4,0.500141378784593));
#1894=CARTESIAN_POINT('',(1.61388359049804,-1.4,0.500141378784593));
#1895=CARTESIAN_POINT('',(1.20450114419945,-1.4,0.500141378784593));
#1896=CARTESIAN_POINT('',(1.20450114419945,-1.4,0.7));
#1897=CARTESIAN_POINT('',(-1.59145511433513,-1.4,0.68025763926349));
#1898=CARTESIAN_POINT('',(-1.64413081641889,-1.4,0.257235120546125));
#1899=CARTESIAN_POINT('',(-1.64413081641889,-1.4,0.7));
#1900=CARTESIAN_POINT('',(-1.64413081641889,-1.4,0.));
#1901=CARTESIAN_POINT('',(-1.75,-1.4,0.));
#1902=CARTESIAN_POINT('',(1.53801352866684,-1.4,1.10943073576451));
#1903=CARTESIAN_POINT('',(1.75,1.4,0.7));
#1904=CARTESIAN_POINT('',(1.59145511433513,1.4,0.68025763926349));
#1905=CARTESIAN_POINT('',(1.64413081641889,1.4,0.257235120546125));
#1906=CARTESIAN_POINT('',(1.64413081641889,1.4,0.7));
#1907=CARTESIAN_POINT('',(1.64413081641889,1.4,0.));
#1908=CARTESIAN_POINT('',(1.75,1.4,0.));
#1909=CARTESIAN_POINT('',(-1.53801352866684,1.4,1.10943073576451));
#1910=CARTESIAN_POINT('',(-1.75,1.4,0.7));
#1911=CARTESIAN_POINT('',(-1.75,0.520437583238581,0.7));
#1912=CARTESIAN_POINT('',(-1.75,0.520437583238581,0.257235120546125));
#1913=CARTESIAN_POINT('',(-1.75,1.4,0.257235120546125));
#1914=CARTESIAN_POINT('',(-1.75,0.825315251580343,0.257235120546125));
#1915=CARTESIAN_POINT('',(-1.75,0.825315251580343,0.846926504465291));
#1916=CARTESIAN_POINT('',(-1.75,1.61717819971189,0.7));
#1917=CARTESIAN_POINT('',(-1.75,1.61717819971189,0.257235120546125));
#1918=CARTESIAN_POINT('',(-1.75,-0.520437583238589,0.257235120546125));
#1919=CARTESIAN_POINT('',(-1.75,-0.825315251580343,0.257235120546125));
#1920=CARTESIAN_POINT('',(-1.75,-0.520437583238589,0.7));
#1921=CARTESIAN_POINT('',(-1.75,-0.825315251580343,0.846926504465291));
#1922=CARTESIAN_POINT('',(1.75,-1.4,0.7));
#1923=CARTESIAN_POINT('',(1.75,-0.520437583238584,0.846926504465291));
#1924=CARTESIAN_POINT('',(1.75,-0.520437583238584,0.257235120546125));
#1925=CARTESIAN_POINT('',(1.75,-1.4,0.257235120546125));
#1926=CARTESIAN_POINT('',(1.75,-0.825315251580342,0.257235120546125));
#1927=CARTESIAN_POINT('',(1.75,-0.825315251580342,0.846926504465291));
#1928=CARTESIAN_POINT('',(1.75,-1.4,0.7));
#1929=CARTESIAN_POINT('',(1.75,-1.4,0.257235120546125));
#1930=CARTESIAN_POINT('',(1.75,0.825315251580343,0.257235120546125));
#1931=CARTESIAN_POINT('',(1.75,0.520437583238582,0.257235120546125));
#1932=CARTESIAN_POINT('',(1.75,0.520437583238582,0.7));
#1933=CARTESIAN_POINT('',(1.75,0.825315251580342,0.846926504465291));
#1934=CARTESIAN_POINT('',(0.,0.,0.));
#1935=CARTESIAN_POINT('',(1.64413081641889,0.,0.));
#1936=CARTESIAN_POINT('',(-1.64413081641889,0.,0.));
#1937=CARTESIAN_POINT('',(-1.80214611964041,-2.33617359637842,0.257235120546125));
#1938=CARTESIAN_POINT('',(-0.480211493664751,-0.306636384241441,0.257235120546125));
#1939=CARTESIAN_POINT('',(-1.64413081641889,0.451479921973388,0.257235120546125));
#1940=CARTESIAN_POINT('',(-1.64413081641889,-2.33617359637842,0.257235120546125));
#1941=CARTESIAN_POINT('',(-1.64413081641889,0.898063031693446,0.257235120546125));
#1942=CARTESIAN_POINT('',(-3.26107079384912,-0.213013770405974,0.257235120546125));
#1943=CARTESIAN_POINT('',(-1.80214611964041,-2.11899539666653,0.257235120546125));
#1944=CARTESIAN_POINT('',(-2.5176743587459,-1.02046059845166,0.257235120546125));
#1945=CARTESIAN_POINT('',(-1.64413081641889,-0.451479921973395,0.257235120546125));
#1946=CARTESIAN_POINT('',(-1.18158591065612,-1.21589976150146,0.257235120546125));
#1947=CARTESIAN_POINT('',(-1.64413081641889,-2.11899539666653,0.257235120546125));
#1948=CARTESIAN_POINT('',(1.80214611964041,-2.33617359637842,0.257235120546125));
#1949=CARTESIAN_POINT('',(1.64413081641889,-2.33617359637842,0.257235120546125));
#1950=CARTESIAN_POINT('',(1.64413081641889,0.451479921973388,0.257235120546125));
#1951=CARTESIAN_POINT('',(0.480211493664751,-0.306636384241442,0.257235120546125));
#1952=CARTESIAN_POINT('',(3.26107079384912,-0.213013770405977,0.257235120546125));
#1953=CARTESIAN_POINT('',(1.80214611964041,-2.33617359637842,0.257235120546125));
#1954=CARTESIAN_POINT('',(2.61699551080745,-1.08515321370246,0.257235120546125));
#1955=CARTESIAN_POINT('',(1.64413081641889,-0.45147992197339,0.257235120546125));
#1956=CARTESIAN_POINT('',(1.64413081641889,-2.33617359637842,0.257235120546125));
#1957=CARTESIAN_POINT('',(1.64413081641889,-0.898063031693446,0.257235120546125));
#1958=CARTESIAN_POINT('',(1.08021629168881,-1.28555567553931,0.257235120546125));
#1959=CARTESIAN_POINT('',(-1.64413081641889,-2.33617359637842,0.257235120546125));
#1960=CARTESIAN_POINT('',(-1.64413081641889,-2.33617359637842,0.257235120546125));
#1961=CARTESIAN_POINT('',(-1.64413081641889,-2.33617359637842,0.257235120546125));
#1962=CARTESIAN_POINT('',(-1.64413081641889,-2.33617359637842,0.257235120546125));
#1963=CARTESIAN_POINT('',(1.64413081641889,-2.33617359637842,0.257235120546125));
#1964=CARTESIAN_POINT('',(1.62648680953734,-1.02741586025078,0.398928765548374));
#1965=CARTESIAN_POINT('',(1.61388359049804,-1.03854363047981,0.500141378784593));
#1966=CARTESIAN_POINT('',(1.61388359049804,-2.33617359637842,0.500141378784593));
#1967=CARTESIAN_POINT('',(1.64413081641889,-2.33617359637842,0.257235120546125));
#1968=CARTESIAN_POINT('',(1.64413081641889,-2.33617359637842,0.257235120546125));
#1969=CARTESIAN_POINT('',(1.64413081641889,-2.33617359637842,0.257235120546125));
#1970=CARTESIAN_POINT('',(1.64863038103269,-0.894971165618189,0.846926504465291));
#1971=CARTESIAN_POINT('',(1.64413081641889,-0.898063031693446,0.846926504465291));
#1972=CARTESIAN_POINT('',(1.64413081641889,-1.4,0.846926504465291));
#1973=CARTESIAN_POINT('',(1.64863038103269,0.894971165618189,0.846926504465291));
#1974=CARTESIAN_POINT('',(1.64413081641889,1.4,0.846926504465291));
#1975=CARTESIAN_POINT('',(1.84932115206156,0.585130198489388,0.846926504465291));
#1976=CARTESIAN_POINT('',(1.64413081641889,0.451479921973388,0.846926504465291));
#1977=CARTESIAN_POINT('',(1.84932115206156,-0.585130198489389,0.846926504465291));
#1978=CARTESIAN_POINT('',(1.64413081641889,-0.45147992197339,0.846926504465291));
#1979=CARTESIAN_POINT('',(1.64413081641889,2.16840434497101E-16,0.846926504465291));
#1980=CARTESIAN_POINT('',(-1.75,-0.825315251580343,0.846926504465291));
#1981=CARTESIAN_POINT('',(-1.64413081641889,-1.4,0.846926504465291));
#1982=CARTESIAN_POINT('',(-1.64863038103269,0.894971165618189,0.846926504465291));
#1983=CARTESIAN_POINT('',(-1.64413081641889,0.898063031693446,0.846926504465291));
#1984=CARTESIAN_POINT('',(-1.64413081641889,1.4,0.846926504465291));
#1985=CARTESIAN_POINT('',(-1.84932115206156,0.585130198489388,0.846926504465291));
#1986=CARTESIAN_POINT('',(-1.64413081641889,0.451479921973388,0.846926504465291));
#1987=CARTESIAN_POINT('',(-1.77552854565133,-0.53706554563587,0.846926504465291));
#1988=CARTESIAN_POINT('',(-1.64413081641889,-0.451479921973396,0.846926504465291));
#1989=CARTESIAN_POINT('',(-1.64413081641889,-0.668658121685287,0.846926504465291));
#1990=CARTESIAN_POINT('',(1.58899675179751,-1.06051698680435,0.899858621215407));
#1991=CARTESIAN_POINT('',(1.58899675179751,-1.06051698680435,0.500141378784593));
#1992=CARTESIAN_POINT('',(0.,0.,0.500141378784593));
#1993=CARTESIAN_POINT('',(-1.18877802299346,1.089713187744,0.7));
#1994=CARTESIAN_POINT('',(-1.4591615435198,0.778867954137751,0.659949689306543));
#1995=CARTESIAN_POINT('',(-1.3512545000402,0.736893874128229,0.257235120546125));
#1996=CARTESIAN_POINT('',(-1.10132316751213,1.00954623688612,0.257235120546125));
#1997=CARTESIAN_POINT('',(-0.990234324185333,1.1307340659699,0.257235120546125));
#1998=CARTESIAN_POINT('',(-1.02908364279065,1.2190476986795,0.586826084819321));
#1999=CARTESIAN_POINT('',(-2.59889058721312E-16,1.24937255785643,0.7));
#2000=CARTESIAN_POINT('',(2.35210394386466E-16,1.1307340659699,0.257235120546125));
#2001=CARTESIAN_POINT('',(0.990234324185333,1.1307340659699,0.257235120546125));
#2002=CARTESIAN_POINT('',(1.03965189978635,1.2430718308961,0.676485366859439));
#2003=CARTESIAN_POINT('',(1.18877802299346,1.089713187744,0.7));
#2004=CARTESIAN_POINT('',(1.10132316751213,1.00954623688612,0.257235120546125));
#2005=CARTESIAN_POINT('',(1.3512545000402,0.736893874128229,0.257235120546125));
#2006=CARTESIAN_POINT('',(1.44969401613434,0.775185240394928,0.624616396081947));
#2007=CARTESIAN_POINT('',(1.46989299192673,0.,0.7));
#2008=CARTESIAN_POINT('',(1.3512545000402,0.,0.257235120546125));
#2009=CARTESIAN_POINT('',(1.3512545000402,-0.755431673112057,0.257235120546125));
#2010=CARTESIAN_POINT('',(1.45767726870417,-0.798798076514323,0.654410300282222));
#2011=CARTESIAN_POINT('',(1.15363333702582,-1.12739576290725,0.7));
#2012=CARTESIAN_POINT('',(1.068783920814,-1.04447611309115,0.257235120546125));
#2013=CARTESIAN_POINT('',(0.992480657417281,-1.12255516152692,0.257235120546125));
#2014=CARTESIAN_POINT('',(1.03019410472852,-1.21214272378283,0.591580454611411));
#2015=CARTESIAN_POINT('',(-2.58187718505625E-16,-1.24119365341345,0.7));
#2016=CARTESIAN_POINT('',(2.3350905417078E-16,-1.12255516152692,0.257235120546125));
#2017=CARTESIAN_POINT('',(-0.992480657417281,-1.12255516152692,0.257235120546125));
#2018=CARTESIAN_POINT('',(-1.04055689714545,-1.23675933607856,0.683450902409298));
#2019=CARTESIAN_POINT('',(-1.15363333702582,-1.12739576290725,0.7));
#2020=CARTESIAN_POINT('',(-1.068783920814,-1.04447611309115,0.257235120546125));
#2021=CARTESIAN_POINT('',(-1.3512545000402,-0.755431673112057,0.257235120546125));
#2022=CARTESIAN_POINT('',(-1.44819386776884,-0.794933668589684,0.619017766163009));
#2023=CARTESIAN_POINT('',(-1.46989299192673,0.,0.7));
#2024=CARTESIAN_POINT('',(-1.3512545000402,0.,0.257235120546125));
#2025=CARTESIAN_POINT('',(0.,0.,0.257235120546125));
#2026=MECHANICAL_DESIGN_GEOMETRIC_PRESENTATION_REPRESENTATION('',(#1008,
#1009,#1010,#1011,#1012,#1013,#1014,#1015,#1016,#1017,#1018,#1019,#1020,
#1021,#1022,#1023,#1024,#1025,#1026,#1027,#1028,#1029,#1030,#1031,#1032,
#1033,#1034,#1035,#1036,#1037,#1038,#1039,#1040,#1041,#1042,#1043,#1044,
#1045,#1046,#1047,#1048,#1049,#1050,#1051,#1052,#1053,#1054),#2027);
#2027=(
GEOMETRIC_REPRESENTATION_CONTEXT(3)
GLOBAL_UNCERTAINTY_ASSIGNED_CONTEXT((#2028))
GLOBAL_UNIT_ASSIGNED_CONTEXT((#2031,#2030,#2029))
REPRESENTATION_CONTEXT('JB2835AWT-W-U57EA0000-N0000001',
'TOP_LEVEL_ASSEMBLY_PART')
);
#2028=UNCERTAINTY_MEASURE_WITH_UNIT(LENGTH_MEASURE(0.005),#2031,
'DISTANCE_ACCURACY_VALUE','Maximum Tolerance applied to model');
#2029=(
NAMED_UNIT(*)
SI_UNIT($,.STERADIAN.)
SOLID_ANGLE_UNIT()
);
#2030=(
NAMED_UNIT(*)
PLANE_ANGLE_UNIT()
SI_UNIT($,.RADIAN.)
);
#2031=(
LENGTH_UNIT()
NAMED_UNIT(*)
SI_UNIT(.MILLI.,.METRE.)
);
#2032=PRODUCT_DEFINITION_SHAPE('','',#2033);
#2033=PRODUCT_DEFINITION('','',#2035,#2034);
#2034=PRODUCT_DEFINITION_CONTEXT('',#2041,'design');
#2035=PRODUCT_DEFINITION_FORMATION_WITH_SPECIFIED_SOURCE('','',#2037,
 .NOT_KNOWN.);
#2036=PRODUCT_RELATED_PRODUCT_CATEGORY('','',(#2037));
#2037=PRODUCT('JB2835AWT-W-U57EA0000-N0000001',
'JB2835AWT-W-U57EA0000-N0000001','JB2835AWT-W-U57EA0000-N0000001',(#2039));
#2038=PRODUCT_CATEGORY('','');
#2039=PRODUCT_CONTEXT('',#2041,'mechanical');
#2040=APPLICATION_PROTOCOL_DEFINITION('international standard',
'automotive_design',2010,#2041);
#2041=APPLICATION_CONTEXT(
'core data for automotive mechanical design processes');
ENDSEC;
END-ISO-10303-21;
