#Codec:CCSDS 122.0 (UNL),"CompressedBitRate=2","CompressionType=lossy","SegmentSize=8192","TransformType=int97"
#Filename,Original Size,Compressed Data Size, Compression Ratio, Decompressed Data Matches Original,[ Attribute List ]
"1.gray","1048576","262144","4","false","BitDepthEndianess=","BitsPerSample=8","Endianess=Native","Maximum Absolute Distorsion=5","Mean Square Error=0.468007","OriginalFilesize=1048576","Peak Signal-to-noise Ratio (classical version)=51.4283","Peak Signal-to-noise Ratio (no classical version)=45.3736","SetEndianess=false","Signal-to-Noise Ratio=32.4724","Signed=no","Width=1024"
"2.gray","1048576","262144","4","false","BitDepthEndianess=","BitsPerSample=8","Endianess=Native","Maximum Absolute Distorsion=5","Mean Square Error=0.496527","OriginalFilesize=1048576","Peak Signal-to-noise Ratio (classical version)=51.1714","Peak Signal-to-noise Ratio (no classical version)=45.1166","SetEndianess=false","Signal-to-Noise Ratio=32","Signed=no","Width=1024"
"3.gray","1048576","262144","4","false","BitDepthEndianess=","BitsPerSample=8","Endianess=Native","Maximum Absolute Distorsion=6","Mean Square Error=0.505762","OriginalFilesize=1048576","Peak Signal-to-noise Ratio (classical version)=51.0913","Peak Signal-to-noise Ratio (no classical version)=45.0366","SetEndianess=false","Signal-to-Noise Ratio=31.8792","Signed=no","Width=1024"
