#Codec:CCSDS 122.0 (ESA),"CompressedBitRate=2","CompressionType=lossy","SegmentSize=524288","TransformType=int97"
#Filename,Original Size,Compressed Data Size, Compression Ratio, Decompressed Data Matches Original,[ Attribute List ]
"1.gray","1048576","262144","4","false","BitDepthEndianess=","BitsPerSample=8","Endianess=Native","Maximum Absolute Distorsion=3","Mean Square Error=0.316959","OriginalFilesize=1048576","Peak Signal-to-noise Ratio (classical version)=53.1208","Peak Signal-to-noise Ratio (no classical version)=47.066","SetEndianess=false","Signal-to-Noise Ratio=34.1649","Signed=no","Width=1024"
"2.gray","1048576","262144","4","false","BitDepthEndianess=","BitsPerSample=8","Endianess=Native","Maximum Absolute Distorsion=3","Mean Square Error=0.335619","OriginalFilesize=1048576","Peak Signal-to-noise Ratio (classical version)=52.8723","Peak Signal-to-noise Ratio (no classical version)=46.8176","SetEndianess=false","Signal-to-Noise Ratio=33.7009","Signed=no","Width=1024"
"3.gray","1048576","262144","4","false","BitDepthEndianess=","BitsPerSample=8","Endianess=Native","Maximum Absolute Distorsion=3","Mean Square Error=0.342823","OriginalFilesize=1048576","Peak Signal-to-noise Ratio (classical version)=52.7801","Peak Signal-to-noise Ratio (no classical version)=46.7254","SetEndianess=false","Signal-to-Noise Ratio=33.568","Signed=no","Width=1024"
