#Codec:CCSDS 122.0 (ESA),"CompressedBitRate=3","CompressionType=lossy","SegmentSize=8192","TransformType=int97"
#Filename,Original Size,Compressed Data Size, Compression Ratio, Decompressed Data Matches Original,[ Attribute List ]
"1.gray","1048576","370557","2.82973","false","BitDepthEndianess=","BitsPerSample=8","Endianess=Native","Maximum Absolute Distorsion=1","Mean Square Error=0.0865297","OriginalFilesize=1048576","Peak Signal-to-noise Ratio (classical version)=58.7592","Peak Signal-to-noise Ratio (no classical version)=52.7044","SetEndianess=false","Signal-to-Noise Ratio=39.8032","Signed=no","Width=1024"
"2.gray","1048576","376474","2.78525","false","BitDepthEndianess=","BitsPerSample=8","Endianess=Native","Maximum Absolute Distorsion=2","Mean Square Error=0.0958881","OriginalFilesize=1048576","Peak Signal-to-noise Ratio (classical version)=58.3132","Peak Signal-to-noise Ratio (no classical version)=52.2584","SetEndianess=false","Signal-to-Noise Ratio=39.1417","Signed=no","Width=1024"
"3.gray","1048576","378169","2.77277","false","BitDepthEndianess=","BitsPerSample=8","Endianess=Native","Maximum Absolute Distorsion=2","Mean Square Error=0.0998325","OriginalFilesize=1048576","Peak Signal-to-noise Ratio (classical version)=58.1381","Peak Signal-to-noise Ratio (no classical version)=52.0834","SetEndianess=false","Signal-to-Noise Ratio=38.926","Signed=no","Width=1024"
