#Codec:CCSDS 122.0 (ESA),"CompressedBitRate=4","CompressionType=lossy","SegmentSize=64","TransformType=int97"
#Filename,Original Size,Compressed Data Size, Compression Ratio, Decompressed Data Matches Original,[ Attribute List ]
"1.gray","1048576","362004","2.89659","false","BitDepthEndianess=","BitsPerSample=8","Endianess=Native","Maximum Absolute Distorsion=2","Mean Square Error=0.110693","OriginalFilesize=1048576","Peak Signal-to-noise Ratio (classical version)=57.6896","Peak Signal-to-noise Ratio (no classical version)=51.6349","SetEndianess=false","Signal-to-Noise Ratio=38.7337","Signed=no","Width=1024"
"2.gray","1048576","369729","2.83607","false","BitDepthEndianess=","BitsPerSample=8","Endianess=Native","Maximum Absolute Distorsion=3","Mean Square Error=0.114031","OriginalFilesize=1048576","Peak Signal-to-noise Ratio (classical version)=57.5606","Peak Signal-to-noise Ratio (no classical version)=51.5059","SetEndianess=false","Signal-to-Noise Ratio=38.3892","Signed=no","Width=1024"
"3.gray","1048576","372399","2.81573","false","BitDepthEndianess=","BitsPerSample=8","Endianess=Native","Maximum Absolute Distorsion=3","Mean Square Error=0.115172","OriginalFilesize=1048576","Peak Signal-to-noise Ratio (classical version)=57.5173","Peak Signal-to-noise Ratio (no classical version)=51.4626","SetEndianess=false","Signal-to-Noise Ratio=38.3052","Signed=no","Width=1024"
