#Codec:CCSDS 122.0 (ESA),"CompressedBitRate=5","CompressionType=lossy","SegmentSize=65536","TransformType=int97"
#Filename,Original Size,Compressed Data Size, Compression Ratio, Decompressed Data Matches Original,[ Attribute List ]
"1.gray","1048576","370554","2.82975","false","BitDepthEndianess=","BitsPerSample=8","Endianess=Native","Maximum Absolute Distorsion=1","Mean Square Error=0.0865297","OriginalFilesize=1048576","Peak Signal-to-noise Ratio (classical version)=58.7592","Peak Signal-to-noise Ratio (no classical version)=52.7044","SetEndianess=false","Signal-to-Noise Ratio=39.8032","Signed=no","Width=1024"
"2.gray","1048576","379247","2.76489","false","BitDepthEndianess=","BitsPerSample=8","Endianess=Native","Maximum Absolute Distorsion=1","Mean Square Error=0.0865879","OriginalFilesize=1048576","Peak Signal-to-noise Ratio (classical version)=58.7562","Peak Signal-to-noise Ratio (no classical version)=52.7015","SetEndianess=false","Signal-to-Noise Ratio=39.5848","Signed=no","Width=1024"
"3.gray","1048576","382273","2.743","false","BitDepthEndianess=","BitsPerSample=8","Endianess=Native","Maximum Absolute Distorsion=1","Mean Square Error=0.0866241","OriginalFilesize=1048576","Peak Signal-to-noise Ratio (classical version)=58.7544","Peak Signal-to-noise Ratio (no classical version)=52.6997","SetEndianess=false","Signal-to-Noise Ratio=39.5423","Signed=no","Width=1024"
