#Codec:CCSDS 122.0 (ESA),"CompressedBitRate=8","CompressionType=lossless","SegmentSize=64","TransformType=int97"
#Filename,Original Size,Compressed Data Size, Compression Ratio, Decompressed Data Matches Original,[ Attribute List ]
"1.gray","1048576","390524","2.68505","true","BitDepthEndianess=","BitsPerSample=8","Endianess=Native","Maximum Absolute Distorsion=0","Mean Square Error=0","OriginalFilesize=1048576","Peak Signal-to-noise Ratio (classical version)=inf","Peak Signal-to-noise Ratio (no classical version)=inf","SetEndianess=false","Signal-to-Noise Ratio=inf","Signed=no","Width=1024"
"2.gray","1048576","397724","2.63644","true","BitDepthEndianess=","BitsPerSample=8","Endianess=Native","Maximum Absolute Distorsion=0","Mean Square Error=0","OriginalFilesize=1048576","Peak Signal-to-noise Ratio (classical version)=inf","Peak Signal-to-noise Ratio (no classical version)=inf","SetEndianess=false","Signal-to-Noise Ratio=inf","Signed=no","Width=1024"
"3.gray","1048576","399944","2.62181","true","BitDepthEndianess=","BitsPerSample=8","Endianess=Native","Maximum Absolute Distorsion=0","Mean Square Error=0","OriginalFilesize=1048576","Peak Signal-to-noise Ratio (classical version)=inf","Peak Signal-to-noise Ratio (no classical version)=inf","SetEndianess=false","Signal-to-Noise Ratio=inf","Signed=no","Width=1024"
