#Codec:CCSDS 122.0 (ESA),"CompressedBitRate=1","CompressionType=lossy","SegmentSize=32768","TransformType=int97"
#Filename,Original Size,Compressed Data Size, Compression Ratio, Decompressed Data Matches Original,[ Attribute List ]
"1.gray","1048576","131072","8","false","BitDepthEndianess=","BitsPerSample=8","Endianess=Native","Maximum Absolute Distorsion=7","Mean Square Error=0.949574","OriginalFilesize=1048576","Peak Signal-to-noise Ratio (classical version)=48.3555","Peak Signal-to-noise Ratio (no classical version)=42.3008","SetEndianess=false","Signal-to-Noise Ratio=29.3996","Signed=no","Width=1024"
"2.gray","1048576","131072","8","false","BitDepthEndianess=","BitsPerSample=8","Endianess=Native","Maximum Absolute Distorsion=7","Mean Square Error=1.03111","OriginalFilesize=1048576","Peak Signal-to-noise Ratio (classical version)=47.9977","Peak Signal-to-noise Ratio (no classical version)=41.943","SetEndianess=false","Signal-to-Noise Ratio=28.8263","Signed=no","Width=1024"
"3.gray","1048576","131072","8","false","BitDepthEndianess=","BitsPerSample=8","Endianess=Native","Maximum Absolute Distorsion=8","Mean Square Error=1.05589","OriginalFilesize=1048576","Peak Signal-to-noise Ratio (classical version)=47.8946","Peak Signal-to-noise Ratio (no classical version)=41.8399","SetEndianess=false","Signal-to-Noise Ratio=28.6825","Signed=no","Width=1024"
