#Codec:CCSDS 122.0 (UNL),"CompressedBitRate=3","CompressionType=lossy","SegmentSize=8192","TransformType=int97"
#Filename,Original Size,Compressed Data Size, Compression Ratio, Decompressed Data Matches Original,[ Attribute List ]
"1.gray","1048576","383242","2.73607","false","BitDepthEndianess=","BitsPerSample=8","Endianess=Native","Maximum Absolute Distorsion=3","Mean Square Error=0.0279675","OriginalFilesize=1048576","Peak Signal-to-noise Ratio (classical version)=63.6643","Peak Signal-to-noise Ratio (no classical version)=57.6095","SetEndianess=false","Signal-to-Noise Ratio=44.7084","Signed=no","Width=1024"
"2.gray","1048576","386701","2.71159","false","BitDepthEndianess=","BitsPerSample=8","Endianess=Native","Maximum Absolute Distorsion=2","Mean Square Error=0.0409384","OriginalFilesize=1048576","Peak Signal-to-noise Ratio (classical version)=62.0095","Peak Signal-to-noise Ratio (no classical version)=55.9548","SetEndianess=false","Signal-to-Noise Ratio=42.8381","Signed=no","Width=1024"
"3.gray","1048576","388091","2.70188","false","BitDepthEndianess=","BitsPerSample=8","Endianess=Native","Maximum Absolute Distorsion=2","Mean Square Error=0.0441113","OriginalFilesize=1048576","Peak Signal-to-noise Ratio (classical version)=61.6853","Peak Signal-to-noise Ratio (no classical version)=55.6306","SetEndianess=false","Signal-to-Noise Ratio=42.4732","Signed=no","Width=1024"
