#Codec:CCSDS 122.0 (UNL),"CompressedBitRate=","CompressionType=lossless","SegmentSize=32","TransformType=int97"
#Filename,Original Size,Compressed Data Size, Compression Ratio, Decompressed Data Matches Original,[ Attribute List ]
"1.gray","1048576","391349","2.67939","true","BitDepthEndianess=","BitsPerSample=8","Endianess=Native","Maximum Absolute Distorsion=0","Mean Square Error=0","OriginalFilesize=1048576","Peak Signal-to-noise Ratio (classical version)=inf","Peak Signal-to-noise Ratio (no classical version)=inf","SetEndianess=false","Signal-to-Noise Ratio=inf","Signed=no","Width=1024"
"2.gray","1048576","398595","2.63068","true","BitDepthEndianess=","BitsPerSample=8","Endianess=Native","Maximum Absolute Distorsion=0","Mean Square Error=0","OriginalFilesize=1048576","Peak Signal-to-noise Ratio (classical version)=inf","Peak Signal-to-noise Ratio (no classical version)=inf","SetEndianess=false","Signal-to-Noise Ratio=inf","Signed=no","Width=1024"
"3.gray","1048576","400794","2.61625","true","BitDepthEndianess=","BitsPerSample=8","Endianess=Native","Maximum Absolute Distorsion=0","Mean Square Error=0","OriginalFilesize=1048576","Peak Signal-to-noise Ratio (classical version)=inf","Peak Signal-to-noise Ratio (no classical version)=inf","SetEndianess=false","Signal-to-Noise Ratio=inf","Signed=no","Width=1024"
