PCBNEW-LibModule-V1  2022-06-03 11:44:41
# encoding utf-8
Units mm
$INDEX
5022441530
$EndINDEX
$MODULE 5022441530
Po 0 0 0 15 6299e619 00000000 ~~
Li 5022441530
Cd 502244-1530-2
Kw Connector
Sc 0
At SMD
AR 
Op 0 0 0
T0 0.000 -0.15 1.27 1.27 0 0.254 N V 21 N "J**"
T1 0.000 -0.15 1.27 1.27 0 0.254 N I 21 N "5022441530"
DS -5.05 2.65 5.05 2.65 0.2 24
DS 5.05 2.65 5.05 -2.65 0.2 24
DS 5.05 -2.65 -5.05 -2.65 0.2 24
DS -5.05 -2.65 -5.05 2.65 0.2 24
DS -5.05 0.72 -5.05 0.72 0.1 21
DS -5.05 0.72 -5.05 -2.65 0.1 21
DS -5.05 -2.65 -5.05 -2.65 0.1 21
DS -5.05 -2.65 -5.05 0.72 0.1 21
DS -5.05 -2.65 -4.25 -2.65 0.1 21
DS -4.25 -2.65 -4.25 -2.65 0.1 21
DS -4.25 -2.65 -5.05 -2.65 0.1 21
DS -5.05 -2.65 -5.05 -2.65 0.1 21
DS 4.25 -2.65 5.05 -2.65 0.1 21
DS 5.05 -2.65 5.05 -2.65 0.1 21
DS 5.05 -2.65 4.25 -2.65 0.1 21
DS 4.25 -2.65 4.25 -2.65 0.1 21
DS 5.05 -2.65 5.05 -2.65 0.1 21
DS 5.05 -2.65 5.05 0.72 0.1 21
DS 5.05 0.72 5.05 0.72 0.1 21
DS 5.05 0.72 5.05 -2.65 0.1 21
DS 2.25 2.65 3.75 2.65 0.1 21
DS 3.75 2.65 3.75 2.65 0.1 21
DS 3.75 2.65 2.25 2.65 0.1 21
DS 2.25 2.65 2.25 2.65 0.1 21
DS -3.5 2.65 -2.25 2.65 0.1 21
DS -2.25 2.65 -2.25 2.65 0.1 21
DS -2.25 2.65 -3.5 2.65 0.1 21
DS -3.5 2.65 -3.5 2.65 0.1 21
DS -6.35 -5.08 6.35 -5.08 0.1 24
DS 6.35 -5.08 6.35 4.78 0.1 24
DS 6.35 4.78 -6.35 4.78 0.1 24
DS -6.35 4.78 -6.35 -5.08 0.1 24
DS -3.6 -4.03 -3.6 -4.03 0.2 21
DS -3.5 -4.03 -3.5 -4.03 0.2 21
DS -3.6 -4.03 -3.6 -4.03 0.2 21
DA -3.55 -4.03 -3.600 -4.03 -1800 0.2 21
DA -3.55 -4.03 -3.500 -4.03 -1800 0.2 21
DA -3.55 -4.03 -3.600 -4.03 -1800 0.2 21
$PAD
Po -3.500 -2.78
Sh "1" R 0.300 0.800 0 0 0
At SMD N 00888000
Ne 0 ""
$EndPAD
$PAD
Po -3.000 -2.78
Sh "2" R 0.300 0.800 0 0 0
At SMD N 00888000
Ne 0 ""
$EndPAD
$PAD
Po -2.500 -2.78
Sh "3" R 0.300 0.800 0 0 0
At SMD N 00888000
Ne 0 ""
$EndPAD
$PAD
Po -2.000 -2.78
Sh "4" R 0.300 0.800 0 0 0
At SMD N 00888000
Ne 0 ""
$EndPAD
$PAD
Po -1.500 -2.78
Sh "5" R 0.300 0.800 0 0 0
At SMD N 00888000
Ne 0 ""
$EndPAD
$PAD
Po -1.000 -2.78
Sh "6" R 0.300 0.800 0 0 0
At SMD N 00888000
Ne 0 ""
$EndPAD
$PAD
Po -0.500 -2.78
Sh "7" R 0.300 0.800 0 0 0
At SMD N 00888000
Ne 0 ""
$EndPAD
$PAD
Po 0.000 -2.78
Sh "8" R 0.300 0.800 0 0 0
At SMD N 00888000
Ne 0 ""
$EndPAD
$PAD
Po 0.500 -2.78
Sh "9" R 0.300 0.800 0 0 0
At SMD N 00888000
Ne 0 ""
$EndPAD
$PAD
Po 1.000 -2.78
Sh "10" R 0.300 0.800 0 0 0
At SMD N 00888000
Ne 0 ""
$EndPAD
$PAD
Po 1.500 -2.78
Sh "11" R 0.300 0.800 0 0 0
At SMD N 00888000
Ne 0 ""
$EndPAD
$PAD
Po 2.000 -2.78
Sh "12" R 0.300 0.800 0 0 0
At SMD N 00888000
Ne 0 ""
$EndPAD
$PAD
Po 2.500 -2.78
Sh "13" R 0.300 0.800 0 0 0
At SMD N 00888000
Ne 0 ""
$EndPAD
$PAD
Po 3.000 -2.78
Sh "14" R 0.300 0.800 0 0 0
At SMD N 00888000
Ne 0 ""
$EndPAD
$PAD
Po 3.500 -2.78
Sh "15" R 0.300 0.800 0 0 0
At SMD N 00888000
Ne 0 ""
$EndPAD
$PAD
Po -4.740 2.07
Sh "MP1" R 1.220 1.400 0 0 0
At SMD N 00888000
Ne 0 ""
$EndPAD
$PAD
Po 4.740 2.07
Sh "MP2" R 1.220 1.400 0 0 0
At SMD N 00888000
Ne 0 ""
$EndPAD
$PAD
Po -1.175 3.08
Sh "MP3" R 0.850 1.400 0 0 0
At SMD N 00888000
Ne 0 ""
$EndPAD
$PAD
Po 1.175 3.08
Sh "MP4" R 0.850 1.400 0 0 0
At SMD N 00888000
Ne 0 ""
$EndPAD
$EndMODULE 5022441530
$EndLIBRARY
