(footprint "NAND Flash"
	(version 20240108)
	(generator "pcbnew")
	(generator_version "8.0")
	(layer "F.Cu")
	(descr "48 PIN TSOP TYPE 1 CPL (PACKAGE WP)_2")
	(tags "Integrated Circuit")
	(property "Reference" "IC**"
		(at 0 0 0)
		(layer "F.SilkS")
		(uuid "60915a27-e6fb-4d73-942d-5ea6d8cfdc78")
		(effects
			(font
				(size 1.27 1.27)
				(thickness 0.254)
			)
		)
	)
	(property "Value" "NAND Flash"
		(at 0 0 0)
		(layer "F.SilkS")
		(hide yes)
		(uuid "e794b4d8-b563-4c97-8f1a-0cc884875373")
		(effects
			(font
				(size 1.27 1.27)
				(thickness 0.254)
			)
		)
	)
	(property "Footprint" ""
		(at 0 0 0)
		(layer "F.Fab")
		(hide yes)
		(uuid "accd46ba-6966-4fce-964b-d2df1e697c89")
		(effects
			(font
				(size 1.27 1.27)
				(thickness 0.15)
			)
		)
	)
	(property "Datasheet" ""
		(at 0 0 0)
		(layer "F.Fab")
		(hide yes)
		(uuid "02a0f763-17a8-4441-9ed7-574ca7c04049")
		(effects
			(font
				(size 1.27 1.27)
				(thickness 0.15)
			)
		)
	)
	(property "Description" ""
		(at 0 0 0)
		(layer "F.Fab")
		(hide yes)
		(uuid "99e62e1c-a0fc-4493-99ee-2a4f1922a784")
		(effects
			(font
				(size 1.27 1.27)
				(thickness 0.15)
			)
		)
	)
	(attr smd)
	(fp_line
		(start -10.5 -6.25)
		(end -9.2 -6.25)
		(stroke
			(width 0.2)
			(type solid)
		)
		(layer "F.SilkS")
		(uuid "6c00f4f3-79d6-4d43-825d-20d5a54df288")
	)
	(fp_line
		(start -8.85 -6)
		(end 8.85 -6)
		(stroke
			(width 0.2)
			(type solid)
		)
		(layer "F.SilkS")
		(uuid "8c85140a-44fe-4585-8112-6483a27db25a")
	)
	(fp_line
		(start -8.85 6)
		(end -8.85 -6)
		(stroke
			(width 0.2)
			(type solid)
		)
		(layer "F.SilkS")
		(uuid "f2b3ae41-a7ef-4cc8-85f5-e74e70972303")
	)
	(fp_line
		(start 8.85 -6)
		(end 8.85 6)
		(stroke
			(width 0.2)
			(type solid)
		)
		(layer "F.SilkS")
		(uuid "1d9c2b63-d219-40a9-ad90-a638eba730c0")
	)
	(fp_line
		(start 8.85 6)
		(end -8.85 6)
		(stroke
			(width 0.2)
			(type solid)
		)
		(layer "F.SilkS")
		(uuid "84832ba0-4b9c-474c-b7a3-b0e043a70354")
	)
	(fp_line
		(start -10.75 -6.29)
		(end 10.75 -6.29)
		(stroke
			(width 0.05)
			(type solid)
		)
		(layer "F.CrtYd")
		(uuid "bf399684-3f53-4293-bc85-9f06f1470f60")
	)
	(fp_line
		(start -10.75 6.29)
		(end -10.75 -6.29)
		(stroke
			(width 0.05)
			(type solid)
		)
		(layer "F.CrtYd")
		(uuid "2e8daf4c-68c2-4f55-aa7b-bbec1203fd84")
	)
	(fp_line
		(start 10.75 -6.29)
		(end 10.75 6.29)
		(stroke
			(width 0.05)
			(type solid)
		)
		(layer "F.CrtYd")
		(uuid "a24bf36d-dab1-4380-bfc8-1d004bf7e086")
	)
	(fp_line
		(start 10.75 6.29)
		(end -10.75 6.29)
		(stroke
			(width 0.05)
			(type solid)
		)
		(layer "F.CrtYd")
		(uuid "94c9a0bf-a6b8-4325-876a-95cfe973307d")
	)
	(fp_line
		(start -9.2 -6)
		(end 9.2 -6)
		(stroke
			(width 0.1)
			(type solid)
		)
		(layer "F.Fab")
		(uuid "74d7e030-e977-47cd-9a3b-743501756c80")
	)
	(fp_line
		(start -9.2 -5.5)
		(end -8.7 -6)
		(stroke
			(width 0.1)
			(type solid)
		)
		(layer "F.Fab")
		(uuid "c6e84671-503a-43fe-b210-94c38d038c80")
	)
	(fp_line
		(start -9.2 6)
		(end -9.2 -6)
		(stroke
			(width 0.1)
			(type solid)
		)
		(layer "F.Fab")
		(uuid "13697f29-923c-42fa-993f-70a857aa9573")
	)
	(fp_line
		(start 9.2 -6)
		(end 9.2 6)
		(stroke
			(width 0.1)
			(type solid)
		)
		(layer "F.Fab")
		(uuid "71496486-7251-4f64-ad49-20852f49460a")
	)
	(fp_line
		(start 9.2 6)
		(end -9.2 6)
		(stroke
			(width 0.1)
			(type solid)
		)
		(layer "F.Fab")
		(uuid "9454bd81-816b-4461-8753-a1d9dac9ec59")
	)
	(fp_text user "${REFERENCE}"
		(at 0 0 0)
		(layer "F.Fab")
		(uuid "9bde2702-8518-4b7f-97fa-ad6d4eaf9da3")
		(effects
			(font
				(size 1.27 1.27)
				(thickness 0.254)
			)
		)
	)
	(pad "1" smd rect
		(at -9.85 -5.75 90)
		(size 0.3 1.3)
		(layers "F.Cu" "F.Paste" "F.Mask")
		(uuid "60a16dd5-dc41-499e-8da5-8ca624a119c3")
	)
	(pad "2" smd rect
		(at -9.85 -5.25 90)
		(size 0.3 1.3)
		(layers "F.Cu" "F.Paste" "F.Mask")
		(uuid "3d6e2445-8787-410d-8ba5-585fbfdf68d4")
	)
	(pad "3" smd rect
		(at -9.85 -4.75 90)
		(size 0.3 1.3)
		(layers "F.Cu" "F.Paste" "F.Mask")
		(uuid "190f5bc7-c985-46d6-937b-dd5d8a33f120")
	)
	(pad "4" smd rect
		(at -9.85 -4.25 90)
		(size 0.3 1.3)
		(layers "F.Cu" "F.Paste" "F.Mask")
		(uuid "92a036ee-2eaf-4df7-aa48-0373bd3f397d")
	)
	(pad "5" smd rect
		(at -9.85 -3.75 90)
		(size 0.3 1.3)
		(layers "F.Cu" "F.Paste" "F.Mask")
		(uuid "be475135-f038-458c-bffe-59f0529dc44d")
	)
	(pad "6" smd rect
		(at -9.85 -3.25 90)
		(size 0.3 1.3)
		(layers "F.Cu" "F.Paste" "F.Mask")
		(uuid "0355f115-f227-45da-a267-43b16d900605")
	)
	(pad "7" smd rect
		(at -9.85 -2.75 90)
		(size 0.3 1.3)
		(layers "F.Cu" "F.Paste" "F.Mask")
		(uuid "7a05027b-d12a-42d4-854c-3468f11ed2ba")
	)
	(pad "8" smd rect
		(at -9.85 -2.25 90)
		(size 0.3 1.3)
		(layers "F.Cu" "F.Paste" "F.Mask")
		(uuid "eebbd492-a566-4b82-9b08-5fd39b587e13")
	)
	(pad "9" smd rect
		(at -9.85 -1.75 90)
		(size 0.3 1.3)
		(layers "F.Cu" "F.Paste" "F.Mask")
		(uuid "17be59d7-41cb-4af1-895b-1f1278828be6")
	)
	(pad "10" smd rect
		(at -9.85 -1.25 90)
		(size 0.3 1.3)
		(layers "F.Cu" "F.Paste" "F.Mask")
		(uuid "62120d20-8bf5-43f2-a460-179ac8b89993")
	)
	(pad "11" smd rect
		(at -9.85 -0.75 90)
		(size 0.3 1.3)
		(layers "F.Cu" "F.Paste" "F.Mask")
		(uuid "6932acca-2bb1-479f-a89e-cbae9d95acef")
	)
	(pad "12" smd rect
		(at -9.85 -0.25 90)
		(size 0.3 1.3)
		(layers "F.Cu" "F.Paste" "F.Mask")
		(uuid "854e4e80-f449-47be-b161-1d21601bab1d")
	)
	(pad "13" smd rect
		(at -9.85 0.25 90)
		(size 0.3 1.3)
		(layers "F.Cu" "F.Paste" "F.Mask")
		(uuid "0210caa3-0cef-4cec-b0cd-28ce274e59c7")
	)
	(pad "14" smd rect
		(at -9.85 0.75 90)
		(size 0.3 1.3)
		(layers "F.Cu" "F.Paste" "F.Mask")
		(uuid "4048471c-60a2-4149-98d7-3c5ccbd2359e")
	)
	(pad "15" smd rect
		(at -9.85 1.25 90)
		(size 0.3 1.3)
		(layers "F.Cu" "F.Paste" "F.Mask")
		(uuid "ac8a209d-fcbb-4614-8b6d-28b49208e10b")
	)
	(pad "16" smd rect
		(at -9.85 1.75 90)
		(size 0.3 1.3)
		(layers "F.Cu" "F.Paste" "F.Mask")
		(uuid "3f2c9472-1add-476a-bc44-5b5c3c8069b3")
	)
	(pad "17" smd rect
		(at -9.85 2.25 90)
		(size 0.3 1.3)
		(layers "F.Cu" "F.Paste" "F.Mask")
		(uuid "5d1329f1-5454-4038-92bd-19cbd1ba4dcb")
	)
	(pad "18" smd rect
		(at -9.85 2.75 90)
		(size 0.3 1.3)
		(layers "F.Cu" "F.Paste" "F.Mask")
		(uuid "77014dda-90dd-4ec4-9056-8e47ae5af2d9")
	)
	(pad "19" smd rect
		(at -9.85 3.25 90)
		(size 0.3 1.3)
		(layers "F.Cu" "F.Paste" "F.Mask")
		(uuid "b13c1d44-c398-4cdb-ad8e-6780eeee0cb6")
	)
	(pad "20" smd rect
		(at -9.85 3.75 90)
		(size 0.3 1.3)
		(layers "F.Cu" "F.Paste" "F.Mask")
		(uuid "ae85d78b-c6d3-4624-b38d-ba3d83f31fc9")
	)
	(pad "21" smd rect
		(at -9.85 4.25 90)
		(size 0.3 1.3)
		(layers "F.Cu" "F.Paste" "F.Mask")
		(uuid "8b58173a-0989-4404-a35b-384772e5c11e")
	)
	(pad "22" smd rect
		(at -9.85 4.75 90)
		(size 0.3 1.3)
		(layers "F.Cu" "F.Paste" "F.Mask")
		(uuid "62383086-dead-439b-9cb1-dd4b19c8a8b2")
	)
	(pad "23" smd rect
		(at -9.85 5.25 90)
		(size 0.3 1.3)
		(layers "F.Cu" "F.Paste" "F.Mask")
		(uuid "22c4f80e-1d8a-445d-8dcb-f601efa3203a")
	)
	(pad "24" smd rect
		(at -9.85 5.75 90)
		(size 0.3 1.3)
		(layers "F.Cu" "F.Paste" "F.Mask")
		(uuid "162407c1-7ffe-4041-bcab-610b54ef12b3")
	)
	(pad "25" smd rect
		(at 9.85 5.75 90)
		(size 0.3 1.3)
		(layers "F.Cu" "F.Paste" "F.Mask")
		(uuid "40afa63d-2f7c-4e0c-9218-aec94fb01ede")
	)
	(pad "26" smd rect
		(at 9.85 5.25 90)
		(size 0.3 1.3)
		(layers "F.Cu" "F.Paste" "F.Mask")
		(uuid "739711ab-a7a8-4c42-a500-c01751ac98dd")
	)
	(pad "27" smd rect
		(at 9.85 4.75 90)
		(size 0.3 1.3)
		(layers "F.Cu" "F.Paste" "F.Mask")
		(uuid "64a68f58-e944-4a1c-90e0-2222599dacd0")
	)
	(pad "28" smd rect
		(at 9.85 4.25 90)
		(size 0.3 1.3)
		(layers "F.Cu" "F.Paste" "F.Mask")
		(uuid "126a3213-8516-4697-9fa0-b3e632679fb9")
	)
	(pad "29" smd rect
		(at 9.85 3.75 90)
		(size 0.3 1.3)
		(layers "F.Cu" "F.Paste" "F.Mask")
		(uuid "6aa4c204-91ab-4632-ac62-9b6b88f8f742")
	)
	(pad "30" smd rect
		(at 9.85 3.25 90)
		(size 0.3 1.3)
		(layers "F.Cu" "F.Paste" "F.Mask")
		(uuid "213998fb-007b-49e3-831d-5a52b2ec97ae")
	)
	(pad "31" smd rect
		(at 9.85 2.75 90)
		(size 0.3 1.3)
		(layers "F.Cu" "F.Paste" "F.Mask")
		(uuid "04f24a34-f9e0-4de5-a19c-36320f1517cf")
	)
	(pad "32" smd rect
		(at 9.85 2.25 90)
		(size 0.3 1.3)
		(layers "F.Cu" "F.Paste" "F.Mask")
		(uuid "b8b8959d-2705-4b75-9766-2f7c4db696ef")
	)
	(pad "33" smd rect
		(at 9.85 1.75 90)
		(size 0.3 1.3)
		(layers "F.Cu" "F.Paste" "F.Mask")
		(uuid "34cfa374-9c4a-40a0-bd74-9bc2d62c3bb2")
	)
	(pad "34" smd rect
		(at 9.85 1.25 90)
		(size 0.3 1.3)
		(layers "F.Cu" "F.Paste" "F.Mask")
		(uuid "3f82b8b7-7f25-42ca-8a20-46ba2fec2f72")
	)
	(pad "35" smd rect
		(at 9.85 0.75 90)
		(size 0.3 1.3)
		(layers "F.Cu" "F.Paste" "F.Mask")
		(uuid "2706d7cc-aa8b-4078-9752-4cad0e1b1b0b")
	)
	(pad "36" smd rect
		(at 9.85 0.25 90)
		(size 0.3 1.3)
		(layers "F.Cu" "F.Paste" "F.Mask")
		(uuid "65644343-8c1e-4acb-9bfe-6bd86b2574c9")
	)
	(pad "37" smd rect
		(at 9.85 -0.25 90)
		(size 0.3 1.3)
		(layers "F.Cu" "F.Paste" "F.Mask")
		(uuid "12028680-91e7-4ce9-9936-d1ee4b6d6242")
	)
	(pad "38" smd rect
		(at 9.85 -0.75 90)
		(size 0.3 1.3)
		(layers "F.Cu" "F.Paste" "F.Mask")
		(uuid "96b93f5a-0de3-4b93-9191-1053a343acdb")
	)
	(pad "39" smd rect
		(at 9.85 -1.25 90)
		(size 0.3 1.3)
		(layers "F.Cu" "F.Paste" "F.Mask")
		(uuid "ef555665-fbaa-46f6-803f-eb27e5ce0c81")
	)
	(pad "40" smd rect
		(at 9.85 -1.75 90)
		(size 0.3 1.3)
		(layers "F.Cu" "F.Paste" "F.Mask")
		(uuid "cd5ed496-64e6-4308-a6a0-7190ee0f0943")
	)
	(pad "41" smd rect
		(at 9.85 -2.25 90)
		(size 0.3 1.3)
		(layers "F.Cu" "F.Paste" "F.Mask")
		(uuid "4db725d7-b08d-4b7c-b2f9-8e132efd8d29")
	)
	(pad "42" smd rect
		(at 9.85 -2.75 90)
		(size 0.3 1.3)
		(layers "F.Cu" "F.Paste" "F.Mask")
		(uuid "cd03fba1-57ef-4c9c-b715-4cbd7c712602")
	)
	(pad "43" smd rect
		(at 9.85 -3.25 90)
		(size 0.3 1.3)
		(layers "F.Cu" "F.Paste" "F.Mask")
		(uuid "83eccedd-b835-47fa-bb6f-643f5be6d651")
	)
	(pad "44" smd rect
		(at 9.85 -3.75 90)
		(size 0.3 1.3)
		(layers "F.Cu" "F.Paste" "F.Mask")
		(uuid "722eccb7-f534-4f22-8f6f-8dd214a1d850")
	)
	(pad "45" smd rect
		(at 9.85 -4.25 90)
		(size 0.3 1.3)
		(layers "F.Cu" "F.Paste" "F.Mask")
		(uuid "1f18a41a-9976-4238-9a5d-9485a2d073d2")
	)
	(pad "46" smd rect
		(at 9.85 -4.75 90)
		(size 0.3 1.3)
		(layers "F.Cu" "F.Paste" "F.Mask")
		(uuid "43244152-ab99-4603-8d36-9bc4eab3646c")
	)
	(pad "47" smd rect
		(at 9.85 -5.25 90)
		(size 0.3 1.3)
		(layers "F.Cu" "F.Paste" "F.Mask")
		(uuid "53029a89-7c94-4135-96cc-b0c6bf78a56e")
	)
	(pad "48" smd rect
		(at 9.85 -5.75 90)
		(size 0.3 1.3)
		(layers "F.Cu" "F.Paste" "F.Mask")
		(uuid "38252fc4-1065-4dba-a10a-c6463b89e199")
	)
	(model "${KIPRJMOD}/3D/MT29F64G08AFAAAWP-ITZ_A_TR.stp"
		(offset
			(xyz 0 0 0)
		)
		(scale
			(xyz 1 1 1)
		)
		(rotate
			(xyz 0 0 0)
		)
	)
)
