(module SOIC127P620X160-16N (layer F.Cu) (tedit 0)
  (descr SOP16)
  (tags Transistor)
  (attr smd)
  (fp_text reference Q** (at 0 0) (layer F.SilkS)
    (effects (font (size 1.27 1.27) (thickness 0.254)))
  )
  (fp_text value SOIC127P620X160-16N (at 0 0) (layer F.SilkS) hide
    (effects (font (size 1.27 1.27) (thickness 0.254)))
  )
  (fp_text user %R (at 0 0) (layer F.Fab)
    (effects (font (size 1.27 1.27) (thickness 0.254)))
  )
  (fp_line (start -3.875 -5.35) (end 3.875 -5.35) (layer F.CrtYd) (width 0.05))
  (fp_line (start 3.875 -5.35) (end 3.875 5.35) (layer F.CrtYd) (width 0.05))
  (fp_line (start 3.875 5.35) (end -3.875 5.35) (layer F.CrtYd) (width 0.05))
  (fp_line (start -3.875 5.35) (end -3.875 -5.35) (layer F.CrtYd) (width 0.05))
  (fp_line (start -2.2 -5) (end 2.2 -5) (layer F.Fab) (width 0.1))
  (fp_line (start 2.2 -5) (end 2.2 5) (layer F.Fab) (width 0.1))
  (fp_line (start 2.2 5) (end -2.2 5) (layer F.Fab) (width 0.1))
  (fp_line (start -2.2 5) (end -2.2 -5) (layer F.Fab) (width 0.1))
  (fp_line (start -2.2 -3.73) (end -0.93 -5) (layer F.Fab) (width 0.1))
  (fp_line (start -1.925 -5) (end 1.925 -5) (layer F.SilkS) (width 0.2))
  (fp_line (start 1.925 -5) (end 1.925 5) (layer F.SilkS) (width 0.2))
  (fp_line (start 1.925 5) (end -1.925 5) (layer F.SilkS) (width 0.2))
  (fp_line (start -1.925 5) (end -1.925 -5) (layer F.SilkS) (width 0.2))
  (fp_line (start -3.625 -5.12) (end -2.275 -5.12) (layer F.SilkS) (width 0.2))
  (pad 16 smd rect (at 2.95 -4.445 90) (size 0.65 1.35) (layers F.Cu F.Paste F.Mask))
  (pad 15 smd rect (at 2.95 -3.175 90) (size 0.65 1.35) (layers F.Cu F.Paste F.Mask))
  (pad 14 smd rect (at 2.95 -1.905 90) (size 0.65 1.35) (layers F.Cu F.Paste F.Mask))
  (pad 13 smd rect (at 2.95 -0.635 90) (size 0.65 1.35) (layers F.Cu F.Paste F.Mask))
  (pad 12 smd rect (at 2.95 0.635 90) (size 0.65 1.35) (layers F.Cu F.Paste F.Mask))
  (pad 11 smd rect (at 2.95 1.905 90) (size 0.65 1.35) (layers F.Cu F.Paste F.Mask))
  (pad 10 smd rect (at 2.95 3.175 90) (size 0.65 1.35) (layers F.Cu F.Paste F.Mask))
  (pad 9 smd rect (at 2.95 4.445 90) (size 0.65 1.35) (layers F.Cu F.Paste F.Mask))
  (pad 8 smd rect (at -2.95 4.445 90) (size 0.65 1.35) (layers F.Cu F.Paste F.Mask))
  (pad 7 smd rect (at -2.95 3.175 90) (size 0.65 1.35) (layers F.Cu F.Paste F.Mask))
  (pad 6 smd rect (at -2.95 1.905 90) (size 0.65 1.35) (layers F.Cu F.Paste F.Mask))
  (pad 5 smd rect (at -2.95 0.635 90) (size 0.65 1.35) (layers F.Cu F.Paste F.Mask))
  (pad 4 smd rect (at -2.95 -0.635 90) (size 0.65 1.35) (layers F.Cu F.Paste F.Mask))
  (pad 3 smd rect (at -2.95 -1.905 90) (size 0.65 1.35) (layers F.Cu F.Paste F.Mask))
  (pad 2 smd rect (at -2.95 -3.175 90) (size 0.65 1.35) (layers F.Cu F.Paste F.Mask))
  (pad 1 smd rect (at -2.95 -4.445 90) (size 0.65 1.35) (layers F.Cu F.Paste F.Mask))
  (model BA12003BF-E2.stp
    (at (xyz 0 0 0))
    (scale (xyz 1 1 1))
    (rotate (xyz 0 0 0))
  )
)
