(module "SOT95P275X110-6N" (layer F.Cu)
  (descr "PIMN31F")
  (tags "Integrated Circuit")
  (attr smd)
  (fp_text reference IC** (at 0 0) (layer F.SilkS)
    (effects (font (size 1.27 1.27) (thickness 0.254)))
  )
  (fp_text user %R (at 0 0) (layer F.Fab)
    (effects (font (size 1.27 1.27) (thickness 0.254)))
  )
  (fp_text value "SOT95P275X110-6N" (at 0 0) (layer F.SilkS) hide
    (effects (font (size 1.27 1.27) (thickness 0.254)))
  )
  (fp_line (start -2.125 -1.8) (end 2.125 -1.8) (layer F.CrtYd) (width 0.05))
  (fp_line (start 2.125 -1.8) (end 2.125 1.8) (layer F.CrtYd) (width 0.05))
  (fp_line (start 2.125 1.8) (end -2.125 1.8) (layer F.CrtYd) (width 0.05))
  (fp_line (start -2.125 1.8) (end -2.125 -1.8) (layer F.CrtYd) (width 0.05))
  (fp_line (start -0.75 -1.45) (end 0.75 -1.45) (layer F.Fab) (width 0.1))
  (fp_line (start 0.75 -1.45) (end 0.75 1.45) (layer F.Fab) (width 0.1))
  (fp_line (start 0.75 1.45) (end -0.75 1.45) (layer F.Fab) (width 0.1))
  (fp_line (start -0.75 1.45) (end -0.75 -1.45) (layer F.Fab) (width 0.1))
  (fp_line (start -0.75 -0.5) (end 0.2 -1.45) (layer F.Fab) (width 0.1))
  (fp_line (start -0.275 -1.45) (end 0.275 -1.45) (layer F.SilkS) (width 0.2))
  (fp_line (start 0.275 -1.45) (end 0.275 1.45) (layer F.SilkS) (width 0.2))
  (fp_line (start 0.275 1.45) (end -0.275 1.45) (layer F.SilkS) (width 0.2))
  (fp_line (start -0.275 1.45) (end -0.275 -1.45) (layer F.SilkS) (width 0.2))
  (fp_line (start -1.875 -1.55) (end -0.625 -1.55) (layer F.SilkS) (width 0.2))
  (pad 1 smd rect (at -1.25 -0.95 90) (size 0.5 1.25) (layers F.Cu F.Paste F.Mask))
  (pad 2 smd rect (at -1.25 0 90) (size 0.5 1.25) (layers F.Cu F.Paste F.Mask))
  (pad 3 smd rect (at -1.25 0.95 90) (size 0.5 1.25) (layers F.Cu F.Paste F.Mask))
  (pad 4 smd rect (at 1.25 0.95 90) (size 0.5 1.25) (layers F.Cu F.Paste F.Mask))
  (pad 5 smd rect (at 1.25 0 90) (size 0.5 1.25) (layers F.Cu F.Paste F.Mask))
  (pad 6 smd rect (at 1.25 -0.95 90) (size 0.5 1.25) (layers F.Cu F.Paste F.Mask))
  (model "C:\\Users\\wmaker\\Desktop\\kicadlib\\SamacSys_Parts.3dshapes\\PIMN31F.stp"
    (at (xyz 0 0 0))
    (scale (xyz 1 1 1))
    (rotate (xyz 0 0 0))
  )
)
