(module "182025113R531" (layer F.Cu)
  (descr "182-025-113R531-2")
  (tags "Connector")
  (fp_text reference J** (at 16.620 7.755) (layer F.SilkS)
    (effects (font (size 1.27 1.27) (thickness 0.254)))
  )
  (fp_text user %R (at 16.620 7.755) (layer F.Fab)
    (effects (font (size 1.27 1.27) (thickness 0.254)))
  )
  (fp_text value "182025113R531" (at 16.620 7.755) (layer F.SilkS) hide
    (effects (font (size 1.27 1.27) (thickness 0.254)))
  )
  (fp_line (start -9.9 -1.5) (end 43.14 -1.5) (layer F.Fab) (width 0.2))
  (fp_line (start 43.14 -1.5) (end 43.14 10.92) (layer F.Fab) (width 0.2))
  (fp_line (start 43.14 10.92) (end -9.9 10.92) (layer F.Fab) (width 0.2))
  (fp_line (start -9.9 10.92) (end -9.9 -1.5) (layer F.Fab) (width 0.2))
  (fp_line (start -2.86 10.92) (end 36.1 10.92) (layer F.Fab) (width 0.2))
  (fp_line (start 36.1 10.92) (end 36.1 17.01) (layer F.Fab) (width 0.2))
  (fp_line (start 36.1 17.01) (end -2.86 17.01) (layer F.Fab) (width 0.2))
  (fp_line (start -2.86 17.01) (end -2.86 10.92) (layer F.Fab) (width 0.2))
  (fp_line (start -9.9 -1.5) (end 43.14 -1.5) (layer F.SilkS) (width 0.1))
  (fp_line (start 43.14 -1.5) (end 43.14 10.92) (layer F.SilkS) (width 0.1))
  (fp_line (start 43.14 10.92) (end -9.9 10.92) (layer F.SilkS) (width 0.1))
  (fp_line (start -9.9 10.92) (end -9.9 -1.5) (layer F.SilkS) (width 0.1))
  (fp_line (start -10.9 -2.5) (end 44.14 -2.5) (layer F.CrtYd) (width 0.1))
  (fp_line (start 44.14 -2.5) (end 44.14 18.01) (layer F.CrtYd) (width 0.1))
  (fp_line (start 44.14 18.01) (end -10.9 18.01) (layer F.CrtYd) (width 0.1))
  (fp_line (start -10.9 18.01) (end -10.9 -2.5) (layer F.CrtYd) (width 0.1))
  (pad 1 thru_hole circle (at 0.000 -0) (size 1.665 1.665) (drill 1.11) (layers *.Cu *.Mask))
  (pad 2 thru_hole circle (at 2.770 -0) (size 1.665 1.665) (drill 1.11) (layers *.Cu *.Mask))
  (pad 3 thru_hole circle (at 5.540 -0) (size 1.665 1.665) (drill 1.11) (layers *.Cu *.Mask))
  (pad 4 thru_hole circle (at 8.310 -0) (size 1.665 1.665) (drill 1.11) (layers *.Cu *.Mask))
  (pad 5 thru_hole circle (at 11.080 -0) (size 1.665 1.665) (drill 1.11) (layers *.Cu *.Mask))
  (pad 6 thru_hole circle (at 13.850 -0) (size 1.665 1.665) (drill 1.11) (layers *.Cu *.Mask))
  (pad 7 thru_hole circle (at 16.620 -0) (size 1.665 1.665) (drill 1.11) (layers *.Cu *.Mask))
  (pad 8 thru_hole circle (at 19.390 -0) (size 1.665 1.665) (drill 1.11) (layers *.Cu *.Mask))
  (pad 9 thru_hole circle (at 22.160 -0) (size 1.665 1.665) (drill 1.11) (layers *.Cu *.Mask))
  (pad 10 thru_hole circle (at 24.930 -0) (size 1.665 1.665) (drill 1.11) (layers *.Cu *.Mask))
  (pad 11 thru_hole circle (at 27.700 -0) (size 1.665 1.665) (drill 1.11) (layers *.Cu *.Mask))
  (pad 12 thru_hole circle (at 30.470 -0) (size 1.665 1.665) (drill 1.11) (layers *.Cu *.Mask))
  (pad 13 thru_hole circle (at 33.240 -0) (size 1.665 1.665) (drill 1.11) (layers *.Cu *.Mask))
  (pad 14 thru_hole circle (at 1.385 2.84) (size 1.665 1.665) (drill 1.11) (layers *.Cu *.Mask))
  (pad 15 thru_hole circle (at 4.155 2.84) (size 1.665 1.665) (drill 1.11) (layers *.Cu *.Mask))
  (pad 16 thru_hole circle (at 6.925 2.84) (size 1.665 1.665) (drill 1.11) (layers *.Cu *.Mask))
  (pad 17 thru_hole circle (at 9.695 2.84) (size 1.665 1.665) (drill 1.11) (layers *.Cu *.Mask))
  (pad 18 thru_hole circle (at 12.465 2.84) (size 1.665 1.665) (drill 1.11) (layers *.Cu *.Mask))
  (pad 19 thru_hole circle (at 15.235 2.84) (size 1.665 1.665) (drill 1.11) (layers *.Cu *.Mask))
  (pad 20 thru_hole circle (at 18.005 2.84) (size 1.665 1.665) (drill 1.11) (layers *.Cu *.Mask))
  (pad 21 thru_hole circle (at 20.775 2.84) (size 1.665 1.665) (drill 1.11) (layers *.Cu *.Mask))
  (pad 22 thru_hole circle (at 23.545 2.84) (size 1.665 1.665) (drill 1.11) (layers *.Cu *.Mask))
  (pad 23 thru_hole circle (at 26.315 2.84) (size 1.665 1.665) (drill 1.11) (layers *.Cu *.Mask))
  (pad 24 thru_hole circle (at 29.085 2.84) (size 1.665 1.665) (drill 1.11) (layers *.Cu *.Mask))
  (pad 25 thru_hole circle (at 31.855 2.84) (size 1.665 1.665) (drill 1.11) (layers *.Cu *.Mask))
  (pad MH1 thru_hole circle (at -6.900 1.42) (size 4.575 4.575) (drill 3.05) (layers *.Cu *.Mask))
  (pad MH2 thru_hole circle (at 40.140 1.42) (size 4.575 4.575) (drill 3.05) (layers *.Cu *.Mask))
  (model "C:\\Users\\wmaker\\Desktop\\kicadlib\\SamacSys_Parts.3dshapes\\182-025-113R531.stp"
    (at (xyz 0 0 0))
    (scale (xyz 1 1 1))
    (rotate (xyz 0 0 0))
  )
)
