(footprint "Bear"
	(version 20240108)
	(generator "pcbnew")
	(generator_version "8.0")
	(layer "F.Cu")
	(property "Reference" "G***"
		(at 0 0 0)
		(layer "F.SilkS")
		(hide yes)
		(uuid "969d59f4-46ac-40d8-9d46-0712ef286455")
		(effects
			(font
				(size 1.5 1.5)
				(thickness 0.3)
			)
		)
	)
	(property "Value" "LOGO"
		(at 0.75 0 0)
		(layer "F.SilkS")
		(hide yes)
		(uuid "9977f3d1-6608-4f53-b96c-cd1081898d78")
		(effects
			(font
				(size 1.5 1.5)
				(thickness 0.3)
			)
		)
	)
	(property "Footprint" ""
		(at 0 0 0)
		(layer "F.Fab")
		(hide yes)
		(uuid "08db3821-cc28-47b8-b551-b74d185b116b")
		(effects
			(font
				(size 1.27 1.27)
				(thickness 0.15)
			)
		)
	)
	(property "Datasheet" ""
		(at 0 0 0)
		(layer "F.Fab")
		(hide yes)
		(uuid "7fb62acf-7949-4d74-926d-47749c6b5d9d")
		(effects
			(font
				(size 1.27 1.27)
				(thickness 0.15)
			)
		)
	)
	(property "Description" ""
		(at 0 0 0)
		(layer "F.Fab")
		(hide yes)
		(uuid "fd892b79-a7a5-4254-9cb1-4f259b5447d0")
		(effects
			(font
				(size 1.27 1.27)
				(thickness 0.15)
			)
		)
	)
	(attr board_only exclude_from_pos_files exclude_from_bom)
	(fp_poly
		(pts
			(xy 1.408773 -0.9544) (xy 1.436189 -0.934494) (xy 1.458046 -0.91547) (xy 1.508059 -0.868819) (xy 1.45806 -0.843311)
			(xy 1.424375 -0.826675) (xy 1.401733 -0.8202) (xy 1.380241 -0.823984) (xy 1.350009 -0.838125) (xy 1.337546 -0.844509)
			(xy 1.304728 -0.865334) (xy 1.289846 -0.883966) (xy 1.289524 -0.889019) (xy 1.301806 -0.907376) (xy 1.327425 -0.929609)
			(xy 1.357846 -0.949587) (xy 1.384532 -0.961179) (xy 1.391306 -0.962121)
		)
		(stroke
			(width 0)
			(type solid)
		)
		(fill solid)
		(layer "F.SilkS")
		(uuid "6a9fbec9-75d4-4434-818b-b522b0a62ce6")
	)
	(fp_poly
		(pts
			(xy 1.90033 -1.631613) (xy 1.950558 -1.60137) (xy 1.993395 -1.551543) (xy 2.014314 -1.502306) (xy 2.021745 -1.44138)
			(xy 2.015712 -1.376978) (xy 1.996237 -1.317312) (xy 1.992729 -1.310351) (xy 1.965004 -1.257922) (xy 2.005193 -1.191201)
			(xy 2.053249 -1.09383) (xy 2.081808 -0.991414) (xy 2.092461 -0.877952) (xy 2.092613 -0.861156) (xy 2.090489 -0.801082)
			(xy 2.08485 -0.740077) (xy 2.076797 -0.68919) (xy 2.074454 -0.679018) (xy 2.048092 -0.599532) (xy 2.008075 -0.510516)
			(xy 1.958041 -0.419162) (xy 1.901627 -0.33266) (xy 1.893778 -0.321825) (xy 1.850119 -0.267386) (xy 1.810917 -0.231886)
			(xy 1.770858 -0.212284) (xy 1.72463 -0.205539) (xy 1.692086 -0.206373) (xy 1.643852 -0.19845) (xy 1.61532 -0.18308)
			(xy 1.587677 -0.159259) (xy 1.55441 -0.124595) (xy 1.519556 -0.084124) (xy 1.487151 -0.042881) (xy 1.461234 -0.0059)
			(xy 1.445842 0.021784) (xy 1.443324 0.031405) (xy 1.44643 0.055352) (xy 1.454261 0.092623) (xy 1.461194 0.120265)
			(xy 1.479274 0.199305) (xy 1.494182 0.290713) (xy 1.506159 0.396944) (xy 1.515446 0.520449) (xy 1.52228 0.663682)
			(xy 1.52585 0.781723) (xy 1.533877 1.112452) (xy 1.571777 1.192978) (xy 1.600188 1.245854) (xy 1.630764 1.284272)
			(xy 1.668642 1.315865) (xy 1.720878 1.361351) (xy 1.74917 1.405649) (xy 1.753586 1.448952) (xy 1.734194 1.491455)
			(xy 1.731671 1.494756) (xy 1.698772 1.52332) (xy 1.662291 1.53533) (xy 1.627896 1.531692) (xy 1.601258 1.513313)
			(xy 1.588044 1.4811) (xy 1.5875 1.471687) (xy 1.578963 1.433295) (xy 1.56244 1.405428) (xy 1.546173 1.388126)
			(xy 1.542402 1.388775) (xy 1.546347 1.401089) (xy 1.558277 1.44919) (xy 1.559458 1.494883) (xy 1.549826 1.52935)
			(xy 1.547288 1.533221) (xy 1.532699 1.549437) (xy 1.519632 1.547277) (xy 1.50646 1.536227) (xy 1.476474 1.519968)
			(xy 1.451255 1.515341) (xy 1.428588 1.511952) (xy 1.4201 1.496832) (xy 1.419129 1.478336) (xy 1.407548 1.436347)
			(xy 1.383974 1.406177) (xy 1.355559 1.381276) (xy 1.33777 1.372145) (xy 1.333128 1.378473) (xy 1.344153 1.399951)
			(xy 1.351546 1.410162) (xy 1.384769 1.462086) (xy 1.397774 1.505292) (xy 1.393314 1.538046) (xy 1.384241 1.557706)
			(xy 1.373584 1.557584) (xy 1.358564 1.545016) (xy 1.340477 1.533955) (xy 1.311646 1.525962) (xy 1.267471 1.520127)
			(xy 1.211466 1.516013) (xy 1.156612 1.511491) (xy 1.10845 1.505183) (xy 1.073584 1.498074) (xy 1.061464 1.493653)
			(xy 1.031073 1.465429) (xy 1.008048 1.423961) (xy 0.998241 1.38001) (xy 0.998201 1.377335) (xy 0.989641 1.348959)
			(xy 0.968134 1.334943) (xy 0.945022 1.318951) (xy 0.938089 1.290371) (xy 0.938068 1.287917) (xy 0.933359 1.248867)
			(xy 0.924735 1.218467) (xy 0.914918 1.195698) (xy 0.908233 1.193818) (xy 0.898999 1.211336) (xy 0.898844 1.211671)
			(xy 0.886755 1.232252) (xy 0.879104 1.238708) (xy 0.871802 1.228265) (xy 0.86053 1.201364) (xy 0.851591 1.175569)
			(xy 0.82519 1.095124) (xy 0.804453 1.0358) (xy 0.78848 0.995577) (xy 0.776369 0.972435) (xy 0.767222 0.964357)
			(xy 0.760139 0.969321) (xy 0.759877 0.969777) (xy 0.750755 0.982361) (xy 0.74459 0.975867) (xy 0.739354 0.955938)
			(xy 0.732584 0.9307) (xy 0.720171 0.888443) (xy 0.703876 0.835035) (xy 0.68546 0.776342) (xy 0.685259 0.77571)
			(xy 0.66665 0.715667) (xy 0.650132 0.659501) (xy 0.637524 0.613582) (xy 0.63072 0.5847) (xy 0.624073 0.556658)
			(xy 0.617453 0.549917) (xy 0.611145 0.557591) (xy 0.601332 0.584526) (xy 0.590761 0.628347) (xy 0.580656 0.681969)
			(xy 0.572239 0.738306) (xy 0.566733 0.790273) (xy 0.565246 0.823545) (xy 0.570469 0.899723) (xy 0.584755 0.987332)
			(xy 0.606025 1.076485) (xy 0.632202 1.157296) (xy 0.638933 1.174231) (xy 0.663984 1.229538) (xy 0.686714 1.266142)
			(xy 0.710972 1.288583) (xy 0.740608 1.301407) (xy 0.74843 1.303435) (xy 0.786439 1.320964) (xy 0.827461 1.352661)
			(xy 0.863506 1.391306) (xy 0.88574 1.427574) (xy 0.898302 1.462399) (xy 0.901141 1.481385) (xy 0.89464 1.482308)
			(xy 0.879587 1.463566) (xy 0.83702 1.41683) (xy 0.786388 1.392491) (xy 0.777799 1.394178) (xy 0.786454 1.408425)
			(xy 0.813084 1.436338) (xy 0.819461 1.44253) (xy 0.852156 1.476231) (xy 0.870023 1.502069) (xy 0.877133 1.527056)
			(xy 0.877935 1.543196) (xy 0.875496 1.57189) (xy 0.869462 1.586873) (xy 0.867757 1.5875) (xy 0.837215 1.578464)
			(xy 0.80369 1.556144) (xy 0.776835 1.527721) (xy 0.769231 1.514216) (xy 0.740581 1.472144) (xy 0.694135 1.444083)
			(xy 0.673485 1.437268) (xy 0.658152 1.434248) (xy 0.658507 1.439668) (xy 0.675892 1.456158) (xy 0.688769 1.467164)
			(xy 0.733969 1.513036) (xy 0.760576 1.557381) (xy 0.767286 1.597323) (xy 0.758906 1.621992) (xy 0.748114 1.630496)
			(xy 0.732367 1.621828) (xy 0.72301 1.612972) (xy 0.699 1.594521) (xy 0.679742 1.5875) (xy 0.663811 1.577635)
			(xy 0.644877 1.552844) (xy 0.638082 1.540721) (xy 0.605996 1.498073) (xy 0.575911 1.480588) (xy 0.540064 1.469702)
			(xy 0.52408 1.468567) (xy 0.528843 1.476907) (xy 0.547206 1.489611) (xy 0.595494 1.526956) (xy 0.622264 1.567399)
			(xy 0.629995 1.607017) (xy 0.626994 1.641472) (xy 0.615309 1.65368) (xy 0.595243 1.643451) (xy 0.586292 1.634532)
			(xy 0.57528 1.625113) (xy 0.559676 1.618658) (xy 0.535186 1.614622) (xy 0.497513 1.612463) (xy 0.44236 1.611636)
			(xy 0.404667 1.611553) (xy 0.325683 1.610315) (xy 0.266339 1.605315) (xy 0.222293 1.594622) (xy 0.189202 1.576306)
			(xy 0.162722 1.548437) (xy 0.138512 1.509086) (xy 0.127918 1.488556) (xy 0.108824 1.451687) (xy 0.095849 1.432917)
			(xy 0.084763 1.428633) (xy 0.071338 1.435221) (xy 0.068116 1.437444) (xy 0.041176 1.452907) (xy 0.027556 1.450475)
			(xy 0.024053 1.431911) (xy 0.020379 1.416581) (xy 0.004908 1.412649) (xy -0.016297 1.415162) (xy -0.041778 1.417902)
			(xy -0.054772 1.41129) (xy -0.06162 1.389549) (xy -0.064748 1.371043) (xy -0.08065 1.323791) (xy -0.10909 1.284207)
			(xy -0.144749 1.25808) (xy -0.175238 1.250757) (xy -0.208008 1.250757) (xy -0.168249 1.277817) (xy -0.120447 1.319002)
			(xy -0.090193 1.363946) (xy -0.081373 1.395076) (xy -0.078173 1.425142) (xy -0.31269 1.428554) (xy -0.386983 1.429296)
			(xy -0.454339 1.429332) (xy -0.51055 1.428711) (xy -0.551409 1.427481) (xy -0.572711 1.42569) (xy -0.573339 1.425551)
			(xy -0.616673 1.404203) (xy -0.657911 1.365574) (xy -0.692249 1.316286) (xy -0.71488 1.262959) (xy -0.721327 1.221694)
			(xy -0.721591 1.186617) (xy -0.761888 1.233234) (xy -0.802184 1.27985) (xy -0.80818 1.196055) (xy -0.814321 1.146708)
			(xy -0.824387 1.101142) (xy -0.834896 1.072191) (xy -0.849281 1.046789) (xy -0.860076 1.040045) (xy -0.874166 1.048965)
			(xy -0.878803 1.053104) (xy -0.894117 1.065394) (xy -0.900564 1.061757) (xy -0.901974 1.038515) (xy -0.901989 1.030847)
			(xy -0.908565 0.995246) (xy -0.928595 0.942931) (xy -0.962535 0.872751) (xy -0.964298 0.86937) (xy -0.250406 0.86937)
			(xy -0.246929 0.908002) (xy -0.235768 0.984524) (xy -0.218402 1.04338) (xy -0.192572 1.090632) (xy -0.167676 1.120648)
			(xy -0.135443 1.147924) (xy -0.10372 1.164157) (xy -0.07761 1.168041) (xy -0.062217 1.158272) (xy -0.060133 1.148146)
			(xy -0.064844 1.125806) (xy -0.076529 1.093462) (xy -0.080182 1.085006) (xy -0.100232 1.040293) (xy -0.107242 1.081709)
			(xy -0.110816 1.099721) (xy -0.115267 1.106664) (xy -0.122728 1.100102) (xy -0.135336 1.077597) (xy -0.155225 1.036714)
			(xy -0.165365 1.01537) (xy -0.187114 0.96832) (xy -0.204261 0.928944) (xy -0.214543 0.902566) (xy -0.216477 0.895074)
			(xy -0.223417 0.876786) (xy -0.235342 0.859188) (xy -0.245498 0.848267) (xy -0.250235 0.85046) (xy -0.250406 0.86937)
			(xy -0.964298 0.86937) (xy -0.970434 0.857605) (xy -0.99985 0.798872) (xy -1.026903 0.739732) (xy -1.048271 0.687743)
			(xy -1.059307 0.655445) (xy -1.07063 0.616768) (xy -1.078029 0.598435) (xy -1.083943 0.597591) (xy -1.090808 0.611385)
			(xy -1.092763 0.616289) (xy -1.102832 0.640745) (xy -1.119894 0.68112) (xy -1.141343 0.731281) (xy -1.159173 0.772634)
			(xy -1.196126 0.861059) (xy -1.222212 0.932207) (xy -1.237984 0.989969) (xy -1.243994 1.038237) (xy -1.240796 1.080904)
			(xy -1.228941 1.12186) (xy -1.213608 1.155984) (xy -1.195188 1.18485) (xy -1.170836 1.202102) (xy -1.134055 1.213811)
			(xy -1.060951 1.241114) (xy -1.002567 1.281935) (xy -0.962867 1.333489) (xy -0.962359 1.334477) (xy -0.944963 1.370243)
			(xy -0.940256 1.386014) (xy -0.949149 1.382329) (xy -0.972553 1.359727) (xy -0.984312 1.347476) (xy -1.021454 1.314762)
			(xy -1.052787 1.299616) (xy -1.059478 1.298908) (xy -1.077314 1.299781) (xy -1.077163 1.304833) (xy -1.057818 1.317835)
			(xy -1.05232 1.321239) (xy -1.005801 1.357186) (xy -0.977195 1.395043) (xy -0.968205 1.43159) (xy -0.978489 1.460968)
			(xy -0.997439 1.475705) (xy -1.031289 1.484809) (xy -1.068744 1.488842) (xy -1.109203 1.491327) (xy -1.131259 1.489977)
			(xy -1.140496 1.482766) (xy -1.142496 1.467668) (xy -1.142519 1.46207) (xy -1.153865 1.409095) (xy -1.185662 1.364392)
			(xy -1.230218 1.334709) (xy -1.2613 1.322734) (xy -1.282364 1.318212) (xy -1.286547 1.319261) (xy -1.283478 1.328628)
			(xy -1.277373 1.331727) (xy -1.248099 1.349204) (xy -1.214387 1.378966) (xy -1.184629 1.41295) (xy -1.171283 1.433673)
			(xy -1.160118 1.457217) (xy -1.156118 1.474758) (xy -1.161888 1.487177) (xy -1.180032 1.495355) (xy -1.213154 1.500175)
			(xy -1.263859 1.502517) (xy -1.334752 1.503264) (xy -1.377045 1.503314) (xy -1.466491 1.502798) (xy -1.535271 1.500586)
			(xy -1.58676 1.495686) (xy -1.624335 1.487104) (xy -1.651372 1.473848) (xy -1.671246 1.454924) (xy -1.687334 1.429338)
			(xy -1.69714 1.409148) (xy -1.713445 1.375014) (xy -1.725196 1.358918) (xy -1.737805 1.357007) (xy -1.756683 1.365429)
			(xy -1.757762 1.365987) (xy -1.78768 1.379441) (xy -1.802629 1.378511) (xy -1.804903 1.360471) (xy -1.796797 1.322594)
			(xy -1.796203 1.320296) (xy -1.786616 1.2751) (xy -1.780784 1.231711) (xy -1.779957 1.215064) (xy -1.77999 1.172585)
			(xy -1.826537 1.226565) (xy -1.873085 1.280545) (xy -1.867001 1.164233) (xy -1.865151 1.111741) (xy -1.865207 1.066817)
			(xy -1.867082 1.035914) (xy -1.868841 1.027273) (xy -1.87606 1.015315) (xy -1.887536 1.017983) (xy -1.908443 1.035485)
			(xy -1.928623 1.052921) (xy -1.934926 1.054268) (xy -1.930695 1.040293) (xy -1.925573 1.016357) (xy -1.92095 0.975799)
			(xy -1.917136 0.925174) (xy -1.914443 0.871037) (xy -1.913183 0.819943) (xy -1.913668 0.778448) (xy -1.916208 0.753106)
			(xy -1.916934 0.750697) (xy -1.924295 0.737749) (xy -1.935582 0.740767) (xy -1.950347 0.753027) (xy -1.968216 0.767796)
			(xy -1.972493 0.764274) (xy -1.967706 0.741835) (xy -1.961239 0.708694) (xy -1.953801 0.661062) (xy -1.946536 0.607587)
			(xy -1.940587 0.556919) (xy -1.937097 0.517707) (xy -1.93664 0.506819) (xy -1.938256 0.494021) (xy -1.945699 0.493843)
			(xy -1.962135 0.508207) (xy -1.990732 0.539035) (xy -1.991924 0.540361) (xy -2.019953 0.570551) (xy -2.041084 0.591465)
			(xy -2.050971 0.598815) (xy -2.051108 0.598734) (xy -2.049588 0.58642) (xy -2.042508 0.556559) (xy -2.031217 0.514642)
			(xy -2.025754 0.495491) (xy -2.010477 0.43272) (xy -1.997745 0.362425) (xy -1.99022 0.299399) (xy -1.990056 0.297107)
			(xy -1.983239 0.198437) (xy -2.007748 0.242757) (xy -2.025054 0.271665) (xy -2.038636 0.290258) (xy -2.041389 0.292746)
			(xy -2.044387 0.28349) (xy -2.046537 0.254216) (xy -2.047701 0.208948) (xy -2.047737 0.151712) (xy -2.04733 0.122147)
			(xy -2.046265 0.05414) (xy -2.046167 0.007125) (xy -2.047363 -0.021951) (xy -2.050181 -0.036141)
			(xy -2.054948 -0.038497) (xy -2.061991 -0.032074) (xy -2.063651 -0.030067) (xy -2.071288 -0.022144)
			(xy -2.076388 -0.022629) (xy -2.079235 -0.034616) (xy -2.080117 -0.061197) (xy -2.079318 -0.105464)
			(xy -2.077125 -0.170512) (xy -2.076983 -0.174385) (xy -2.064148 -0.337319) (xy -2.041032 -0.4637)
			(xy -1.93155 -0.4637) (xy -1.929407 -0.456293) (xy -1.918177 -0.464167) (xy -1.898103 -0.485682)
			(xy -1.896882 -0.487074) (xy -1.872042 -0.512247) (xy -1.842732 -0.537518) (xy -1.814192 -0.559008)
			(xy -1.79166 -0.572839) (xy -1.780378 -0.575136) (xy -1.779924 -0.573633) (xy -1.784569 -0.56113)
			(xy -1.796917 -0.532303) (xy -1.814587 -0.492669) (xy -1.820455 -0.479748) (xy -1.862576 -0.371755)
			(xy -1.890012 -0.262661) (xy -1.902744 -0.149405) (xy -1.900753 -0.028928) (xy -1.884016 0.101832)
			(xy -1.852516 0.245934) (xy -1.814845 0.378835) (xy -1.798313 0.43) (xy -1.783006 0.472829) (xy -1.770956 0.501873)
			(xy -1.765504 0.511127) (xy -1.757979 0.513615) (xy -1.760842 0.497674) (xy -1.763369 0.471196) (xy -1.76192 0.428405)
			(xy -1.757316 0.376558) (xy -1.75038 0.322911) (xy -1.741932 0.27472) (xy -1.732795 0.239242) (xy -1.73104 0.234517)
			(xy -1.72402 0.218974) (xy -1.718698 0.215454) (xy -1.713822 0.226906) (xy -1.708139 0.256279) (xy -1.700395 0.306518)
			(xy -1.700372 0.306676) (xy -1.675622 0.431713) (xy -1.640903 0.545616) (xy -1.597587 0.645144) (xy -1.547049 0.727054)
			(xy -1.499885 0.779994) (xy -1.468978 0.808331) (xy -1.499459 0.713848) (xy -1.51173 0.667121) (xy -1.522335 0.610629)
			(xy -1.53086 0.549323) (xy -1.536892 0.488156) (xy -1.540017 0.432078) (xy -1.539822 0.386043) (xy -1.535893 0.355)
			(xy -1.530289 0.344561) (xy -1.520307 0.349792) (xy -1.511348 0.373821) (xy -1.509642 0.381947) (xy -1.492184 0.439465)
			(xy -1.462218 0.503013) (xy -1.424962 0.562356) (xy -1.404624 0.587946) (xy -1.367078 0.630709) (xy -1.376574 0.594971)
			(xy -1.381104 0.568951) (xy -1.386251 0.525211) (xy -1.391354 0.470051) (xy -1.395427 0.414915) (xy -1.401174 0.343174)
			(xy -1.408911 0.286613) (xy -1.420378 0.236357) (xy -1.437318 0.183534) (xy -1.445026 0.162358) (xy -1.460364 0.120191)
			(xy -1.471208 0.085878) (xy -1.478336 0.053721) (xy -1.482525 0.018024) (xy -1.484553 -0.026911)
			(xy -1.485198 -0.086779) (xy -1.485245 -0.132292) (xy -1.484784 -0.20796) (xy -1.483035 -0.26531)
			(xy -1.479413 -0.310068) (xy -1.473331 -0.34796) (xy -1.464204 -0.384711) (xy -1.456973 -0.408756)
			(xy -1.440204 -0.458161) (xy -1.421761 -0.50614) (xy -1.403915 -0.547462) (xy -1.388939 -0.576895)
			(xy -1.379103 -0.58921) (xy -1.378554 -0.589299) (xy -1.379061 -0.578813) (xy -1.384611 -0.551808)
			(xy -1.3908 -0.526639) (xy -1.416349 -0.392242) (xy -1.423351 -0.26064) (xy -1.412094 -0.135383)
			(xy -1.382866 -0.020022) (xy -1.342452 0.070588) (xy -1.334527 0.082563) (xy -1.328356 0.082988)
			(xy -1.32242 0.068637) (xy -1.315202 0.036284) (xy -1.307779 -0.003129) (xy -1.295951 -0.058024)
			(xy -1.281614 -0.110893) (xy -1.267503 -0.151864) (xy -1.264885 -0.157903) (xy -1.250525 -0.188051)
			(xy -1.243224 -0.198042) (xy -1.240394 -0.189751) (xy -1.239745 -0.176121) (xy -1.227693 -0.091977)
			(xy -1.19789 0.000201) (xy -1.152917 0.095595) (xy -1.095353 0.189385) (xy -1.027778 0.276752) (xy -0.960043 0.346354)
			(xy -0.921767 0.379983) (xy -0.899631 0.39612) (xy -0.893071 0.394586) (xy -0.901526 0.375198) (xy -0.924433 0.337777)
			(xy -0.925976 0.335385) (xy -0.962993 0.268043) (xy -0.994736 0.191339) (xy -1.018566 0.113285) (xy -1.031844 0.041896)
			(xy -1.033693 0.008399) (xy -1.033105 -0.05412) (xy -1.004144 0.021134) (xy -0.968074 0.100007) (xy -0.922534 0.16964)
			(xy -0.862244 0.23754) (xy -0.830399 0.268139) (xy -0.79535 0.297998) (xy -0.751997 0.331188) (xy -0.705258 0.364398)
			(xy -0.66005 0.394315) (xy -0.62129 0.417624) (xy -0.593897 0.431012) (xy -0.58578 0.432954) (xy -0.588593 0.424074)
			(xy -0.603082 0.400367) (xy -0.626471 0.366236) (xy -0.637636 0.350733) (xy -0.695789 0.258555) (xy -0.738156 0.164648)
			(xy -0.762016 0.075131) (xy -0.762928 0.069152) (xy -0.765352 0.032238) (xy -0.760777 0.013798) (xy -0.751153 0.015597)
			(xy -0.738432 0.039399) (xy -0.736333 0.045099) (xy -0.711788 0.092662) (xy -0.671144 0.147519) (xy -0.619111 0.204894)
			(xy -0.5604 0.260016) (xy -0.499719 0.30811) (xy -0.441777 0.344403) (xy -0.440259 0.345193) (xy -0.416797 0.356388)
			(xy -0.40936 0.354298) (xy -0.412743 0.33694) (xy -0.413298 0.334931) (xy -0.43479 0.240331) (xy -0.448355 0.138029)
			(xy -0.454449 0.022926) (xy -0.453525 -0.110075) (xy -0.453398 -0.114252) (xy -0.447279 -0.233552)
			(xy -0.435985 -0.334466) (xy -0.418001 -0.422383) (xy -0.391814 -0.502689) (xy -0.355909 -0.580773)
			(xy -0.308773 -0.662022) (xy -0.292214 -0.687822) (xy -0.2681 -0.720366) (xy -0.233845 -0.760947)
			(xy -0.19298 -0.805992) (xy -0.149037 -0.851929) (xy -0.105547 -0.895186) (xy -0.066041 -0.93219)
			(xy -0.034052 -0.959368) (xy -0.013109 -0.973149) (xy -0.009176 -0.974148) (xy -0.011267 -0.966142)
			(xy -0.026976 -0.94478) (xy -0.053253 -0.914046) (xy -0.065547 -0.900551) (xy -0.100678 -0.860541)
			(xy -0.138262 -0.814356) (xy -0.175117 -0.766345) (xy -0.208057 -0.720856) (xy -0.233901 -0.682237)
			(xy -0.249463 -0.654836) (xy -0.252557 -0.645141) (xy -0.246475 -0.640577) (xy -0.238125 -0.647027)
			(xy -0.216824 -0.659853) (xy -0.208084 -0.661459) (xy -0.207276 -0.652763) (xy -0.218969 -0.629664)
			(xy -0.240764 -0.596641) (xy -0.248301 -0.586293) (xy -0.31471 -0.482656) (xy -0.363685 -0.372386)
			(xy -0.397037 -0.250552) (xy -0.414465 -0.134139) (xy -0.417626 -0.089875) (xy -0.41547 -0.067897)
			(xy -0.40963 -0.065696) (xy -0.399394 -0.082836) (xy -0.396875 -0.100268) (xy -0.390456 -0.130616)
			(xy -0.373571 -0.173626) (xy -0.349778 -0.222421) (xy -0.322636 -0.270123) (xy -0.295703 -0.309852)
			(xy -0.277988 -0.330085) (xy -0.240296 -0.365521) (xy -0.26979 -0.292934) (xy -0.302247 -0.191577)
			(xy -0.319609 -0.082096) (xy -0.322632 0.040823) (xy -0.321392 0.071267) (xy -0.31579 0.134911) (xy -0.306029 0.20101)
			(xy -0.293348 0.26402) (xy -0.278984 0.3184) (xy -0.264174 0.358606) (xy -0.253235 0.376431) (xy -0.248642 0.369633)
			(xy -0.243743 0.343488) (xy -0.239274 0.30268) (xy -0.237174 0.274205) (xy -0.227408 0.187674) (xy -0.209934 0.103014)
			(xy -0.18659 0.02723) (xy -0.159214 -0.032671) (xy -0.154711 -0.04011) (xy -0.130624 -0.078173) (xy -0.140478 0)
			(xy -0.14385 0.039577) (xy -0.146615 0.096865) (xy -0.148567 0.165527) (xy -0.149498 0.239225) (xy -0.149514 0.27661)
			(xy -0.144005 0.447403) (xy -0.1287 0.59763) (xy -0.103191 0.728871) (xy -0.067067 0.842704) (xy -0.019918 0.940711)
			(xy 0.038665 1.024471) (xy 0.047042 1.03428) (xy 0.083794 1.076373) (xy 0.041916 0.983998) (xy 0.005142 0.893287)
			(xy -0.019571 0.806907) (xy -0.033946 0.716433) (xy -0.039702 0.613441) (xy -0.04 0.582992) (xy -0.038965 0.518444)
			(xy -0.035879 0.466529) (xy -0.031228 0.429238) (xy -0.025497 0.408562) (xy -0.019172 0.406492) (xy -0.012739 0.425017)
			(xy -0.008245 0.452742) (xy -0.000369 0.500128) (xy 0.010232 0.547215) (xy 0.013582 0.559233) (xy 0.02798 0.607339)
			(xy 0.036259 0.569548) (xy 0.045396 0.532058) (xy 0.053452 0.512388) (xy 0.061632 0.511707) (xy 0.071144 0.531183)
			(xy 0.083193 0.571985) (xy 0.097417 0.628791) (xy 0.118032 0.703255) (xy 0.143193 0.777575) (xy 0.170744 0.846579)
			(xy 0.198532 0.905091) (xy 0.224402 0.947935) (xy 0.236197 0.962121) (xy 0.247752 0.971821) (xy 0.249313 0.964485)
			(xy 0.244328 0.944081) (xy 0.236126 0.893117) (xy 0.234918 0.833749) (xy 0.240151 0.775161) (xy 0.251272 0.726535)
			(xy 0.258466 0.709564) (xy 0.281079 0.667471) (xy 0.301222 0.787737) (xy 0.334808 0.924261) (xy 0.387435 1.050146)
			(xy 0.436557 1.132391) (xy 0.457748 1.162349) (xy 0.472672 1.181787) (xy 0.477336 1.186225) (xy 0.474891 1.174714)
			(xy 0.466254 1.146823) (xy 0.454526 1.112168) (xy 0.439191 1.054741) (xy 0.428969 0.983011) (xy 0.423528 0.901988)
			(xy 0.420839 0.843622) (xy 0.418348 0.806586) (xy 0.415468 0.788171) (xy 0.411615 0.785668) (xy 0.406204 0.796365)
			(xy 0.402745 0.805776) (xy 0.387861 0.847869) (xy 0.378783 0.801596) (xy 0.375387 0.763801) (xy 0.375543 0.706951)
			(xy 0.37905 0.635747) (xy 0.385707 0.554893) (xy 0.391664 0.4991) (xy 0.397264 0.450994) (xy 0.378572 0.4991)
			(xy 0.366441 0.539636) (xy 0.356266 0.589575) (xy 0.352611 0.616359) (xy 0.346222 0.6604) (xy 0.339392 0.681313)
			(xy 0.333002 0.679985) (xy 0.327931 0.657306) (xy 0.325057 0.614163) (xy 0.324716 0.588182) (xy 0.329511 0.505139)
			(xy 0.34271 0.40973) (xy 0.36253 0.311378) (xy 0.387191 0.219507) (xy 0.403419 0.171816) (xy 0.417517 0.132092)
			(xy 0.426546 0.102134) (xy 0.428689 0.088021) (xy 0.428527 0.087776) (xy 0.417992 0.092331) (xy 0.398549 0.112171)
			(xy 0.374114 0.142231) (xy 0.348603 0.177448) (xy 0.325932 0.212756) (xy 0.312256 0.238125) (xy 0.296094 0.279527)
			(xy 0.279891 0.332272) (xy 0.268752 0.377795) (xy 0.25918 0.420214) (xy 0.250516 0.452579) (xy 0.244516 0.468388)
			(xy 0.244182 0.468762) (xy 0.238934 0.464376) (xy 0.237729 0.440348) (xy 0.240066 0.400653) (xy 0.245442 0.349271)
			(xy 0.253356 0.290178) (xy 0.263305 0.22735) (xy 0.274787 0.164765) (xy 0.287301 0.106401) (xy 0.292723 0.084185)
			(xy 0.330305 -0.076605) (xy 0.357134 -0.22352) (xy 0.374398 -0.363563) (xy 0.379411 -0.426942) (xy 0.390194 -0.542402)
			(xy 0.40671 -0.638589) (xy 0.430172 -0.719854) (xy 0.46179 -0.790548) (xy 0.495969 -0.845555) (xy 0.513054 -0.866725)
			(xy 0.523978 -0.874683) (xy 0.524758 -0.874326) (xy 0.524611 -0.860997) (xy 0.519185 -0.831406) (xy 0.51142 -0.798948)
			(xy 0.493627 -0.690002) (xy 0.495606 -0.581098) (xy 0.516289 -0.476249) (xy 0.554605 -0.379466) (xy 0.609489 -0.29476)
			(xy 0.65957 -0.242708) (xy 0.687549 -0.22007) (xy 0.722852 -0.193883) (xy 0.759642 -0.168166) (xy 0.792081 -0.146937)
			(xy 0.814334 -0.134213) (xy 0.819973 -0.132292) (xy 0.820664 -0.14203) (xy 0.812832 -0.16678) (xy 0.805978 -0.183405)
			(xy 0.779822 -0.259526) (xy 0.760571 -0.349121) (xy 0.74983 -0.442201) (xy 0.749201 -0.528777) (xy 0.749606 -0.534725)
			(xy 0.759211 -0.612829) (xy 0.775689 -0.693885) (xy 0.797002 -0.769924) (xy 0.821111 -0.832977) (xy 0.830802 -0.852273)
			(xy 0.845801 -0.878767) (xy 0.851521 -0.885174) (xy 0.850221 -0.87251) (xy 0.847756 -0.859896) (xy 0.844169 -0.83309)
			(xy 0.840147 -0.78902) (xy 0.836251 -0.734454) (xy 0.833779 -0.691296) (xy 0.831451 -0.618352) (xy 0.833323 -0.56132)
			(xy 0.839886 -0.512344) (xy 0.846971 -0.480832) (xy 0.880021 -0.37814) (xy 0.921735 -0.292461) (xy 0.961736 -0.236793)
			(xy 0.993393 -0.203983) (xy 1.025922 -0.175426) (xy 1.05429 -0.154993) (xy 1.073464 -0.146556) (xy 1.077681 -0.147631)
			(xy 1.075002 -0.160086) (xy 1.061951 -0.186215) (xy 1.046501 -0.212082) (xy 1.000447 -0.306099) (xy 0.977644 -0.406267)
			(xy 0.974993 -0.462197) (xy 0.977255 -0.508177) (xy 0.982225 -0.544784) (xy 0.988893 -0.568108) (xy 0.99625 -0.574239)
			(xy 1.001597 -0.565246) (xy 1.024793 -0.49982) (xy 1.046045 -0.451455) (xy 1.068517 -0.413708) (xy 1.088817 -0.38762)
			(xy 1.13829 -0.340524) (xy 1.202636 -0.294668) (xy 1.273145 -0.256041) (xy 1.292717 -0.247375) (xy 1.335185 -0.22963)
			(xy 1.293263 -0.284533) (xy 1.287823 -0.293439) (xy 1.593985 -0.293439) (xy 1.606542 -0.280504) (xy 1.609879 -0.277526)
			(xy 1.64487 -0.259838) (xy 1.69243 -0.251745) (xy 1.743027 -0.253342) (xy 1.787132 -0.264723) (xy 1.805651 -0.275575)
			(xy 1.823057 -0.293995) (xy 1.825919 -0.306728) (xy 1.825691 -0.306978) (xy 1.810745 -0.309193) (xy 1.778082 -0.307868)
			(xy 1.733724 -0.303337) (xy 1.715146 -0.300857) (xy 1.666763 -0.295132) (xy 1.626638 -0.292483) (xy 1.601353 -0.293267)
			(xy 1.59722 -0.294423) (xy 1.593985 -0.293439) (xy 1.287823 -0.293439) (xy 1.256225 -0.345174) (xy 1.242157 -0.400383)
			(xy 1.249662 -0.448113) (xy 1.263828 -0.473071) (xy 1.277802 -0.48035) (xy 1.286773 -0.468452) (xy 1.287818 -0.460014)
			(xy 1.29193 -0.453532) (xy 1.301943 -0.46918) (xy 1.305001 -0.475871) (xy 1.322029 -0.506591) (xy 1.3401 -0.528456)
			(xy 1.353776 -0.536607) (xy 1.358584 -0.526246) (xy 1.358996 -0.5126) (xy 1.364065 -0.488315) (xy 1.382006 -0.481072)
			(xy 1.383153 -0.481061) (xy 1.403086 -0.473262) (xy 1.434071 -0.452606) (xy 1.470111 -0.423197) (xy 1.477863 -0.416201)
			(xy 1.527457 -0.374776) (xy 1.571265 -0.350191) (xy 1.617464 -0.339701) (xy 1.674232 -0.340559) (xy 1.696409 -0.342834)
			(xy 1.741294 -0.350248) (xy 1.747504 -0.352684) (xy 1.79856 -0.352684) (xy 1.809631 -0.34753) (xy 1.830743 -0.350032)
			(xy 1.855838 -0.359338) (xy 1.878859 -0.3746) (xy 1.881707 -0.377299) (xy 1.907656 -0.415443) (xy 1.926729 -0.466249)
			(xy 1.934996 -0.518507) (xy 1.934971 -0.529167) (xy 1.933546 -0.546603) (xy 1.930314 -0.54281) (xy 1.924796 -0.521448)
			(xy 1.910059 -0.479995) (xy 1.887857 -0.439478) (xy 1.862979 -0.407312) (xy 1.840546 -0.391017) (xy 1.813594 -0.375846)
			(xy 1.803591 -0.366343) (xy 1.79856 -0.352684) (xy 1.747504 -0.352684) (xy 1.764159 -0.359217) (xy 1.764307 -0.369211)
			(xy 1.74378 -0.378856) (xy 1.699997 -0.403213) (xy 1.661651 -0.442655) (xy 1.637032 -0.488383) (xy 1.635383 -0.493915)
			(xy 1.629542 -0.541254) (xy 1.642156 -0.573764) (xy 1.673846 -0.592758) (xy 1.683336 -0.59523) (xy 1.728015 -0.601578)
			(xy 1.780159 -0.603944) (xy 1.83168 -0.602513) (xy 1.874487 -0.59747) (xy 1.898321 -0.590303) (xy 1.918125 -0.581266)
			(xy 1.922109 -0.587703) (xy 1.918041 -0.6033) (xy 1.907219 -0.625789) (xy 1.88587 -0.660961) (xy 1.858002 -0.702339)
			(xy 1.848547 -0.715578) (xy 1.804945 -0.776067) (xy 1.773706 -0.820683) (xy 1.752891 -0.852889) (xy 1.740557 -0.876148)
			(xy 1.734764 -0.893924) (xy 1.733571 -0.90968) (xy 1.734251 -0.919546) (xy 1.739416 -0.9446) (xy 1.753479 -0.953856)
			(xy 1.777249 -0.954299) (xy 1.820187 -0.944458) (xy 1.845862 -0.922329) (xy 1.852159 -0.891998) (xy 1.836963 -0.857552)
			(xy 1.831037 -0.850392) (xy 1.817749 -0.832874) (xy 1.821441 -0.820964) (xy 1.840057 -0.80775) (xy 1.865275 -0.788689)
			(xy 1.898613 -0.759797) (xy 1.922627 -0.737213) (xy 1.97513 -0.685894) (xy 1.970423 -0.803101) (xy 1.967167 -0.861735)
			(xy 1.961511 -0.905553) (xy 1.951294 -0.943795) (xy 1.934353 -0.985698) (xy 1.920926 -1.014622) (xy 1.898008 -1.06302)
			(xy 1.884285 -1.09336) (xy 1.878723 -1.109355) (xy 1.880291 -1.114719) (xy 1.887954 -1.113164) (xy 1.894176 -1.110789)
			(xy 1.910061 -1.109433) (xy 1.909493 -1.122721) (xy 1.893334 -1.148601) (xy 1.863499 -1.183881) (xy 1.837362 -1.213736)
			(xy 1.826855 -1.23084) (xy 1.830149 -1.23899) (xy 1.836062 -1.240831) (xy 1.841655 -1.24727) (xy 1.828537 -1.261878)
			(xy 1.795451 -1.285981) (xy 1.789535 -1.289936) (xy 1.752801 -1.312885) (xy 1.722522 -1.329232) (xy 1.705727 -1.335326)
			(xy 1.699104 -1.34019) (xy 1.710944 -1.351811) (xy 1.721045 -1.361989) (xy 1.717585 -1.371035) (xy 1.697217 -1.38261)
			(xy 1.672927 -1.393395) (xy 1.601988 -1.419279) (xy 1.522588 -1.440646) (xy 1.440854 -1.456524) (xy 1.36291 -1.465943)
			(xy 1.294882 -1.467932) (xy 1.242987 -1.461544) (xy 1.208665 -1.452618) (xy 1.238731 -1.440379) (xy 1.268797 -1.428141)
			(xy 1.226704 -1.41668) (xy 1.192791 -1.405126) (xy 1.173631 -1.394058) (xy 1.171999 -1.385901) (xy 1.188219 -1.383049)
			(xy 1.210512 -1.378657) (xy 1.21212 -1.368558) (xy 1.194082 -1.357374) (xy 1.181605 -1.353633) (xy 1.156627 -1.345008)
			(xy 1.116733 -1.328396) (xy 1.068501 -1.306609) (xy 1.040293 -1.293194) (xy 0.98882 -1.266215) (xy 0.940529 -1.237304)
			(xy 0.897931 -1.20855) (xy 0.863533 -1.182038) (xy 0.839845 -1.159857) (xy 0.829374 -1.144093) (xy 0.834631 -1.136834)
			(xy 0.855505 -1.139459) (xy 0.861694 -1.135925) (xy 0.849299 -1.117214) (xy 0.818304 -1.083306) (xy 0.804393 -1.069181)
			(xy 0.767822 -1.033325) (xy 0.744505 -1.013124) (xy 0.731347 -1.006588) (xy 0.725254 -1.011727) (xy 0.72397 -1.017468)
			(xy 0.726049 -1.042894) (xy 0.73536 -1.080005) (xy 0.743258 -1.103074) (xy 0.756071 -1.138512) (xy 0.760137 -1.159885)
			(xy 0.755476 -1.175526) (xy 0.743476 -1.192045) (xy 0.695948 -1.268173) (xy 0.671392 -1.34854) (xy 0.66752 -1.387809)
			(xy 0.665944 -1.408594) (xy 0.769697 -1.408594) (xy 0.772732 -1.365575) (xy 0.780398 -1.327134) (xy 0.78473 -1.315027)
			(xy 0.799763 -1.281953) (xy 0.806378 -1.330941) (xy 0.815942 -1.371277) (xy 0.830876 -1.406899) (xy 0.833589 -1.411365)
			(xy 0.85436 -1.435884) (xy 0.880247 -1.44956) (xy 0.915877 -1.453022) (xy 0.965879 -1.446902) (xy 1.01624 -1.436253)
			(xy 1.038341 -1.433116) (xy 1.044013 -1.436672) (xy 1.043404 -1.437425) (xy 1.04205 -1.453424) (xy 1.047119 -1.4622)
			(xy 1.047438 -1.477814) (xy 1.044098 -1.481195) (xy 1.641619 -1.481195) (xy 1.676906 -1.467658) (xy 1.710254 -1.460376)
			(xy 1.750295 -1.464326) (xy 1.769134 -1.468714) (xy 1.806367 -1.476587) (xy 1.831027 -1.47573) (xy 1.853203 -1.465476)
			(xy 1.85724 -1.462889) (xy 1.885143 -1.439901) (xy 1.903316 -1.418337) (xy 1.913179 -1.404893) (xy 1.918365 -1.409047)
			(xy 1.921647 -1.433813) (xy 1.922082 -1.438745) (xy 1.916417 -1.489142) (xy 1.902813 -1.514347) (xy 1.876315 -1.540394)
			(xy 1.849049 -1.556327) (xy 1.810469 -1.560116) (xy 1.762099 -1.551221) (xy 1.712853 -1.532073) (xy 1.676609 -1.509268)
			(xy 1.641619 -1.481195) (xy 1.044098 -1.481195) (xy 1.029568 -1.495901) (xy 0.998806 -1.513737) (xy 0.960448 -1.528598)
			(xy 0.919791 -1.537763) (xy 0.897 -1.539394) (xy 0.856425 -1.536261) (xy 0.827503 -1.523829) (xy 0.804851 -1.50424)
			(xy 0.782588 -1.477574) (xy 0.772231 -1.449324) (xy 0.769697 -1.408594) (xy 0.665944 -1.408594) (xy 0.664757 -1.42424)
			(xy 0.657379 -1.449797) (xy 0.641775 -1.466206) (xy 0.614336 -1.47519) (xy 0.571452 -1.478473) (xy 0.509514 -1.477779)
			(xy 0.48106 -1.47686) (xy 0.408929 -1.472099) (xy 0.348093 -1.461783) (xy 0.292086 -1.443527) (xy 0.234439 -1.414951)
			(xy 0.168686 -1.373672) (xy 0.131658 -1.348163) (xy 0.044631 -1.295989) (xy -0.047068 -1.25642) (xy -0.053187 -1.25435)
			(xy -0.0966 -1.240812) (xy -0.134769 -1.231672) (xy -0.174406 -1.226101) (xy -0.222224 -1.223272)
			(xy -0.284933 -1.222356) (xy -0.31269 -1.222335) (xy -0.386225 -1.223161) (xy -0.443665 -1.226038)
			(xy -0.492938 -1.231891) (xy -0.541977 -1.241646) (xy -0.595313 -1.255299) (xy -0.735046 -1.286722)
			(xy -0.863394 -1.301202) (xy -0.985496 -1.299274) (xy -1.002773 -1.297685) (xy -1.13761 -1.272283)
			(xy -1.270259 -1.224749) (xy -1.398324 -1.157007) (xy -1.519405 -1.070977) (xy -1.631104 -0.96858)
			(xy -1.731023 -0.851739) (xy -1.816764 -0.722374) (xy -1.881028 -0.594029) (xy -1.907604 -0.530926)
			(xy -1.924364 -0.488031) (xy -1.93155 -0.4637) (xy -2.041032 -0.4637) (xy -2.037299 -0.484108) (xy -1.994925 -0.619155)
			(xy -1.935519 -0.746861) (xy -1.857571 -0.871628) (xy -1.820735 -0.921865) (xy -1.703838 -1.057043)
			(xy -1.575551 -1.171109) (xy -1.436056 -1.263953) (xy -1.285537 -1.335465) (xy -1.124178 -1.385537)
			(xy -1.004997 -1.407755) (xy -0.899846 -1.413852) (xy -0.781403 -1.404429) (xy -0.647762 -1.379286)
			(xy -0.583131 -1.36305) (xy -0.520034 -1.347524) (xy -0.464439 -1.337773) (xy -0.40657 -1.332601)
			(xy -0.336649 -1.330816) (xy -0.318703 -1.330759) (xy -0.22577 -1.333697) (xy -0.14807 -1.344158)
			(xy -0.077793 -1.364476) (xy -0.007126 -1.396984) (xy 0.071743 -1.444017) (xy 0.081492 -1.450331)
			(xy 0.161307 -1.499902) (xy 0.229417 -1.535721) (xy 0.292068 -1.560043) (xy 0.355508 -1.575127) (xy 0.425983 -1.583226)
			(xy 0.453952 -1.584852) (xy 0.523795 -1.586043) (xy 0.590177 -1.583454) (xy 0.643595 -1.577499) (xy 0.64983 -1.576355)
			(xy 0.690612 -1.569047) (xy 0.71625 -1.568054) (xy 0.735103 -1.574593) (xy 0.755532 -1.589876) (xy 0.758174 -1.592092)
			(xy 0.807178 -1.618945) (xy 0.868747 -1.631468) (xy 0.93635 -1.629954) (xy 1.003452 -1.614694) (xy 1.063522 -1.585981)
			(xy 1.075084 -1.577933) (xy 1.118704 -1.545407) (xy 1.338069 -1.546447) (xy 1.557433 -1.547487) (xy 1.617381 -1.585829)
			(xy 1.692398 -1.625054) (xy 1.765677 -1.643872) (xy 1.837454 -1.644843)
		)
		(stroke
			(width 0)
			(type solid)
		)
		(fill solid)
		(layer "F.SilkS")
		(uuid "c32b51f3-b903-4b7d-912f-dc1e313a1099")
	)
)
