(module "SFT1342TLW" (layer F.Cu)
  (descr "DPAK / TP−FA CASE 369AH ISSUE O")
  (tags "MOSFET (P-Channel)")
  (attr smd)
  (fp_text reference Q** (at 0.000 -0.07) (layer F.SilkS)
    (effects (font (size 1.27 1.27) (thickness 0.254)))
  )
  (fp_text user %R (at 0.000 -0.07) (layer F.Fab)
    (effects (font (size 1.27 1.27) (thickness 0.254)))
  )
  (fp_text value "SFT1342TLW" (at 0.000 -0.07) (layer F.SilkS) hide
    (effects (font (size 1.27 1.27) (thickness 0.254)))
  )
  (fp_line (start -3.25 -4.21) (end 3.25 -4.21) (layer F.Fab) (width 0.2))
  (fp_line (start 3.25 -4.21) (end 3.25 1.29) (layer F.Fab) (width 0.2))
  (fp_line (start 3.25 1.29) (end -3.25 1.29) (layer F.Fab) (width 0.2))
  (fp_line (start -3.25 1.29) (end -3.25 -4.21) (layer F.Fab) (width 0.2))
  (fp_line (start -4 -6.54) (end 4 -6.54) (layer F.CrtYd) (width 0.1))
  (fp_line (start 4 -6.54) (end 4 6.4) (layer F.CrtYd) (width 0.1))
  (fp_line (start 4 6.4) (end -4 6.4) (layer F.CrtYd) (width 0.1))
  (fp_line (start -4 6.4) (end -4 -6.54) (layer F.CrtYd) (width 0.1))
  (fp_line (start -3.25 1.29) (end 3.25 1.29) (layer F.SilkS) (width 0.1))
  (fp_line (start -2.4 5.8) (end -2.4 5.8) (layer F.SilkS) (width 0.2))
  (fp_line (start -2.2 5.8) (end -2.2 5.8) (layer F.SilkS) (width 0.2))
  (fp_arc (start -2.3 5.8) (end -2.400 5.8) (angle 180) (layer F.SilkS) (width 0.2))
  (fp_arc (start -2.3 5.8) (end -2.200 5.8) (angle 180) (layer F.SilkS) (width 0.2))
  (pad 1 smd rect (at -2.300 4.21 0) (size 1.500 2.500) (layers F.Cu F.Paste F.Mask))
  (pad 2 smd rect (at 0.000 -2.54 0) (size 7.000 7.000) (layers F.Cu F.Paste F.Mask))
  (pad 3 smd rect (at 2.300 4.21 0) (size 1.500 2.500) (layers F.Cu F.Paste F.Mask))
)
