(footprint "SOT95P251X112-3N" (version 20221018) (generator pcbnew)
  (layer "F.Cu")
  (descr "SOT-23-ren10")
  (tags "MOSFET (P-Channel)")
  (attr smd)
  (fp_text reference "Q**" (at 0 0) (layer "F.SilkS")
      (effects (font (size 1.27 1.27) (thickness 0.254)))
    (tstamp 508a1134-348a-40ce-b84d-98913a8a57ab)
  )
  (fp_text value "SOT95P251X112-3N" (at 0 0) (layer "F.SilkS") hide
      (effects (font (size 1.27 1.27) (thickness 0.254)))
    (tstamp 64ce2734-e754-4dee-bea1-47a90efba8ae)
  )
  (fp_text user "${REFERENCE}" (at 0 0) (layer "F.Fab")
      (effects (font (size 1.27 1.27) (thickness 0.254)))
    (tstamp 9713b18c-5ffa-47f7-b354-9189d9ef92ce)
  )
  (fp_line (start -1.7 -1.525) (end -0.6 -1.525)
    (stroke (width 0.2) (type solid)) (layer "F.SilkS") (tstamp bfc87399-1517-4f8d-b3b9-db323f55b061))
  (fp_line (start -0.25 -1.46) (end 0.25 -1.46)
    (stroke (width 0.2) (type solid)) (layer "F.SilkS") (tstamp 11913570-2d54-48fb-a965-3ef699c9e88a))
  (fp_line (start -0.25 1.46) (end -0.25 -1.46)
    (stroke (width 0.2) (type solid)) (layer "F.SilkS") (tstamp e170d4cb-8346-484a-a8c7-83a3a225c3eb))
  (fp_line (start 0.25 -1.46) (end 0.25 1.46)
    (stroke (width 0.2) (type solid)) (layer "F.SilkS") (tstamp 0f554ec6-26db-42a6-b715-b8fb90f86e42))
  (fp_line (start 0.25 1.46) (end -0.25 1.46)
    (stroke (width 0.2) (type solid)) (layer "F.SilkS") (tstamp 5d75bb4c-db05-411f-8113-830355607e38))
  (fp_line (start -1.95 -1.77) (end 1.95 -1.77)
    (stroke (width 0.05) (type solid)) (layer "F.CrtYd") (tstamp bb78014e-9148-4217-9a75-01616fd52625))
  (fp_line (start -1.95 1.77) (end -1.95 -1.77)
    (stroke (width 0.05) (type solid)) (layer "F.CrtYd") (tstamp 7a6eff79-4b88-49fe-b767-69bff675c739))
  (fp_line (start 1.95 -1.77) (end 1.95 1.77)
    (stroke (width 0.05) (type solid)) (layer "F.CrtYd") (tstamp 55255afd-44b9-4918-b2b2-3b54b438384b))
  (fp_line (start 1.95 1.77) (end -1.95 1.77)
    (stroke (width 0.05) (type solid)) (layer "F.CrtYd") (tstamp 2f605740-8e8f-4812-86a7-703106e432ce))
  (fp_line (start -0.68 -1.46) (end 0.68 -1.46)
    (stroke (width 0.1) (type solid)) (layer "F.Fab") (tstamp 419748db-5d5a-4eba-9b55-3d21d239b1e9))
  (fp_line (start -0.68 -0.51) (end 0.27 -1.46)
    (stroke (width 0.1) (type solid)) (layer "F.Fab") (tstamp 0641a539-a7a3-4eab-bbeb-a5919cf52798))
  (fp_line (start -0.68 1.46) (end -0.68 -1.46)
    (stroke (width 0.1) (type solid)) (layer "F.Fab") (tstamp 4518245e-a55c-4c11-911b-1a01ba4a8f5a))
  (fp_line (start 0.68 -1.46) (end 0.68 1.46)
    (stroke (width 0.1) (type solid)) (layer "F.Fab") (tstamp abf47744-6688-4589-8e26-ad555a89dbd6))
  (fp_line (start 0.68 1.46) (end -0.68 1.46)
    (stroke (width 0.1) (type solid)) (layer "F.Fab") (tstamp e408330c-80b8-4add-a9bf-1c3f330629b1))
  (pad "1" smd rect (at -1.15 -0.95 90) (size 0.65 1.1) (layers "F.Cu" "F.Paste" "F.Mask") (tstamp afa4bcec-57c0-42f9-b8ae-00e0802ed6ac))
  (pad "2" smd rect (at -1.15 0.95 90) (size 0.65 1.1) (layers "F.Cu" "F.Paste" "F.Mask") (tstamp 67e3583c-4abe-45ca-8e1e-032814ccd696))
  (pad "3" smd rect (at 1.15 0 90) (size 0.65 1.1) (layers "F.Cu" "F.Paste" "F.Mask") (tstamp 408b28a0-9949-4e29-8878-51ebbea5150d))
  (model "FDV304P.stp"
    (offset (xyz 0 0 0))
    (scale (xyz 1 1 1))
    (rotate (xyz 0 0 0))
  )
)
