EESchema Schematic File Version 4
EELAYER 30 0
EELAYER END
$Descr A3 16535 11693
encoding utf-8
Sheet 2 3
Title ""
Date ""
Rev ""
Comp ""
Comment1 ""
Comment2 ""
Comment3 ""
Comment4 ""
$EndDescr
$Comp
L Diode:1N4001 D?
U 1 1 62509B25
P 7700 5050
AR Path="/62509B25" Ref="D?"  Part="1" 
AR Path="/62406C1B/62509B25" Ref="D?"  Part="1" 
F 0 "D?" H 7700 5267 50  0000 C CNN
F 1 "1N4001" H 7700 5176 50  0000 C CNN
F 2 "Diode_THT:D_DO-41_SOD81_P10.16mm_Horizontal" H 7700 4875 50  0001 C CNN
F 3 "http://www.vishay.com/docs/88503/1n4001.pdf" H 7700 5050 50  0001 C CNN
	1    7700 5050
	-1   0    0    1   
$EndComp
$Comp
L Diode:1N4001 D?
U 1 1 62509B2B
P 7700 5400
AR Path="/62509B2B" Ref="D?"  Part="1" 
AR Path="/62406C1B/62509B2B" Ref="D?"  Part="1" 
F 0 "D?" H 7700 5617 50  0000 C CNN
F 1 "1N4001" H 7700 5526 50  0000 C CNN
F 2 "Diode_THT:D_DO-41_SOD81_P10.16mm_Horizontal" H 7700 5225 50  0001 C CNN
F 3 "http://www.vishay.com/docs/88503/1n4001.pdf" H 7700 5400 50  0001 C CNN
	1    7700 5400
	-1   0    0    1   
$EndComp
$Comp
L Diode:1N4001 D?
U 1 1 62509B31
P 7700 5750
AR Path="/62509B31" Ref="D?"  Part="1" 
AR Path="/62406C1B/62509B31" Ref="D?"  Part="1" 
F 0 "D?" H 7700 5967 50  0000 C CNN
F 1 "1N4001" H 7700 5876 50  0000 C CNN
F 2 "Diode_THT:D_DO-41_SOD81_P10.16mm_Horizontal" H 7700 5575 50  0001 C CNN
F 3 "http://www.vishay.com/docs/88503/1n4001.pdf" H 7700 5750 50  0001 C CNN
	1    7700 5750
	-1   0    0    1   
$EndComp
$Comp
L Diode:1N4001 D?
U 1 1 62509B37
P 7700 6100
AR Path="/62509B37" Ref="D?"  Part="1" 
AR Path="/62406C1B/62509B37" Ref="D?"  Part="1" 
F 0 "D?" H 7700 6317 50  0000 C CNN
F 1 "1N4001" H 7700 6226 50  0000 C CNN
F 2 "Diode_THT:D_DO-41_SOD81_P10.16mm_Horizontal" H 7700 5925 50  0001 C CNN
F 3 "http://www.vishay.com/docs/88503/1n4001.pdf" H 7700 6100 50  0001 C CNN
	1    7700 6100
	-1   0    0    1   
$EndComp
$Comp
L Diode:1N4001 D?
U 1 1 62509B3D
P 7700 6450
AR Path="/62509B3D" Ref="D?"  Part="1" 
AR Path="/62406C1B/62509B3D" Ref="D?"  Part="1" 
F 0 "D?" H 7700 6667 50  0000 C CNN
F 1 "1N4001" H 7700 6576 50  0000 C CNN
F 2 "Diode_THT:D_DO-41_SOD81_P10.16mm_Horizontal" H 7700 6275 50  0001 C CNN
F 3 "http://www.vishay.com/docs/88503/1n4001.pdf" H 7700 6450 50  0001 C CNN
	1    7700 6450
	-1   0    0    1   
$EndComp
$Comp
L Diode:1N4001 D?
U 1 1 62509B43
P 7700 6800
AR Path="/62509B43" Ref="D?"  Part="1" 
AR Path="/62406C1B/62509B43" Ref="D?"  Part="1" 
F 0 "D?" H 7700 7017 50  0000 C CNN
F 1 "1N4001" H 7700 6926 50  0000 C CNN
F 2 "Diode_THT:D_DO-41_SOD81_P10.16mm_Horizontal" H 7700 6625 50  0001 C CNN
F 3 "http://www.vishay.com/docs/88503/1n4001.pdf" H 7700 6800 50  0001 C CNN
	1    7700 6800
	-1   0    0    1   
$EndComp
Wire Wire Line
	7950 5050 7950 5400
Wire Wire Line
	7950 6800 7850 6800
Wire Wire Line
	7950 5050 7850 5050
Wire Wire Line
	7850 6450 7950 6450
Connection ~ 7950 6450
Wire Wire Line
	7950 6450 7950 6800
Wire Wire Line
	7850 6100 7950 6100
Connection ~ 7950 6100
Wire Wire Line
	7950 6100 7950 6450
Wire Wire Line
	7850 5750 7950 5750
Connection ~ 7950 5750
Wire Wire Line
	7850 5400 7950 5400
Connection ~ 7950 5400
Wire Wire Line
	7950 5400 7950 5750
$Comp
L power:+12V #PWR?
U 1 1 62509B57
P 7950 4950
AR Path="/62509B57" Ref="#PWR?"  Part="1" 
AR Path="/62406C1B/62509B57" Ref="#PWR?"  Part="1" 
F 0 "#PWR?" H 7950 4800 50  0001 C CNN
F 1 "+12V" H 7965 5123 50  0000 C CNN
F 2 "" H 7950 4950 50  0001 C CNN
F 3 "" H 7950 4950 50  0001 C CNN
	1    7950 4950
	1    0    0    -1  
$EndComp
Text Label 7550 5050 2    50   ~ 0
CONTROL_VALVE_GND_1
Text Label 7550 5400 2    50   ~ 0
CONTROL_VALVE_GND_2
Text Label 7550 5750 2    50   ~ 0
CONTROL_VALVE_GND_3
Text Label 7550 6100 2    50   ~ 0
CONTROL_VALVE_GND_4
Text Label 7550 6450 2    50   ~ 0
CONTROL_VALVE_GND_5
Text Label 7550 6800 2    50   ~ 0
CONTROL_VALVE_GND_6
Text Notes 6950 4650 0    50   ~ 0
Valve Fly-back Diodes
$Comp
L Components:SIHLL110TR-GE3 Q?
U 1 1 62509B6A
P 2750 5050
AR Path="/62509B6A" Ref="Q?"  Part="1" 
AR Path="/62406C1B/62509B6A" Ref="Q?"  Part="1" 
F 0 "Q?" H 3250 5315 50  0000 C CNN
F 1 "SIHLL110TR-GE3" H 3250 5224 50  0000 C CNN
F 2 "SOT230P700X180-4N" H 3600 5150 50  0001 L CNN
F 3 "https://www.mouser.in/datasheet/2/427/sihll110-1504798.pdf" H 3600 5050 50  0001 L CNN
F 4 "SOT-223" H 3600 4950 50  0001 L CNN "Description"
F 5 "1.8" H 3600 4850 50  0001 L CNN "Height"
F 6 "78-SIHLL110TR-GE3" H 3600 4750 50  0001 L CNN "Mouser Part Number"
F 7 "https://www.mouser.co.uk/ProductDetail/Vishay-Siliconix/SIHLL110TR-GE3?qs=6viq6gG%252BWEu27dKn8Se0pw%3D%3D" H 3600 4650 50  0001 L CNN "Mouser Price/Stock"
F 8 "Vishay" H 3600 4550 50  0001 L CNN "Manufacturer_Name"
F 9 "SIHLL110TR-GE3" H 3600 4450 50  0001 L CNN "Manufacturer_Part_Number"
	1    2750 5050
	1    0    0    -1  
$EndComp
$Comp
L power:GND #PWR?
U 1 1 62509B70
P 2650 5350
AR Path="/62509B70" Ref="#PWR?"  Part="1" 
AR Path="/62406C1B/62509B70" Ref="#PWR?"  Part="1" 
F 0 "#PWR?" H 2650 5100 50  0001 C CNN
F 1 "GND" H 2655 5177 50  0000 C CNN
F 2 "" H 2650 5350 50  0001 C CNN
F 3 "" H 2650 5350 50  0001 C CNN
	1    2650 5350
	1    0    0    -1  
$EndComp
Wire Wire Line
	2750 5250 2650 5250
Wire Wire Line
	2650 5250 2650 5350
Text Label 2750 5050 2    50   ~ 0
CONTROL_VALVE_SIGNAL_1
Text Label 2450 5350 2    50   ~ 0
CONTROL_VALVE_GND_1
Wire Wire Line
	2850 5150 2750 5150
Wire Wire Line
	2550 5150 2550 5350
Connection ~ 2750 5150
Wire Wire Line
	2750 5150 2550 5150
Wire Wire Line
	2550 5600 3850 5600
Wire Wire Line
	3850 5600 3850 5050
Wire Wire Line
	3850 5050 3750 5050
Wire Wire Line
	2550 5350 2450 5350
Connection ~ 2550 5350
Wire Wire Line
	2550 5350 2550 5600
$Comp
L Components:SIHLL110TR-GE3 Q?
U 1 1 62509B8A
P 2750 5950
AR Path="/62509B8A" Ref="Q?"  Part="1" 
AR Path="/62406C1B/62509B8A" Ref="Q?"  Part="1" 
F 0 "Q?" H 3250 6215 50  0000 C CNN
F 1 "SIHLL110TR-GE3" H 3250 6124 50  0000 C CNN
F 2 "SOT230P700X180-4N" H 3600 6050 50  0001 L CNN
F 3 "https://www.mouser.in/datasheet/2/427/sihll110-1504798.pdf" H 3600 5950 50  0001 L CNN
F 4 "SOT-223" H 3600 5850 50  0001 L CNN "Description"
F 5 "1.8" H 3600 5750 50  0001 L CNN "Height"
F 6 "78-SIHLL110TR-GE3" H 3600 5650 50  0001 L CNN "Mouser Part Number"
F 7 "https://www.mouser.co.uk/ProductDetail/Vishay-Siliconix/SIHLL110TR-GE3?qs=6viq6gG%252BWEu27dKn8Se0pw%3D%3D" H 3600 5550 50  0001 L CNN "Mouser Price/Stock"
F 8 "Vishay" H 3600 5450 50  0001 L CNN "Manufacturer_Name"
F 9 "SIHLL110TR-GE3" H 3600 5350 50  0001 L CNN "Manufacturer_Part_Number"
	1    2750 5950
	1    0    0    -1  
$EndComp
$Comp
L power:GND #PWR?
U 1 1 62509B90
P 2650 6250
AR Path="/62509B90" Ref="#PWR?"  Part="1" 
AR Path="/62406C1B/62509B90" Ref="#PWR?"  Part="1" 
F 0 "#PWR?" H 2650 6000 50  0001 C CNN
F 1 "GND" H 2655 6077 50  0000 C CNN
F 2 "" H 2650 6250 50  0001 C CNN
F 3 "" H 2650 6250 50  0001 C CNN
	1    2650 6250
	1    0    0    -1  
$EndComp
Wire Wire Line
	2750 6150 2650 6150
Wire Wire Line
	2650 6150 2650 6250
Text Label 2750 5950 2    50   ~ 0
CONTROL_VALVE_SIGNAL_2
Text Label 2450 6250 2    50   ~ 0
CONTROL_VALVE_GND_2
Wire Wire Line
	2850 6050 2750 6050
Wire Wire Line
	2550 6050 2550 6250
Connection ~ 2750 6050
Wire Wire Line
	2750 6050 2550 6050
Wire Wire Line
	2550 6500 3850 6500
Wire Wire Line
	3850 6500 3850 5950
Wire Wire Line
	3850 5950 3750 5950
Wire Wire Line
	2550 6250 2450 6250
Connection ~ 2550 6250
Wire Wire Line
	2550 6250 2550 6500
$Comp
L Components:SIHLL110TR-GE3 Q?
U 1 1 62509BAA
P 2750 6850
AR Path="/62509BAA" Ref="Q?"  Part="1" 
AR Path="/62406C1B/62509BAA" Ref="Q?"  Part="1" 
F 0 "Q?" H 3250 7115 50  0000 C CNN
F 1 "SIHLL110TR-GE3" H 3250 7024 50  0000 C CNN
F 2 "SOT230P700X180-4N" H 3600 6950 50  0001 L CNN
F 3 "https://www.mouser.in/datasheet/2/427/sihll110-1504798.pdf" H 3600 6850 50  0001 L CNN
F 4 "SOT-223" H 3600 6750 50  0001 L CNN "Description"
F 5 "1.8" H 3600 6650 50  0001 L CNN "Height"
F 6 "78-SIHLL110TR-GE3" H 3600 6550 50  0001 L CNN "Mouser Part Number"
F 7 "https://www.mouser.co.uk/ProductDetail/Vishay-Siliconix/SIHLL110TR-GE3?qs=6viq6gG%252BWEu27dKn8Se0pw%3D%3D" H 3600 6450 50  0001 L CNN "Mouser Price/Stock"
F 8 "Vishay" H 3600 6350 50  0001 L CNN "Manufacturer_Name"
F 9 "SIHLL110TR-GE3" H 3600 6250 50  0001 L CNN "Manufacturer_Part_Number"
	1    2750 6850
	1    0    0    -1  
$EndComp
$Comp
L power:GND #PWR?
U 1 1 62509BB0
P 2650 7150
AR Path="/62509BB0" Ref="#PWR?"  Part="1" 
AR Path="/62406C1B/62509BB0" Ref="#PWR?"  Part="1" 
F 0 "#PWR?" H 2650 6900 50  0001 C CNN
F 1 "GND" H 2655 6977 50  0000 C CNN
F 2 "" H 2650 7150 50  0001 C CNN
F 3 "" H 2650 7150 50  0001 C CNN
	1    2650 7150
	1    0    0    -1  
$EndComp
Wire Wire Line
	2750 7050 2650 7050
Wire Wire Line
	2650 7050 2650 7150
Text Label 2750 6850 2    50   ~ 0
CONTROL_VALVE_SIGNAL_3
Text Label 2450 7150 2    50   ~ 0
CONTROL_VALVE_GND_3
Wire Wire Line
	2850 6950 2750 6950
Wire Wire Line
	2550 6950 2550 7150
Connection ~ 2750 6950
Wire Wire Line
	2750 6950 2550 6950
Wire Wire Line
	2550 7400 3850 7400
Wire Wire Line
	3850 7400 3850 6850
Wire Wire Line
	3850 6850 3750 6850
Wire Wire Line
	2550 7150 2450 7150
Connection ~ 2550 7150
Wire Wire Line
	2550 7150 2550 7400
$Comp
L Components:SIHLL110TR-GE3 Q?
U 1 1 62509BCA
P 5100 5100
AR Path="/62509BCA" Ref="Q?"  Part="1" 
AR Path="/62406C1B/62509BCA" Ref="Q?"  Part="1" 
F 0 "Q?" H 5600 5365 50  0000 C CNN
F 1 "SIHLL110TR-GE3" H 5600 5274 50  0000 C CNN
F 2 "SOT230P700X180-4N" H 5950 5200 50  0001 L CNN
F 3 "https://www.mouser.in/datasheet/2/427/sihll110-1504798.pdf" H 5950 5100 50  0001 L CNN
F 4 "SOT-223" H 5950 5000 50  0001 L CNN "Description"
F 5 "1.8" H 5950 4900 50  0001 L CNN "Height"
F 6 "78-SIHLL110TR-GE3" H 5950 4800 50  0001 L CNN "Mouser Part Number"
F 7 "https://www.mouser.co.uk/ProductDetail/Vishay-Siliconix/SIHLL110TR-GE3?qs=6viq6gG%252BWEu27dKn8Se0pw%3D%3D" H 5950 4700 50  0001 L CNN "Mouser Price/Stock"
F 8 "Vishay" H 5950 4600 50  0001 L CNN "Manufacturer_Name"
F 9 "SIHLL110TR-GE3" H 5950 4500 50  0001 L CNN "Manufacturer_Part_Number"
	1    5100 5100
	1    0    0    -1  
$EndComp
$Comp
L power:GND #PWR?
U 1 1 62509BD0
P 5000 5400
AR Path="/62509BD0" Ref="#PWR?"  Part="1" 
AR Path="/62406C1B/62509BD0" Ref="#PWR?"  Part="1" 
F 0 "#PWR?" H 5000 5150 50  0001 C CNN
F 1 "GND" H 5005 5227 50  0000 C CNN
F 2 "" H 5000 5400 50  0001 C CNN
F 3 "" H 5000 5400 50  0001 C CNN
	1    5000 5400
	1    0    0    -1  
$EndComp
Wire Wire Line
	5100 5300 5000 5300
Wire Wire Line
	5000 5300 5000 5400
Text Label 5100 5100 2    50   ~ 0
CONTROL_VALVE_SIGNAL_4
Text Label 4800 5400 2    50   ~ 0
CONTROL_VALVE_GND_4
Wire Wire Line
	5200 5200 5100 5200
Wire Wire Line
	4900 5200 4900 5400
Connection ~ 5100 5200
Wire Wire Line
	5100 5200 4900 5200
Wire Wire Line
	4900 5650 6200 5650
Wire Wire Line
	6200 5650 6200 5100
Wire Wire Line
	6200 5100 6100 5100
Wire Wire Line
	4900 5400 4800 5400
Connection ~ 4900 5400
Wire Wire Line
	4900 5400 4900 5650
$Comp
L Components:SIHLL110TR-GE3 Q?
U 1 1 62509BEA
P 5100 6000
AR Path="/62509BEA" Ref="Q?"  Part="1" 
AR Path="/62406C1B/62509BEA" Ref="Q?"  Part="1" 
F 0 "Q?" H 5600 6265 50  0000 C CNN
F 1 "SIHLL110TR-GE3" H 5600 6174 50  0000 C CNN
F 2 "SOT230P700X180-4N" H 5950 6100 50  0001 L CNN
F 3 "https://www.mouser.in/datasheet/2/427/sihll110-1504798.pdf" H 5950 6000 50  0001 L CNN
F 4 "SOT-223" H 5950 5900 50  0001 L CNN "Description"
F 5 "1.8" H 5950 5800 50  0001 L CNN "Height"
F 6 "78-SIHLL110TR-GE3" H 5950 5700 50  0001 L CNN "Mouser Part Number"
F 7 "https://www.mouser.co.uk/ProductDetail/Vishay-Siliconix/SIHLL110TR-GE3?qs=6viq6gG%252BWEu27dKn8Se0pw%3D%3D" H 5950 5600 50  0001 L CNN "Mouser Price/Stock"
F 8 "Vishay" H 5950 5500 50  0001 L CNN "Manufacturer_Name"
F 9 "SIHLL110TR-GE3" H 5950 5400 50  0001 L CNN "Manufacturer_Part_Number"
	1    5100 6000
	1    0    0    -1  
$EndComp
$Comp
L power:GND #PWR?
U 1 1 62509BF0
P 5000 6300
AR Path="/62509BF0" Ref="#PWR?"  Part="1" 
AR Path="/62406C1B/62509BF0" Ref="#PWR?"  Part="1" 
F 0 "#PWR?" H 5000 6050 50  0001 C CNN
F 1 "GND" H 5005 6127 50  0000 C CNN
F 2 "" H 5000 6300 50  0001 C CNN
F 3 "" H 5000 6300 50  0001 C CNN
	1    5000 6300
	1    0    0    -1  
$EndComp
Wire Wire Line
	5100 6200 5000 6200
Wire Wire Line
	5000 6200 5000 6300
Text Label 5100 6000 2    50   ~ 0
CONTROL_VALVE_SIGNAL_5
Text Label 4800 6300 2    50   ~ 0
CONTROL_VALVE_GND_5
Wire Wire Line
	5200 6100 5100 6100
Wire Wire Line
	4900 6100 4900 6300
Connection ~ 5100 6100
Wire Wire Line
	5100 6100 4900 6100
Wire Wire Line
	4900 6550 6200 6550
Wire Wire Line
	6200 6550 6200 6000
Wire Wire Line
	6200 6000 6100 6000
Wire Wire Line
	4900 6300 4800 6300
Connection ~ 4900 6300
Wire Wire Line
	4900 6300 4900 6550
$Comp
L Components:SIHLL110TR-GE3 Q?
U 1 1 62509C0A
P 5100 6900
AR Path="/62509C0A" Ref="Q?"  Part="1" 
AR Path="/62406C1B/62509C0A" Ref="Q?"  Part="1" 
F 0 "Q?" H 5600 7165 50  0000 C CNN
F 1 "SIHLL110TR-GE3" H 5600 7074 50  0000 C CNN
F 2 "SOT230P700X180-4N" H 5950 7000 50  0001 L CNN
F 3 "https://www.mouser.in/datasheet/2/427/sihll110-1504798.pdf" H 5950 6900 50  0001 L CNN
F 4 "SOT-223" H 5950 6800 50  0001 L CNN "Description"
F 5 "1.8" H 5950 6700 50  0001 L CNN "Height"
F 6 "78-SIHLL110TR-GE3" H 5950 6600 50  0001 L CNN "Mouser Part Number"
F 7 "https://www.mouser.co.uk/ProductDetail/Vishay-Siliconix/SIHLL110TR-GE3?qs=6viq6gG%252BWEu27dKn8Se0pw%3D%3D" H 5950 6500 50  0001 L CNN "Mouser Price/Stock"
F 8 "Vishay" H 5950 6400 50  0001 L CNN "Manufacturer_Name"
F 9 "SIHLL110TR-GE3" H 5950 6300 50  0001 L CNN "Manufacturer_Part_Number"
	1    5100 6900
	1    0    0    -1  
$EndComp
$Comp
L power:GND #PWR?
U 1 1 62509C10
P 5000 7200
AR Path="/62509C10" Ref="#PWR?"  Part="1" 
AR Path="/62406C1B/62509C10" Ref="#PWR?"  Part="1" 
F 0 "#PWR?" H 5000 6950 50  0001 C CNN
F 1 "GND" H 5005 7027 50  0000 C CNN
F 2 "" H 5000 7200 50  0001 C CNN
F 3 "" H 5000 7200 50  0001 C CNN
	1    5000 7200
	1    0    0    -1  
$EndComp
Wire Wire Line
	5100 7100 5000 7100
Wire Wire Line
	5000 7100 5000 7200
Text Label 5100 6900 2    50   ~ 0
CONTROL_VALVE_SIGNAL_6
Text Label 4800 7200 2    50   ~ 0
CONTROL_VALVE_GND_6
Wire Wire Line
	5200 7000 5100 7000
Wire Wire Line
	4900 7000 4900 7200
Connection ~ 5100 7000
Wire Wire Line
	5100 7000 4900 7000
Wire Wire Line
	4900 7450 6200 7450
Wire Wire Line
	6200 7450 6200 6900
Wire Wire Line
	6200 6900 6100 6900
Wire Wire Line
	4900 7200 4800 7200
Connection ~ 4900 7200
Wire Wire Line
	4900 7200 4900 7450
Text Notes 4550 1100 0    50   ~ 0
Flow Valves Driving
Wire Notes Line
	6400 4650 6400 7650
Wire Notes Line
	6400 7650 1550 7650
Wire Notes Line
	1550 7650 1550 4650
Wire Notes Line
	1550 4650 6400 4650
Text Notes 3650 4650 0    50   ~ 0
Control Valves Driving
$Comp
L Device:R R?
U 1 1 62509C2A
P 9550 6200
AR Path="/62509C2A" Ref="R?"  Part="1" 
AR Path="/62406C1B/62509C2A" Ref="R?"  Part="1" 
F 0 "R?" H 9620 6246 50  0000 L CNN
F 1 "10k" H 9620 6155 50  0000 L CNN
F 2 "" V 9480 6200 50  0001 C CNN
F 3 "~" H 9550 6200 50  0001 C CNN
	1    9550 6200
	0    -1   -1   0   
$EndComp
$Comp
L Device:R R?
U 1 1 62509C30
P 9550 5950
AR Path="/62509C30" Ref="R?"  Part="1" 
AR Path="/62406C1B/62509C30" Ref="R?"  Part="1" 
F 0 "R?" H 9620 5996 50  0000 L CNN
F 1 "10k" H 9620 5905 50  0000 L CNN
F 2 "" V 9480 5950 50  0001 C CNN
F 3 "~" H 9550 5950 50  0001 C CNN
	1    9550 5950
	0    -1   -1   0   
$EndComp
$Comp
L Device:R R?
U 1 1 62509C36
P 9550 5700
AR Path="/62509C36" Ref="R?"  Part="1" 
AR Path="/62406C1B/62509C36" Ref="R?"  Part="1" 
F 0 "R?" H 9620 5746 50  0000 L CNN
F 1 "10k" H 9620 5655 50  0000 L CNN
F 2 "" V 9480 5700 50  0001 C CNN
F 3 "~" H 9550 5700 50  0001 C CNN
	1    9550 5700
	0    -1   -1   0   
$EndComp
$Comp
L Device:R R?
U 1 1 62509C3C
P 9550 5450
AR Path="/62509C3C" Ref="R?"  Part="1" 
AR Path="/62406C1B/62509C3C" Ref="R?"  Part="1" 
F 0 "R?" H 9620 5496 50  0000 L CNN
F 1 "10k" H 9620 5405 50  0000 L CNN
F 2 "" V 9480 5450 50  0001 C CNN
F 3 "~" H 9550 5450 50  0001 C CNN
	1    9550 5450
	0    -1   -1   0   
$EndComp
$Comp
L Device:R R?
U 1 1 62509C42
P 9550 5200
AR Path="/62509C42" Ref="R?"  Part="1" 
AR Path="/62406C1B/62509C42" Ref="R?"  Part="1" 
F 0 "R?" H 9620 5246 50  0000 L CNN
F 1 "10k" H 9620 5155 50  0000 L CNN
F 2 "" V 9480 5200 50  0001 C CNN
F 3 "~" H 9550 5200 50  0001 C CNN
	1    9550 5200
	0    -1   -1   0   
$EndComp
$Comp
L Device:R R?
U 1 1 62509C48
P 9550 4950
AR Path="/62509C48" Ref="R?"  Part="1" 
AR Path="/62406C1B/62509C48" Ref="R?"  Part="1" 
F 0 "R?" H 9620 4996 50  0000 L CNN
F 1 "10k" H 9620 4905 50  0000 L CNN
F 2 "" V 9480 4950 50  0001 C CNN
F 3 "~" H 9550 4950 50  0001 C CNN
	1    9550 4950
	0    -1   -1   0   
$EndComp
Wire Wire Line
	9700 6200 9800 6200
Wire Wire Line
	9800 6200 9800 5950
Wire Wire Line
	9800 4950 9700 4950
Wire Wire Line
	9700 5200 9800 5200
Connection ~ 9800 5200
Wire Wire Line
	9800 5200 9800 4950
Wire Wire Line
	9700 5450 9800 5450
Connection ~ 9800 5450
Wire Wire Line
	9800 5450 9800 5200
Wire Wire Line
	9700 5700 9800 5700
Connection ~ 9800 5700
Wire Wire Line
	9700 5950 9800 5950
Connection ~ 9800 5950
Wire Wire Line
	9800 5950 9800 5700
Text Label 9400 6200 2    50   ~ 0
CONTROL_VALVE_SIGNAL_1
Text Label 9400 5950 2    50   ~ 0
CONTROL_VALVE_SIGNAL_2
Text Label 9400 5700 2    50   ~ 0
CONTROL_VALVE_SIGNAL_3
Text Label 9400 5450 2    50   ~ 0
CONTROL_VALVE_SIGNAL_4
Text Label 9400 5200 2    50   ~ 0
CONTROL_VALVE_SIGNAL_5
Text Label 9400 4950 2    50   ~ 0
CONTROL_VALVE_SIGNAL_6
$Comp
L power:GND #PWR?
U 1 1 62509C62
P 9800 6300
AR Path="/62509C62" Ref="#PWR?"  Part="1" 
AR Path="/62406C1B/62509C62" Ref="#PWR?"  Part="1" 
F 0 "#PWR?" H 9800 6050 50  0001 C CNN
F 1 "GND" H 9805 6127 50  0000 C CNN
F 2 "" H 9800 6300 50  0001 C CNN
F 3 "" H 9800 6300 50  0001 C CNN
	1    9800 6300
	1    0    0    -1  
$EndComp
Wire Wire Line
	9800 5450 9800 5700
Wire Wire Line
	9800 6200 9800 6300
Connection ~ 9800 6200
Wire Wire Line
	7950 5750 7950 6100
Wire Notes Line
	6600 4650 8150 4650
Wire Notes Line
	8300 4650 9950 4650
Text Notes 8650 4650 0    50   ~ 0
Valve Pull-down Resistors
$Comp
L power:GND #PWR?
U 1 1 62509C71
P 2450 2600
AR Path="/62509C71" Ref="#PWR?"  Part="1" 
AR Path="/62406C1B/62509C71" Ref="#PWR?"  Part="1" 
F 0 "#PWR?" H 2450 2350 50  0001 C CNN
F 1 "GND" H 2455 2427 50  0000 C CNN
F 2 "" H 2450 2600 50  0001 C CNN
F 3 "" H 2450 2600 50  0001 C CNN
	1    2450 2600
	1    0    0    -1  
$EndComp
$Comp
L power:+12V #PWR?
U 1 1 62509C77
P 4150 2100
AR Path="/62509C77" Ref="#PWR?"  Part="1" 
AR Path="/62406C1B/62509C77" Ref="#PWR?"  Part="1" 
F 0 "#PWR?" H 4150 1950 50  0001 C CNN
F 1 "+12V" H 4165 2273 50  0000 C CNN
F 2 "" H 4150 2100 50  0001 C CNN
F 3 "" H 4150 2100 50  0001 C CNN
	1    4150 2100
	1    0    0    -1  
$EndComp
Wire Wire Line
	4000 2300 4150 2300
Wire Wire Line
	4150 2300 4150 2100
Wire Wire Line
	2600 2400 2450 2400
Wire Wire Line
	2450 2400 2450 2600
$Comp
L Components:ZXMHC3F381N8TC Q?
U 1 1 62509C87
P 2600 2200
AR Path="/62509C87" Ref="Q?"  Part="1" 
AR Path="/62406C1B/62509C87" Ref="Q?"  Part="1" 
F 0 "Q?" H 3300 2465 50  0000 C CNN
F 1 "ZXMHC3F381N8TC" H 3300 2374 50  0000 C CNN
F 2 "SOIC127P600X175-8N" H 3850 2300 50  0001 L CNN
F 3 "https://www.diodes.com/assets/Datasheets/ZXMHC3F381N8.pdf" H 3850 2200 50  0001 L CNN
F 4 "MOSFET Dual N/P-Ch 30V 4.98A/4.13A SOIC8 Diodes Inc ZXMHC3F381N8TC Quad N/P-channel MOSFET Transistor, 8-Pin SO" H 3850 2100 50  0001 L CNN "Description"
F 5 "1.75" H 3850 2000 50  0001 L CNN "Height"
F 6 "522-ZXMHC3F381N8TC" H 3850 1900 50  0001 L CNN "Mouser Part Number"
F 7 "https://www.mouser.co.uk/ProductDetail/Diodes-Incorporated/ZXMHC3F381N8TC?qs=7E5rbXJDVJoJr15tcLBfrA%3D%3D" H 3850 1800 50  0001 L CNN "Mouser Price/Stock"
F 8 "Diodes Inc." H 3850 1700 50  0001 L CNN "Manufacturer_Name"
F 9 "ZXMHC3F381N8TC" H 3850 1600 50  0001 L CNN "Manufacturer_Part_Number"
	1    2600 2200
	1    0    0    -1  
$EndComp
Wire Wire Line
	2600 2300 2450 2300
Wire Wire Line
	4000 2400 4150 2400
Text Label 4150 2400 0    50   ~ 0
CONTROL_VALVE_2-
Text Label 2450 2300 2    50   ~ 0
CONTROL_VALVE_2+
Text Label 4000 2200 0    50   ~ 0
CONTROL_VALVE_2_FWD+
Text Label 2600 2500 2    50   ~ 0
CONTROL_VALVE_2_FWD-
Text Label 2600 2200 2    50   ~ 0
CONTROL_VALVE_2_REV-
Text Label 4000 2500 0    50   ~ 0
CONTROL_VALVE_2_REV+
$Comp
L power:GND #PWR?
U 1 1 62509C95
P 2450 3350
AR Path="/62509C95" Ref="#PWR?"  Part="1" 
AR Path="/62406C1B/62509C95" Ref="#PWR?"  Part="1" 
F 0 "#PWR?" H 2450 3100 50  0001 C CNN
F 1 "GND" H 2455 3177 50  0000 C CNN
F 2 "" H 2450 3350 50  0001 C CNN
F 3 "" H 2450 3350 50  0001 C CNN
	1    2450 3350
	1    0    0    -1  
$EndComp
$Comp
L power:+12V #PWR?
U 1 1 62509C9B
P 4150 2850
AR Path="/62509C9B" Ref="#PWR?"  Part="1" 
AR Path="/62406C1B/62509C9B" Ref="#PWR?"  Part="1" 
F 0 "#PWR?" H 4150 2700 50  0001 C CNN
F 1 "+12V" H 4165 3023 50  0000 C CNN
F 2 "" H 4150 2850 50  0001 C CNN
F 3 "" H 4150 2850 50  0001 C CNN
	1    4150 2850
	1    0    0    -1  
$EndComp
Wire Wire Line
	4000 3050 4150 3050
Wire Wire Line
	4150 3050 4150 2850
Wire Wire Line
	2600 3150 2450 3150
Wire Wire Line
	2450 3150 2450 3350
$Comp
L Components:ZXMHC3F381N8TC Q?
U 1 1 62509CAB
P 2600 2950
AR Path="/62509CAB" Ref="Q?"  Part="1" 
AR Path="/62406C1B/62509CAB" Ref="Q?"  Part="1" 
F 0 "Q?" H 3300 3215 50  0000 C CNN
F 1 "ZXMHC3F381N8TC" H 3300 3124 50  0000 C CNN
F 2 "SOIC127P600X175-8N" H 3850 3050 50  0001 L CNN
F 3 "https://www.diodes.com/assets/Datasheets/ZXMHC3F381N8.pdf" H 3850 2950 50  0001 L CNN
F 4 "MOSFET Dual N/P-Ch 30V 4.98A/4.13A SOIC8 Diodes Inc ZXMHC3F381N8TC Quad N/P-channel MOSFET Transistor, 8-Pin SO" H 3850 2850 50  0001 L CNN "Description"
F 5 "1.75" H 3850 2750 50  0001 L CNN "Height"
F 6 "522-ZXMHC3F381N8TC" H 3850 2650 50  0001 L CNN "Mouser Part Number"
F 7 "https://www.mouser.co.uk/ProductDetail/Diodes-Incorporated/ZXMHC3F381N8TC?qs=7E5rbXJDVJoJr15tcLBfrA%3D%3D" H 3850 2550 50  0001 L CNN "Mouser Price/Stock"
F 8 "Diodes Inc." H 3850 2450 50  0001 L CNN "Manufacturer_Name"
F 9 "ZXMHC3F381N8TC" H 3850 2350 50  0001 L CNN "Manufacturer_Part_Number"
	1    2600 2950
	1    0    0    -1  
$EndComp
Wire Wire Line
	2600 3050 2450 3050
Wire Wire Line
	4000 3150 4150 3150
Text Label 4150 3150 0    50   ~ 0
CONTROL_VALVE_3-
Text Label 2450 3050 2    50   ~ 0
CONTROL_VALVE_3+
Text Label 4000 2950 0    50   ~ 0
CONTROL_VALVE_3_FWD+
Text Label 2600 3250 2    50   ~ 0
CONTROL_VALVE_3_FWD-
Text Label 2600 2950 2    50   ~ 0
CONTROL_VALVE_3_REV-
Text Label 4000 3250 0    50   ~ 0
CONTROL_VALVE_3_REV+
$Comp
L power:GND #PWR?
U 1 1 62509CB9
P 2450 4100
AR Path="/62509CB9" Ref="#PWR?"  Part="1" 
AR Path="/62406C1B/62509CB9" Ref="#PWR?"  Part="1" 
F 0 "#PWR?" H 2450 3850 50  0001 C CNN
F 1 "GND" H 2455 3927 50  0000 C CNN
F 2 "" H 2450 4100 50  0001 C CNN
F 3 "" H 2450 4100 50  0001 C CNN
	1    2450 4100
	1    0    0    -1  
$EndComp
$Comp
L power:+12V #PWR?
U 1 1 62509CBF
P 4150 3600
AR Path="/62509CBF" Ref="#PWR?"  Part="1" 
AR Path="/62406C1B/62509CBF" Ref="#PWR?"  Part="1" 
F 0 "#PWR?" H 4150 3450 50  0001 C CNN
F 1 "+12V" H 4165 3773 50  0000 C CNN
F 2 "" H 4150 3600 50  0001 C CNN
F 3 "" H 4150 3600 50  0001 C CNN
	1    4150 3600
	1    0    0    -1  
$EndComp
Wire Wire Line
	4000 3800 4150 3800
Wire Wire Line
	4150 3800 4150 3600
Wire Wire Line
	2600 3900 2450 3900
Wire Wire Line
	2450 3900 2450 4100
$Comp
L Components:ZXMHC3F381N8TC Q?
U 1 1 62509CCF
P 2600 3700
AR Path="/62509CCF" Ref="Q?"  Part="1" 
AR Path="/62406C1B/62509CCF" Ref="Q?"  Part="1" 
F 0 "Q?" H 3300 3965 50  0000 C CNN
F 1 "ZXMHC3F381N8TC" H 3300 3874 50  0000 C CNN
F 2 "SOIC127P600X175-8N" H 3850 3800 50  0001 L CNN
F 3 "https://www.diodes.com/assets/Datasheets/ZXMHC3F381N8.pdf" H 3850 3700 50  0001 L CNN
F 4 "MOSFET Dual N/P-Ch 30V 4.98A/4.13A SOIC8 Diodes Inc ZXMHC3F381N8TC Quad N/P-channel MOSFET Transistor, 8-Pin SO" H 3850 3600 50  0001 L CNN "Description"
F 5 "1.75" H 3850 3500 50  0001 L CNN "Height"
F 6 "522-ZXMHC3F381N8TC" H 3850 3400 50  0001 L CNN "Mouser Part Number"
F 7 "https://www.mouser.co.uk/ProductDetail/Diodes-Incorporated/ZXMHC3F381N8TC?qs=7E5rbXJDVJoJr15tcLBfrA%3D%3D" H 3850 3300 50  0001 L CNN "Mouser Price/Stock"
F 8 "Diodes Inc." H 3850 3200 50  0001 L CNN "Manufacturer_Name"
F 9 "ZXMHC3F381N8TC" H 3850 3100 50  0001 L CNN "Manufacturer_Part_Number"
	1    2600 3700
	1    0    0    -1  
$EndComp
Wire Wire Line
	2600 3800 2450 3800
Wire Wire Line
	4000 3900 4150 3900
Text Label 4150 3900 0    50   ~ 0
CONTROL_VALVE_4-
Text Label 2450 3800 2    50   ~ 0
CONTROL_VALVE_4+
Text Label 4000 3700 0    50   ~ 0
CONTROL_VALVE_4_FWD+
Text Label 2600 4000 2    50   ~ 0
CONTROL_VALVE_4_FWD-
Text Label 2600 3700 2    50   ~ 0
CONTROL_VALVE_4_REV-
Text Label 4000 4000 0    50   ~ 0
CONTROL_VALVE_4_REV+
$Comp
L power:GND #PWR?
U 1 1 62509CDD
P 5850 1850
AR Path="/62509CDD" Ref="#PWR?"  Part="1" 
AR Path="/62406C1B/62509CDD" Ref="#PWR?"  Part="1" 
F 0 "#PWR?" H 5850 1600 50  0001 C CNN
F 1 "GND" H 5855 1677 50  0000 C CNN
F 2 "" H 5850 1850 50  0001 C CNN
F 3 "" H 5850 1850 50  0001 C CNN
	1    5850 1850
	1    0    0    -1  
$EndComp
$Comp
L power:+12V #PWR?
U 1 1 62509CE3
P 7550 1350
AR Path="/62509CE3" Ref="#PWR?"  Part="1" 
AR Path="/62406C1B/62509CE3" Ref="#PWR?"  Part="1" 
F 0 "#PWR?" H 7550 1200 50  0001 C CNN
F 1 "+12V" H 7565 1523 50  0000 C CNN
F 2 "" H 7550 1350 50  0001 C CNN
F 3 "" H 7550 1350 50  0001 C CNN
	1    7550 1350
	1    0    0    -1  
$EndComp
Wire Wire Line
	7400 1550 7550 1550
Wire Wire Line
	7550 1550 7550 1350
Wire Wire Line
	6000 1650 5850 1650
Wire Wire Line
	5850 1650 5850 1850
$Comp
L Components:ZXMHC3F381N8TC Q?
U 1 1 62509CF3
P 6000 1450
AR Path="/62509CF3" Ref="Q?"  Part="1" 
AR Path="/62406C1B/62509CF3" Ref="Q?"  Part="1" 
F 0 "Q?" H 6700 1715 50  0000 C CNN
F 1 "ZXMHC3F381N8TC" H 6700 1624 50  0000 C CNN
F 2 "SOIC127P600X175-8N" H 7250 1550 50  0001 L CNN
F 3 "https://www.diodes.com/assets/Datasheets/ZXMHC3F381N8.pdf" H 7250 1450 50  0001 L CNN
F 4 "MOSFET Dual N/P-Ch 30V 4.98A/4.13A SOIC8 Diodes Inc ZXMHC3F381N8TC Quad N/P-channel MOSFET Transistor, 8-Pin SO" H 7250 1350 50  0001 L CNN "Description"
F 5 "1.75" H 7250 1250 50  0001 L CNN "Height"
F 6 "522-ZXMHC3F381N8TC" H 7250 1150 50  0001 L CNN "Mouser Part Number"
F 7 "https://www.mouser.co.uk/ProductDetail/Diodes-Incorporated/ZXMHC3F381N8TC?qs=7E5rbXJDVJoJr15tcLBfrA%3D%3D" H 7250 1050 50  0001 L CNN "Mouser Price/Stock"
F 8 "Diodes Inc." H 7250 950 50  0001 L CNN "Manufacturer_Name"
F 9 "ZXMHC3F381N8TC" H 7250 850 50  0001 L CNN "Manufacturer_Part_Number"
	1    6000 1450
	1    0    0    -1  
$EndComp
Wire Wire Line
	6000 1550 5850 1550
Wire Wire Line
	7400 1650 7550 1650
Text Label 7550 1650 0    50   ~ 0
CONTROL_VALVE_5-
Text Label 5850 1550 2    50   ~ 0
CONTROL_VALVE_5+
Text Label 7400 1450 0    50   ~ 0
CONTROL_VALVE_5_FWD+
Text Label 6000 1750 2    50   ~ 0
CONTROL_VALVE_5_FWD-
Text Label 6000 1450 2    50   ~ 0
CONTROL_VALVE_5_REV-
Text Label 7400 1750 0    50   ~ 0
CONTROL_VALVE_5_REV+
$Comp
L power:GND #PWR?
U 1 1 62509D01
P 5850 2600
AR Path="/62509D01" Ref="#PWR?"  Part="1" 
AR Path="/62406C1B/62509D01" Ref="#PWR?"  Part="1" 
F 0 "#PWR?" H 5850 2350 50  0001 C CNN
F 1 "GND" H 5855 2427 50  0000 C CNN
F 2 "" H 5850 2600 50  0001 C CNN
F 3 "" H 5850 2600 50  0001 C CNN
	1    5850 2600
	1    0    0    -1  
$EndComp
$Comp
L power:+12V #PWR?
U 1 1 62509D07
P 7550 2100
AR Path="/62509D07" Ref="#PWR?"  Part="1" 
AR Path="/62406C1B/62509D07" Ref="#PWR?"  Part="1" 
F 0 "#PWR?" H 7550 1950 50  0001 C CNN
F 1 "+12V" H 7565 2273 50  0000 C CNN
F 2 "" H 7550 2100 50  0001 C CNN
F 3 "" H 7550 2100 50  0001 C CNN
	1    7550 2100
	1    0    0    -1  
$EndComp
Wire Wire Line
	7400 2300 7550 2300
Wire Wire Line
	7550 2300 7550 2100
Wire Wire Line
	6000 2400 5850 2400
Wire Wire Line
	5850 2400 5850 2600
$Comp
L Components:ZXMHC3F381N8TC Q?
U 1 1 62509D17
P 6000 2200
AR Path="/62509D17" Ref="Q?"  Part="1" 
AR Path="/62406C1B/62509D17" Ref="Q?"  Part="1" 
F 0 "Q?" H 6700 2465 50  0000 C CNN
F 1 "ZXMHC3F381N8TC" H 6700 2374 50  0000 C CNN
F 2 "SOIC127P600X175-8N" H 7250 2300 50  0001 L CNN
F 3 "https://www.diodes.com/assets/Datasheets/ZXMHC3F381N8.pdf" H 7250 2200 50  0001 L CNN
F 4 "MOSFET Dual N/P-Ch 30V 4.98A/4.13A SOIC8 Diodes Inc ZXMHC3F381N8TC Quad N/P-channel MOSFET Transistor, 8-Pin SO" H 7250 2100 50  0001 L CNN "Description"
F 5 "1.75" H 7250 2000 50  0001 L CNN "Height"
F 6 "522-ZXMHC3F381N8TC" H 7250 1900 50  0001 L CNN "Mouser Part Number"
F 7 "https://www.mouser.co.uk/ProductDetail/Diodes-Incorporated/ZXMHC3F381N8TC?qs=7E5rbXJDVJoJr15tcLBfrA%3D%3D" H 7250 1800 50  0001 L CNN "Mouser Price/Stock"
F 8 "Diodes Inc." H 7250 1700 50  0001 L CNN "Manufacturer_Name"
F 9 "ZXMHC3F381N8TC" H 7250 1600 50  0001 L CNN "Manufacturer_Part_Number"
	1    6000 2200
	1    0    0    -1  
$EndComp
Wire Wire Line
	6000 2300 5850 2300
Wire Wire Line
	7400 2400 7550 2400
Text Label 7550 2400 0    50   ~ 0
CONTROL_VALVE_6-
Text Label 5850 2300 2    50   ~ 0
CONTROL_VALVE_6+
Text Label 7400 2200 0    50   ~ 0
CONTROL_VALVE_6_FWD+
Text Label 6000 2500 2    50   ~ 0
CONTROL_VALVE_6_FWD-
Text Label 6000 2200 2    50   ~ 0
CONTROL_VALVE_6_REV-
$Comp
L power:GND #PWR?
U 1 1 62509D24
P 5850 3350
AR Path="/62509D24" Ref="#PWR?"  Part="1" 
AR Path="/62406C1B/62509D24" Ref="#PWR?"  Part="1" 
F 0 "#PWR?" H 5850 3100 50  0001 C CNN
F 1 "GND" H 5855 3177 50  0000 C CNN
F 2 "" H 5850 3350 50  0001 C CNN
F 3 "" H 5850 3350 50  0001 C CNN
	1    5850 3350
	1    0    0    -1  
$EndComp
$Comp
L power:+12V #PWR?
U 1 1 62509D2A
P 7550 2850
AR Path="/62509D2A" Ref="#PWR?"  Part="1" 
AR Path="/62406C1B/62509D2A" Ref="#PWR?"  Part="1" 
F 0 "#PWR?" H 7550 2700 50  0001 C CNN
F 1 "+12V" H 7565 3023 50  0000 C CNN
F 2 "" H 7550 2850 50  0001 C CNN
F 3 "" H 7550 2850 50  0001 C CNN
	1    7550 2850
	1    0    0    -1  
$EndComp
Wire Wire Line
	7400 3050 7550 3050
Wire Wire Line
	7550 3050 7550 2850
Wire Wire Line
	6000 3150 5850 3150
Wire Wire Line
	5850 3150 5850 3350
$Comp
L Components:ZXMHC3F381N8TC Q?
U 1 1 62509D3A
P 6000 2950
AR Path="/62509D3A" Ref="Q?"  Part="1" 
AR Path="/62406C1B/62509D3A" Ref="Q?"  Part="1" 
F 0 "Q?" H 6700 3215 50  0000 C CNN
F 1 "ZXMHC3F381N8TC" H 6700 3124 50  0000 C CNN
F 2 "SOIC127P600X175-8N" H 7250 3050 50  0001 L CNN
F 3 "https://www.diodes.com/assets/Datasheets/ZXMHC3F381N8.pdf" H 7250 2950 50  0001 L CNN
F 4 "MOSFET Dual N/P-Ch 30V 4.98A/4.13A SOIC8 Diodes Inc ZXMHC3F381N8TC Quad N/P-channel MOSFET Transistor, 8-Pin SO" H 7250 2850 50  0001 L CNN "Description"
F 5 "1.75" H 7250 2750 50  0001 L CNN "Height"
F 6 "522-ZXMHC3F381N8TC" H 7250 2650 50  0001 L CNN "Mouser Part Number"
F 7 "https://www.mouser.co.uk/ProductDetail/Diodes-Incorporated/ZXMHC3F381N8TC?qs=7E5rbXJDVJoJr15tcLBfrA%3D%3D" H 7250 2550 50  0001 L CNN "Mouser Price/Stock"
F 8 "Diodes Inc." H 7250 2450 50  0001 L CNN "Manufacturer_Name"
F 9 "ZXMHC3F381N8TC" H 7250 2350 50  0001 L CNN "Manufacturer_Part_Number"
	1    6000 2950
	1    0    0    -1  
$EndComp
Wire Wire Line
	6000 3050 5850 3050
Wire Wire Line
	7400 3150 7550 3150
Text Label 7550 3150 0    50   ~ 0
CONTROL_VALVE_7-
Text Label 5850 3050 2    50   ~ 0
CONTROL_VALVE_7+
Text Label 7400 2950 0    50   ~ 0
CONTROL_VALVE_7_FWD+
Text Label 6000 3250 2    50   ~ 0
CONTROL_VALVE_7_FWD-
Text Label 6000 2950 2    50   ~ 0
CONTROL_VALVE_7_REV-
Text Label 7400 3250 0    50   ~ 0
CONTROL_VALVE_7_REV+
$Comp
L power:GND #PWR?
U 1 1 62509D48
P 5850 4100
AR Path="/62509D48" Ref="#PWR?"  Part="1" 
AR Path="/62406C1B/62509D48" Ref="#PWR?"  Part="1" 
F 0 "#PWR?" H 5850 3850 50  0001 C CNN
F 1 "GND" H 5855 3927 50  0000 C CNN
F 2 "" H 5850 4100 50  0001 C CNN
F 3 "" H 5850 4100 50  0001 C CNN
	1    5850 4100
	1    0    0    -1  
$EndComp
$Comp
L power:+12V #PWR?
U 1 1 62509D4E
P 7550 3600
AR Path="/62509D4E" Ref="#PWR?"  Part="1" 
AR Path="/62406C1B/62509D4E" Ref="#PWR?"  Part="1" 
F 0 "#PWR?" H 7550 3450 50  0001 C CNN
F 1 "+12V" H 7565 3773 50  0000 C CNN
F 2 "" H 7550 3600 50  0001 C CNN
F 3 "" H 7550 3600 50  0001 C CNN
	1    7550 3600
	1    0    0    -1  
$EndComp
Wire Wire Line
	7400 3800 7550 3800
Wire Wire Line
	7550 3800 7550 3600
Wire Wire Line
	6000 3900 5850 3900
Wire Wire Line
	5850 3900 5850 4100
$Comp
L Components:ZXMHC3F381N8TC Q?
U 1 1 62509D5E
P 6000 3700
AR Path="/62509D5E" Ref="Q?"  Part="1" 
AR Path="/62406C1B/62509D5E" Ref="Q?"  Part="1" 
F 0 "Q?" H 6700 3965 50  0000 C CNN
F 1 "ZXMHC3F381N8TC" H 6700 3874 50  0000 C CNN
F 2 "SOIC127P600X175-8N" H 7250 3800 50  0001 L CNN
F 3 "https://www.diodes.com/assets/Datasheets/ZXMHC3F381N8.pdf" H 7250 3700 50  0001 L CNN
F 4 "MOSFET Dual N/P-Ch 30V 4.98A/4.13A SOIC8 Diodes Inc ZXMHC3F381N8TC Quad N/P-channel MOSFET Transistor, 8-Pin SO" H 7250 3600 50  0001 L CNN "Description"
F 5 "1.75" H 7250 3500 50  0001 L CNN "Height"
F 6 "522-ZXMHC3F381N8TC" H 7250 3400 50  0001 L CNN "Mouser Part Number"
F 7 "https://www.mouser.co.uk/ProductDetail/Diodes-Incorporated/ZXMHC3F381N8TC?qs=7E5rbXJDVJoJr15tcLBfrA%3D%3D" H 7250 3300 50  0001 L CNN "Mouser Price/Stock"
F 8 "Diodes Inc." H 7250 3200 50  0001 L CNN "Manufacturer_Name"
F 9 "ZXMHC3F381N8TC" H 7250 3100 50  0001 L CNN "Manufacturer_Part_Number"
	1    6000 3700
	1    0    0    -1  
$EndComp
Wire Wire Line
	6000 3800 5850 3800
Wire Wire Line
	7400 3900 7550 3900
Text Label 7550 3900 0    50   ~ 0
CONTROL_VALVE_8-
Text Label 5850 3800 2    50   ~ 0
CONTROL_VALVE_8+
Text Label 7400 3700 0    50   ~ 0
CONTROL_VALVE_8_FWD+
Text Label 6000 4000 2    50   ~ 0
CONTROL_VALVE_8_FWD-
Text Label 6000 3700 2    50   ~ 0
CONTROL_VALVE_8_REV-
Text Label 7400 4000 0    50   ~ 0
CONTROL_VALVE_8_REV+
Text Label 7400 2500 0    50   ~ 0
CONTROL_VALVE_6_REV+
Wire Notes Line
	8450 1100 8450 4400
Wire Notes Line
	8450 4400 1550 4400
Wire Notes Line
	1550 4400 1550 1100
Wire Notes Line
	1550 1100 8450 1100
Wire Notes Line
	9950 4650 9950 6600
Wire Notes Line
	9950 6600 8300 6600
Wire Notes Line
	8300 6600 8300 4650
Wire Wire Line
	7950 4950 7950 5050
Connection ~ 7950 5050
Wire Notes Line
	8150 4650 8150 7100
Wire Notes Line
	8150 7100 6600 7100
Wire Notes Line
	6600 7100 6600 4650
Text Label 4000 1750 0    50   ~ 0
CONTROL_VALVE_1_REV+
Text Label 2600 1450 2    50   ~ 0
CONTROL_VALVE_1_REV-
Text Label 2600 1750 2    50   ~ 0
CONTROL_VALVE_1_FWD-
Text Label 4000 1450 0    50   ~ 0
CONTROL_VALVE_1_FWD+
Text Label 2450 1550 2    50   ~ 0
CONTROL_VALVE_1+
Text Label 4150 1650 0    50   ~ 0
CONTROL_VALVE_1-
Wire Wire Line
	4000 1650 4150 1650
Wire Wire Line
	2600 1550 2450 1550
$Comp
L Components:ZXMHC3F381N8TC Q?
U 1 1 62509D8A
P 2600 1450
AR Path="/62509D8A" Ref="Q?"  Part="1" 
AR Path="/62406C1B/62509D8A" Ref="Q?"  Part="1" 
F 0 "Q?" H 3300 1715 50  0000 C CNN
F 1 "ZXMHC3F381N8TC" H 3300 1624 50  0000 C CNN
F 2 "SOIC127P600X175-8N" H 3850 1550 50  0001 L CNN
F 3 "https://www.diodes.com/assets/Datasheets/ZXMHC3F381N8.pdf" H 3850 1450 50  0001 L CNN
F 4 "MOSFET Dual N/P-Ch 30V 4.98A/4.13A SOIC8 Diodes Inc ZXMHC3F381N8TC Quad N/P-channel MOSFET Transistor, 8-Pin SO" H 3850 1350 50  0001 L CNN "Description"
F 5 "1.75" H 3850 1250 50  0001 L CNN "Height"
F 6 "522-ZXMHC3F381N8TC" H 3850 1150 50  0001 L CNN "Mouser Part Number"
F 7 "https://www.mouser.co.uk/ProductDetail/Diodes-Incorporated/ZXMHC3F381N8TC?qs=7E5rbXJDVJoJr15tcLBfrA%3D%3D" H 3850 1050 50  0001 L CNN "Mouser Price/Stock"
F 8 "Diodes Inc." H 3850 950 50  0001 L CNN "Manufacturer_Name"
F 9 "ZXMHC3F381N8TC" H 3850 850 50  0001 L CNN "Manufacturer_Part_Number"
	1    2600 1450
	1    0    0    -1  
$EndComp
Wire Wire Line
	2450 1650 2450 1850
Wire Wire Line
	2600 1650 2450 1650
Wire Wire Line
	4150 1550 4150 1350
Wire Wire Line
	4000 1550 4150 1550
$Comp
L power:+12V #PWR?
U 1 1 62509D94
P 4150 1350
AR Path="/62509D94" Ref="#PWR?"  Part="1" 
AR Path="/62406C1B/62509D94" Ref="#PWR?"  Part="1" 
F 0 "#PWR?" H 4150 1200 50  0001 C CNN
F 1 "+12V" H 4165 1523 50  0000 C CNN
F 2 "" H 4150 1350 50  0001 C CNN
F 3 "" H 4150 1350 50  0001 C CNN
	1    4150 1350
	1    0    0    -1  
$EndComp
$Comp
L power:GND #PWR?
U 1 1 62509D9A
P 2450 1850
AR Path="/62509D9A" Ref="#PWR?"  Part="1" 
AR Path="/62406C1B/62509D9A" Ref="#PWR?"  Part="1" 
F 0 "#PWR?" H 2450 1600 50  0001 C CNN
F 1 "GND" H 2455 1677 50  0000 C CNN
F 2 "" H 2450 1850 50  0001 C CNN
F 3 "" H 2450 1850 50  0001 C CNN
	1    2450 1850
	1    0    0    -1  
$EndComp
Text Label 13500 1700 3    50   ~ 0
CONTROL_VALVE_8_REV+
Wire Wire Line
	13500 1350 13500 1400
$Comp
L power:+12V #PWR?
U 1 1 625916DD
P 13500 1350
AR Path="/625916DD" Ref="#PWR?"  Part="1" 
AR Path="/62406C1B/625916DD" Ref="#PWR?"  Part="1" 
F 0 "#PWR?" H 13500 1200 50  0001 C CNN
F 1 "+12V" H 13515 1523 50  0000 C CNN
F 2 "" H 13500 1350 50  0001 C CNN
F 3 "" H 13500 1350 50  0001 C CNN
	1    13500 1350
	1    0    0    -1  
$EndComp
$Comp
L Device:R R?
U 1 1 625916E3
P 13500 1550
AR Path="/625916E3" Ref="R?"  Part="1" 
AR Path="/62406C1B/625916E3" Ref="R?"  Part="1" 
F 0 "R?" H 13570 1596 50  0000 L CNN
F 1 "10k" H 13570 1505 50  0000 L CNN
F 2 "" V 13430 1550 50  0001 C CNN
F 3 "~" H 13500 1550 50  0001 C CNN
	1    13500 1550
	1    0    0    -1  
$EndComp
Text Label 13200 1700 3    50   ~ 0
CONTROL_VALVE_8_FWD+
Wire Wire Line
	13200 1350 13200 1400
$Comp
L power:+12V #PWR?
U 1 1 625916EB
P 13200 1350
AR Path="/625916EB" Ref="#PWR?"  Part="1" 
AR Path="/62406C1B/625916EB" Ref="#PWR?"  Part="1" 
F 0 "#PWR?" H 13200 1200 50  0001 C CNN
F 1 "+12V" H 13215 1523 50  0000 C CNN
F 2 "" H 13200 1350 50  0001 C CNN
F 3 "" H 13200 1350 50  0001 C CNN
	1    13200 1350
	1    0    0    -1  
$EndComp
$Comp
L Device:R R?
U 1 1 625916F1
P 13200 1550
AR Path="/625916F1" Ref="R?"  Part="1" 
AR Path="/62406C1B/625916F1" Ref="R?"  Part="1" 
F 0 "R?" H 13270 1596 50  0000 L CNN
F 1 "10k" H 13270 1505 50  0000 L CNN
F 2 "" V 13130 1550 50  0001 C CNN
F 3 "~" H 13200 1550 50  0001 C CNN
	1    13200 1550
	1    0    0    -1  
$EndComp
Text Label 12900 1700 3    50   ~ 0
CONTROL_VALVE_7_REV+
Wire Wire Line
	12900 1350 12900 1400
$Comp
L power:+12V #PWR?
U 1 1 625916F9
P 12900 1350
AR Path="/625916F9" Ref="#PWR?"  Part="1" 
AR Path="/62406C1B/625916F9" Ref="#PWR?"  Part="1" 
F 0 "#PWR?" H 12900 1200 50  0001 C CNN
F 1 "+12V" H 12915 1523 50  0000 C CNN
F 2 "" H 12900 1350 50  0001 C CNN
F 3 "" H 12900 1350 50  0001 C CNN
	1    12900 1350
	1    0    0    -1  
$EndComp
$Comp
L Device:R R?
U 1 1 625916FF
P 12900 1550
AR Path="/625916FF" Ref="R?"  Part="1" 
AR Path="/62406C1B/625916FF" Ref="R?"  Part="1" 
F 0 "R?" H 12970 1596 50  0000 L CNN
F 1 "10k" H 12970 1505 50  0000 L CNN
F 2 "" V 12830 1550 50  0001 C CNN
F 3 "~" H 12900 1550 50  0001 C CNN
	1    12900 1550
	1    0    0    -1  
$EndComp
Text Label 12600 1700 3    50   ~ 0
CONTROL_VALVE_7_FWD+
Wire Wire Line
	12600 1350 12600 1400
$Comp
L power:+12V #PWR?
U 1 1 62591707
P 12600 1350
AR Path="/62591707" Ref="#PWR?"  Part="1" 
AR Path="/62406C1B/62591707" Ref="#PWR?"  Part="1" 
F 0 "#PWR?" H 12600 1200 50  0001 C CNN
F 1 "+12V" H 12615 1523 50  0000 C CNN
F 2 "" H 12600 1350 50  0001 C CNN
F 3 "" H 12600 1350 50  0001 C CNN
	1    12600 1350
	1    0    0    -1  
$EndComp
$Comp
L Device:R R?
U 1 1 6259170D
P 12600 1550
AR Path="/6259170D" Ref="R?"  Part="1" 
AR Path="/62406C1B/6259170D" Ref="R?"  Part="1" 
F 0 "R?" H 12670 1596 50  0000 L CNN
F 1 "10k" H 12670 1505 50  0000 L CNN
F 2 "" V 12530 1550 50  0001 C CNN
F 3 "~" H 12600 1550 50  0001 C CNN
	1    12600 1550
	1    0    0    -1  
$EndComp
Text Label 12300 1700 3    50   ~ 0
CONTROL_VALVE_6_REV+
Wire Wire Line
	12300 1350 12300 1400
$Comp
L power:+12V #PWR?
U 1 1 62591715
P 12300 1350
AR Path="/62591715" Ref="#PWR?"  Part="1" 
AR Path="/62406C1B/62591715" Ref="#PWR?"  Part="1" 
F 0 "#PWR?" H 12300 1200 50  0001 C CNN
F 1 "+12V" H 12315 1523 50  0000 C CNN
F 2 "" H 12300 1350 50  0001 C CNN
F 3 "" H 12300 1350 50  0001 C CNN
	1    12300 1350
	1    0    0    -1  
$EndComp
$Comp
L Device:R R?
U 1 1 6259171B
P 12300 1550
AR Path="/6259171B" Ref="R?"  Part="1" 
AR Path="/62406C1B/6259171B" Ref="R?"  Part="1" 
F 0 "R?" H 12370 1596 50  0000 L CNN
F 1 "10k" H 12370 1505 50  0000 L CNN
F 2 "" V 12230 1550 50  0001 C CNN
F 3 "~" H 12300 1550 50  0001 C CNN
	1    12300 1550
	1    0    0    -1  
$EndComp
Text Label 12000 1700 3    50   ~ 0
CONTROL_VALVE_6_FWD+
Wire Wire Line
	12000 1350 12000 1400
$Comp
L power:+12V #PWR?
U 1 1 62591723
P 12000 1350
AR Path="/62591723" Ref="#PWR?"  Part="1" 
AR Path="/62406C1B/62591723" Ref="#PWR?"  Part="1" 
F 0 "#PWR?" H 12000 1200 50  0001 C CNN
F 1 "+12V" H 12015 1523 50  0000 C CNN
F 2 "" H 12000 1350 50  0001 C CNN
F 3 "" H 12000 1350 50  0001 C CNN
	1    12000 1350
	1    0    0    -1  
$EndComp
$Comp
L Device:R R?
U 1 1 62591729
P 12000 1550
AR Path="/62591729" Ref="R?"  Part="1" 
AR Path="/62406C1B/62591729" Ref="R?"  Part="1" 
F 0 "R?" H 12070 1596 50  0000 L CNN
F 1 "10k" H 12070 1505 50  0000 L CNN
F 2 "" V 11930 1550 50  0001 C CNN
F 3 "~" H 12000 1550 50  0001 C CNN
	1    12000 1550
	1    0    0    -1  
$EndComp
Text Label 11700 1700 3    50   ~ 0
CONTROL_VALVE_5_REV+
Wire Wire Line
	11700 1350 11700 1400
$Comp
L power:+12V #PWR?
U 1 1 62591731
P 11700 1350
AR Path="/62591731" Ref="#PWR?"  Part="1" 
AR Path="/62406C1B/62591731" Ref="#PWR?"  Part="1" 
F 0 "#PWR?" H 11700 1200 50  0001 C CNN
F 1 "+12V" H 11715 1523 50  0000 C CNN
F 2 "" H 11700 1350 50  0001 C CNN
F 3 "" H 11700 1350 50  0001 C CNN
	1    11700 1350
	1    0    0    -1  
$EndComp
$Comp
L Device:R R?
U 1 1 62591737
P 11700 1550
AR Path="/62591737" Ref="R?"  Part="1" 
AR Path="/62406C1B/62591737" Ref="R?"  Part="1" 
F 0 "R?" H 11770 1596 50  0000 L CNN
F 1 "10k" H 11770 1505 50  0000 L CNN
F 2 "" V 11630 1550 50  0001 C CNN
F 3 "~" H 11700 1550 50  0001 C CNN
	1    11700 1550
	1    0    0    -1  
$EndComp
Text Label 11400 1700 3    50   ~ 0
CONTROL_VALVE_5_FWD+
Wire Wire Line
	11400 1350 11400 1400
$Comp
L power:+12V #PWR?
U 1 1 6259173F
P 11400 1350
AR Path="/6259173F" Ref="#PWR?"  Part="1" 
AR Path="/62406C1B/6259173F" Ref="#PWR?"  Part="1" 
F 0 "#PWR?" H 11400 1200 50  0001 C CNN
F 1 "+12V" H 11415 1523 50  0000 C CNN
F 2 "" H 11400 1350 50  0001 C CNN
F 3 "" H 11400 1350 50  0001 C CNN
	1    11400 1350
	1    0    0    -1  
$EndComp
$Comp
L Device:R R?
U 1 1 62591745
P 11400 1550
AR Path="/62591745" Ref="R?"  Part="1" 
AR Path="/62406C1B/62591745" Ref="R?"  Part="1" 
F 0 "R?" H 11470 1596 50  0000 L CNN
F 1 "10k" H 11470 1505 50  0000 L CNN
F 2 "" V 11330 1550 50  0001 C CNN
F 3 "~" H 11400 1550 50  0001 C CNN
	1    11400 1550
	1    0    0    -1  
$EndComp
Text Label 11100 1700 3    50   ~ 0
CONTROL_VALVE_4_REV+
Wire Wire Line
	11100 1350 11100 1400
$Comp
L power:+12V #PWR?
U 1 1 6259174D
P 11100 1350
AR Path="/6259174D" Ref="#PWR?"  Part="1" 
AR Path="/62406C1B/6259174D" Ref="#PWR?"  Part="1" 
F 0 "#PWR?" H 11100 1200 50  0001 C CNN
F 1 "+12V" H 11115 1523 50  0000 C CNN
F 2 "" H 11100 1350 50  0001 C CNN
F 3 "" H 11100 1350 50  0001 C CNN
	1    11100 1350
	1    0    0    -1  
$EndComp
$Comp
L Device:R R?
U 1 1 62591753
P 11100 1550
AR Path="/62591753" Ref="R?"  Part="1" 
AR Path="/62406C1B/62591753" Ref="R?"  Part="1" 
F 0 "R?" H 11170 1596 50  0000 L CNN
F 1 "10k" H 11170 1505 50  0000 L CNN
F 2 "" V 11030 1550 50  0001 C CNN
F 3 "~" H 11100 1550 50  0001 C CNN
	1    11100 1550
	1    0    0    -1  
$EndComp
Text Label 10800 1700 3    50   ~ 0
CONTROL_VALVE_4_FWD+
Wire Wire Line
	10800 1350 10800 1400
$Comp
L power:+12V #PWR?
U 1 1 6259175B
P 10800 1350
AR Path="/6259175B" Ref="#PWR?"  Part="1" 
AR Path="/62406C1B/6259175B" Ref="#PWR?"  Part="1" 
F 0 "#PWR?" H 10800 1200 50  0001 C CNN
F 1 "+12V" H 10815 1523 50  0000 C CNN
F 2 "" H 10800 1350 50  0001 C CNN
F 3 "" H 10800 1350 50  0001 C CNN
	1    10800 1350
	1    0    0    -1  
$EndComp
$Comp
L Device:R R?
U 1 1 62591761
P 10800 1550
AR Path="/62591761" Ref="R?"  Part="1" 
AR Path="/62406C1B/62591761" Ref="R?"  Part="1" 
F 0 "R?" H 10870 1596 50  0000 L CNN
F 1 "10k" H 10870 1505 50  0000 L CNN
F 2 "" V 10730 1550 50  0001 C CNN
F 3 "~" H 10800 1550 50  0001 C CNN
	1    10800 1550
	1    0    0    -1  
$EndComp
Text Label 10500 1700 3    50   ~ 0
CONTROL_VALVE_3_REV+
Wire Wire Line
	10500 1350 10500 1400
$Comp
L power:+12V #PWR?
U 1 1 62591769
P 10500 1350
AR Path="/62591769" Ref="#PWR?"  Part="1" 
AR Path="/62406C1B/62591769" Ref="#PWR?"  Part="1" 
F 0 "#PWR?" H 10500 1200 50  0001 C CNN
F 1 "+12V" H 10515 1523 50  0000 C CNN
F 2 "" H 10500 1350 50  0001 C CNN
F 3 "" H 10500 1350 50  0001 C CNN
	1    10500 1350
	1    0    0    -1  
$EndComp
$Comp
L Device:R R?
U 1 1 6259176F
P 10500 1550
AR Path="/6259176F" Ref="R?"  Part="1" 
AR Path="/62406C1B/6259176F" Ref="R?"  Part="1" 
F 0 "R?" H 10570 1596 50  0000 L CNN
F 1 "10k" H 10570 1505 50  0000 L CNN
F 2 "" V 10430 1550 50  0001 C CNN
F 3 "~" H 10500 1550 50  0001 C CNN
	1    10500 1550
	1    0    0    -1  
$EndComp
Text Label 10200 1700 3    50   ~ 0
CONTROL_VALVE_3_FWD+
Wire Wire Line
	10200 1350 10200 1400
$Comp
L power:+12V #PWR?
U 1 1 62591777
P 10200 1350
AR Path="/62591777" Ref="#PWR?"  Part="1" 
AR Path="/62406C1B/62591777" Ref="#PWR?"  Part="1" 
F 0 "#PWR?" H 10200 1200 50  0001 C CNN
F 1 "+12V" H 10215 1523 50  0000 C CNN
F 2 "" H 10200 1350 50  0001 C CNN
F 3 "" H 10200 1350 50  0001 C CNN
	1    10200 1350
	1    0    0    -1  
$EndComp
$Comp
L Device:R R?
U 1 1 6259177D
P 10200 1550
AR Path="/6259177D" Ref="R?"  Part="1" 
AR Path="/62406C1B/6259177D" Ref="R?"  Part="1" 
F 0 "R?" H 10270 1596 50  0000 L CNN
F 1 "10k" H 10270 1505 50  0000 L CNN
F 2 "" V 10130 1550 50  0001 C CNN
F 3 "~" H 10200 1550 50  0001 C CNN
	1    10200 1550
	1    0    0    -1  
$EndComp
Text Label 9900 1700 3    50   ~ 0
CONTROL_VALVE_2_REV+
Wire Wire Line
	9900 1350 9900 1400
$Comp
L power:+12V #PWR?
U 1 1 62591785
P 9900 1350
AR Path="/62591785" Ref="#PWR?"  Part="1" 
AR Path="/62406C1B/62591785" Ref="#PWR?"  Part="1" 
F 0 "#PWR?" H 9900 1200 50  0001 C CNN
F 1 "+12V" H 9915 1523 50  0000 C CNN
F 2 "" H 9900 1350 50  0001 C CNN
F 3 "" H 9900 1350 50  0001 C CNN
	1    9900 1350
	1    0    0    -1  
$EndComp
$Comp
L Device:R R?
U 1 1 6259178B
P 9900 1550
AR Path="/6259178B" Ref="R?"  Part="1" 
AR Path="/62406C1B/6259178B" Ref="R?"  Part="1" 
F 0 "R?" H 9970 1596 50  0000 L CNN
F 1 "10k" H 9970 1505 50  0000 L CNN
F 2 "" V 9830 1550 50  0001 C CNN
F 3 "~" H 9900 1550 50  0001 C CNN
	1    9900 1550
	1    0    0    -1  
$EndComp
Text Label 9600 1700 3    50   ~ 0
CONTROL_VALVE_2_FWD+
Wire Wire Line
	9600 1350 9600 1400
$Comp
L power:+12V #PWR?
U 1 1 62591793
P 9600 1350
AR Path="/62591793" Ref="#PWR?"  Part="1" 
AR Path="/62406C1B/62591793" Ref="#PWR?"  Part="1" 
F 0 "#PWR?" H 9600 1200 50  0001 C CNN
F 1 "+12V" H 9615 1523 50  0000 C CNN
F 2 "" H 9600 1350 50  0001 C CNN
F 3 "" H 9600 1350 50  0001 C CNN
	1    9600 1350
	1    0    0    -1  
$EndComp
$Comp
L Device:R R?
U 1 1 62591799
P 9600 1550
AR Path="/62591799" Ref="R?"  Part="1" 
AR Path="/62406C1B/62591799" Ref="R?"  Part="1" 
F 0 "R?" H 9670 1596 50  0000 L CNN
F 1 "10k" H 9670 1505 50  0000 L CNN
F 2 "" V 9530 1550 50  0001 C CNN
F 3 "~" H 9600 1550 50  0001 C CNN
	1    9600 1550
	1    0    0    -1  
$EndComp
Text Label 9300 1700 3    50   ~ 0
CONTROL_VALVE_1_REV+
Wire Wire Line
	9300 1350 9300 1400
$Comp
L power:+12V #PWR?
U 1 1 625917A1
P 9300 1350
AR Path="/625917A1" Ref="#PWR?"  Part="1" 
AR Path="/62406C1B/625917A1" Ref="#PWR?"  Part="1" 
F 0 "#PWR?" H 9300 1200 50  0001 C CNN
F 1 "+12V" H 9315 1523 50  0000 C CNN
F 2 "" H 9300 1350 50  0001 C CNN
F 3 "" H 9300 1350 50  0001 C CNN
	1    9300 1350
	1    0    0    -1  
$EndComp
$Comp
L Device:R R?
U 1 1 625917A7
P 9300 1550
AR Path="/625917A7" Ref="R?"  Part="1" 
AR Path="/62406C1B/625917A7" Ref="R?"  Part="1" 
F 0 "R?" H 9370 1596 50  0000 L CNN
F 1 "10k" H 9370 1505 50  0000 L CNN
F 2 "" V 9230 1550 50  0001 C CNN
F 3 "~" H 9300 1550 50  0001 C CNN
	1    9300 1550
	1    0    0    -1  
$EndComp
Text Label 9000 1700 3    50   ~ 0
CONTROL_VALVE_1_FWD+
Wire Wire Line
	9000 1350 9000 1400
$Comp
L power:+12V #PWR?
U 1 1 625917AF
P 9000 1350
AR Path="/625917AF" Ref="#PWR?"  Part="1" 
AR Path="/62406C1B/625917AF" Ref="#PWR?"  Part="1" 
F 0 "#PWR?" H 9000 1200 50  0001 C CNN
F 1 "+12V" H 9015 1523 50  0000 C CNN
F 2 "" H 9000 1350 50  0001 C CNN
F 3 "" H 9000 1350 50  0001 C CNN
	1    9000 1350
	1    0    0    -1  
$EndComp
$Comp
L Device:R R?
U 1 1 625917B5
P 9000 1550
AR Path="/625917B5" Ref="R?"  Part="1" 
AR Path="/62406C1B/625917B5" Ref="R?"  Part="1" 
F 0 "R?" H 9070 1596 50  0000 L CNN
F 1 "10k" H 9070 1505 50  0000 L CNN
F 2 "" V 8930 1550 50  0001 C CNN
F 3 "~" H 9000 1550 50  0001 C CNN
	1    9000 1550
	1    0    0    -1  
$EndComp
$Comp
L Device:R R?
U 1 1 625917BB
P 13500 3850
AR Path="/625917BB" Ref="R?"  Part="1" 
AR Path="/62406C1B/625917BB" Ref="R?"  Part="1" 
F 0 "R?" H 13570 3896 50  0000 L CNN
F 1 "10k" H 13570 3805 50  0000 L CNN
F 2 "" V 13430 3850 50  0001 C CNN
F 3 "~" H 13500 3850 50  0001 C CNN
	1    13500 3850
	-1   0    0    1   
$EndComp
Wire Wire Line
	13500 4050 13500 4000
Text Label 13500 3700 1    50   ~ 0
CONTROL_VALVE_1_FWD-
$Comp
L Device:R R?
U 1 1 625917C3
P 13200 3850
AR Path="/625917C3" Ref="R?"  Part="1" 
AR Path="/62406C1B/625917C3" Ref="R?"  Part="1" 
F 0 "R?" H 13270 3896 50  0000 L CNN
F 1 "10k" H 13270 3805 50  0000 L CNN
F 2 "" V 13130 3850 50  0001 C CNN
F 3 "~" H 13200 3850 50  0001 C CNN
	1    13200 3850
	-1   0    0    1   
$EndComp
Wire Wire Line
	13200 4050 13200 4000
Text Label 13200 3700 1    50   ~ 0
CONTROL_VALVE_1_REV-
$Comp
L Device:R R?
U 1 1 625917CB
P 12900 3850
AR Path="/625917CB" Ref="R?"  Part="1" 
AR Path="/62406C1B/625917CB" Ref="R?"  Part="1" 
F 0 "R?" H 12970 3896 50  0000 L CNN
F 1 "10k" H 12970 3805 50  0000 L CNN
F 2 "" V 12830 3850 50  0001 C CNN
F 3 "~" H 12900 3850 50  0001 C CNN
	1    12900 3850
	-1   0    0    1   
$EndComp
Wire Wire Line
	12900 4050 12900 4000
Text Label 12900 3700 1    50   ~ 0
CONTROL_VALVE_2_FWD-
$Comp
L Device:R R?
U 1 1 625917D3
P 12600 3850
AR Path="/625917D3" Ref="R?"  Part="1" 
AR Path="/62406C1B/625917D3" Ref="R?"  Part="1" 
F 0 "R?" H 12670 3896 50  0000 L CNN
F 1 "10k" H 12670 3805 50  0000 L CNN
F 2 "" V 12530 3850 50  0001 C CNN
F 3 "~" H 12600 3850 50  0001 C CNN
	1    12600 3850
	-1   0    0    1   
$EndComp
Wire Wire Line
	12600 4050 12600 4000
Text Label 12600 3700 1    50   ~ 0
CONTROL_VALVE_2_REV-
$Comp
L Device:R R?
U 1 1 625917DB
P 12300 3850
AR Path="/625917DB" Ref="R?"  Part="1" 
AR Path="/62406C1B/625917DB" Ref="R?"  Part="1" 
F 0 "R?" H 12370 3896 50  0000 L CNN
F 1 "10k" H 12370 3805 50  0000 L CNN
F 2 "" V 12230 3850 50  0001 C CNN
F 3 "~" H 12300 3850 50  0001 C CNN
	1    12300 3850
	-1   0    0    1   
$EndComp
Wire Wire Line
	12300 4050 12300 4000
Text Label 12300 3700 1    50   ~ 0
CONTROL_VALVE_3_FWD-
$Comp
L Device:R R?
U 1 1 625917E3
P 12000 3850
AR Path="/625917E3" Ref="R?"  Part="1" 
AR Path="/62406C1B/625917E3" Ref="R?"  Part="1" 
F 0 "R?" H 12070 3896 50  0000 L CNN
F 1 "10k" H 12070 3805 50  0000 L CNN
F 2 "" V 11930 3850 50  0001 C CNN
F 3 "~" H 12000 3850 50  0001 C CNN
	1    12000 3850
	-1   0    0    1   
$EndComp
Wire Wire Line
	12000 4050 12000 4000
Text Label 12000 3700 1    50   ~ 0
CONTROL_VALVE_3_REV-
$Comp
L Device:R R?
U 1 1 625917EB
P 11700 3850
AR Path="/625917EB" Ref="R?"  Part="1" 
AR Path="/62406C1B/625917EB" Ref="R?"  Part="1" 
F 0 "R?" H 11770 3896 50  0000 L CNN
F 1 "10k" H 11770 3805 50  0000 L CNN
F 2 "" V 11630 3850 50  0001 C CNN
F 3 "~" H 11700 3850 50  0001 C CNN
	1    11700 3850
	-1   0    0    1   
$EndComp
Wire Wire Line
	11700 4050 11700 4000
Text Label 11700 3700 1    50   ~ 0
CONTROL_VALVE_4_FWD-
$Comp
L Device:R R?
U 1 1 625917F3
P 11400 3850
AR Path="/625917F3" Ref="R?"  Part="1" 
AR Path="/62406C1B/625917F3" Ref="R?"  Part="1" 
F 0 "R?" H 11470 3896 50  0000 L CNN
F 1 "10k" H 11470 3805 50  0000 L CNN
F 2 "" V 11330 3850 50  0001 C CNN
F 3 "~" H 11400 3850 50  0001 C CNN
	1    11400 3850
	-1   0    0    1   
$EndComp
Wire Wire Line
	11400 4050 11400 4000
Text Label 11400 3700 1    50   ~ 0
CONTROL_VALVE_4_REV-
$Comp
L Device:R R?
U 1 1 625917FB
P 11100 3850
AR Path="/625917FB" Ref="R?"  Part="1" 
AR Path="/62406C1B/625917FB" Ref="R?"  Part="1" 
F 0 "R?" H 11170 3896 50  0000 L CNN
F 1 "10k" H 11170 3805 50  0000 L CNN
F 2 "" V 11030 3850 50  0001 C CNN
F 3 "~" H 11100 3850 50  0001 C CNN
	1    11100 3850
	-1   0    0    1   
$EndComp
Wire Wire Line
	11100 4050 11100 4000
Text Label 11100 3700 1    50   ~ 0
CONTROL_VALVE_5_FWD-
$Comp
L Device:R R?
U 1 1 62591803
P 10800 3850
AR Path="/62591803" Ref="R?"  Part="1" 
AR Path="/62406C1B/62591803" Ref="R?"  Part="1" 
F 0 "R?" H 10870 3896 50  0000 L CNN
F 1 "10k" H 10870 3805 50  0000 L CNN
F 2 "" V 10730 3850 50  0001 C CNN
F 3 "~" H 10800 3850 50  0001 C CNN
	1    10800 3850
	-1   0    0    1   
$EndComp
Wire Wire Line
	10800 4050 10800 4000
Text Label 10800 3700 1    50   ~ 0
CONTROL_VALVE_5_REV-
$Comp
L Device:R R?
U 1 1 6259180B
P 10500 3850
AR Path="/6259180B" Ref="R?"  Part="1" 
AR Path="/62406C1B/6259180B" Ref="R?"  Part="1" 
F 0 "R?" H 10570 3896 50  0000 L CNN
F 1 "10k" H 10570 3805 50  0000 L CNN
F 2 "" V 10430 3850 50  0001 C CNN
F 3 "~" H 10500 3850 50  0001 C CNN
	1    10500 3850
	-1   0    0    1   
$EndComp
Wire Wire Line
	10500 4050 10500 4000
Text Label 10500 3700 1    50   ~ 0
CONTROL_VALVE_6_FWD-
$Comp
L Device:R R?
U 1 1 62591813
P 10200 3850
AR Path="/62591813" Ref="R?"  Part="1" 
AR Path="/62406C1B/62591813" Ref="R?"  Part="1" 
F 0 "R?" H 10270 3896 50  0000 L CNN
F 1 "10k" H 10270 3805 50  0000 L CNN
F 2 "" V 10130 3850 50  0001 C CNN
F 3 "~" H 10200 3850 50  0001 C CNN
	1    10200 3850
	-1   0    0    1   
$EndComp
Wire Wire Line
	10200 4050 10200 4000
Text Label 10200 3700 1    50   ~ 0
CONTROL_VALVE_6_REV-
$Comp
L Device:R R?
U 1 1 6259181B
P 9900 3850
AR Path="/6259181B" Ref="R?"  Part="1" 
AR Path="/62406C1B/6259181B" Ref="R?"  Part="1" 
F 0 "R?" H 9970 3896 50  0000 L CNN
F 1 "10k" H 9970 3805 50  0000 L CNN
F 2 "" V 9830 3850 50  0001 C CNN
F 3 "~" H 9900 3850 50  0001 C CNN
	1    9900 3850
	-1   0    0    1   
$EndComp
Wire Wire Line
	9900 4050 9900 4000
Text Label 9900 3700 1    50   ~ 0
CONTROL_VALVE_7_FWD-
$Comp
L Device:R R?
U 1 1 62591823
P 9600 3850
AR Path="/62591823" Ref="R?"  Part="1" 
AR Path="/62406C1B/62591823" Ref="R?"  Part="1" 
F 0 "R?" H 9670 3896 50  0000 L CNN
F 1 "10k" H 9670 3805 50  0000 L CNN
F 2 "" V 9530 3850 50  0001 C CNN
F 3 "~" H 9600 3850 50  0001 C CNN
	1    9600 3850
	-1   0    0    1   
$EndComp
Wire Wire Line
	9600 4050 9600 4000
Text Label 9600 3700 1    50   ~ 0
CONTROL_VALVE_7_REV-
$Comp
L Device:R R?
U 1 1 6259182B
P 9300 3850
AR Path="/6259182B" Ref="R?"  Part="1" 
AR Path="/62406C1B/6259182B" Ref="R?"  Part="1" 
F 0 "R?" H 9370 3896 50  0000 L CNN
F 1 "10k" H 9370 3805 50  0000 L CNN
F 2 "" V 9230 3850 50  0001 C CNN
F 3 "~" H 9300 3850 50  0001 C CNN
	1    9300 3850
	-1   0    0    1   
$EndComp
Wire Wire Line
	9300 4050 9300 4000
Text Label 9300 3700 1    50   ~ 0
CONTROL_VALVE_8_FWD-
$Comp
L Device:R R?
U 1 1 62591833
P 9000 3850
AR Path="/62591833" Ref="R?"  Part="1" 
AR Path="/62406C1B/62591833" Ref="R?"  Part="1" 
F 0 "R?" H 9070 3896 50  0000 L CNN
F 1 "10k" H 9070 3805 50  0000 L CNN
F 2 "" V 8930 3850 50  0001 C CNN
F 3 "~" H 9000 3850 50  0001 C CNN
	1    9000 3850
	-1   0    0    1   
$EndComp
Wire Wire Line
	9000 4050 9000 4000
Text Label 9000 3700 1    50   ~ 0
CONTROL_VALVE_8_REV-
$Comp
L power:GND #PWR?
U 1 1 6259183B
P 9000 4050
AR Path="/6259183B" Ref="#PWR?"  Part="1" 
AR Path="/62406C1B/6259183B" Ref="#PWR?"  Part="1" 
F 0 "#PWR?" H 9000 3800 50  0001 C CNN
F 1 "GND" H 9005 3877 50  0000 C CNN
F 2 "" H 9000 4050 50  0001 C CNN
F 3 "" H 9000 4050 50  0001 C CNN
	1    9000 4050
	1    0    0    -1  
$EndComp
$Comp
L power:GND #PWR?
U 1 1 62591841
P 9300 4050
AR Path="/62591841" Ref="#PWR?"  Part="1" 
AR Path="/62406C1B/62591841" Ref="#PWR?"  Part="1" 
F 0 "#PWR?" H 9300 3800 50  0001 C CNN
F 1 "GND" H 9305 3877 50  0000 C CNN
F 2 "" H 9300 4050 50  0001 C CNN
F 3 "" H 9300 4050 50  0001 C CNN
	1    9300 4050
	1    0    0    -1  
$EndComp
$Comp
L power:GND #PWR?
U 1 1 62591847
P 9600 4050
AR Path="/62591847" Ref="#PWR?"  Part="1" 
AR Path="/62406C1B/62591847" Ref="#PWR?"  Part="1" 
F 0 "#PWR?" H 9600 3800 50  0001 C CNN
F 1 "GND" H 9605 3877 50  0000 C CNN
F 2 "" H 9600 4050 50  0001 C CNN
F 3 "" H 9600 4050 50  0001 C CNN
	1    9600 4050
	1    0    0    -1  
$EndComp
$Comp
L power:GND #PWR?
U 1 1 6259184D
P 9900 4050
AR Path="/6259184D" Ref="#PWR?"  Part="1" 
AR Path="/62406C1B/6259184D" Ref="#PWR?"  Part="1" 
F 0 "#PWR?" H 9900 3800 50  0001 C CNN
F 1 "GND" H 9905 3877 50  0000 C CNN
F 2 "" H 9900 4050 50  0001 C CNN
F 3 "" H 9900 4050 50  0001 C CNN
	1    9900 4050
	1    0    0    -1  
$EndComp
$Comp
L power:GND #PWR?
U 1 1 62591853
P 10200 4050
AR Path="/62591853" Ref="#PWR?"  Part="1" 
AR Path="/62406C1B/62591853" Ref="#PWR?"  Part="1" 
F 0 "#PWR?" H 10200 3800 50  0001 C CNN
F 1 "GND" H 10205 3877 50  0000 C CNN
F 2 "" H 10200 4050 50  0001 C CNN
F 3 "" H 10200 4050 50  0001 C CNN
	1    10200 4050
	1    0    0    -1  
$EndComp
$Comp
L power:GND #PWR?
U 1 1 62591859
P 10500 4050
AR Path="/62591859" Ref="#PWR?"  Part="1" 
AR Path="/62406C1B/62591859" Ref="#PWR?"  Part="1" 
F 0 "#PWR?" H 10500 3800 50  0001 C CNN
F 1 "GND" H 10505 3877 50  0000 C CNN
F 2 "" H 10500 4050 50  0001 C CNN
F 3 "" H 10500 4050 50  0001 C CNN
	1    10500 4050
	1    0    0    -1  
$EndComp
$Comp
L power:GND #PWR?
U 1 1 6259185F
P 10800 4050
AR Path="/6259185F" Ref="#PWR?"  Part="1" 
AR Path="/62406C1B/6259185F" Ref="#PWR?"  Part="1" 
F 0 "#PWR?" H 10800 3800 50  0001 C CNN
F 1 "GND" H 10805 3877 50  0000 C CNN
F 2 "" H 10800 4050 50  0001 C CNN
F 3 "" H 10800 4050 50  0001 C CNN
	1    10800 4050
	1    0    0    -1  
$EndComp
$Comp
L power:GND #PWR?
U 1 1 62591865
P 11100 4050
AR Path="/62591865" Ref="#PWR?"  Part="1" 
AR Path="/62406C1B/62591865" Ref="#PWR?"  Part="1" 
F 0 "#PWR?" H 11100 3800 50  0001 C CNN
F 1 "GND" H 11105 3877 50  0000 C CNN
F 2 "" H 11100 4050 50  0001 C CNN
F 3 "" H 11100 4050 50  0001 C CNN
	1    11100 4050
	1    0    0    -1  
$EndComp
$Comp
L power:GND #PWR?
U 1 1 6259186B
P 11400 4050
AR Path="/6259186B" Ref="#PWR?"  Part="1" 
AR Path="/62406C1B/6259186B" Ref="#PWR?"  Part="1" 
F 0 "#PWR?" H 11400 3800 50  0001 C CNN
F 1 "GND" H 11405 3877 50  0000 C CNN
F 2 "" H 11400 4050 50  0001 C CNN
F 3 "" H 11400 4050 50  0001 C CNN
	1    11400 4050
	1    0    0    -1  
$EndComp
$Comp
L power:GND #PWR?
U 1 1 62591871
P 11700 4050
AR Path="/62591871" Ref="#PWR?"  Part="1" 
AR Path="/62406C1B/62591871" Ref="#PWR?"  Part="1" 
F 0 "#PWR?" H 11700 3800 50  0001 C CNN
F 1 "GND" H 11705 3877 50  0000 C CNN
F 2 "" H 11700 4050 50  0001 C CNN
F 3 "" H 11700 4050 50  0001 C CNN
	1    11700 4050
	1    0    0    -1  
$EndComp
$Comp
L power:GND #PWR?
U 1 1 62591877
P 12000 4050
AR Path="/62591877" Ref="#PWR?"  Part="1" 
AR Path="/62406C1B/62591877" Ref="#PWR?"  Part="1" 
F 0 "#PWR?" H 12000 3800 50  0001 C CNN
F 1 "GND" H 12005 3877 50  0000 C CNN
F 2 "" H 12000 4050 50  0001 C CNN
F 3 "" H 12000 4050 50  0001 C CNN
	1    12000 4050
	1    0    0    -1  
$EndComp
$Comp
L power:GND #PWR?
U 1 1 6259187D
P 12300 4050
AR Path="/6259187D" Ref="#PWR?"  Part="1" 
AR Path="/62406C1B/6259187D" Ref="#PWR?"  Part="1" 
F 0 "#PWR?" H 12300 3800 50  0001 C CNN
F 1 "GND" H 12305 3877 50  0000 C CNN
F 2 "" H 12300 4050 50  0001 C CNN
F 3 "" H 12300 4050 50  0001 C CNN
	1    12300 4050
	1    0    0    -1  
$EndComp
$Comp
L power:GND #PWR?
U 1 1 62591883
P 12600 4050
AR Path="/62591883" Ref="#PWR?"  Part="1" 
AR Path="/62406C1B/62591883" Ref="#PWR?"  Part="1" 
F 0 "#PWR?" H 12600 3800 50  0001 C CNN
F 1 "GND" H 12605 3877 50  0000 C CNN
F 2 "" H 12600 4050 50  0001 C CNN
F 3 "" H 12600 4050 50  0001 C CNN
	1    12600 4050
	1    0    0    -1  
$EndComp
$Comp
L power:GND #PWR?
U 1 1 62591889
P 12900 4050
AR Path="/62591889" Ref="#PWR?"  Part="1" 
AR Path="/62406C1B/62591889" Ref="#PWR?"  Part="1" 
F 0 "#PWR?" H 12900 3800 50  0001 C CNN
F 1 "GND" H 12905 3877 50  0000 C CNN
F 2 "" H 12900 4050 50  0001 C CNN
F 3 "" H 12900 4050 50  0001 C CNN
	1    12900 4050
	1    0    0    -1  
$EndComp
$Comp
L power:GND #PWR?
U 1 1 6259188F
P 13200 4050
AR Path="/6259188F" Ref="#PWR?"  Part="1" 
AR Path="/62406C1B/6259188F" Ref="#PWR?"  Part="1" 
F 0 "#PWR?" H 13200 3800 50  0001 C CNN
F 1 "GND" H 13205 3877 50  0000 C CNN
F 2 "" H 13200 4050 50  0001 C CNN
F 3 "" H 13200 4050 50  0001 C CNN
	1    13200 4050
	1    0    0    -1  
$EndComp
$Comp
L power:GND #PWR?
U 1 1 62591895
P 13500 4050
AR Path="/62591895" Ref="#PWR?"  Part="1" 
AR Path="/62406C1B/62591895" Ref="#PWR?"  Part="1" 
F 0 "#PWR?" H 13500 3800 50  0001 C CNN
F 1 "GND" H 13505 3877 50  0000 C CNN
F 2 "" H 13500 4050 50  0001 C CNN
F 3 "" H 13500 4050 50  0001 C CNN
	1    13500 4050
	1    0    0    -1  
$EndComp
Wire Notes Line
	13800 1100 13800 4350
Wire Notes Line
	13800 4350 8700 4350
Wire Notes Line
	8700 4350 8700 1100
Wire Notes Line
	8700 1100 13800 1100
Text Notes 10950 1100 0    50   ~ 0
Control resistors
$EndSCHEMATC
