(module "T1M10GFDV" (layer F.Cu)
  (descr "T1M-10-GF-DV-1")
  (tags "Connector")
  (fp_text reference J** (at 0.000 0.488) (layer F.SilkS)
    (effects (font (size 1.27 1.27) (thickness 0.254)))
  )
  (fp_text user %R (at 0.000 0.488) (layer F.Fab)
    (effects (font (size 1.27 1.27) (thickness 0.254)))
  )
  (fp_text value "T1M10GFDV" (at 0.000 0.488) (layer F.SilkS) hide
    (effects (font (size 1.27 1.27) (thickness 0.254)))
  )
  (fp_line (start -8.55 3.125) (end 8.55 3.125) (layer F.Fab) (width 0.2))
  (fp_line (start 8.55 3.125) (end 8.55 -3.125) (layer F.Fab) (width 0.2))
  (fp_line (start 8.55 -3.125) (end -8.55 -3.125) (layer F.Fab) (width 0.2))
  (fp_line (start -8.55 -3.125) (end -8.55 3.125) (layer F.Fab) (width 0.2))
  (fp_line (start -5.5 -3.125) (end -8.55 -3.125) (layer F.SilkS) (width 0.1))
  (fp_line (start -8.55 -3.125) (end -8.55 -3.125) (layer F.SilkS) (width 0.1))
  (fp_line (start -8.55 -3.125) (end -5.5 -3.125) (layer F.SilkS) (width 0.1))
  (fp_line (start -5.5 -3.125) (end -5.5 -3.125) (layer F.SilkS) (width 0.1))
  (fp_line (start -8.55 3.125) (end -5.5 3.125) (layer F.SilkS) (width 0.1))
  (fp_line (start -5.5 3.125) (end -5.5 3.125) (layer F.SilkS) (width 0.1))
  (fp_line (start -5.5 3.125) (end -8.55 3.125) (layer F.SilkS) (width 0.1))
  (fp_line (start -8.55 3.125) (end -8.55 3.125) (layer F.SilkS) (width 0.1))
  (fp_line (start 5.5 3.125) (end 8.55 3.125) (layer F.SilkS) (width 0.1))
  (fp_line (start 8.55 3.125) (end 8.55 3.125) (layer F.SilkS) (width 0.1))
  (fp_line (start 8.55 3.125) (end 5.5 3.125) (layer F.SilkS) (width 0.1))
  (fp_line (start 5.5 3.125) (end 5.5 3.125) (layer F.SilkS) (width 0.1))
  (fp_line (start 8.55 -3.125) (end 5.5 -3.125) (layer F.SilkS) (width 0.1))
  (fp_line (start 5.5 -3.125) (end 5.5 -3.125) (layer F.SilkS) (width 0.1))
  (fp_line (start 5.5 -3.125) (end 8.55 -3.125) (layer F.SilkS) (width 0.1))
  (fp_line (start 8.55 -3.125) (end 8.55 -3.125) (layer F.SilkS) (width 0.1))
  (fp_line (start -9.55 -4.925) (end 9.55 -4.925) (layer F.CrtYd) (width 0.1))
  (fp_line (start 9.55 -4.925) (end 9.55 5.9) (layer F.CrtYd) (width 0.1))
  (fp_line (start 9.55 5.9) (end -9.55 5.9) (layer F.CrtYd) (width 0.1))
  (fp_line (start -9.55 5.9) (end -9.55 -4.925) (layer F.CrtYd) (width 0.1))
  (fp_line (start -8.55 -3.125) (end -8.55 -3.125) (layer F.SilkS) (width 0.1))
  (fp_line (start -8.55 -3.125) (end -8.55 3.125) (layer F.SilkS) (width 0.1))
  (fp_line (start -8.55 3.125) (end -8.55 3.125) (layer F.SilkS) (width 0.1))
  (fp_line (start -8.55 3.125) (end -8.55 -3.125) (layer F.SilkS) (width 0.1))
  (fp_line (start 8.55 3.125) (end 8.55 3.125) (layer F.SilkS) (width 0.1))
  (fp_line (start 8.55 3.125) (end 8.55 -3.125) (layer F.SilkS) (width 0.1))
  (fp_line (start 8.55 -3.125) (end 8.55 -3.125) (layer F.SilkS) (width 0.1))
  (fp_line (start 8.55 -3.125) (end 8.55 3.125) (layer F.SilkS) (width 0.1))
  (fp_line (start -4.5 4.8) (end -4.5 4.8) (layer F.SilkS) (width 0.2))
  (fp_line (start -4.5 4.9) (end -4.5 4.9) (layer F.SilkS) (width 0.2))
  (fp_line (start -4.5 4.8) (end -4.5 4.8) (layer F.SilkS) (width 0.2))
  (fp_arc (start -4.5 4.85) (end -4.500 4.8) (angle -180) (layer F.SilkS) (width 0.2))
  (fp_arc (start -4.5 4.85) (end -4.500 4.9) (angle -180) (layer F.SilkS) (width 0.2))
  (fp_arc (start -4.5 4.85) (end -4.500 4.8) (angle -180) (layer F.SilkS) (width 0.2))
  (pad 1 smd rect (at -4.500 3.125 0) (size 0.600 1.600) (layers F.Cu F.Paste F.Mask))
  (pad 2 smd rect (at -4.500 -3.125 0) (size 0.600 1.600) (layers F.Cu F.Paste F.Mask))
  (pad 3 smd rect (at -3.500 3.125 0) (size 0.600 1.600) (layers F.Cu F.Paste F.Mask))
  (pad 4 smd rect (at -3.500 -3.125 0) (size 0.600 1.600) (layers F.Cu F.Paste F.Mask))
  (pad 5 smd rect (at -2.500 3.125 0) (size 0.600 1.600) (layers F.Cu F.Paste F.Mask))
  (pad 6 smd rect (at -2.500 -3.125 0) (size 0.600 1.600) (layers F.Cu F.Paste F.Mask))
  (pad 7 smd rect (at -1.500 3.125 0) (size 0.600 1.600) (layers F.Cu F.Paste F.Mask))
  (pad 8 smd rect (at -1.500 -3.125 0) (size 0.600 1.600) (layers F.Cu F.Paste F.Mask))
  (pad 9 smd rect (at -0.500 3.125 0) (size 0.600 1.600) (layers F.Cu F.Paste F.Mask))
  (pad 10 smd rect (at -0.500 -3.125 0) (size 0.600 1.600) (layers F.Cu F.Paste F.Mask))
  (pad 11 smd rect (at 0.500 3.125 0) (size 0.600 1.600) (layers F.Cu F.Paste F.Mask))
  (pad 12 smd rect (at 0.500 -3.125 0) (size 0.600 1.600) (layers F.Cu F.Paste F.Mask))
  (pad 13 smd rect (at 1.500 3.125 0) (size 0.600 1.600) (layers F.Cu F.Paste F.Mask))
  (pad 14 smd rect (at 1.500 -3.125 0) (size 0.600 1.600) (layers F.Cu F.Paste F.Mask))
  (pad 15 smd rect (at 2.500 3.125 0) (size 0.600 1.600) (layers F.Cu F.Paste F.Mask))
  (pad 16 smd rect (at 2.500 -3.125 0) (size 0.600 1.600) (layers F.Cu F.Paste F.Mask))
  (pad 17 smd rect (at 3.500 3.125 0) (size 0.600 1.600) (layers F.Cu F.Paste F.Mask))
  (pad 18 smd rect (at 3.500 -3.125 0) (size 0.600 1.600) (layers F.Cu F.Paste F.Mask))
  (pad 19 smd rect (at 4.500 3.125 0) (size 0.600 1.600) (layers F.Cu F.Paste F.Mask))
  (pad 20 smd rect (at 4.500 -3.125 0) (size 0.600 1.600) (layers F.Cu F.Paste F.Mask))
  (pad MH1 thru_hole circle (at -5.750 -0.5) (size 1.269 1.269) (drill 0.74) (layers *.Cu *.Mask))
  (pad MH2 thru_hole circle (at 5.750 -0.5) (size 1.269 1.269) (drill 0.74) (layers *.Cu *.Mask))
  (pad MH3 np_thru_hole circle (at 7.250 2.15) (size 0.89 0) (drill 0.89) (layers *.Cu *.Mask))
  (pad MH4 np_thru_hole circle (at -7.250 2.15) (size 0.89 0) (drill 0.89) (layers *.Cu *.Mask))
  (model T1M-10-GF-DV.stp
    (at (xyz 0 0 0))
    (scale (xyz 1 1 1))
    (rotate (xyz 0 0 0))
  )
)
