0
SECTION
2
HEADER
9
$INSUNITS
70
4
9
$ACADVER
1
AC1014
9
$HANDSEED
5
FFFF
0
ENDSEC
0
SECTION
2
TABLES
0
TABLE
2
VPORT
5
8
100
AcDbSymbolTable
0
ENDTAB
0
TABLE
2
LTYPE
5
5
100
AcDbSymbolTable
0
LTYPE
5
14
100
AcDbSymbolTableRecord
100
AcDbLinetypeTableRecord
2
BYBLOCK
70
0
0
LTYPE
5
15
100
AcDbSymbolTableRecord
100
AcDbLinetypeTableRecord
2
BYLAYER
70
0
0
ENDTAB
0
TABLE
2
LAYER
5
2
100
AcDbSymbolTable
70
2
0
LAYER
5
50
100
AcDbSymbolTableRecord
100
AcDbLayerTableRecord
2
0
70
0
6
CONTINUOUS
0
ENDTAB
0
TABLE
2
STYLE
5
3
100
AcDbSymbolTable
70
1
0
STYLE
5
11
100
AcDbSymbolTableRecord
100
AcDbTextStyleTableRecord
2
STANDARD
70
0
0
ENDTAB
0
TABLE
2
VIEW
5
6
100
AcDbSymbolTable
70
0
0
ENDTAB
0
TABLE
2
UCS
5
7
100
AcDbSymbolTable
70
0
0
ENDTAB
0
TABLE
2
APPID
5
9
100
AcDbSymbolTable
70
2
0
APPID
5
12
100
AcDbSymbolTableRecord
100
AcDbRegAppTableRecord
2
ACAD
70
0
0
ENDTAB
0
TABLE
2
DIMSTYLE
5
A
100
AcDbSymbolTable
70
1
0
ENDTAB
0
TABLE
2
BLOCK_RECORD
5
1
100
AcDbSymbolTable
70
1
0
BLOCK_RECORD
5
1F
100
AcDbSymbolTableRecord
100
AcDbBlockTableRecord
2
*MODEL_SPACE
0
BLOCK_RECORD
5
1B
100
AcDbSymbolTableRecord
100
AcDbBlockTableRecord
2
*PAPER_SPACE
0
ENDTAB
0
ENDSEC
0
SECTION
2
BLOCKS
0
BLOCK
5
20
100
AcDbEntity
100
AcDbBlockBegin
2
*MODEL_SPACE
0
ENDBLK
5
21
100
AcDbEntity
100
AcDbBlockEnd
0
BLOCK
5
1C
100
AcDbEntity
100
AcDbBlockBegin
2
*PAPER_SPACE
0
ENDBLK
5
1D
100
AcDbEntity
100
AcDbBlockEnd
0
ENDSEC
0
SECTION
2
ENTITIES
0
LWPOLYLINE
5
100
100
AcDbEntity
8
0
100
AcDbPolyline
90
10
70
1
43
0.0
10
-192.99982324218769
20
14.395982131957563
10
-149.56582324218766
20
14.395982131957545
42
-0.41421356237309503
10
-148.54982324218767
20
13.379982131957568
10
-148.5498232421877
20
7.5379821319575591
42
-0.41421356237309503
10
-149.43882324218771
20
6.6489821319575704
10
-201.50882324218767
20
6.6489821319575526
42
-0.41421356237309503
10
-202.39782324218768
20
7.5379821319575768
10
-202.39782324218766
20
16.300982131957582
42
-0.41421356237309503
10
-201.50882324218767
20
17.189982131957589
10
-196.53042324218768
20
17.189982131957571
0
CIRCLE
5
101
100
AcDbEntity
8
0
100
AcDbCircle
10
191.25867724218767
20
10.467136131957577
30
-2.0024415321849119e-06
40
0.38100000000000001
210
8.0914209705365973e-23
220
1.0047797496231288e-29
230
-1
0
CIRCLE
5
102
100
AcDbEntity
8
0
100
AcDbCircle
10
188.71867724218765
20
10.487136131957566
30
-2.0024415325965005e-06
40
0.38100000000000001
210
8.0914209705365973e-23
220
1.0047797496231288e-29
230
-1
0
CIRCLE
5
103
100
AcDbEntity
8
0
100
AcDbCircle
10
183.63897024218767
20
10.467136131957577
30
-2.0024415334221276e-06
40
0.38100000000000001
210
8.0914209705365973e-23
220
1.0047797496231288e-29
230
-1
0
CIRCLE
5
104
100
AcDbEntity
8
0
100
AcDbCircle
10
173.47897024218767
20
10.48742913195758
30
-2.0024415350709671e-06
40
0.38100000000000001
210
8.0914209705365973e-23
220
1.0047797496231288e-29
230
-1
0
CIRCLE
5
105
100
AcDbEntity
8
0
100
AcDbCircle
10
176.01897024218766
20
10.467429131957573
30
-2.0024415346593789e-06
40
0.38100000000000001
210
8.0914209705365973e-23
220
1.0047797496231288e-29
230
-1
0
CIRCLE
5
106
100
AcDbEntity
8
0
100
AcDbCircle
10
181.09897024218768
20
10.487136131957566
30
-2.0024415338337162e-06
40
0.38100000000000001
210
8.0914209705365973e-23
220
1.0047797496231288e-29
230
-1
0
CIRCLE
5
107
100
AcDbEntity
8
0
100
AcDbCircle
10
165.85897124218769
20
10.48742913195758
30
-2.0024415363082302e-06
40
0.38100000000000001
210
8.0914209705365973e-23
220
1.0047797496231288e-29
230
-1
0
CIRCLE
5
108
100
AcDbEntity
8
0
100
AcDbCircle
10
168.39897124218768
20
10.467429131957573
30
-2.0024415358966416e-06
40
0.38100000000000001
210
8.0914209705365973e-23
220
1.0047797496231288e-29
230
-1
0
CIRCLE
5
109
100
AcDbEntity
8
0
100
AcDbCircle
10
158.23867824218766
20
10.487136131957566
30
-2.0024415375455531e-06
40
0.38100000000000001
210
8.0914209705365973e-23
220
1.0047797496231288e-29
230
-1
0
CIRCLE
5
110
100
AcDbEntity
8
0
100
AcDbCircle
10
160.77867824218768
20
10.467136131957577
30
-2.0024415371339649e-06
40
0.38100000000000001
210
8.0914209705365973e-23
220
1.0047797496231288e-29
230
-1
0
CIRCLE
5
111
100
AcDbEntity
8
0
100
AcDbCircle
10
153.15897124218768
20
10.467429131957573
30
-2.0024415383711684e-06
40
0.38100000000000001
210
8.0914209705365973e-23
220
1.0047797496231288e-29
230
-1
0
CIRCLE
5
112
100
AcDbEntity
8
0
100
AcDbCircle
10
150.61897124218768
20
10.48742913195758
30
-2.0024415387827565e-06
40
0.38100000000000001
210
8.0914209705365973e-23
220
1.0047797496231288e-29
230
-1
0
LINE
5
113
100
AcDbEntity
8
0
100
AcDbLine
10
-202.64292184385809
20
14.243902959129711
30
-2.7755575615628914e-16
11
-199.2229218438581
21
14.24390295912972
31
-2.9929628178598013e-16
0
LINE
5
114
100
AcDbEntity
8
0
100
AcDbLine
10
-191.50572205551561
20
5.0082891635833127
30
0
11
-197.94064374943102
21
5.0082891635833011
31
1.1506282477162247e-41
0
LWPOLYLINE
5
115
100
AcDbEntity
8
0
100
AcDbPolyline
90
10
70
1
43
0.0
10
-192.99982324218752
20
14.395982131957572
10
-149.56582324218758
20
14.395982131957547
42
-0.41421356237310719
10
-148.54982324218759
20
13.379982131957565
10
-148.54982324218764
20
7.5379821319575591
42
-0.41421356237310269
10
-149.43882324218765
20
6.6489821319575784
10
-201.50882324218756
20
6.6489821319575482
42
-0.41421356237311591
10
-202.3978232421876
20
7.5379821319575644
10
-202.39782324218754
20
16.300982131957564
42
-0.41421356237313234
10
-201.50882324218753
20
17.189982131957553
10
-196.53042324218757
20
17.189982131957571
0
CIRCLE
5
116
100
AcDbEntity
8
0
100
AcDbCircle
10
-191.25867724218756
20
10.467136131957577
30
-5.2939559203393771e-22
40
0.38099999999999973
210
2.4651903288156652e-32
220
-6.162975822039167e-33
230
1
0
CIRCLE
5
117
100
AcDbEntity
8
0
100
AcDbCircle
10
-188.71867724218757
20
10.487136131957566
30
-2.6469779601696886e-22
40
0.38099999999999973
210
2.4651903288156652e-32
220
-6.162975822039167e-33
230
1
0
CIRCLE
5
118
100
AcDbEntity
8
0
100
AcDbCircle
10
-183.63897024218758
20
10.467136131957577
30
-2.6469779601696886e-22
40
0.38099999999999973
210
2.4651903288156652e-32
220
-6.162975822039167e-33
230
1
0
CIRCLE
5
119
100
AcDbEntity
8
0
100
AcDbCircle
10
-173.47897024218756
20
10.48742913195758
30
-5.2939559203393771e-22
40
0.38099999999999973
210
2.4651903288156652e-32
220
-6.162975822039167e-33
230
1
0
CIRCLE
5
120
100
AcDbEntity
8
0
100
AcDbCircle
10
-176.01897024218755
20
10.467429131957573
30
-2.6469779601696886e-22
40
0.38099999999999973
210
2.4651903288156652e-32
220
-6.162975822039167e-33
230
1
0
CIRCLE
5
121
100
AcDbEntity
8
0
100
AcDbCircle
10
-181.09897024218756
20
10.487136131957566
30
-2.6469779601696886e-22
40
0.38099999999999973
210
2.4651903288156652e-32
220
-6.162975822039167e-33
230
1
0
CIRCLE
5
122
100
AcDbEntity
8
0
100
AcDbCircle
10
-165.85897124218758
20
10.48742913195758
30
-5.2939559203393771e-22
40
0.38099999999999973
210
2.4651903288156652e-32
220
-6.162975822039167e-33
230
1
0
CIRCLE
5
123
100
AcDbEntity
8
0
100
AcDbCircle
10
-168.3989712421876
20
10.467429131957573
30
-5.2939559203393771e-22
40
0.38099999999999973
210
2.4651903288156652e-32
220
-6.162975822039167e-33
230
1
0
CIRCLE
5
124
100
AcDbEntity
8
0
100
AcDbCircle
10
-158.23867824218758
20
10.487136131957566
30
-2.6469779601696886e-22
40
0.38099999999999973
210
2.4651903288156652e-32
220
-6.162975822039167e-33
230
1
0
CIRCLE
5
125
100
AcDbEntity
8
0
100
AcDbCircle
10
-160.7786782421876
20
10.467136131957577
30
-2.6469779601696886e-22
40
0.38099999999999973
210
2.4651903288156652e-32
220
-6.162975822039167e-33
230
1
0
CIRCLE
5
126
100
AcDbEntity
8
0
100
AcDbCircle
10
-153.15897124218762
20
10.467429131957573
30
-2.6469779601696886e-22
40
0.38099999999999973
210
2.4651903288156652e-32
220
-6.162975822039167e-33
230
1
0
CIRCLE
5
127
100
AcDbEntity
8
0
100
AcDbCircle
10
-150.6189712421876
20
10.48742913195758
30
-5.2939559203393771e-22
40
0.38099999999999973
210
2.4651903288156652e-32
220
-6.162975822039167e-33
230
1
0
CIRCLE
5
128
100
AcDbEntity
8
0
100
AcDbCircle
10
-189.98867724218758
20
12.524536131957467
30
0
40
3.5687000000000002
210
3.9443045261050376e-31
220
7.8886090522101286e-31
230
1
0
ARC
5
129
100
AcDbEntity
8
0
100
AcDbCircle
10
-202.64292184385809
20
13.354902959129705
30
2.1293675081078144e-15
40
0.88900000000000645
210
0
220
4.1633181916382945e-17
230
1
100
AcDbArc
50
90
51
180
0
LINE
5
130
100
AcDbEntity
8
0
100
AcDbLine
10
-203.53192184385807
20
13.354902959129705
30
1.9850201237036767e-15
11
-203.53192184385807
21
7.5379821319575644
31
2.2271970466945313e-15
0
LINE
5
131
100
AcDbEntity
8
0
100
AcDbLine
10
-197.94064374943102
20
5.0082891635833011
30
1.1506282477162247e-41
11
-202.39782324218766
21
5.008289163583294
31
-2.6469779593974861e-22
0
LINE
5
132
100
AcDbEntity
8
0
100
AcDbLine
10
-203.53192184385807
20
7.5379821319575644
30
1.1231637557652913e-14
11
-203.53192184385807
21
5.8972891635833005
31
1.1231637557652913e-14
0
ARC
5
133
100
AcDbEntity
8
0
100
AcDbCircle
10
-202.64292184385806
20
5.8972891635833005
30
1.1375984942057051e-14
40
0.88900000000002422
210
-1.6237051114075777e-16
220
0
230
1
100
AcDbArc
50
180
51
270
0
LINE
5
134
100
AcDbEntity
8
0
100
AcDbLine
10
-202.39782324218766
20
5.008289163583294
30
-2.6469779593974861e-22
11
-202.64292184385806
21
5.008289163583294
31
1.1412997105478512e-14
0
LINE
5
135
100
AcDbEntity
8
0
100
AcDbLine
10
-199.2229218438581
20
14.24390295912972
30
-2.9929628178598013e-16
11
-149.56559036490293
21
14.243902959129709
31
-2.9929628178598013e-16
0
LINE
5
136
100
AcDbEntity
8
0
100
AcDbLine
10
-191.50572205551561
20
5.0082891635833127
30
0
11
-197.94064374943102
21
5.0082891635833011
31
1.1506282477162247e-41
0
SPLINE
5
137
100
AcDbEntity
8
0
100
AcDbSpline
70
0
71
3
72
10
73
6
74
0
42
0.000000001
43
0.0000000001
44
0.0000000001
40
0
40
0
40
0
40
0
40
0.27618722683222702
40
0.27618722683222702
40
0.578120974528605
40
0.578120974528605
40
0.578120974528605
40
0.578120974528605
10
-187.53882383952282
20
6.5582897000251217
30
-1.1102230246251565e-15
10
-188.45844533570289
20
6.6012433706729201
30
0
10
-189.1142022456371
20
6.4125254113011154
30
0
10
-189.84991189707819
20
6.1465166286177153
30
0
10
-190.57158034143728
20
5.8273172344101143
30
0
10
-191.50572205551561
20
5.0082891635833127
30
0
0
LINE
5
138
100
AcDbEntity
8
0
100
AcDbLine
10
-187.53882383952282
20
6.5582897000251217
30
-1.1102230246251565e-15
11
-191.50572205551561
21
5.0082891635833127
31
0
0
LINE
5
139
100
AcDbEntity
8
0
100
AcDbLine
10
-191.50572205551561
20
5.0082891635833127
30
0
11
-187.30671576086189
21
6.648982131957581
31
-1.1751835351045971e-15
0
ENDSEC
0
SECTION
2
OBJECTS
0
DICTIONARY
5
C
100
AcDbDictionary
3
ACAD_GROUP
350
D
3
ACAD_MLINESTYLE
350
17
0
DICTIONARY
5
D
100
AcDbDictionary
0
DICTIONARY
5
1A
330
C
100
AcDbDictionary
0
DICTIONARY
5
17
100
AcDbDictionary
0
ENDSEC
0
EOF
