(module LPS22HHTR (layer F.Cu) (tedit 0)
  (descr LPS22HHTR-3)
  (tags "Integrated Circuit")
  (attr smd)
  (fp_text reference IC** (at 0 0) (layer F.SilkS)
    (effects (font (size 1.27 1.27) (thickness 0.254)))
  )
  (fp_text value LPS22HHTR (at 0 0) (layer F.SilkS) hide
    (effects (font (size 1.27 1.27) (thickness 0.254)))
  )
  (fp_arc (start -1.3 -0.25) (end -1.3 -0.2) (angle -180) (layer F.SilkS) (width 0.1))
  (fp_arc (start -1.3 -0.25) (end -1.3 -0.3) (angle -180) (layer F.SilkS) (width 0.1))
  (fp_line (start -1.3 -0.2) (end -1.3 -0.2) (layer F.SilkS) (width 0.1))
  (fp_line (start -1.3 -0.3) (end -1.3 -0.3) (layer F.SilkS) (width 0.1))
  (fp_line (start 1 1) (end 1 0.9) (layer F.SilkS) (width 0.1))
  (fp_line (start 0.9 1) (end 1 1) (layer F.SilkS) (width 0.1))
  (fp_line (start -1 1) (end -1 0.9) (layer F.SilkS) (width 0.1))
  (fp_line (start -0.9 1) (end -1 1) (layer F.SilkS) (width 0.1))
  (fp_line (start 1 -1) (end 1 -0.9) (layer F.SilkS) (width 0.1))
  (fp_line (start 0.9 -1) (end 1 -1) (layer F.SilkS) (width 0.1))
  (fp_line (start -1 -1) (end -1 -0.9) (layer F.SilkS) (width 0.1))
  (fp_line (start -0.9 -1) (end -1 -1) (layer F.SilkS) (width 0.1))
  (fp_line (start -1.5 1.5) (end -1.5 -1.5) (layer F.CrtYd) (width 0.1))
  (fp_line (start 1.5 1.5) (end -1.5 1.5) (layer F.CrtYd) (width 0.1))
  (fp_line (start 1.5 -1.5) (end 1.5 1.5) (layer F.CrtYd) (width 0.1))
  (fp_line (start -1.5 -1.5) (end 1.5 -1.5) (layer F.CrtYd) (width 0.1))
  (fp_line (start -1 1) (end -1 -1) (layer F.Fab) (width 0.2))
  (fp_line (start 1 1) (end -1 1) (layer F.Fab) (width 0.2))
  (fp_line (start 1 -1) (end 1 1) (layer F.Fab) (width 0.2))
  (fp_line (start -1 -1) (end 1 -1) (layer F.Fab) (width 0.2))
  (fp_text user %R (at 0 0) (layer F.Fab)
    (effects (font (size 1.27 1.27) (thickness 0.254)))
  )
  (pad 10 smd rect (at -0.4 -0.8) (size 0.3 0.35) (layers F.Cu F.Paste F.Mask))
  (pad 9 smd rect (at 0 -0.8) (size 0.3 0.35) (layers F.Cu F.Paste F.Mask))
  (pad 8 smd rect (at 0.4 -0.8) (size 0.3 0.35) (layers F.Cu F.Paste F.Mask))
  (pad 7 smd rect (at 0.8 -0.25 90) (size 0.3 0.35) (layers F.Cu F.Paste F.Mask))
  (pad 6 smd rect (at 0.8 0.25 90) (size 0.3 0.35) (layers F.Cu F.Paste F.Mask))
  (pad 5 smd rect (at 0.4 0.8) (size 0.3 0.35) (layers F.Cu F.Paste F.Mask))
  (pad 4 smd rect (at 0 0.8) (size 0.3 0.35) (layers F.Cu F.Paste F.Mask))
  (pad 3 smd rect (at -0.4 0.8) (size 0.3 0.35) (layers F.Cu F.Paste F.Mask))
  (pad 2 smd rect (at -0.8 0.25 90) (size 0.3 0.35) (layers F.Cu F.Paste F.Mask))
  (pad 1 smd rect (at -0.8 -0.25 90) (size 0.3 0.35) (layers F.Cu F.Paste F.Mask))
  (model LPS22HHTR.stp
    (at (xyz 0 0 0))
    (scale (xyz 1 1 1))
    (rotate (xyz 0 0 0))
  )
)
