#VRML V2.0 utf8
# META "generator" "CAD Exchanger 3.8.1 (cadexchanger.com)"
DEF __1 Transform {
  children [
    DEF ASSEMBLY Group {
      children [
        DEF PinsArrayL Group {
          children [
            DEF PinsArrayL_1 Shape {
              appearance DEF __5 Appearance {
                material DEF __6 Material {
                  ambientIntensity 0.260947436094
                  diffuseColor 0.73400002718 0.773000001907 0.79699999094
                  shininess 0
                }
              }
              geometry DEF __7 IndexedFaceSet {
                solid FALSE
                coord Coordinate {
                  point [
                    -0.0035 0.002675 0.000375,
                    -0.00283443566983 0.002675 0.000375,
                    -0.0035 0.001925 0.000375,
                    -0.00283443566983 0.001925 0.000375,
                    -0.0035 0.002675 0,
                    -0.00275295711322 0.002675 -5.55111512313e-20,
                    -0.00269736280703 0.002675 0.000434565328057,
                    -0.00207974003178 0.002675 0.00109630401583,
                    -0.00194266716898 0.002675 0.00115586934389,
                    -0.00175 0.002675 0.00115586934389,
                    -0.00175 0.002675 0.000780869343885,
                    -0.00186118861237 0.002675 0.000780869343885,
                    -0.00247881138763 0.002675 0.000119130656115,
                    -0.00269736280703 0.001925 0.000434565328057,
                    -0.0035 0.001925 0,
                    -0.00275295711322 0.001925 -5.55111512313e-20,
                    -0.00247881138763 0.001925 0.000119130656115,
                    -0.00186118861237 0.001925 0.000780869343885,
                    -0.00175 0.001925 0.000780869343885,
                    -0.00175 0.001925 0.00115586934389,
                    -0.00194266716898 0.001925 0.00115586934389,
                    -0.00207974003178 0.001925 0.00109630401583,
                    -0.00280382823738 0.002675 0.000377515040938,
                    -0.00277404191369 0.002675 0.000384992692489,
                    -0.00274587577954 0.002675 0.000397232350921,
                    -0.00272008545071 0.002675 0.000413905661654,
                    -0.0020570173881 0.002675 0.00111696368223,
                    -0.00203122705927 0.002675 0.00113363699296,
                    -0.00200306092512 0.002675 0.0011458766514,
                    -0.00197327460143 0.002675 0.00115335430295,
                    -0.00269174224833 0.002675 5.03008187592e-06,
                    -0.00263216960095 0.002675 1.99853849774e-05,
                    -0.00257583733264 0.002675 4.44647018427e-05,
                    -0.00252425667499 0.002675 7.78113233085e-05,
                    -0.00280382823738 0.001925 0.000377515040938,
                    -0.00277404191369 0.001925 0.000384992692489,
                    -0.00274587577954 0.001925 0.000397232350921,
                    -0.00272008545071 0.001925 0.000413905661654,
                    -0.00269174224833 0.001925 5.03008187592e-06,
                    -0.00263216960095 0.001925 1.99853849774e-05,
                    -0.00257583733264 0.001925 4.44647018427e-05,
                    -0.00252425667499 0.001925 7.78113233085e-05,
                    -0.0020570173881 0.001925 0.00111696368223,
                    -0.00203122705927 0.001925 0.00113363699296,
                    -0.00200306092512 0.001925 0.0011458766514,
                    -0.00197327460143 0.001925 0.00115335430295

                  ]
                }
                normal Normal {
                  vector [
                    0 0 1,
                    0 0 1,
                    0 0 1,
                    0 0 1,
                    3.1920525e-30 1 -4.5675693e-30,
                    3.1920525e-30 1 -4.5675693e-30,
                    3.1920525e-30 1 -4.5675693e-30,
                    3.1920525e-30 1 -4.5675693e-30,
                    3.1920525e-30 1 -4.5675693e-30,
                    3.1920525e-30 1 -4.5675693e-30,
                    3.1920525e-30 1 -4.5675693e-30,
                    3.1920525e-30 1 -4.5675693e-30,
                    3.1920525e-30 1 -4.5675693e-30,
                    3.1920525e-30 1 -4.5675693e-30,
                    3.1920525e-30 1 -4.5675693e-30,
                    3.1920525e-30 1 -4.5675693e-30,
                    3.1920525e-30 1 -4.5675693e-30,
                    3.1920525e-30 1 -4.5675693e-30,
                    3.1920525e-30 1 -4.5675693e-30,
                    3.1920525e-30 1 -4.5675693e-30,
                    3.1920525e-30 1 -4.5675693e-30,
                    3.1920525e-30 1 -4.5675693e-30,
                    3.1920525e-30 1 -4.5675693e-30,
                    3.1920525e-30 1 -4.5675693e-30,
                    3.1920525e-30 1 -4.5675693e-30,
                    3.1920525e-30 1 -4.5675693e-30,
                    3.1920525e-30 1 -4.5675693e-30,
                    -4.4408921e-16 -0 1,
                    -4.4408921e-16 -0 1,
                    -0.16323964 -0 0.98658645,
                    -0.32210004 -0 0.94670564,
                    -0.47231942 -0 0.88142747,
                    -0.60986781 -0 0.79250312,
                    -0.73105526 -0 0.68231827,
                    -0.73105526 -0 0.68231827,
                    -0.60986781 -0 0.79250312,
                    -0.47231942 -0 0.88142747,
                    -0.32210004 -0 0.94670564,
                    -0.16323964 -0 0.98658645,
                    -1 -0 -0,
                    -1 -0 -0,
                    -1 -0 -0,
                    -1 -0 -0,
                    -3.9611997e-32 -1 1.5913003e-31,
                    -3.9611997e-32 -1 1.5913003e-31,
                    -3.9611997e-32 -1 1.5913003e-31,
                    -3.9611997e-32 -1 1.5913003e-31,
                    -3.9611997e-32 -1 1.5913003e-31,
                    -3.9611997e-32 -1 1.5913003e-31,
                    -3.9611997e-32 -1 1.5913003e-31,
                    -3.9611997e-32 -1 1.5913003e-31,
                    -3.9611997e-32 -1 1.5913003e-31,
                    -3.9611997e-32 -1 1.5913003e-31,
                    -3.9611997e-32 -1 1.5913003e-31,
                    -3.9611997e-32 -1 1.5913003e-31,
                    -3.9611997e-32 -1 1.5913003e-31,
                    -3.9611997e-32 -1 1.5913003e-31,
                    -3.9611997e-32 -1 1.5913003e-31,
                    -3.9611997e-32 -1 1.5913003e-31,
                    -3.9611997e-32 -1 1.5913003e-31,
                    -3.9611997e-32 -1 1.5913003e-31,
                    -3.9611997e-32 -1 1.5913003e-31,
                    -3.9611997e-32 -1 1.5913003e-31,
                    -3.9611997e-32 -1 1.5913003e-31,
                    -3.9611997e-32 -1 1.5913003e-31,
                    -3.9611997e-32 -1 1.5913003e-31,
                    -0 -0 -1,
                    -0 -0 -1,
                    -0 -0 -1,
                    -0 -0 -1,
                    4.4408921e-16 0 -1,
                    4.4408921e-16 0 -1,
                    0.16323964 0 -0.98658645,
                    0.32210004 0 -0.94670564,
                    0.47231942 0 -0.88142747,
                    0.60986781 0 -0.79250312,
                    0.73105526 0 -0.68231827,
                    0.73105526 0 -0.68231827,
                    0.60986781 0 -0.79250312,
                    0.47231942 0 -0.88142747,
                    0.32210004 0 -0.94670564,
                    0.16323964 0 -0.98658645,
                    0.73105526 0 -0.68231827,
                    0.73105526 0 -0.68231827,
                    0.73105526 0 -0.68231827,
                    0.73105526 0 -0.68231827,
                    -0 -0 -1,
                    -0 -0 -1,
                    -0 -0 -1,
                    -0 -0 -1,
                    1 0 0,
                    1 0 0,
                    1 0 0,
                    1 0 0,
                    -0.73105526 -0 0.68231827,
                    -0.73105526 -0 0.68231827,
                    -0.73105526 -0 0.68231827,
                    -0.73105526 -0 0.68231827,
                    0 0 1,
                    0 0 1,
                    0 0 1,
                    0 0 1,
                    -0.73105526 0 0.68231827,
                    -0.60986781 0 0.79250312,
                    -0.47231942 0 0.88142747,
                    -0.32210004 0 0.94670564,
                    -0.16323964 0 0.98658645,
                    -4.6784798e-13 0 1,
                    -5.3956839e-14 0 1,
                    -0.16323964 0 0.98658645,
                    -0.32210004 0 0.94670564,
                    -0.47231942 0 0.88142747,
                    -0.60986781 0 0.79250312,
                    -0.73105526 0 0.68231827

                  ]
                }
                coordIndex [
                  0 2 1 -1 
                  3 1 2 -1 
                  1 5 4 -1 
                  1 4 0 -1 
                  22 5 1 -1 
                  23 5 22 -1 
                  30 5 23 -1 
                  32 23 24 -1 
                  12 24 25 -1 
                  12 6 11 -1 
                  12 25 6 -1 
                  27 7 26 -1 
                  28 7 27 -1 
                  29 7 28 -1 
                  8 7 29 -1 
                  11 7 8 -1 
                  11 8 9 -1 
                  11 6 7 -1 
                  11 9 10 -1 
                  33 24 12 -1 
                  32 24 33 -1 
                  31 23 32 -1 
                  30 23 31 -1 
                  22 1 3 -1 
                  34 35 22 -1 
                  36 37 24 -1 
                  37 13 25 -1 
                  37 25 24 -1 
                  13 6 25 -1 
                  36 24 23 -1 
                  35 36 23 -1 
                  35 23 22 -1 
                  34 22 3 -1 
                  14 2 4 -1 
                  0 4 2 -1 
                  35 15 38 -1 
                  35 38 39 -1 
                  36 39 40 -1 
                  36 40 41 -1 
                  36 41 16 -1 
                  18 19 17 -1 
                  13 16 17 -1 
                  20 17 19 -1 
                  21 17 20 -1 
                  44 20 45 -1 
                  43 20 44 -1 
                  42 20 43 -1 
                  21 20 42 -1 
                  13 17 21 -1 
                  37 16 13 -1 
                  3 14 15 -1 
                  36 16 37 -1 
                  35 39 36 -1 
                  34 15 35 -1 
                  3 15 34 -1 
                  2 14 3 -1 
                  4 5 14 -1 
                  15 14 5 -1 
                  30 15 5 -1 
                  38 30 39 -1 
                  40 32 41 -1 
                  41 33 16 -1 
                  41 32 33 -1 
                  16 33 12 -1 
                  40 31 32 -1 
                  39 31 40 -1 
                  39 30 31 -1 
                  38 15 30 -1 
                  16 12 17 -1 
                  11 17 12 -1 
                  11 10 17 -1 
                  18 17 10 -1 
                  18 10 19 -1 
                  9 19 10 -1 
                  13 21 6 -1 
                  7 6 21 -1 
                  9 20 19 -1 
                  8 20 9 -1 
                  26 21 42 -1 
                  27 42 43 -1 
                  28 43 44 -1 
                  29 44 45 -1 
                  8 45 20 -1 
                  29 45 8 -1 
                  28 44 29 -1 
                  27 43 28 -1 
                  26 42 27 -1 
                  7 21 26 -1 
                ]
                normalIndex [
                  1 2 0 -1 
                  3 0 2 -1 
                  7 4 5 -1 
                  7 5 6 -1 
                  8 4 7 -1 
                  9 4 8 -1 
                  26 4 9 -1 
                  24 9 10 -1 
                  22 10 11 -1 
                  22 12 21 -1 
                  22 11 12 -1 
                  15 13 14 -1 
                  16 13 15 -1 
                  17 13 16 -1 
                  18 13 17 -1 
                  21 13 18 -1 
                  21 18 19 -1 
                  21 12 13 -1 
                  21 19 20 -1 
                  23 10 22 -1 
                  24 10 23 -1 
                  25 9 24 -1 
                  26 9 25 -1 
                  29 28 27 -1 
                  38 37 29 -1 
                  36 35 31 -1 
                  35 34 32 -1 
                  35 32 31 -1 
                  34 33 32 -1 
                  36 31 30 -1 
                  37 36 30 -1 
                  37 30 29 -1 
                  38 29 27 -1 
                  40 39 41 -1 
                  42 41 39 -1 
                  62 44 45 -1 
                  62 45 46 -1 
                  61 46 47 -1 
                  61 47 48 -1 
                  61 48 49 -1 
                  51 52 50 -1 
                  59 49 50 -1 
                  53 50 52 -1 
                  58 50 53 -1 
                  55 53 54 -1 
                  56 53 55 -1 
                  57 53 56 -1 
                  58 53 57 -1 
                  59 50 58 -1 
                  60 49 59 -1 
                  64 43 44 -1 
                  61 49 60 -1 
                  62 46 61 -1 
                  63 44 62 -1 
                  64 44 63 -1 
                  65 43 64 -1 
                  67 66 68 -1 
                  69 68 66 -1 
                  72 70 71 -1 
                  81 72 80 -1 
                  79 74 78 -1 
                  78 75 77 -1 
                  78 74 75 -1 
                  77 75 76 -1 
                  79 73 74 -1 
                  80 73 79 -1 
                  80 72 73 -1 
                  81 70 72 -1 
                  83 84 82 -1 
                  85 82 84 -1 
                  87 86 88 -1 
                  89 88 86 -1 
                  91 92 90 -1 
                  93 90 92 -1 
                  95 94 96 -1 
                  97 96 94 -1 
                  100 98 99 -1 
                  101 98 100 -1 
                  112 102 103 -1 
                  111 103 104 -1 
                  110 104 105 -1 
                  109 105 106 -1 
                  108 106 107 -1 
                  109 106 108 -1 
                  110 105 109 -1 
                  111 104 110 -1 
                  112 103 111 -1 
                  113 102 112 -1 
                ]
              }
            }
            DEF PinsArrayL_2 Shape {
              appearance DEF __9 Appearance {
                material DEF __10 Material {
                  ambientIntensity 0.260947436094
                  diffuseColor 0.73400002718 0.773000001907 0.79699999094
                  shininess 0
                }
              }
              geometry DEF __11 IndexedFaceSet {
                solid FALSE
                coord Coordinate {
                  point [
                    -0.0035 0.000375 0.000375,
                    -0.00283443566983 0.000375 0.000375,
                    -0.0035 -0.000375 0.000375,
                    -0.00283443566983 -0.000375 0.000375,
                    -0.0035 0.000375 0,
                    -0.00275295711322 0.000375 -5.55111512313e-20,
                    -0.00269736280703 0.000375 0.000434565328057,
                    -0.00207974003178 0.000375 0.00109630401583,
                    -0.00194266716898 0.000375 0.00115586934389,
                    -0.00175 0.000375 0.00115586934389,
                    -0.00175 0.000375 0.000780869343885,
                    -0.00186118861237 0.000375 0.000780869343885,
                    -0.00247881138763 0.000375 0.000119130656115,
                    -0.00269736280703 -0.000375 0.000434565328057,
                    -0.0035 -0.000375 0,
                    -0.00275295711322 -0.000375 -5.55111512313e-20,
                    -0.00247881138763 -0.000375 0.000119130656115,
                    -0.00186118861237 -0.000375 0.000780869343885,
                    -0.00175 -0.000375 0.000780869343885,
                    -0.00175 -0.000375 0.00115586934389,
                    -0.00194266716898 -0.000375 0.00115586934389,
                    -0.00207974003178 -0.000375 0.00109630401583,
                    -0.00280382823738 0.000375 0.000377515040938,
                    -0.00277404191369 0.000375 0.000384992692489,
                    -0.00274587577954 0.000375 0.000397232350921,
                    -0.00272008545071 0.000375 0.000413905661654,
                    -0.0020570173881 0.000375 0.00111696368223,
                    -0.00203122705927 0.000375 0.00113363699296,
                    -0.00200306092512 0.000375 0.0011458766514,
                    -0.00197327460143 0.000375 0.00115335430295,
                    -0.00269174224833 0.000375 5.03008187592e-06,
                    -0.00263216960095 0.000375 1.99853849774e-05,
                    -0.00257583733264 0.000375 4.44647018427e-05,
                    -0.00252425667499 0.000375 7.78113233085e-05,
                    -0.00280382823738 -0.000375 0.000377515040938,
                    -0.00277404191369 -0.000375 0.000384992692489,
                    -0.00274587577954 -0.000375 0.000397232350921,
                    -0.00272008545071 -0.000375 0.000413905661654,
                    -0.00269174224833 -0.000375 5.03008187592e-06,
                    -0.00263216960095 -0.000375 1.99853849774e-05,
                    -0.00257583733264 -0.000375 4.44647018427e-05,
                    -0.00252425667499 -0.000375 7.78113233085e-05,
                    -0.0020570173881 -0.000375 0.00111696368223,
                    -0.00203122705927 -0.000375 0.00113363699296,
                    -0.00200306092512 -0.000375 0.0011458766514,
                    -0.00197327460143 -0.000375 0.00115335430295

                  ]
                }
                normal Normal {
                  vector [
                    0 0 1,
                    0 0 1,
                    0 0 1,
                    0 0 1,
                    3.1920525e-30 1 -4.5675693e-30,
                    3.1920525e-30 1 -4.5675693e-30,
                    3.1920525e-30 1 -4.5675693e-30,
                    3.1920525e-30 1 -4.5675693e-30,
                    3.1920525e-30 1 -4.5675693e-30,
                    3.1920525e-30 1 -4.5675693e-30,
                    3.1920525e-30 1 -4.5675693e-30,
                    3.1920525e-30 1 -4.5675693e-30,
                    3.1920525e-30 1 -4.5675693e-30,
                    3.1920525e-30 1 -4.5675693e-30,
                    3.1920525e-30 1 -4.5675693e-30,
                    3.1920525e-30 1 -4.5675693e-30,
                    3.1920525e-30 1 -4.5675693e-30,
                    3.1920525e-30 1 -4.5675693e-30,
                    3.1920525e-30 1 -4.5675693e-30,
                    3.1920525e-30 1 -4.5675693e-30,
                    3.1920525e-30 1 -4.5675693e-30,
                    3.1920525e-30 1 -4.5675693e-30,
                    3.1920525e-30 1 -4.5675693e-30,
                    3.1920525e-30 1 -4.5675693e-30,
                    3.1920525e-30 1 -4.5675693e-30,
                    3.1920525e-30 1 -4.5675693e-30,
                    3.1920525e-30 1 -4.5675693e-30,
                    -4.4408921e-16 -0 1,
                    -4.4408921e-16 -0 1,
                    -0.16323964 -0 0.98658645,
                    -0.32210004 -0 0.94670564,
                    -0.47231942 -0 0.88142747,
                    -0.60986781 -0 0.79250312,
                    -0.73105526 -0 0.68231827,
                    -0.73105526 -0 0.68231827,
                    -0.60986781 -0 0.79250312,
                    -0.47231942 -0 0.88142747,
                    -0.32210004 -0 0.94670564,
                    -0.16323964 -0 0.98658645,
                    -1 -0 -0,
                    -1 -0 -0,
                    -1 -0 -0,
                    -1 -0 -0,
                    -3.9611997e-32 -1 1.5913003e-31,
                    -3.9611997e-32 -1 1.5913003e-31,
                    -3.9611997e-32 -1 1.5913003e-31,
                    -3.9611997e-32 -1 1.5913003e-31,
                    -3.9611997e-32 -1 1.5913003e-31,
                    -3.9611997e-32 -1 1.5913003e-31,
                    -3.9611997e-32 -1 1.5913003e-31,
                    -3.9611997e-32 -1 1.5913003e-31,
                    -3.9611997e-32 -1 1.5913003e-31,
                    -3.9611997e-32 -1 1.5913003e-31,
                    -3.9611997e-32 -1 1.5913003e-31,
                    -3.9611997e-32 -1 1.5913003e-31,
                    -3.9611997e-32 -1 1.5913003e-31,
                    -3.9611997e-32 -1 1.5913003e-31,
                    -3.9611997e-32 -1 1.5913003e-31,
                    -3.9611997e-32 -1 1.5913003e-31,
                    -3.9611997e-32 -1 1.5913003e-31,
                    -3.9611997e-32 -1 1.5913003e-31,
                    -3.9611997e-32 -1 1.5913003e-31,
                    -3.9611997e-32 -1 1.5913003e-31,
                    -3.9611997e-32 -1 1.5913003e-31,
                    -3.9611997e-32 -1 1.5913003e-31,
                    -3.9611997e-32 -1 1.5913003e-31,
                    -0 -0 -1,
                    -0 -0 -1,
                    -0 -0 -1,
                    -0 -0 -1,
                    4.4408921e-16 0 -1,
                    4.4408921e-16 0 -1,
                    0.16323964 0 -0.98658645,
                    0.32210004 0 -0.94670564,
                    0.47231942 0 -0.88142747,
                    0.60986781 0 -0.79250312,
                    0.73105526 0 -0.68231827,
                    0.73105526 0 -0.68231827,
                    0.60986781 0 -0.79250312,
                    0.47231942 0 -0.88142747,
                    0.32210004 0 -0.94670564,
                    0.16323964 0 -0.98658645,
                    0.73105526 0 -0.68231827,
                    0.73105526 0 -0.68231827,
                    0.73105526 0 -0.68231827,
                    0.73105526 0 -0.68231827,
                    -0 -0 -1,
                    -0 -0 -1,
                    -0 -0 -1,
                    -0 -0 -1,
                    1 0 0,
                    1 0 0,
                    1 0 0,
                    1 0 0,
                    -0.73105526 -0 0.68231827,
                    -0.73105526 -0 0.68231827,
                    -0.73105526 -0 0.68231827,
                    -0.73105526 -0 0.68231827,
                    0 0 1,
                    0 0 1,
                    0 0 1,
                    0 0 1,
                    -0.73105526 0 0.68231827,
                    -0.60986781 0 0.79250312,
                    -0.47231942 0 0.88142747,
                    -0.32210004 0 0.94670564,
                    -0.16323964 0 0.98658645,
                    -4.6784798e-13 0 1,
                    -5.3956839e-14 0 1,
                    -0.16323964 0 0.98658645,
                    -0.32210004 0 0.94670564,
                    -0.47231942 0 0.88142747,
                    -0.60986781 0 0.79250312,
                    -0.73105526 0 0.68231827

                  ]
                }
                coordIndex [
                  0 2 1 -1 
                  3 1 2 -1 
                  1 5 4 -1 
                  1 4 0 -1 
                  22 5 1 -1 
                  23 5 22 -1 
                  30 5 23 -1 
                  32 23 24 -1 
                  12 24 25 -1 
                  12 6 11 -1 
                  12 25 6 -1 
                  27 7 26 -1 
                  28 7 27 -1 
                  29 7 28 -1 
                  8 7 29 -1 
                  11 7 8 -1 
                  11 8 9 -1 
                  11 6 7 -1 
                  11 9 10 -1 
                  33 24 12 -1 
                  32 24 33 -1 
                  31 23 32 -1 
                  30 23 31 -1 
                  22 1 3 -1 
                  34 35 22 -1 
                  36 37 24 -1 
                  37 13 25 -1 
                  37 25 24 -1 
                  13 6 25 -1 
                  36 24 23 -1 
                  35 36 23 -1 
                  35 23 22 -1 
                  34 22 3 -1 
                  14 2 4 -1 
                  0 4 2 -1 
                  35 15 38 -1 
                  35 38 39 -1 
                  36 39 40 -1 
                  36 40 41 -1 
                  36 41 16 -1 
                  18 19 17 -1 
                  13 16 17 -1 
                  20 17 19 -1 
                  21 17 20 -1 
                  44 20 45 -1 
                  43 20 44 -1 
                  42 20 43 -1 
                  21 20 42 -1 
                  13 17 21 -1 
                  37 16 13 -1 
                  3 14 15 -1 
                  36 16 37 -1 
                  35 39 36 -1 
                  34 15 35 -1 
                  3 15 34 -1 
                  2 14 3 -1 
                  4 5 14 -1 
                  15 14 5 -1 
                  30 15 5 -1 
                  38 30 39 -1 
                  40 32 41 -1 
                  41 33 16 -1 
                  41 32 33 -1 
                  16 33 12 -1 
                  40 31 32 -1 
                  39 31 40 -1 
                  39 30 31 -1 
                  38 15 30 -1 
                  16 12 17 -1 
                  11 17 12 -1 
                  11 10 17 -1 
                  18 17 10 -1 
                  18 10 19 -1 
                  9 19 10 -1 
                  13 21 6 -1 
                  7 6 21 -1 
                  9 20 19 -1 
                  8 20 9 -1 
                  26 21 42 -1 
                  27 42 43 -1 
                  28 43 44 -1 
                  29 44 45 -1 
                  8 45 20 -1 
                  29 45 8 -1 
                  28 44 29 -1 
                  27 43 28 -1 
                  26 42 27 -1 
                  7 21 26 -1 
                ]
                normalIndex [
                  1 2 0 -1 
                  3 0 2 -1 
                  7 4 5 -1 
                  7 5 6 -1 
                  8 4 7 -1 
                  9 4 8 -1 
                  26 4 9 -1 
                  24 9 10 -1 
                  22 10 11 -1 
                  22 12 21 -1 
                  22 11 12 -1 
                  15 13 14 -1 
                  16 13 15 -1 
                  17 13 16 -1 
                  18 13 17 -1 
                  21 13 18 -1 
                  21 18 19 -1 
                  21 12 13 -1 
                  21 19 20 -1 
                  23 10 22 -1 
                  24 10 23 -1 
                  25 9 24 -1 
                  26 9 25 -1 
                  29 28 27 -1 
                  38 37 29 -1 
                  36 35 31 -1 
                  35 34 32 -1 
                  35 32 31 -1 
                  34 33 32 -1 
                  36 31 30 -1 
                  37 36 30 -1 
                  37 30 29 -1 
                  38 29 27 -1 
                  40 39 41 -1 
                  42 41 39 -1 
                  62 44 45 -1 
                  62 45 46 -1 
                  61 46 47 -1 
                  61 47 48 -1 
                  61 48 49 -1 
                  51 52 50 -1 
                  59 49 50 -1 
                  53 50 52 -1 
                  58 50 53 -1 
                  55 53 54 -1 
                  56 53 55 -1 
                  57 53 56 -1 
                  58 53 57 -1 
                  59 50 58 -1 
                  60 49 59 -1 
                  64 43 44 -1 
                  61 49 60 -1 
                  62 46 61 -1 
                  63 44 62 -1 
                  64 44 63 -1 
                  65 43 64 -1 
                  67 66 68 -1 
                  69 68 66 -1 
                  72 70 71 -1 
                  81 72 80 -1 
                  79 74 78 -1 
                  78 75 77 -1 
                  78 74 75 -1 
                  77 75 76 -1 
                  79 73 74 -1 
                  80 73 79 -1 
                  80 72 73 -1 
                  81 70 72 -1 
                  83 84 82 -1 
                  85 82 84 -1 
                  87 86 88 -1 
                  89 88 86 -1 
                  91 92 90 -1 
                  93 90 92 -1 
                  95 94 96 -1 
                  97 96 94 -1 
                  100 98 99 -1 
                  101 98 100 -1 
                  112 102 103 -1 
                  111 103 104 -1 
                  110 104 105 -1 
                  109 105 106 -1 
                  108 106 107 -1 
                  109 106 108 -1 
                  110 105 109 -1 
                  111 104 110 -1 
                  112 103 111 -1 
                  113 102 112 -1 
                ]
              }
            }
            DEF PinsArrayL_3 Shape {
              appearance DEF __13 Appearance {
                material DEF __14 Material {
                  ambientIntensity 0.260947436094
                  diffuseColor 0.73400002718 0.773000001907 0.79699999094
                  shininess 0
                }
              }
              geometry DEF __15 IndexedFaceSet {
                solid FALSE
                coord Coordinate {
                  point [
                    -0.0035 -0.001925 0.000375,
                    -0.00283443566983 -0.001925 0.000375,
                    -0.0035 -0.002675 0.000375,
                    -0.00283443566983 -0.002675 0.000375,
                    -0.0035 -0.001925 0,
                    -0.00275295711322 -0.001925 -5.55111512313e-20,
                    -0.00269736280703 -0.001925 0.000434565328057,
                    -0.00207974003178 -0.001925 0.00109630401583,
                    -0.00194266716898 -0.001925 0.00115586934389,
                    -0.00175 -0.001925 0.00115586934389,
                    -0.00175 -0.001925 0.000780869343885,
                    -0.00186118861237 -0.001925 0.000780869343885,
                    -0.00247881138763 -0.001925 0.000119130656115,
                    -0.00269736280703 -0.002675 0.000434565328057,
                    -0.0035 -0.002675 0,
                    -0.00275295711322 -0.002675 -5.55111512313e-20,
                    -0.00247881138763 -0.002675 0.000119130656115,
                    -0.00186118861237 -0.002675 0.000780869343885,
                    -0.00175 -0.002675 0.000780869343885,
                    -0.00175 -0.002675 0.00115586934389,
                    -0.00194266716898 -0.002675 0.00115586934389,
                    -0.00207974003178 -0.002675 0.00109630401583,
                    -0.00280382823738 -0.001925 0.000377515040938,
                    -0.00277404191369 -0.001925 0.000384992692489,
                    -0.00274587577954 -0.001925 0.000397232350921,
                    -0.00272008545071 -0.001925 0.000413905661654,
                    -0.0020570173881 -0.001925 0.00111696368223,
                    -0.00203122705927 -0.001925 0.00113363699296,
                    -0.00200306092512 -0.001925 0.0011458766514,
                    -0.00197327460143 -0.001925 0.00115335430295,
                    -0.00269174224833 -0.001925 5.03008187592e-06,
                    -0.00263216960095 -0.001925 1.99853849774e-05,
                    -0.00257583733264 -0.001925 4.44647018427e-05,
                    -0.00252425667499 -0.001925 7.78113233085e-05,
                    -0.00280382823738 -0.002675 0.000377515040938,
                    -0.00277404191369 -0.002675 0.000384992692489,
                    -0.00274587577954 -0.002675 0.000397232350921,
                    -0.00272008545071 -0.002675 0.000413905661654,
                    -0.00269174224833 -0.002675 5.03008187592e-06,
                    -0.00263216960095 -0.002675 1.99853849774e-05,
                    -0.00257583733264 -0.002675 4.44647018427e-05,
                    -0.00252425667499 -0.002675 7.78113233085e-05,
                    -0.0020570173881 -0.002675 0.00111696368223,
                    -0.00203122705927 -0.002675 0.00113363699296,
                    -0.00200306092512 -0.002675 0.0011458766514,
                    -0.00197327460143 -0.002675 0.00115335430295

                  ]
                }
                normal Normal {
                  vector [
                    0 0 1,
                    0 0 1,
                    0 0 1,
                    0 0 1,
                    3.1920525e-30 1 -4.5675693e-30,
                    3.1920525e-30 1 -4.5675693e-30,
                    3.1920525e-30 1 -4.5675693e-30,
                    3.1920525e-30 1 -4.5675693e-30,
                    3.1920525e-30 1 -4.5675693e-30,
                    3.1920525e-30 1 -4.5675693e-30,
                    3.1920525e-30 1 -4.5675693e-30,
                    3.1920525e-30 1 -4.5675693e-30,
                    3.1920525e-30 1 -4.5675693e-30,
                    3.1920525e-30 1 -4.5675693e-30,
                    3.1920525e-30 1 -4.5675693e-30,
                    3.1920525e-30 1 -4.5675693e-30,
                    3.1920525e-30 1 -4.5675693e-30,
                    3.1920525e-30 1 -4.5675693e-30,
                    3.1920525e-30 1 -4.5675693e-30,
                    3.1920525e-30 1 -4.5675693e-30,
                    3.1920525e-30 1 -4.5675693e-30,
                    3.1920525e-30 1 -4.5675693e-30,
                    3.1920525e-30 1 -4.5675693e-30,
                    3.1920525e-30 1 -4.5675693e-30,
                    3.1920525e-30 1 -4.5675693e-30,
                    3.1920525e-30 1 -4.5675693e-30,
                    3.1920525e-30 1 -4.5675693e-30,
                    -4.4408921e-16 -0 1,
                    -4.4408921e-16 -0 1,
                    -0.16323964 -0 0.98658645,
                    -0.32210004 -0 0.94670564,
                    -0.47231942 -0 0.88142747,
                    -0.60986781 -0 0.79250312,
                    -0.73105526 -0 0.68231827,
                    -0.73105526 -0 0.68231827,
                    -0.60986781 -0 0.79250312,
                    -0.47231942 -0 0.88142747,
                    -0.32210004 -0 0.94670564,
                    -0.16323964 -0 0.98658645,
                    -1 -0 -0,
                    -1 -0 -0,
                    -1 -0 -0,
                    -1 -0 -0,
                    -3.9611997e-32 -1 1.5913003e-31,
                    -3.9611997e-32 -1 1.5913003e-31,
                    -3.9611997e-32 -1 1.5913003e-31,
                    -3.9611997e-32 -1 1.5913003e-31,
                    -3.9611997e-32 -1 1.5913003e-31,
                    -3.9611997e-32 -1 1.5913003e-31,
                    -3.9611997e-32 -1 1.5913003e-31,
                    -3.9611997e-32 -1 1.5913003e-31,
                    -3.9611997e-32 -1 1.5913003e-31,
                    -3.9611997e-32 -1 1.5913003e-31,
                    -3.9611997e-32 -1 1.5913003e-31,
                    -3.9611997e-32 -1 1.5913003e-31,
                    -3.9611997e-32 -1 1.5913003e-31,
                    -3.9611997e-32 -1 1.5913003e-31,
                    -3.9611997e-32 -1 1.5913003e-31,
                    -3.9611997e-32 -1 1.5913003e-31,
                    -3.9611997e-32 -1 1.5913003e-31,
                    -3.9611997e-32 -1 1.5913003e-31,
                    -3.9611997e-32 -1 1.5913003e-31,
                    -3.9611997e-32 -1 1.5913003e-31,
                    -3.9611997e-32 -1 1.5913003e-31,
                    -3.9611997e-32 -1 1.5913003e-31,
                    -3.9611997e-32 -1 1.5913003e-31,
                    -0 -0 -1,
                    -0 -0 -1,
                    -0 -0 -1,
                    -0 -0 -1,
                    4.4408921e-16 0 -1,
                    4.4408921e-16 0 -1,
                    0.16323964 0 -0.98658645,
                    0.32210004 0 -0.94670564,
                    0.47231942 0 -0.88142747,
                    0.60986781 0 -0.79250312,
                    0.73105526 0 -0.68231827,
                    0.73105526 0 -0.68231827,
                    0.60986781 0 -0.79250312,
                    0.47231942 0 -0.88142747,
                    0.32210004 0 -0.94670564,
                    0.16323964 0 -0.98658645,
                    0.73105526 0 -0.68231827,
                    0.73105526 0 -0.68231827,
                    0.73105526 0 -0.68231827,
                    0.73105526 0 -0.68231827,
                    -0 -0 -1,
                    -0 -0 -1,
                    -0 -0 -1,
                    -0 -0 -1,
                    1 0 0,
                    1 0 0,
                    1 0 0,
                    1 0 0,
                    -0.73105526 -0 0.68231827,
                    -0.73105526 -0 0.68231827,
                    -0.73105526 -0 0.68231827,
                    -0.73105526 -0 0.68231827,
                    0 0 1,
                    0 0 1,
                    0 0 1,
                    0 0 1,
                    -0.73105526 0 0.68231827,
                    -0.60986781 0 0.79250312,
                    -0.47231942 0 0.88142747,
                    -0.32210004 0 0.94670564,
                    -0.16323964 0 0.98658645,
                    -4.6784798e-13 0 1,
                    -5.3956839e-14 0 1,
                    -0.16323964 0 0.98658645,
                    -0.32210004 0 0.94670564,
                    -0.47231942 0 0.88142747,
                    -0.60986781 0 0.79250312,
                    -0.73105526 0 0.68231827

                  ]
                }
                coordIndex [
                  0 2 1 -1 
                  3 1 2 -1 
                  1 5 4 -1 
                  1 4 0 -1 
                  22 5 1 -1 
                  23 5 22 -1 
                  30 5 23 -1 
                  32 23 24 -1 
                  12 24 25 -1 
                  12 6 11 -1 
                  12 25 6 -1 
                  27 7 26 -1 
                  28 7 27 -1 
                  29 7 28 -1 
                  8 7 29 -1 
                  11 7 8 -1 
                  11 8 9 -1 
                  11 6 7 -1 
                  11 9 10 -1 
                  33 24 12 -1 
                  32 24 33 -1 
                  31 23 32 -1 
                  30 23 31 -1 
                  22 1 3 -1 
                  34 35 22 -1 
                  36 37 24 -1 
                  37 13 25 -1 
                  37 25 24 -1 
                  13 6 25 -1 
                  36 24 23 -1 
                  35 36 23 -1 
                  35 23 22 -1 
                  34 22 3 -1 
                  14 2 4 -1 
                  0 4 2 -1 
                  35 15 38 -1 
                  35 38 39 -1 
                  36 39 40 -1 
                  36 40 41 -1 
                  36 41 16 -1 
                  18 19 17 -1 
                  13 16 17 -1 
                  20 17 19 -1 
                  21 17 20 -1 
                  44 20 45 -1 
                  43 20 44 -1 
                  42 20 43 -1 
                  21 20 42 -1 
                  13 17 21 -1 
                  37 16 13 -1 
                  3 14 15 -1 
                  36 16 37 -1 
                  35 39 36 -1 
                  34 15 35 -1 
                  3 15 34 -1 
                  2 14 3 -1 
                  4 5 14 -1 
                  15 14 5 -1 
                  30 15 5 -1 
                  38 30 39 -1 
                  40 32 41 -1 
                  41 33 16 -1 
                  41 32 33 -1 
                  16 33 12 -1 
                  40 31 32 -1 
                  39 31 40 -1 
                  39 30 31 -1 
                  38 15 30 -1 
                  16 12 17 -1 
                  11 17 12 -1 
                  11 10 17 -1 
                  18 17 10 -1 
                  18 10 19 -1 
                  9 19 10 -1 
                  13 21 6 -1 
                  7 6 21 -1 
                  9 20 19 -1 
                  8 20 9 -1 
                  26 21 42 -1 
                  27 42 43 -1 
                  28 43 44 -1 
                  29 44 45 -1 
                  8 45 20 -1 
                  29 45 8 -1 
                  28 44 29 -1 
                  27 43 28 -1 
                  26 42 27 -1 
                  7 21 26 -1 
                ]
                normalIndex [
                  1 2 0 -1 
                  3 0 2 -1 
                  7 4 5 -1 
                  7 5 6 -1 
                  8 4 7 -1 
                  9 4 8 -1 
                  26 4 9 -1 
                  24 9 10 -1 
                  22 10 11 -1 
                  22 12 21 -1 
                  22 11 12 -1 
                  15 13 14 -1 
                  16 13 15 -1 
                  17 13 16 -1 
                  18 13 17 -1 
                  21 13 18 -1 
                  21 18 19 -1 
                  21 12 13 -1 
                  21 19 20 -1 
                  23 10 22 -1 
                  24 10 23 -1 
                  25 9 24 -1 
                  26 9 25 -1 
                  29 28 27 -1 
                  38 37 29 -1 
                  36 35 31 -1 
                  35 34 32 -1 
                  35 32 31 -1 
                  34 33 32 -1 
                  36 31 30 -1 
                  37 36 30 -1 
                  37 30 29 -1 
                  38 29 27 -1 
                  40 39 41 -1 
                  42 41 39 -1 
                  62 44 45 -1 
                  62 45 46 -1 
                  61 46 47 -1 
                  61 47 48 -1 
                  61 48 49 -1 
                  51 52 50 -1 
                  59 49 50 -1 
                  53 50 52 -1 
                  58 50 53 -1 
                  55 53 54 -1 
                  56 53 55 -1 
                  57 53 56 -1 
                  58 53 57 -1 
                  59 50 58 -1 
                  60 49 59 -1 
                  64 43 44 -1 
                  61 49 60 -1 
                  62 46 61 -1 
                  63 44 62 -1 
                  64 44 63 -1 
                  65 43 64 -1 
                  67 66 68 -1 
                  69 68 66 -1 
                  72 70 71 -1 
                  81 72 80 -1 
                  79 74 78 -1 
                  78 75 77 -1 
                  78 74 75 -1 
                  77 75 76 -1 
                  79 73 74 -1 
                  80 73 79 -1 
                  80 72 73 -1 
                  81 70 72 -1 
                  83 84 82 -1 
                  85 82 84 -1 
                  87 86 88 -1 
                  89 88 86 -1 
                  91 92 90 -1 
                  93 90 92 -1 
                  95 94 96 -1 
                  97 96 94 -1 
                  100 98 99 -1 
                  101 98 100 -1 
                  112 102 103 -1 
                  111 103 104 -1 
                  110 104 105 -1 
                  109 105 106 -1 
                  108 106 107 -1 
                  109 106 108 -1 
                  110 105 109 -1 
                  111 104 110 -1 
                  112 103 111 -1 
                  113 102 112 -1 
                ]
              }
            }
          ]
        }
        DEF FilletPinR Group {
          children [
            DEF FilletPinR_1 Shape {
              appearance DEF __18 Appearance {
                material DEF __19 Material {
                  ambientIntensity 0.260947436094
                  diffuseColor 0.73400002718 0.773000001907 0.79699999094
                  shininess 0
                }
              }
              geometry DEF __20 IndexedFaceSet {
                solid FALSE
                coord Coordinate {
                  point [
                    0.00283443566983 0.001525 0.000375,
                    0.0035 0.001525 0.000375,
                    0.00283443566983 -0.001525 0.000375,
                    0.0035 -0.001525 0.000375,
                    0.00275295711322 0.001525 -5.55111512313e-20,
                    0.0035 0.001525 0,
                    0.00247881138763 0.001525 0.000119130656115,
                    0.00186118861237 0.001525 0.000780869343885,
                    0.00175 0.001525 0.000780869343885,
                    0.00175 0.001525 0.00115586934389,
                    0.00194266716898 0.001525 0.00115586934389,
                    0.00207974003178 0.001525 0.00109630401583,
                    0.00269736280703 0.001525 0.000434565328057,
                    0.00269736280703 -0.001525 0.000434565328057,
                    0.0035 -0.001525 0,
                    0.00275295711322 -0.001525 -5.55111512313e-20,
                    0.00207974003178 -0.001525 0.00109630401583,
                    0.00194266716898 -0.001525 0.00115586934389,
                    0.00175 -0.001525 0.00115586934389,
                    0.00175 -0.001525 0.000780869343885,
                    0.00186118861237 -0.001525 0.000780869343885,
                    0.00247881138763 -0.001525 0.000119130656115,
                    0.00269174224833 0.001525 5.03008187593e-06,
                    0.00263216960095 0.001525 1.99853849774e-05,
                    0.00257583733264 0.001525 4.44647018427e-05,
                    0.00252425667499 0.001525 7.78113233085e-05,
                    0.0020570173881 0.001525 0.00111696368223,
                    0.00203122705927 0.001525 0.00113363699296,
                    0.00200306092512 0.001525 0.0011458766514,
                    0.00197327460143 0.001525 0.00115335430295,
                    0.00280382823738 0.001525 0.000377515040938,
                    0.00277404191369 0.001525 0.000384992692489,
                    0.00274587577954 0.001525 0.000397232350921,
                    0.00272008545071 0.001525 0.000413905661654,
                    0.00280382823738 -0.001525 0.000377515040938,
                    0.00277404191369 -0.001525 0.000384992692489,
                    0.00274587577954 -0.001525 0.000397232350921,
                    0.00272008545071 -0.001525 0.000413905661654,
                    0.0020570173881 -0.001525 0.00111696368223,
                    0.00203122705927 -0.001525 0.00113363699296,
                    0.00200306092512 -0.001525 0.0011458766514,
                    0.00197327460143 -0.001525 0.00115335430295,
                    0.00269174224833 -0.001525 5.03008187592e-06,
                    0.00263216960095 -0.001525 1.99853849774e-05,
                    0.00257583733264 -0.001525 4.44647018427e-05,
                    0.00252425667499 -0.001525 7.78113233085e-05

                  ]
                }
                normal Normal {
                  vector [
                    0 0 1,
                    0 0 1,
                    0 0 1,
                    0 0 1,
                    0 1 0,
                    0 1 0,
                    0 1 0,
                    0 1 0,
                    0 1 0,
                    0 1 0,
                    0 1 0,
                    0 1 0,
                    0 1 0,
                    0 1 0,
                    0 1 0,
                    0 1 0,
                    0 1 0,
                    0 1 0,
                    0 1 0,
                    0 1 0,
                    0 1 0,
                    0 1 0,
                    0 1 0,
                    0 1 0,
                    0 1 0,
                    0 1 0,
                    0 1 0,
                    -0 -0 1,
                    0.16323964 -0 0.98658645,
                    0.32210004 -0 0.94670564,
                    0.47231942 -0 0.88142747,
                    0.60986781 -0 0.79250312,
                    0.73105526 -0 0.68231827,
                    0.73105526 -0 0.68231827,
                    0.60986781 -0 0.79250312,
                    0.47231942 -0 0.88142747,
                    0.32210004 -0 0.94670564,
                    0.16323964 -0 0.98658645,
                    -0 -0 1,
                    1 0 0,
                    1 0 0,
                    1 0 0,
                    1 0 0,
                    -5.3037248e-30 -1 -6.8290045e-30,
                    -5.3037248e-30 -1 -6.8290045e-30,
                    -5.3037248e-30 -1 -6.8290045e-30,
                    -5.3037248e-30 -1 -6.8290045e-30,
                    -5.3037248e-30 -1 -6.8290045e-30,
                    -5.3037248e-30 -1 -6.8290045e-30,
                    -5.3037248e-30 -1 -6.8290045e-30,
                    -5.3037248e-30 -1 -6.8290045e-30,
                    -5.3037248e-30 -1 -6.8290045e-30,
                    -5.3037248e-30 -1 -6.8290045e-30,
                    -5.3037248e-30 -1 -6.8290045e-30,
                    -5.3037248e-30 -1 -6.8290045e-30,
                    -5.3037248e-30 -1 -6.8290045e-30,
                    -5.3037248e-30 -1 -6.8290045e-30,
                    -5.3037248e-30 -1 -6.8290045e-30,
                    -5.3037248e-30 -1 -6.8290045e-30,
                    -5.3037248e-30 -1 -6.8290045e-30,
                    -5.3037248e-30 -1 -6.8290045e-30,
                    -5.3037248e-30 -1 -6.8290045e-30,
                    -5.3037248e-30 -1 -6.8290045e-30,
                    -5.3037248e-30 -1 -6.8290045e-30,
                    -5.3037248e-30 -1 -6.8290045e-30,
                    -5.3037248e-30 -1 -6.8290045e-30,
                    -0 -0 -1,
                    -0 -0 -1,
                    -0 -0 -1,
                    -0 -0 -1,
                    2.0694557e-13 0 -1,
                    -0.16323964 0 -0.98658645,
                    -0.32210004 0 -0.94670564,
                    -0.47231942 0 -0.88142747,
                    -0.60986781 0 -0.79250312,
                    -0.73105526 0 -0.68231827,
                    -0.73105526 0 -0.68231827,
                    -0.60986781 0 -0.79250312,
                    -0.47231942 0 -0.88142747,
                    -0.32210004 0 -0.94670564,
                    -0.16323964 0 -0.98658645,
                    0 0 -1,
                    -0.73105526 -0 -0.68231827,
                    -0.73105526 -0 -0.68231827,
                    -0.73105526 -0 -0.68231827,
                    -0.73105526 -0 -0.68231827,
                    -0 -0 -1,
                    -0 -0 -1,
                    -0 -0 -1,
                    -0 -0 -1,
                    -1 -0 -0,
                    -1 -0 -0,
                    -1 -0 -0,
                    -1 -0 -0,
                    0.73105526 0 0.68231827,
                    0.73105526 0 0.68231827,
                    0.73105526 0 0.68231827,
                    0.73105526 0 0.68231827,
                    0 0 1,
                    0 0 1,
                    0 0 1,
                    0 0 1,
                    0.73105526 0 0.68231827,
                    0.73105526 0 0.68231827,
                    0.60986781 0 0.79250312,
                    0.47231942 0 0.88142747,
                    0.32210004 0 0.94670564,
                    0.16323964 0 0.98658645,
                    3.9963588e-12 0 1,
                    5.3956839e-14 0 1,
                    0.16323964 0 0.98658645,
                    0.32210004 0 0.94670564,
                    0.47231942 0 0.88142747,
                    0.60986781 0 0.79250312

                  ]
                }
                coordIndex [
                  0 2 1 -1 
                  3 1 2 -1 
                  31 4 22 -1 
                  31 22 23 -1 
                  32 23 24 -1 
                  32 24 25 -1 
                  32 25 6 -1 
                  12 6 7 -1 
                  9 7 8 -1 
                  10 7 9 -1 
                  11 7 10 -1 
                  28 10 29 -1 
                  27 10 28 -1 
                  26 10 27 -1 
                  11 10 26 -1 
                  12 7 11 -1 
                  33 6 12 -1 
                  0 5 4 -1 
                  32 6 33 -1 
                  31 23 32 -1 
                  30 4 31 -1 
                  0 1 5 -1 
                  0 4 30 -1 
                  30 34 2 -1 
                  31 35 34 -1 
                  32 36 35 -1 
                  33 37 36 -1 
                  12 13 37 -1 
                  33 12 37 -1 
                  32 33 36 -1 
                  31 32 35 -1 
                  30 31 34 -1 
                  0 30 2 -1 
                  14 5 3 -1 
                  1 3 5 -1 
                  2 15 14 -1 
                  2 14 3 -1 
                  34 15 2 -1 
                  35 15 34 -1 
                  42 15 35 -1 
                  44 35 36 -1 
                  21 36 37 -1 
                  21 13 20 -1 
                  21 37 13 -1 
                  39 16 38 -1 
                  40 16 39 -1 
                  41 16 40 -1 
                  17 16 41 -1 
                  20 16 17 -1 
                  20 17 18 -1 
                  20 13 16 -1 
                  20 18 19 -1 
                  45 36 21 -1 
                  44 36 45 -1 
                  43 35 44 -1 
                  42 35 43 -1 
                  5 14 15 -1 
                  4 5 15 -1 
                  22 15 42 -1 
                  23 42 43 -1 
                  24 43 44 -1 
                  25 44 45 -1 
                  6 45 21 -1 
                  25 45 6 -1 
                  24 44 25 -1 
                  23 43 24 -1 
                  22 42 23 -1 
                  4 15 22 -1 
                  21 20 6 -1 
                  7 6 20 -1 
                  8 7 19 -1 
                  20 19 7 -1 
                  9 19 18 -1 
                  9 8 19 -1 
                  13 12 16 -1 
                  11 16 12 -1 
                  9 18 10 -1 
                  17 10 18 -1 
                  26 16 11 -1 
                  38 16 26 -1 
                  39 26 27 -1 
                  40 27 28 -1 
                  41 28 29 -1 
                  17 29 10 -1 
                  41 29 17 -1 
                  40 28 41 -1 
                  39 27 40 -1 
                  38 26 39 -1 
                ]
                normalIndex [
                  1 2 0 -1 
                  3 0 2 -1 
                  23 5 6 -1 
                  23 6 7 -1 
                  22 7 8 -1 
                  22 8 9 -1 
                  22 9 10 -1 
                  20 10 11 -1 
                  13 11 12 -1 
                  14 11 13 -1 
                  19 11 14 -1 
                  16 14 15 -1 
                  17 14 16 -1 
                  18 14 17 -1 
                  19 14 18 -1 
                  20 11 19 -1 
                  21 10 20 -1 
                  25 4 5 -1 
                  22 10 21 -1 
                  23 7 22 -1 
                  24 5 23 -1 
                  25 26 4 -1 
                  25 5 24 -1 
                  37 28 27 -1 
                  36 29 28 -1 
                  35 30 29 -1 
                  34 31 30 -1 
                  33 32 31 -1 
                  34 33 31 -1 
                  35 34 30 -1 
                  36 35 29 -1 
                  37 36 28 -1 
                  38 37 27 -1 
                  40 41 39 -1 
                  42 39 41 -1 
                  46 43 44 -1 
                  46 44 45 -1 
                  47 43 46 -1 
                  48 43 47 -1 
                  65 43 48 -1 
                  63 48 49 -1 
                  61 49 50 -1 
                  61 51 60 -1 
                  61 50 51 -1 
                  54 52 53 -1 
                  55 52 54 -1 
                  56 52 55 -1 
                  57 52 56 -1 
                  60 52 57 -1 
                  60 57 58 -1 
                  60 51 52 -1 
                  60 58 59 -1 
                  62 49 61 -1 
                  63 49 62 -1 
                  64 48 63 -1 
                  65 48 64 -1 
                  68 67 66 -1 
                  69 68 66 -1 
                  80 70 71 -1 
                  79 71 72 -1 
                  78 72 73 -1 
                  77 73 74 -1 
                  76 74 75 -1 
                  77 74 76 -1 
                  78 73 77 -1 
                  79 72 78 -1 
                  80 71 79 -1 
                  81 70 80 -1 
                  83 82 84 -1 
                  85 84 82 -1 
                  87 86 88 -1 
                  89 88 86 -1 
                  92 90 93 -1 
                  92 91 90 -1 
                  95 96 94 -1 
                  97 94 96 -1 
                  99 100 98 -1 
                  101 98 100 -1 
                  104 102 103 -1 
                  113 102 104 -1 
                  112 104 105 -1 
                  111 105 106 -1 
                  110 106 107 -1 
                  109 107 108 -1 
                  110 107 109 -1 
                  111 106 110 -1 
                  112 105 111 -1 
                  113 104 112 -1 
                ]
              }
            }
          ]
        }
      ]
    }
  ]
}
