(footprint "CAN Transceiver"
	(version 20240108)
	(generator "pcbnew")
	(generator_version "8.0")
	(layer "F.Cu")
	(descr "D000")
	(tags "Integrated Circuit")
	(property "Reference" "IC**"
		(at 0 0 0)
		(layer "F.SilkS")
		(uuid "e756fc71-eb61-4121-97cb-3b52601efc1b")
		(effects
			(font
				(size 1.27 1.27)
				(thickness 0.254)
			)
		)
	)
	(property "Value" "CAN Transceiver"
		(at 0 0 0)
		(layer "F.SilkS")
		(hide yes)
		(uuid "9a44607f-5bf8-49be-b34b-effca425e9bb")
		(effects
			(font
				(size 1.27 1.27)
				(thickness 0.254)
			)
		)
	)
	(property "Footprint" ""
		(at 0 0 0)
		(layer "F.Fab")
		(hide yes)
		(uuid "3cd3f477-14ae-4156-abfe-f89844c8888d")
		(effects
			(font
				(size 1.27 1.27)
				(thickness 0.15)
			)
		)
	)
	(property "Datasheet" ""
		(at 0 0 0)
		(layer "F.Fab")
		(hide yes)
		(uuid "b179b954-65ec-4271-b372-05981040b008")
		(effects
			(font
				(size 1.27 1.27)
				(thickness 0.15)
			)
		)
	)
	(property "Description" ""
		(at 0 0 0)
		(layer "F.Fab")
		(hide yes)
		(uuid "f195aa6b-ff45-4ce1-8356-6203123ad772")
		(effects
			(font
				(size 1.27 1.27)
				(thickness 0.15)
			)
		)
	)
	(attr smd)
	(fp_line
		(start -3.475 -2.58)
		(end -1.948 -2.58)
		(stroke
			(width 0.2)
			(type solid)
		)
		(layer "F.SilkS")
		(uuid "4acc5f8b-c70d-4f4f-b7cf-88837f0806fb")
	)
	(fp_line
		(start -1.598 -2.452)
		(end 1.598 -2.452)
		(stroke
			(width 0.2)
			(type solid)
		)
		(layer "F.SilkS")
		(uuid "6d2866a2-755d-4731-951b-d5fd7f91449f")
	)
	(fp_line
		(start -1.598 2.452)
		(end -1.598 -2.452)
		(stroke
			(width 0.2)
			(type solid)
		)
		(layer "F.SilkS")
		(uuid "261e261b-d242-470e-bf36-9a0655ab67f1")
	)
	(fp_line
		(start 1.598 -2.452)
		(end 1.598 2.452)
		(stroke
			(width 0.2)
			(type solid)
		)
		(layer "F.SilkS")
		(uuid "0a462ff8-f7f0-41c8-918e-9738556b6818")
	)
	(fp_line
		(start 1.598 2.452)
		(end -1.598 2.452)
		(stroke
			(width 0.2)
			(type solid)
		)
		(layer "F.SilkS")
		(uuid "2c87ad35-99ac-40b3-b6d7-1b0f96b0099c")
	)
	(fp_line
		(start -3.725 -2.75)
		(end 3.725 -2.75)
		(stroke
			(width 0.05)
			(type solid)
		)
		(layer "F.CrtYd")
		(uuid "ba4429f8-c718-4b87-aa84-0a262dcc7e94")
	)
	(fp_line
		(start -3.725 2.75)
		(end -3.725 -2.75)
		(stroke
			(width 0.05)
			(type solid)
		)
		(layer "F.CrtYd")
		(uuid "37eb54f0-9930-4ae4-b2f7-cc69a95fc410")
	)
	(fp_line
		(start 3.725 -2.75)
		(end 3.725 2.75)
		(stroke
			(width 0.05)
			(type solid)
		)
		(layer "F.CrtYd")
		(uuid "5a41cc12-0580-419f-b4db-8a1abf575265")
	)
	(fp_line
		(start 3.725 2.75)
		(end -3.725 2.75)
		(stroke
			(width 0.05)
			(type solid)
		)
		(layer "F.CrtYd")
		(uuid "75433d62-be0c-4298-a78b-57adafaea334")
	)
	(fp_line
		(start -1.948 -2.452)
		(end 1.948 -2.452)
		(stroke
			(width 0.1)
			(type solid)
		)
		(layer "F.Fab")
		(uuid "794a0521-befd-4a8f-b29c-9a5f35d6894f")
	)
	(fp_line
		(start -1.948 -1.182)
		(end -0.678 -2.452)
		(stroke
			(width 0.1)
			(type solid)
		)
		(layer "F.Fab")
		(uuid "7a861f75-28a8-467a-b110-459eae4425f4")
	)
	(fp_line
		(start -1.948 2.452)
		(end -1.948 -2.452)
		(stroke
			(width 0.1)
			(type solid)
		)
		(layer "F.Fab")
		(uuid "6847689e-b765-466c-b5e6-ad16727b4768")
	)
	(fp_line
		(start 1.948 -2.452)
		(end 1.948 2.452)
		(stroke
			(width 0.1)
			(type solid)
		)
		(layer "F.Fab")
		(uuid "d0d5eea3-0967-41c9-a3dc-fbadc25200d0")
	)
	(fp_line
		(start 1.948 2.452)
		(end -1.948 2.452)
		(stroke
			(width 0.1)
			(type solid)
		)
		(layer "F.Fab")
		(uuid "ea7a58e2-ce24-43d6-bbd8-bc54416d8669")
	)
	(fp_text user "${REFERENCE}"
		(at 0 0 0)
		(layer "F.Fab")
		(uuid "afded6d6-392e-4ecb-88f2-82fa51498f23")
		(effects
			(font
				(size 1.27 1.27)
				(thickness 0.254)
			)
		)
	)
	(pad "1" smd rect
		(at -2.711 -1.905 90)
		(size 0.65 1.528)
		(layers "F.Cu" "F.Paste" "F.Mask")
		(uuid "ad0805f7-3052-450e-85fb-609d055ab303")
	)
	(pad "2" smd rect
		(at -2.711 -0.635 90)
		(size 0.65 1.528)
		(layers "F.Cu" "F.Paste" "F.Mask")
		(uuid "61f8780d-25cd-48cf-818f-c9c6a1df8b70")
	)
	(pad "3" smd rect
		(at -2.711 0.635 90)
		(size 0.65 1.528)
		(layers "F.Cu" "F.Paste" "F.Mask")
		(uuid "e2e14791-0856-4e8e-87ec-2a322f6e3791")
	)
	(pad "4" smd rect
		(at -2.711 1.905 90)
		(size 0.65 1.528)
		(layers "F.Cu" "F.Paste" "F.Mask")
		(uuid "2840c3be-bd35-420d-b0a4-3faca174f411")
	)
	(pad "5" smd rect
		(at 2.711 1.905 90)
		(size 0.65 1.528)
		(layers "F.Cu" "F.Paste" "F.Mask")
		(uuid "59500c53-d367-4c15-ba99-787b0be4d98f")
	)
	(pad "6" smd rect
		(at 2.711 0.635 90)
		(size 0.65 1.528)
		(layers "F.Cu" "F.Paste" "F.Mask")
		(uuid "a8cb78cf-55dd-4adc-90af-439f94c300ef")
	)
	(pad "7" smd rect
		(at 2.711 -0.635 90)
		(size 0.65 1.528)
		(layers "F.Cu" "F.Paste" "F.Mask")
		(uuid "43e28c01-4fba-4abc-864d-9253910b9671")
	)
	(pad "8" smd rect
		(at 2.711 -1.905 90)
		(size 0.65 1.528)
		(layers "F.Cu" "F.Paste" "F.Mask")
		(uuid "a9cf737f-9295-40d1-a460-545c287d815f")
	)
	(model "${KIPRJMOD}/3D/TCAN337GD.stp"
		(offset
			(xyz 0 0 0)
		)
		(scale
			(xyz 1 1 1)
		)
		(rotate
			(xyz 0 0 0)
		)
	)
)
