(kicad_sch (version 20230121) (generator eeschema)

  (uuid f6cfe5cf-bca8-40fc-8d53-fb9a1cb06fdd)

  (paper "A4")

  (title_block
    (title "Science Unit Main Board (Payload Board)")
    (date "2022-03-13")
    (rev "2.0 (EM)")
    (company "SpaceDot")
    (comment 1 "AcubeSAT")
  )

  (lib_symbols
  )

)
