(module SOT153P700X170-8N (layer F.Cu) (tedit 624C6918)
  (descr SM-8)
  (tags "MOSFET (P-Channel)")
  (attr smd)
  (fp_text reference Q** (at 0 0) (layer F.SilkS)
    (effects (font (size 0.8 0.8) (thickness 0.2)))
  )
  (fp_text value SOT153P700X170-8N (at 0 0) (layer F.SilkS) hide
    (effects (font (size 1.27 1.27) (thickness 0.254)))
  )
  (fp_line (start -4.25 -3.6) (end 4.25 -3.6) (layer F.CrtYd) (width 0.05))
  (fp_line (start 4.25 -3.6) (end 4.25 3.6) (layer F.CrtYd) (width 0.05))
  (fp_line (start 4.25 3.6) (end -4.25 3.6) (layer F.CrtYd) (width 0.05))
  (fp_line (start -4.25 3.6) (end -4.25 -3.6) (layer F.CrtYd) (width 0.05))
  (fp_line (start -1.75 -3.25) (end 1.75 -3.25) (layer F.Fab) (width 0.1))
  (fp_line (start 1.75 -3.25) (end 1.75 3.25) (layer F.Fab) (width 0.1))
  (fp_line (start 1.75 3.25) (end -1.75 3.25) (layer F.Fab) (width 0.1))
  (fp_line (start -1.75 3.25) (end -1.75 -3.25) (layer F.Fab) (width 0.1))
  (fp_line (start -1.75 -1.72) (end -0.22 -3.25) (layer F.Fab) (width 0.1))
  (fp_line (start -1.75 -3.25) (end 1.75 -3.25) (layer F.SilkS) (width 0.2))
  (fp_line (start 1.75 -3.25) (end 1.75 3.25) (layer F.SilkS) (width 0.2))
  (fp_line (start 1.75 3.25) (end -1.75 3.25) (layer F.SilkS) (width 0.2))
  (fp_line (start -1.75 3.25) (end -1.75 -3.25) (layer F.SilkS) (width 0.2))
  (fp_line (start -4 -3.145) (end -2.3 -3.145) (layer F.SilkS) (width 0.2))
  (fp_text user %R (at 0 0) (layer F.Fab)
    (effects (font (size 1.27 1.27) (thickness 0.254)))
  )
  (pad 8 smd rect (at 3.15 -2.295 90) (size 1 1.7) (layers F.Cu F.Paste F.Mask))
  (pad 7 smd rect (at 3.15 -0.765 90) (size 1 1.7) (layers F.Cu F.Paste F.Mask))
  (pad 6 smd rect (at 3.15 0.765 90) (size 1 1.7) (layers F.Cu F.Paste F.Mask))
  (pad 5 smd rect (at 3.15 2.295 90) (size 1 1.7) (layers F.Cu F.Paste F.Mask))
  (pad 4 smd rect (at -3.15 2.295 90) (size 1 1.7) (layers F.Cu F.Paste F.Mask))
  (pad 3 smd rect (at -3.15 0.765 90) (size 1 1.7) (layers F.Cu F.Paste F.Mask))
  (pad 2 smd rect (at -3.15 -0.765 90) (size 1 1.7) (layers F.Cu F.Paste F.Mask))
  (pad 1 smd rect (at -3.15 -2.295 90) (size 1 1.7) (layers F.Cu F.Paste F.Mask))
  (model ZXMHC3A01T8TA.stp
    (at (xyz 0 0 0))
    (scale (xyz 1 1 1))
    (rotate (xyz 0 0 0))
  )
)
