(module "CONUFL001-SMD" (layer F.Cu)
  (descr "CONUFL001-SMD")
  (tags "Connector")
  (attr smd)
  (fp_text reference J** (at -0.332 -0.051) (layer F.SilkS)
    (effects (font (size 1.27 1.27) (thickness 0.254)))
  )
  (fp_text user %R (at -0.332 -0.051) (layer F.Fab)
    (effects (font (size 1.27 1.27) (thickness 0.254)))
  )
  (fp_text value "CONUFL001-SMD" (at -0.332 -0.051) (layer F.SilkS) hide
    (effects (font (size 1.27 1.27) (thickness 0.254)))
  )
  (fp_line (start -1.3 -1.3) (end 1.3 -1.3) (layer F.Fab) (width 0.2))
  (fp_line (start 1.3 -1.3) (end 1.3 1.3) (layer F.Fab) (width 0.2))
  (fp_line (start 1.3 1.3) (end -1.3 1.3) (layer F.Fab) (width 0.2))
  (fp_line (start -1.3 1.3) (end -1.3 -1.3) (layer F.Fab) (width 0.2))
  (fp_line (start -1.3 -1.3) (end 1.3 -1.3) (layer F.SilkS) (width 0.2))
  (fp_line (start -1.3 1.3) (end -0.761 1.3) (layer F.SilkS) (width 0.2))
  (fp_line (start 1.3 1.3) (end 0.761 1.3) (layer F.SilkS) (width 0.2))
  (fp_circle (center -0.013 2.353) (end -0.013 2.384) (layer F.SilkS) (width 0.2))
  (pad 1 smd rect (at 0 1.525 0) (size 1 1.05) (layers F.Cu F.Paste F.Mask))
  (pad 2 smd rect (at -1.475 0 0) (size 1.05 2.2) (layers F.Cu F.Paste F.Mask))
  (pad 3 smd rect (at 1.475 0 0) (size 1.05 2.2) (layers F.Cu F.Paste F.Mask))
  (model "C:\\Users\\boupa\\Desktop\\AcubeSAT\\Libraries\\SamacSys_Parts.3dshapes\\CONUFL001-SMD-T.stp"
    (at (xyz 0 0.0015748031144067 0.0070866144548251))
    (scale (xyz 1 1 1))
    (rotate (xyz -90 0 0))
  )
)
