(module LOGO (layer F.Cu)
  (at 0 0)
 (fp_text reference "G***" (at 0 0) (layer F.SilkS) hide
  (effects (font (thickness 0.3)))
  )
  (fp_text value "LOGO" (at 0.75 0) (layer F.SilkS) hide
  (effects (font (thickness 0.3)))
  )
  (fp_poly (pts (xy 0.537570 -8.653235) (xy 1.072390 -8.603731) (xy 1.600023 -8.521889) (xy 2.119208 -8.408312) (xy 2.628684 -8.263603) (xy 3.127188 -8.088365) (xy 3.613459 -7.883201) (xy 4.086235 -7.648714)
     (xy 4.544254 -7.385507) (xy 4.986255 -7.094184) (xy 5.410975 -6.775347) (xy 5.817153 -6.429600) (xy 6.203527 -6.057544) (xy 6.568836 -5.659785) (xy 6.751051 -5.441756) (xy 7.075136 -5.014365)
     (xy 7.370845 -4.569186) (xy 7.637658 -4.107690) (xy 7.875058 -3.631347) (xy 8.082526 -3.141628) (xy 8.259543 -2.640003) (xy 8.405592 -2.127942) (xy 8.520153 -1.606915) (xy 8.602708 -1.078394)
     (xy 8.652739 -0.543847) (xy 8.669728 -0.004747) (xy 8.669729 0.000000) (xy 8.652997 0.543714) (xy 8.602999 1.081885) (xy 8.520033 1.613491) (xy 8.404397 2.137509) (xy 8.256390 2.652917)
     (xy 8.076309 3.158692) (xy 7.864451 3.653810) (xy 7.621116 4.137250) (xy 7.346600 4.607989) (xy 7.310587 4.665133) (xy 7.019074 5.093014) (xy 6.698629 5.505678) (xy 6.351647 5.900770)
     (xy 5.980525 6.275939) (xy 5.587659 6.628828) (xy 5.175445 6.957084) (xy 4.746281 7.258354) (xy 4.532486 7.394209) (xy 4.391214 7.477745) (xy 4.227048 7.569444) (xy 4.048541 7.664897)
     (xy 3.864245 7.759695) (xy 3.682715 7.849431) (xy 3.512503 7.929695) (xy 3.376952 7.989810) (xy 2.918899 8.168062) (xy 2.441296 8.321236) (xy 1.948423 8.448318) (xy 1.444564 8.548290)
     (xy 0.934000 8.620137) (xy 0.584200 8.652480) (xy 0.467575 8.658893) (xy 0.325339 8.663430) (xy 0.165695 8.666105) (xy -0.003152 8.666930) (xy -0.172999 8.665917) (xy -0.335644 8.663081)
     (xy -0.482882 8.658434) (xy -0.606511 8.651989) (xy -0.626533 8.650571) (xy -1.164029 8.593843) (xy -1.692529 8.504994) (xy -2.210881 8.384848) (xy -2.717930 8.234232) (xy -3.212524 8.053970)
     (xy -3.693508 7.844887) (xy -4.159730 7.607808) (xy -4.610036 7.343558) (xy -5.043273 7.052963) (xy -5.458287 6.736847) (xy -5.853924 6.396036) (xy -6.229032 6.031354) (xy -6.582457 5.643627)
     (xy -6.913045 5.233680) (xy -7.219644 4.802338) (xy -7.501099 4.350425) (xy -7.756257 3.878767) (xy -7.983965 3.388190) (xy -7.984329 3.387338) (xy -8.176093 2.895697) (xy -8.336746 2.392220)
     (xy -8.466083 1.878916) (xy -8.563903 1.357792) (xy -8.630001 0.830856) (xy -8.664174 0.300115) (xy -8.665336 -0.002506) (xy -8.312244 -0.002506) (xy -8.296347 0.516276) (xy -8.248437 1.030023)
     (xy -8.169126 1.537405) (xy -8.059027 2.037094) (xy -7.918753 2.527761) (xy -7.748915 3.008079) (xy -7.550127 3.476719) (xy -7.323000 3.932352) (xy -7.068147 4.373650) (xy -6.786181 4.799285)
     (xy -6.477715 5.207928) (xy -6.143359 5.598251) (xy -5.783728 5.968925) (xy -5.399433 6.318623) (xy -4.991086 6.646015) (xy -4.559301 6.949773) (xy -4.556529 6.951595) (xy -4.109258 7.225370)
     (xy -3.646568 7.469569) (xy -3.170209 7.683727) (xy -2.681934 7.867378) (xy -2.183495 8.020058) (xy -1.676643 8.141300) (xy -1.163130 8.230640) (xy -0.644708 8.287613) (xy -0.123130 8.311753)
     (xy 0.399854 8.302595) (xy 0.508000 8.296505) (xy 1.036517 8.246542) (xy 1.556764 8.164201) (xy 2.067508 8.050200) (xy 2.567511 7.905255) (xy 3.055539 7.730083) (xy 3.530356 7.525402)
     (xy 3.990726 7.291930) (xy 4.435413 7.030382) (xy 4.863183 6.741477) (xy 5.272799 6.425931) (xy 5.663025 6.084462) (xy 6.032627 5.717787) (xy 6.380369 5.326623) (xy 6.705014 4.911687)
     (xy 6.951595 4.556529) (xy 7.226450 4.107618) (xy 7.471188 3.644087) (xy 7.685451 3.167480) (xy 7.868886 2.679340) (xy 8.021134 2.181208) (xy 8.141841 1.674628) (xy 8.230650 1.161142)
     (xy 8.287206 0.642294) (xy 8.311151 0.119625) (xy 8.302130 -0.405320) (xy 8.259787 -0.931001) (xy 8.245550 -1.049867) (xy 8.162515 -1.570760) (xy 8.047417 -2.082185) (xy 7.901050 -2.582869)
     (xy 7.724210 -3.071538) (xy 7.517693 -3.546920) (xy 7.282296 -4.007740) (xy 7.018813 -4.452726) (xy 6.728041 -4.880605) (xy 6.410776 -5.290103) (xy 6.067814 -5.679947) (xy 5.699949 -6.048864)
     (xy 5.307979 -6.395581) (xy 4.892699 -6.718824) (xy 4.556529 -6.951595) (xy 4.106585 -7.227048) (xy 3.641065 -7.472697) (xy 3.161452 -7.687995) (xy 2.669228 -7.872395) (xy 2.165876 -8.025350)
     (xy 1.652879 -8.146312) (xy 1.131720 -8.234736) (xy 1.049867 -8.245549) (xy 0.524997 -8.295516) (xy 0.002507 -8.312244) (xy -0.516276 -8.296347) (xy -1.030022 -8.248437) (xy -1.537404 -8.169126)
     (xy -2.037093 -8.059027) (xy -2.527761 -7.918753) (xy -3.008079 -7.748915) (xy -3.476718 -7.550127) (xy -3.932351 -7.323000) (xy -4.373650 -7.068147) (xy -4.799284 -6.786181) (xy -5.207928 -6.477715)
     (xy -5.598250 -6.143359) (xy -5.968925 -5.783728) (xy -6.318622 -5.399433) (xy -6.646014 -4.991086) (xy -6.949773 -4.559301) (xy -6.951595 -4.556529) (xy -7.227048 -4.106585) (xy -7.472697 -3.641065)
     (xy -7.687995 -3.161452) (xy -7.872395 -2.669228) (xy -8.025350 -2.165876) (xy -8.146312 -1.652879) (xy -8.234736 -1.131719) (xy -8.245549 -1.049867) (xy -8.295516 -0.524997) (xy -8.312244 -0.002506)
     (xy -8.665336 -0.002506) (xy -8.666220 -0.232422) (xy -8.635934 -0.764749) (xy -8.573114 -1.294857) (xy -8.500446 -1.710267) (xy -8.378464 -2.233651) (xy -8.224697 -2.746547) (xy -8.039978 -3.247583)
     (xy -7.825139 -3.735386) (xy -7.581013 -4.208582) (xy -7.308433 -4.665800) (xy -7.008230 -5.105666) (xy -6.681237 -5.526807) (xy -6.328286 -5.927851) (xy -5.950210 -6.307424) (xy -5.547842 -6.664155)
     (xy -5.445821 -6.747777) (xy -5.014009 -7.074718) (xy -4.565378 -7.372585) (xy -4.101222 -7.640922) (xy -3.622831 -7.879272) (xy -3.131497 -8.087180) (xy -2.628514 -8.264189) (xy -2.115173 -8.409843)
     (xy -1.592766 -8.523686) (xy -1.062584 -8.605260) (xy -0.525922 -8.654111) (xy -0.003173 -8.669798) (xy 0.537570 -8.653235) )(layer F.SilkS) (width  0.010000)
  )
  (fp_poly (pts (xy 0.590882 7.289328) (xy 0.644020 7.292761) (xy 0.665301 7.296911) (xy 0.705346 7.329078) (xy 0.725003 7.369183) (xy 0.734353 7.416255) (xy 0.742061 7.485663) (xy 0.747826 7.568673)
     (xy 0.751346 7.656551) (xy 0.752322 7.740559) (xy 0.750453 7.811964) (xy 0.745439 7.862030) (xy 0.742383 7.874420) (xy 0.729596 7.900458) (xy 0.708775 7.920582) (xy 0.675547 7.935819)
     (xy 0.625541 7.947193) (xy 0.554386 7.955730) (xy 0.457710 7.962454) (xy 0.344009 7.967858) (xy 0.069951 7.979357) (xy 0.028403 7.937809) (xy 0.012001 7.919399) (xy 0.000133 7.898221)
     (xy -0.008338 7.868217) (xy -0.014547 7.823324) (xy -0.019629 7.757482) (xy -0.024722 7.664632) (xy -0.025429 7.650544) (xy -0.030028 7.541327) (xy -0.030491 7.460827) (xy -0.029096 7.444600)
     (xy 0.102291 7.444600) (xy 0.102831 7.489915) (xy 0.105192 7.555865) (xy 0.109194 7.635869) (xy 0.109805 7.646614) (xy 0.122169 7.860979) (xy 0.370118 7.848772) (xy 0.457749 7.844234)
     (xy 0.532344 7.839947) (xy 0.587858 7.836292) (xy 0.618246 7.833648) (xy 0.622101 7.832903) (xy 0.622809 7.815618) (xy 0.621861 7.770989) (xy 0.619458 7.705490) (xy 0.615807 7.625591)
     (xy 0.615172 7.612929) (xy 0.604209 7.396616) (xy 0.357138 7.408684) (xy 0.269434 7.413320) (xy 0.194552 7.417948) (xy 0.138622 7.422136) (xy 0.107775 7.425453) (xy 0.103754 7.426500)
     (xy 0.102291 7.444600) (xy -0.029096 7.444600) (xy -0.025605 7.404018) (xy -0.014155 7.365878) (xy 0.005071 7.341381) (xy 0.033288 7.325503) (xy 0.054904 7.318064) (xy 0.096657 7.310120)
     (xy 0.162489 7.303024) (xy 0.244915 7.297034) (xy 0.336451 7.292410) (xy 0.429613 7.289412) (xy 0.516918 7.288298) (xy 0.590882 7.289328) )(layer F.SilkS) (width  0.010000)
  )
  (fp_poly (pts (xy -1.215615 7.203846) (xy -1.146881 7.211082) (xy -1.067960 7.220944) (xy -0.986584 7.232414) (xy -0.910487 7.244474) (xy -0.847401 7.256104) (xy -0.810526 7.264684) (xy -0.723599 7.304857)
     (xy -0.657410 7.367993) (xy -0.613947 7.448851) (xy -0.595202 7.542191) (xy -0.603163 7.642771) (xy -0.633205 7.731752) (xy -0.676212 7.806859) (xy -0.727235 7.857239) (xy -0.793433 7.887112)
     (xy -0.881966 7.900695) (xy -0.922867 7.902462) (xy -1.005053 7.900909) (xy -1.102479 7.894057) (xy -1.197179 7.883270) (xy -1.219087 7.879997) (xy -1.288885 7.868306) (xy -1.345034 7.857756)
     (xy -1.379848 7.849854) (xy -1.387240 7.847071) (xy -1.389326 7.826643) (xy -1.386367 7.779465) (xy -1.383386 7.750922) (xy -1.245462 7.750922) (xy -1.228537 7.755605) (xy -1.188134 7.763547)
     (xy -1.150367 7.770109) (xy -1.052186 7.782475) (xy -0.960864 7.786808) (xy -0.885474 7.783020) (xy -0.840188 7.773156) (xy -0.786874 7.735504) (xy -0.751153 7.669526) (xy -0.733521 7.582644)
     (xy -0.729948 7.525983) (xy -0.736210 7.488184) (xy -0.755826 7.454837) (xy -0.768581 7.439062) (xy -0.801306 7.408284) (xy -0.844924 7.384198) (xy -0.905432 7.364792) (xy -0.988828 7.348056)
     (xy -1.079500 7.334780) (xy -1.134323 7.327768) (xy -1.172934 7.323260) (xy -1.186347 7.322236) (xy -1.189600 7.339388) (xy -1.196154 7.382165) (xy -1.204943 7.442829) (xy -1.214899 7.513642)
     (xy -1.224955 7.586866) (xy -1.234044 7.654764) (xy -1.241100 7.709597) (xy -1.245054 7.743629) (xy -1.245462 7.750922) (xy -1.383386 7.750922) (xy -1.379311 7.711926) (xy -1.369104 7.630415)
     (xy -1.356692 7.541320) (xy -1.343021 7.451031) (xy -1.329039 7.365937) (xy -1.315691 7.292426) (xy -1.303924 7.236888) (xy -1.294683 7.205712) (xy -1.291587 7.201327) (xy -1.266428 7.200255)
     (xy -1.215615 7.203846) )(layer F.SilkS) (width  0.010000)
  )
  (fp_poly (pts (xy 1.870691 7.081080) (xy 1.877311 7.099767) (xy 1.886502 7.137353) (xy 1.886878 7.139103) (xy 1.898113 7.191606) (xy 1.772199 7.213144) (xy 1.708916 7.224997) (xy 1.658123 7.236398)
     (xy 1.629638 7.245112) (xy 1.628030 7.245965) (xy 1.622922 7.265394) (xy 1.626443 7.313071) (xy 1.638777 7.390436) (xy 1.660108 7.498930) (xy 1.660604 7.501312) (xy 1.678307 7.589530)
     (xy 1.692636 7.667165) (xy 1.702467 7.727616) (xy 1.706675 7.764285) (xy 1.706514 7.770915) (xy 1.689261 7.790828) (xy 1.655007 7.805439) (xy 1.617613 7.811419) (xy 1.590941 7.805438)
     (xy 1.586629 7.799707) (xy 1.580952 7.777035) (xy 1.570112 7.727665) (xy 1.555496 7.658124) (xy 1.538493 7.574941) (xy 1.532232 7.543800) (xy 1.514377 7.457816) (xy 1.497770 7.383672)
     (xy 1.483931 7.327750) (xy 1.474382 7.296433) (xy 1.472302 7.292427) (xy 1.450953 7.288912) (xy 1.405475 7.292386) (xy 1.344702 7.302057) (xy 1.328398 7.305300) (xy 1.266242 7.317358)
     (xy 1.218391 7.325140) (xy 1.193156 7.327340) (xy 1.191328 7.326839) (xy 1.184364 7.307978) (xy 1.175589 7.270712) (xy 1.165492 7.220227) (xy 1.515615 7.147893) (xy 1.619670 7.126691)
     (xy 1.711892 7.108465) (xy 1.787362 7.094140) (xy 1.841163 7.084641) (xy 1.868378 7.080893) (xy 1.870691 7.081080) )(layer F.SilkS) (width  0.010000)
  )
  (fp_poly (pts (xy -2.388743 6.900194) (xy -2.358115 6.908475) (xy -2.301827 6.925056) (xy -2.226479 6.947943) (xy -2.138676 6.975138) (xy -2.082800 6.992680) (xy -1.985059 7.023844) (xy -1.915215 7.047317)
     (xy -1.868754 7.065234) (xy -1.841161 7.079730) (xy -1.827923 7.092939) (xy -1.824527 7.106995) (xy -1.825053 7.114560) (xy -1.834524 7.151432) (xy -1.844058 7.167898) (xy -1.864500 7.168219)
     (xy -1.910944 7.159372) (xy -1.977234 7.142806) (xy -2.057213 7.119973) (xy -2.089385 7.110119) (xy -2.189605 7.080337) (xy -2.266079 7.060766) (xy -2.316099 7.052017) (xy -2.336475 7.054102)
     (xy -2.348816 7.080907) (xy -2.357046 7.124268) (xy -2.357361 7.127704) (xy -2.362200 7.185259) (xy -2.222793 7.227282) (xy -2.155655 7.248086) (xy -2.115159 7.263436) (xy -2.095409 7.277272)
     (xy -2.090508 7.293534) (xy -2.093900 7.313419) (xy -2.103849 7.350256) (xy -2.110447 7.368465) (xy -2.128181 7.368839) (xy -2.169888 7.360099) (xy -2.227478 7.344037) (xy -2.244218 7.338831)
     (xy -2.307759 7.319572) (xy -2.360474 7.305263) (xy -2.392699 7.298490) (xy -2.395916 7.298267) (xy -2.413514 7.312968) (xy -2.432444 7.349256) (xy -2.447919 7.395409) (xy -2.455153 7.439705)
     (xy -2.455239 7.443568) (xy -2.439956 7.454813) (xy -2.397986 7.472924) (xy -2.335255 7.495640) (xy -2.257692 7.520704) (xy -2.234331 7.527772) (xy -2.151877 7.552762) (xy -2.080656 7.575102)
     (xy -2.027221 7.592680) (xy -1.998128 7.603385) (xy -1.995454 7.604722) (xy -1.987540 7.624923) (xy -1.988159 7.660075) (xy -1.995235 7.695874) (xy -2.006689 7.718017) (xy -2.012179 7.719825)
     (xy -2.031221 7.714407) (xy -2.077251 7.700427) (xy -2.144960 7.679525) (xy -2.229042 7.653336) (xy -2.319866 7.624860) (xy -2.414224 7.595000) (xy -2.496820 7.568503) (xy -2.562465 7.547064)
     (xy -2.605969 7.532379) (xy -2.622092 7.526199) (xy -2.619127 7.509125) (xy -2.607394 7.464765) (xy -2.588329 7.398127) (xy -2.563370 7.314219) (xy -2.533954 7.218047) (xy -2.530102 7.205630)
     (xy -2.496372 7.097472) (xy -2.470743 7.017571) (xy -2.451315 6.961826) (xy -2.436192 6.926137) (xy -2.423475 6.906405) (xy -2.411267 6.898527) (xy -2.397671 6.898404) (xy -2.388743 6.900194) )(layer F.SilkS) (width  0.010000)
  )
  (fp_poly (pts (xy 3.565317 6.742875) (xy 3.672134 6.818302) (xy 3.754012 6.876515) (xy 3.813490 6.920098) (xy 3.853104 6.951636) (xy 3.875393 6.973715) (xy 3.882895 6.988918) (xy 3.878146 6.999831)
     (xy 3.863684 7.009039) (xy 3.842047 7.019126) (xy 3.838265 7.020911) (xy 3.776578 7.050327) (xy 3.700903 6.995981) (xy 3.625227 6.941635) (xy 3.438214 7.035426) (xy 3.251200 7.129216)
     (xy 3.251200 7.213307) (xy 3.249061 7.265274) (xy 3.239056 7.295308) (xy 3.215802 7.315250) (xy 3.201241 7.323232) (xy 3.150461 7.345058) (xy 3.124144 7.344869) (xy 3.120963 7.322602)
     (xy 3.121789 7.319433) (xy 3.125144 7.293231) (xy 3.129153 7.239451) (xy 3.133448 7.164369) (xy 3.137658 7.074259) (xy 3.140490 7.001933) (xy 3.141676 6.970251) (xy 3.259696 6.970251)
     (xy 3.260150 6.992475) (xy 3.260588 6.993467) (xy 3.276386 6.986957) (xy 3.315609 6.969607) (xy 3.370895 6.944688) (xy 3.393019 6.934628) (xy 3.451865 6.907057) (xy 3.496659 6.884636)
     (xy 3.520226 6.871011) (xy 3.522134 6.868975) (xy 3.509627 6.856337) (xy 3.477126 6.830418) (xy 3.432154 6.796653) (xy 3.382238 6.760476) (xy 3.334903 6.727320) (xy 3.297674 6.702620)
     (xy 3.278075 6.691809) (xy 3.276850 6.691861) (xy 3.274114 6.709378) (xy 3.270665 6.750754) (xy 3.267001 6.806759) (xy 3.263620 6.868164) (xy 3.261019 6.925738) (xy 3.259696 6.970251)
     (xy 3.141676 6.970251) (xy 3.145250 6.874872) (xy 3.149768 6.777322) (xy 3.154868 6.704944) (xy 3.161378 6.653402) (xy 3.170123 6.618356) (xy 3.181929 6.595468) (xy 3.197623 6.580400)
     (xy 3.218030 6.568813) (xy 3.223460 6.566193) (xy 3.278301 6.540041) (xy 3.565317 6.742875) )(layer F.SilkS) (width  0.010000)
  )
  (fp_poly (pts (xy 2.557327 7.161503) (xy 2.571942 7.182853) (xy 2.577614 7.211940) (xy 2.576603 7.233875) (xy 2.563158 7.251001) (xy 2.530825 7.267893) (xy 2.473152 7.289130) (xy 2.464735 7.292013)
     (xy 2.393402 7.315630) (xy 2.347160 7.327455) (xy 2.319214 7.327112) (xy 2.302772 7.314227) (xy 2.291039 7.288426) (xy 2.288880 7.282317) (xy 2.271514 7.232500) (xy 2.407254 7.187294)
     (xy 2.480796 7.164564) (xy 2.528883 7.155687) (xy 2.557327 7.161503) )(layer F.SilkS) (width  0.010000)
  )
  (fp_poly (pts (xy -3.478481 6.429968) (xy -3.434283 6.443207) (xy -3.373134 6.469061) (xy -3.289751 6.508841) (xy -3.242733 6.532047) (xy -3.140295 6.584359) (xy -3.065952 6.627275) (xy -3.016644 6.664683)
     (xy -2.989314 6.700472) (xy -2.980904 6.738528) (xy -2.988355 6.782742) (xy -3.006607 6.832240) (xy -3.025639 6.872215) (xy -3.045615 6.887837) (xy -3.079313 6.886488) (xy -3.095507 6.883598)
     (xy -3.137240 6.874859) (xy -3.161327 6.868025) (xy -3.163026 6.867053) (xy -3.159623 6.850328) (xy -3.145075 6.814521) (xy -3.138824 6.801043) (xy -3.122112 6.761075) (xy -3.116050 6.736081)
     (xy -3.116932 6.733158) (xy -3.134863 6.722686) (xy -3.175406 6.701427) (xy -3.231153 6.673059) (xy -3.294695 6.641260) (xy -3.358627 6.609708) (xy -3.415539 6.582082) (xy -3.458026 6.562058)
     (xy -3.478679 6.553316) (xy -3.479351 6.553200) (xy -3.489216 6.567240) (xy -3.510370 6.604683) (xy -3.539214 6.658512) (xy -3.572151 6.721710) (xy -3.605582 6.787262) (xy -3.635909 6.848151)
     (xy -3.659532 6.897360) (xy -3.672854 6.927874) (xy -3.674533 6.933777) (xy -3.660303 6.944203) (xy -3.621487 6.966380) (xy -3.563894 6.997124) (xy -3.493336 7.033254) (xy -3.488145 7.035861)
     (xy -3.301756 7.129338) (xy -3.265348 7.054398) (xy -3.228939 6.979458) (xy -3.180803 7.015047) (xy -3.145941 7.048045) (xy -3.135642 7.082378) (xy -3.150035 7.125522) (xy -3.183573 7.177193)
     (xy -3.228154 7.227451) (xy -3.267711 7.247028) (xy -3.274392 7.247467) (xy -3.303840 7.240214) (xy -3.356557 7.220342) (xy -3.425677 7.190685) (xy -3.504333 7.154076) (xy -3.524053 7.144479)
     (xy -3.628516 7.091771) (xy -3.705332 7.049196) (xy -3.758182 7.014023) (xy -3.790746 6.983524) (xy -3.806707 6.954969) (xy -3.810000 6.932505) (xy -3.801820 6.898102) (xy -3.779778 6.842021)
     (xy -3.747620 6.771515) (xy -3.709092 6.693835) (xy -3.667941 6.616232) (xy -3.627913 6.545959) (xy -3.592754 6.490267) (xy -3.566210 6.456407) (xy -3.562211 6.452851) (xy -3.537161 6.436101)
     (xy -3.511013 6.428036) (xy -3.478481 6.429968) )(layer F.SilkS) (width  0.010000)
  )
  (fp_poly (pts (xy 0.635214 -6.750964) (xy 1.104575 -6.691290) (xy 1.573884 -6.598426) (xy 1.596466 -6.593129) (xy 1.676094 -6.572746) (xy 1.742692 -6.550719) (xy 1.802228 -6.523262) (xy 1.860668 -6.486592)
     (xy 1.923982 -6.436926) (xy 1.998137 -6.370480) (xy 2.089101 -6.283471) (xy 2.096967 -6.275816) (xy 2.318215 -6.037801) (xy 2.509541 -5.784144) (xy 2.670590 -5.515633) (xy 2.801010 -5.233058)
     (xy 2.900447 -4.937208) (xy 2.968547 -4.628869) (xy 3.004957 -4.308831) (xy 3.008477 -4.241800) (xy 3.005304 -3.924941) (xy 2.969465 -3.613111) (xy 2.901904 -3.308649) (xy 2.803568 -3.013893)
     (xy 2.675402 -2.731184) (xy 2.518350 -2.462860) (xy 2.333357 -2.211261) (xy 2.121370 -1.978726) (xy 2.076612 -1.935465) (xy 2.014294 -1.878654) (xy 1.942698 -1.816847) (xy 1.867438 -1.754502)
     (xy 1.794127 -1.696080) (xy 1.728380 -1.646037) (xy 1.675810 -1.608834) (xy 1.642030 -1.588930) (xy 1.638675 -1.587625) (xy 1.641397 -1.571588) (xy 1.658067 -1.529060) (xy 1.687039 -1.463609)
     (xy 1.726667 -1.378808) (xy 1.775304 -1.278226) (xy 1.831303 -1.165433) (xy 1.854995 -1.118486) (xy 2.089712 -0.655480) (xy 2.035348 -0.557342) (xy 1.970509 -0.439984) (xy 1.899149 -0.310269)
     (xy 1.822892 -0.171197) (xy 1.743364 -0.025766) (xy 1.662191 0.123024) (xy 1.580999 0.272173) (xy 1.501412 0.418683) (xy 1.425057 0.559554) (xy 1.353559 0.691787) (xy 1.288544 0.812383)
     (xy 1.231637 0.918343) (xy 1.184464 1.006668) (xy 1.148651 1.074358) (xy 1.125822 1.118414) (xy 1.117604 1.135837) (xy 1.117600 1.135900) (xy 1.131581 1.149001) (xy 1.147234 1.151253)
     (xy 1.183237 1.156169) (xy 1.236655 1.169390) (xy 1.299153 1.188098) (xy 1.362392 1.209471) (xy 1.418037 1.230690) (xy 1.457750 1.248934) (xy 1.473196 1.261383) (xy 1.473200 1.261522)
     (xy 1.458534 1.278398) (xy 1.421838 1.296405) (xy 1.406178 1.301653) (xy 1.361323 1.318439) (xy 1.331797 1.335627) (xy 1.327923 1.339908) (xy 1.329258 1.365525) (xy 1.354756 1.394194)
     (xy 1.396163 1.419168) (xy 1.442020 1.433209) (xy 1.470947 1.436393) (xy 1.494448 1.431940) (xy 1.518941 1.415285) (xy 1.550844 1.381867) (xy 1.596578 1.327121) (xy 1.603991 1.318055)
     (xy 1.666690 1.245194) (xy 1.736403 1.170500) (xy 1.807464 1.099427) (xy 1.874206 1.037430) (xy 1.888438 1.025527) (xy 2.944554 1.025527) (xy 2.972156 1.040826) (xy 3.022600 1.066036)
     (xy 3.079579 1.094006) (xy 3.112561 1.109528) (xy 3.128059 1.114852) (xy 3.132589 1.112226) (xy 3.132667 1.104012) (xy 3.118153 1.091163) (xy 3.080708 1.072262) (xy 3.044240 1.057445)
     (xy 2.980152 1.034014) (xy 2.947071 1.023316) (xy 2.944554 1.025527) (xy 1.888438 1.025527) (xy 1.930963 0.989963) (xy 1.946695 0.979445) (xy 2.980267 0.979445) (xy 2.994383 0.991169)
     (xy 3.029590 1.009530) (xy 3.075174 1.029525) (xy 3.120421 1.046154) (xy 3.128434 1.048620) (xy 3.132658 1.037438) (xy 3.132667 1.036586) (xy 3.118242 1.023488) (xy 3.081557 1.005107)
     (xy 3.056467 0.995063) (xy 3.012449 0.981084) (xy 2.984926 0.976836) (xy 2.980267 0.979445) (xy 1.946695 0.979445) (xy 1.972068 0.962482) (xy 1.974698 0.961224) (xy 2.005554 0.941809)
     (xy 2.010096 0.921027) (xy 1.986621 0.895686) (xy 1.933427 0.862594) (xy 1.917438 0.853887) (xy 1.863153 0.822552) (xy 1.832672 0.797077) (xy 1.818694 0.769917) (xy 1.815027 0.748054)
     (xy 1.814040 0.712271) (xy 1.827027 0.697389) (xy 1.863327 0.694282) (xy 1.870061 0.694267) (xy 1.914852 0.689057) (xy 1.927482 0.673833) (xy 1.907949 0.649200) (xy 1.870410 0.623863)
     (xy 1.834699 0.600670) (xy 1.816956 0.584880) (xy 1.816633 0.582256) (xy 1.836447 0.583503) (xy 1.882898 0.595978) (xy 1.951333 0.617950) (xy 2.037101 0.647688) (xy 2.135549 0.683461)
     (xy 2.242026 0.723536) (xy 2.351878 0.766182) (xy 2.460455 0.809669) (xy 2.563104 0.852263) (xy 2.655173 0.892235) (xy 2.681859 0.904289) (xy 2.815251 0.965241) (xy 2.845178 0.938239)
     (xy 3.040188 0.938239) (xy 3.062246 0.955178) (xy 3.064934 0.956734) (xy 3.103093 0.975298) (xy 3.124936 0.980135) (xy 3.125078 0.971313) (xy 3.108264 0.956195) (xy 3.071941 0.936753)
     (xy 3.048997 0.931934) (xy 3.040188 0.938239) (xy 2.845178 0.938239) (xy 2.876592 0.909896) (xy 2.929271 0.866358) (xy 2.985442 0.825633) (xy 3.000093 0.816189) (xy 3.038544 0.790003)
     (xy 3.053346 0.767927) (xy 3.050579 0.737854) (xy 3.046660 0.723459) (xy 3.035616 0.663045) (xy 3.034871 0.646464) (xy 3.149678 0.646464) (xy 3.162245 0.657602) (xy 3.166534 0.660400)
     (xy 3.204980 0.674053) (xy 3.225800 0.675884) (xy 3.259667 0.674953) (xy 3.225800 0.660400) (xy 3.186240 0.647869) (xy 3.166534 0.644916) (xy 3.149678 0.646464) (xy 3.034871 0.646464)
     (xy 3.032512 0.594047) (xy 3.033389 0.578276) (xy 3.152603 0.578276) (xy 3.155049 0.585736) (xy 3.178941 0.600979) (xy 3.221882 0.620693) (xy 3.270687 0.638962) (xy 3.280834 0.642179)
     (xy 3.285013 0.630743) (xy 3.285067 0.628369) (xy 3.270754 0.613312) (xy 3.244307 0.603041) (xy 3.198536 0.590151) (xy 3.172340 0.581574) (xy 3.152603 0.578276) (xy 3.033389 0.578276)
     (xy 3.036387 0.524435) (xy 3.036800 0.521832) (xy 3.149600 0.521832) (xy 3.164158 0.532109) (xy 3.200295 0.546865) (xy 3.246706 0.562481) (xy 3.292088 0.575336) (xy 3.325136 0.581808)
     (xy 3.334456 0.581041) (xy 3.334456 0.569003) (xy 3.313178 0.558696) (xy 3.273646 0.545848) (xy 3.226820 0.533257) (xy 3.183662 0.523718) (xy 3.155135 0.520031) (xy 3.149600 0.521832)
     (xy 3.036800 0.521832) (xy 3.046277 0.462175) (xy 3.061220 0.415237) (xy 3.080256 0.391587) (xy 3.086896 0.390232) (xy 3.112599 0.398382) (xy 3.155634 0.418331) (xy 3.183467 0.433022)
     (xy 3.259667 0.475047) (xy 3.200400 0.464146) (xy 3.161014 0.458880) (xy 3.150705 0.462061) (xy 3.166296 0.471817) (xy 3.204610 0.486275) (xy 3.262469 0.503561) (xy 3.271286 0.505925)
     (xy 3.349564 0.527931) (xy 3.399325 0.546570) (xy 3.425182 0.565503) (xy 3.431749 0.588387) (xy 3.423639 0.618884) (xy 3.421225 0.624864) (xy 3.397533 0.663188) (xy 3.356675 0.712384)
     (xy 3.308253 0.761077) (xy 3.261507 0.805032) (xy 3.236032 0.834558) (xy 3.227514 0.857417) (xy 3.231641 0.881369) (xy 3.235495 0.892024) (xy 3.244466 0.932377) (xy 3.250999 0.993874)
     (xy 3.253784 1.063806) (xy 3.253806 1.069779) (xy 3.253874 1.199759) (xy 3.519237 1.377336) (xy 3.902087 1.653350) (xy 4.260857 1.952696) (xy 4.594865 2.274641) (xy 4.903433 2.618453)
     (xy 5.185881 2.983398) (xy 5.441528 3.368745) (xy 5.569468 3.587335) (xy 5.657983 3.745669) (xy 5.611820 3.815935) (xy 5.511601 3.960260) (xy 5.391620 4.119392) (xy 5.257802 4.286066)
     (xy 5.116070 4.453018) (xy 4.972350 4.612984) (xy 4.894758 4.695193) (xy 4.824013 4.768297) (xy 4.771271 4.819579) (xy 4.730870 4.851441) (xy 4.697147 4.866284) (xy 4.664439 4.866513)
     (xy 4.627084 4.854530) (xy 4.579418 4.832737) (xy 4.575245 4.830763) (xy 4.531744 4.814910) (xy 4.505445 4.819016) (xy 4.499892 4.823602) (xy 4.463929 4.839044) (xy 4.406340 4.841447)
     (xy 4.336803 4.830696) (xy 4.318000 4.825744) (xy 4.279402 4.808423) (xy 4.223068 4.775428) (xy 4.157784 4.732149) (xy 4.114800 4.701120) (xy 4.035608 4.643154) (xy 3.978196 4.605071)
     (xy 3.938180 4.585252) (xy 3.911177 4.582075) (xy 3.892804 4.593921) (xy 3.880704 4.614576) (xy 3.871140 4.646927) (xy 3.875735 4.682008) (xy 3.896285 4.732514) (xy 3.897832 4.735818)
     (xy 3.933983 4.797902) (xy 3.979991 4.858699) (xy 3.995057 4.875033) (xy 4.038891 4.915265) (xy 4.096127 4.962206) (xy 4.160871 5.011693) (xy 4.227231 5.059564) (xy 4.289311 5.101658)
     (xy 4.341219 5.133813) (xy 4.377060 5.151868) (xy 4.389750 5.153718) (xy 4.399768 5.153060) (xy 4.395234 5.162994) (xy 4.370004 5.191006) (xy 4.321271 5.233956) (xy 4.253207 5.288894)
     (xy 4.169981 5.352871) (xy 4.075766 5.422937) (xy 3.974731 5.496140) (xy 3.871049 5.569531) (xy 3.768889 5.640161) (xy 3.672423 5.705078) (xy 3.585823 5.761333) (xy 3.513258 5.805975)
     (xy 3.458899 5.836055) (xy 3.426919 5.848623) (xy 3.425661 5.848768) (xy 3.406543 5.836598) (xy 3.375246 5.802891) (xy 3.338030 5.754514) (xy 3.332210 5.746253) (xy 3.180650 5.536739)
     (xy 3.033596 5.349760) (xy 2.893391 5.188124) (xy 2.762378 5.054642) (xy 2.732707 5.027237) (xy 2.705549 5.005753) (xy 2.685036 5.006506) (xy 2.657723 5.026451) (xy 2.618633 5.058104)
     (xy 2.671321 5.151461) (xy 2.725364 5.241138) (xy 2.790598 5.340044) (xy 2.860780 5.439460) (xy 2.929663 5.530668) (xy 2.991005 5.604949) (xy 3.014295 5.630333) (xy 3.055248 5.680234)
     (xy 3.098620 5.744864) (xy 3.139583 5.815450) (xy 3.173310 5.883217) (xy 3.194973 5.939389) (xy 3.200400 5.968625) (xy 3.185526 5.983587) (xy 3.143899 6.009460) (xy 3.080011 6.044089)
     (xy 2.998353 6.085322) (xy 2.903419 6.131004) (xy 2.799700 6.178981) (xy 2.691688 6.227100) (xy 2.583875 6.273207) (xy 2.480754 6.315149) (xy 2.463800 6.321792) (xy 2.011924 6.479673)
     (xy 1.551102 6.604928) (xy 1.082150 6.697358) (xy 0.706285 6.747058) (xy 0.598682 6.756419) (xy 0.469036 6.764781) (xy 0.325415 6.771884) (xy 0.175887 6.777469) (xy 0.028522 6.781276)
     (xy -0.108611 6.783047) (xy -0.227444 6.782523) (xy -0.313267 6.779812) (xy -0.592887 6.758675) (xy -0.886355 6.724931) (xy -1.179322 6.680566) (xy -1.457438 6.627566) (xy -1.532467 6.611047)
     (xy -1.660619 6.581267) (xy -1.774209 6.553220) (xy -1.879524 6.524939) (xy -1.982855 6.494454) (xy -2.090490 6.459799) (xy -2.208719 6.419004) (xy -2.343831 6.370102) (xy -2.502116 6.311125)
     (xy -2.556933 6.290466) (xy -2.594951 6.274976) (xy -2.655670 6.248954) (xy -2.730978 6.215925) (xy -2.812763 6.179412) (xy -2.819400 6.176421) (xy -2.907509 6.136272) (xy -2.967860 6.104871)
     (xy -3.003303 6.076474) (xy -3.016689 6.045336) (xy -3.010870 6.005715) (xy -2.988696 5.951866) (xy -2.960180 5.892800) (xy -2.896623 5.789695) (xy -2.809748 5.687270) (xy -2.708903 5.595158)
     (xy -2.603432 5.522992) (xy -2.599032 5.520536) (xy -2.524684 5.472177) (xy -2.470391 5.417126) (xy -2.443232 5.377963) (xy -2.391777 5.300866) (xy -2.335054 5.224283) (xy -2.278871 5.155352)
     (xy -2.229035 5.101210) (xy -2.192336 5.069629) (xy -2.151105 5.049677) (xy -2.092738 5.029509) (xy -2.055754 5.019655) (xy -1.995332 5.002498) (xy -1.942620 4.982279) (xy -1.920908 4.970819)
     (xy -1.863348 4.916279) (xy -1.815450 4.839076) (xy -1.783375 4.750231) (xy -1.776066 4.711802) (xy -1.769833 4.682748) (xy 0.681112 4.682748) (xy 0.698820 4.689476) (xy 0.741165 4.702955)
     (xy 0.800163 4.720831) (xy 0.867830 4.740754) (xy 0.936183 4.760372) (xy 0.997238 4.777332) (xy 1.041400 4.788888) (xy 1.105108 4.802807) (xy 1.145656 4.806336) (xy 1.171963 4.799944)
     (xy 1.178493 4.796108) (xy 1.195439 4.771886) (xy 1.209273 4.732867) (xy 1.227207 4.681166) (xy 1.247067 4.642548) (xy 1.286513 4.604397) (xy 1.346779 4.570330) (xy 1.414873 4.546392)
     (xy 1.470702 4.538505) (xy 1.513558 4.544189) (xy 1.578052 4.559569) (xy 1.654456 4.581574) (xy 1.733042 4.607130) (xy 1.804082 4.633166) (xy 1.857846 4.656609) (xy 1.874771 4.666111)
     (xy 1.908349 4.683540) (xy 1.943121 4.688492) (xy 1.988056 4.680232) (xy 2.052120 4.658027) (xy 2.073005 4.649884) (xy 2.147107 4.623543) (xy 2.227127 4.599452) (xy 2.272650 4.588068)
     (xy 2.333941 4.576937) (xy 2.378966 4.576692) (xy 2.423739 4.587972) (xy 2.442549 4.594851) (xy 2.488130 4.611517) (xy 2.519222 4.621516) (xy 2.525507 4.622800) (xy 2.528965 4.607140)
     (xy 2.530162 4.565114) (xy 2.529008 4.504153) (xy 2.527386 4.466167) (xy 2.524604 4.385975) (xy 2.526965 4.326648) (xy 2.536176 4.275356) (xy 2.553948 4.219272) (xy 2.563833 4.192632)
     (xy 2.584212 4.135095) (xy 2.597185 4.090838) (xy 2.600320 4.068326) (xy 2.599818 4.067374) (xy 2.580783 4.068076) (xy 2.538778 4.077885) (xy 2.482789 4.094694) (xy 2.481192 4.095217)
     (xy 2.370921 4.131417) (xy 2.223231 4.059663) (xy 2.144122 4.106024) (xy 2.074367 4.138529) (xy 2.020786 4.144203) (xy 2.018873 4.143874) (xy 1.967045 4.129412) (xy 1.901906 4.104704)
     (xy 1.835118 4.074919) (xy 1.778343 4.045226) (xy 1.745074 4.022518) (xy 1.719534 3.987160) (xy 1.693136 3.932414) (xy 1.671452 3.872142) (xy 1.660057 3.820206) (xy 1.659467 3.809608)
     (xy 1.647679 3.776808) (xy 1.628540 3.753394) (xy 1.609824 3.739631) (xy 1.589459 3.737144) (xy 1.558685 3.747636) (xy 1.508741 3.772810) (xy 1.497307 3.778889) (xy 1.445470 3.806834)
     (xy 1.406653 3.828333) (xy 1.389464 3.838599) (xy 1.397279 3.852409) (xy 1.424443 3.884443) (xy 1.466132 3.929206) (xy 1.495298 3.959072) (xy 1.544443 4.010601) (xy 1.582847 4.054681)
     (xy 1.605173 4.084986) (xy 1.608667 4.093463) (xy 1.593750 4.120258) (xy 1.556011 4.138927) (xy 1.505967 4.147297) (xy 1.454135 4.143197) (xy 1.422663 4.131874) (xy 1.395946 4.103650)
     (xy 1.380793 4.067305) (xy 1.360213 4.032137) (xy 1.317464 3.990012) (xy 1.261535 3.947239) (xy 1.201416 3.910128) (xy 1.146096 3.884988) (xy 1.110715 3.877734) (xy 1.081768 3.881549)
     (xy 1.069308 3.899537) (xy 1.066506 3.941234) (xy 1.058938 4.026956) (xy 1.039254 4.128288) (xy 1.010965 4.230793) (xy 0.977583 4.320036) (xy 0.970791 4.334638) (xy 0.931941 4.398523)
     (xy 0.873839 4.473569) (xy 0.803970 4.550147) (xy 0.800942 4.553201) (xy 0.750080 4.605128) (xy 0.710189 4.647418) (xy 0.686033 4.674921) (xy 0.681112 4.682748) (xy -1.769833 4.682748)
     (xy -1.759276 4.633547) (xy -1.729254 4.574760) (xy -1.699799 4.546600) (xy 0.287867 4.546600) (xy 0.296334 4.555067) (xy 0.304800 4.546600) (xy 0.296334 4.538133) (xy 0.287867 4.546600)
     (xy -1.699799 4.546600) (xy -1.679588 4.527278) (xy -1.603867 4.482937) (xy -1.591573 4.476879) (xy -1.537545 4.445056) (xy 0.323471 4.445056) (xy 0.330915 4.466149) (xy 0.356753 4.505886)
     (xy 0.387149 4.540927) (xy 0.411250 4.555361) (xy 0.422998 4.545966) (xy 0.423334 4.541302) (xy 0.412134 4.521974) (xy 0.384135 4.490347) (xy 0.372534 4.478867) (xy 0.337555 4.448934)
     (xy 0.323471 4.445056) (xy -1.537545 4.445056) (xy -1.508538 4.427971) (xy -1.439719 4.370810) (xy -1.391085 4.311372) (xy -1.374628 4.270558) (xy 0.290780 4.270558) (xy 0.298380 4.288985)
     (xy 0.323944 4.323769) (xy 0.361350 4.368255) (xy 0.404475 4.415788) (xy 0.447198 4.459713) (xy 0.483396 4.493376) (xy 0.506948 4.510123) (xy 0.511554 4.510537) (xy 0.507073 4.495277)
     (xy 0.483069 4.461515) (xy 0.443815 4.414844) (xy 0.411390 4.379433) (xy 0.362517 4.329414) (xy 0.322782 4.292066) (xy 0.297312 4.272014) (xy 0.290780 4.270558) (xy -1.374628 4.270558)
     (xy -1.368609 4.255632) (xy -1.368326 4.253459) (xy -1.351475 4.214363) (xy -1.321714 4.199589) (xy -1.314132 4.196629) (xy -1.261533 4.196629) (xy -1.159933 4.203313) (xy -1.099056 4.207441)
     (xy -1.047930 4.211121) (xy -1.024467 4.212980) (xy -0.991214 4.209612) (xy -0.938083 4.197873) (xy -0.883258 4.182315) (xy -0.839831 4.170136) (xy -0.794578 4.161230) (xy -0.741290 4.155112)
     (xy -0.673758 4.151303) (xy -0.585772 4.149318) (xy -0.471125 4.148677) (xy -0.450039 4.148667) (xy -0.124162 4.148667) (xy -0.116388 4.137378) (xy 0.158045 4.137378) (xy 0.160369 4.147445)
     (xy 0.169334 4.148667) (xy 0.183272 4.142471) (xy 0.180622 4.137378) (xy 0.160526 4.135351) (xy 0.158045 4.137378) (xy -0.116388 4.137378) (xy -0.069196 4.068858) (xy 0.227242 4.068858)
     (xy 0.234581 4.085179) (xy 0.257712 4.115584) (xy 0.298776 4.162695) (xy 0.359910 4.229132) (xy 0.423334 4.296509) (xy 0.482482 4.357504) (xy 0.533776 4.407656) (xy 0.572662 4.442717)
     (xy 0.594585 4.458438) (xy 0.597234 4.458715) (xy 0.590803 4.444457) (xy 0.564571 4.410070) (xy 0.522153 4.359892) (xy 0.467164 4.298261) (xy 0.429583 4.257528) (xy 0.366725 4.191202)
     (xy 0.311369 4.134671) (xy 0.267817 4.092183) (xy 0.240369 4.067984) (xy 0.233555 4.064000) (xy 0.227242 4.068858) (xy -0.069196 4.068858) (xy -0.061405 4.057546) (xy -0.024578 4.006679)
     (xy 0.287867 4.006679) (xy 0.298991 4.023677) (xy 0.329094 4.058693) (xy 0.373268 4.106725) (xy 0.426606 4.162774) (xy 0.484202 4.221839) (xy 0.541149 4.278921) (xy 0.592539 4.329019)
     (xy 0.633466 4.367133) (xy 0.659024 4.388263) (xy 0.664815 4.390801) (xy 0.658275 4.376720) (xy 0.631854 4.342566) (xy 0.589181 4.292642) (xy 0.533884 4.231251) (xy 0.495482 4.189985)
     (xy 0.455451 4.147864) (xy 0.562045 4.147864) (xy 0.577624 4.169862) (xy 0.610729 4.207010) (xy 0.625541 4.222470) (xy 0.669794 4.265950) (xy 0.704773 4.296597) (xy 0.724309 4.309113)
     (xy 0.726041 4.308804) (xy 0.719887 4.293259) (xy 0.695310 4.261728) (xy 0.667767 4.231682) (xy 0.624422 4.189977) (xy 0.585128 4.157187) (xy 0.584735 4.156926) (xy 0.714230 4.156926)
     (xy 0.717879 4.173978) (xy 0.736600 4.199467) (xy 0.761766 4.221621) (xy 0.775904 4.225074) (xy 0.772255 4.208022) (xy 0.753534 4.182534) (xy 0.728368 4.160380) (xy 0.714230 4.156926)
     (xy 0.584735 4.156926) (xy 0.567267 4.145349) (xy 0.562045 4.147864) (xy 0.455451 4.147864) (xy 0.419809 4.110363) (xy 0.364062 4.053711) (xy 0.350105 4.040642) (xy 0.721651 4.040642)
     (xy 0.740917 4.067098) (xy 0.753364 4.080757) (xy 0.785102 4.110216) (xy 0.806656 4.123516) (xy 0.810221 4.123023) (xy 0.805599 4.106589) (xy 0.783320 4.077247) (xy 0.778871 4.072400)
     (xy 0.747309 4.043691) (xy 0.723508 4.030268) (xy 0.722014 4.030134) (xy 0.721651 4.040642) (xy 0.350105 4.040642) (xy 0.325627 4.017722) (xy 0.301892 4.000089) (xy 0.290244 3.998505)
     (xy 0.287867 4.006679) (xy -0.024578 4.006679) (xy -0.023321 4.004943) (xy 0.012218 3.960340) (xy 0.021183 3.950665) (xy 0.378624 3.950665) (xy 0.380094 3.969341) (xy 0.399536 3.996793)
     (xy 0.426946 4.022714) (xy 0.452320 4.036792) (xy 0.461422 4.035991) (xy 0.461518 4.019106) (xy 0.441277 3.989966) (xy 0.434074 3.982377) (xy 0.402842 3.956894) (xy 0.381073 3.949330)
     (xy 0.378624 3.950665) (xy 0.021183 3.950665) (xy 0.033740 3.937115) (xy 0.042710 3.922117) (xy 0.467587 3.922117) (xy 0.486953 3.948602) (xy 0.499534 3.962400) (xy 0.533774 3.994218)
     (xy 0.560109 4.011909) (xy 0.565136 4.013200) (xy 0.565347 4.002684) (xy 0.560655 3.996267) (xy 0.812800 3.996267) (xy 0.818996 4.010205) (xy 0.824089 4.007556) (xy 0.826116 3.987460)
     (xy 0.824089 3.984978) (xy 0.814022 3.987302) (xy 0.812800 3.996267) (xy 0.560655 3.996267) (xy 0.545981 3.976199) (xy 0.533400 3.962400) (xy 0.499159 3.930582) (xy 0.472825 3.912892)
     (xy 0.467797 3.911600) (xy 0.467587 3.922117) (xy 0.042710 3.922117) (xy 0.052898 3.905081) (xy 0.585454 3.905081) (xy 0.603922 3.930759) (xy 0.609600 3.937000) (xy 0.641114 3.965729)
     (xy 0.664793 3.979193) (xy 0.666304 3.979334) (xy 0.667613 3.968919) (xy 0.649145 3.943241) (xy 0.643467 3.937000) (xy 0.611953 3.908271) (xy 0.588274 3.894807) (xy 0.586763 3.894667)
     (xy 0.585454 3.905081) (xy 0.052898 3.905081) (xy 0.058082 3.896415) (xy 0.057232 3.863136) (xy 0.056687 3.813044) (xy 0.066082 3.771900) (xy 0.093922 3.734834) (xy 0.131990 3.723754)
     (xy 0.169138 3.739197) (xy 0.188583 3.765987) (xy 0.207106 3.806641) (xy 0.288045 3.765987) (xy 0.334886 3.743251) (xy 0.368302 3.728496) (xy 0.378124 3.725334) (xy 0.399010 3.719913)
     (xy 0.432743 3.708042) (xy 0.478225 3.690750) (xy 0.412020 3.642791) (xy 0.365230 3.604004) (xy 0.326564 3.563708) (xy 0.317101 3.551009) (xy 0.281659 3.510726) (xy 0.230943 3.468838)
     (xy 0.175441 3.432487) (xy 0.125642 3.408813) (xy 0.100602 3.403600) (xy 0.067304 3.414538) (xy 0.022850 3.442516) (xy -0.004258 3.464699) (xy -0.047894 3.500808) (xy -0.081504 3.516930)
     (xy -0.117841 3.518135) (xy -0.133310 3.516012) (xy -0.173622 3.512457) (xy -0.199157 3.523081) (xy -0.222924 3.554940) (xy -0.231375 3.569213) (xy -0.249949 3.597153) (xy -0.272906 3.619868)
     (xy -0.306612 3.641120) (xy -0.357431 3.664674) (xy -0.431727 3.694292) (xy -0.463309 3.706352) (xy -0.566296 3.747630) (xy -0.640208 3.783281) (xy -0.688721 3.816293) (xy -0.715513 3.849656)
     (xy -0.724259 3.886360) (xy -0.721494 3.916283) (xy -0.719049 3.964296) (xy -0.736425 3.996074) (xy -0.740598 3.999966) (xy -0.787588 4.032411) (xy -0.853688 4.067520) (xy -0.925362 4.098942)
     (xy -0.989076 4.120327) (xy -1.004662 4.123846) (xy -1.057030 4.135816) (xy -1.123271 4.153748) (xy -1.164594 4.166146) (xy -1.261533 4.196629) (xy -1.314132 4.196629) (xy -1.304613 4.192913)
     (xy -1.310740 4.184229) (xy -1.343633 4.171243) (xy -1.385839 4.157949) (xy -1.478955 4.121282) (xy -1.541311 4.077365) (xy -1.571781 4.027115) (xy -1.574800 4.004034) (xy -1.582254 3.978688)
     (xy -1.600690 3.933745) (xy -1.369282 3.933745) (xy -1.365235 3.943454) (xy -1.355983 3.945467) (xy -1.336712 3.939459) (xy -1.290196 3.922508) (xy -1.220643 3.896222) (xy -1.132261 3.862208)
     (xy -1.029260 3.822076) (xy -0.915850 3.777431) (xy -0.907516 3.774134) (xy -0.778560 3.722925) (xy -0.676734 3.681814) (xy -0.597620 3.648589) (xy -0.536800 3.621033) (xy -0.489856 3.596933)
     (xy -0.452369 3.574075) (xy -0.419922 3.550244) (xy -0.388096 3.523225) (xy -0.364815 3.502142) (xy -0.279140 3.412512) (xy -0.203939 3.307794) (xy -0.172485 3.254829) (xy 0.426571 3.254829)
     (xy 0.431997 3.296362) (xy 0.438028 3.318137) (xy 0.452442 3.352984) (xy 0.477248 3.388929) (xy 0.517213 3.431318) (xy 0.577107 3.485496) (xy 0.619826 3.521881) (xy 0.683498 3.573853)
     (xy 0.739441 3.616629) (xy 0.781833 3.645950) (xy 0.804847 3.657560) (xy 0.805489 3.657600) (xy 0.821139 3.647013) (xy 0.828569 3.611694) (xy 0.829734 3.574863) (xy 0.828286 3.536875)
     (xy 1.783334 3.536875) (xy 1.818767 3.573303) (xy 1.865970 3.598791) (xy 1.934192 3.604158) (xy 2.017658 3.589996) (xy 2.110593 3.556896) (xy 2.146638 3.539756) (xy 2.270433 3.491094)
     (xy 2.390949 3.474314) (xy 2.514227 3.488738) (xy 2.540580 3.495541) (xy 2.614321 3.511369) (xy 2.676636 3.515754) (xy 2.697572 3.513542) (xy 2.766666 3.497037) (xy 2.803342 3.479133)
     (xy 2.808924 3.455559) (xy 2.784739 3.422043) (xy 2.738967 3.380145) (xy 2.663330 3.327584) (xy 2.588735 3.297713) (xy 2.522846 3.293414) (xy 2.513483 3.295327) (xy 2.479855 3.293081)
     (xy 2.441758 3.266507) (xy 2.423630 3.248279) (xy 2.391689 3.209880) (xy 2.372868 3.178911) (xy 2.370745 3.170767) (xy 2.362952 3.150839) (xy 2.346691 3.155727) (xy 2.332275 3.182059)
     (xy 2.331894 3.183467) (xy 2.309162 3.212117) (xy 2.286777 3.217334) (xy 2.250591 3.229242) (xy 2.212798 3.258060) (xy 2.211283 3.259667) (xy 2.167584 3.294205) (xy 2.130921 3.298119)
     (xy 2.104459 3.271287) (xy 2.101294 3.263900) (xy 2.079056 3.230125) (xy 2.038957 3.188079) (xy 1.989801 3.145115) (xy 1.940392 3.108585) (xy 1.899536 3.085843) (xy 1.883315 3.081867)
     (xy 1.868039 3.084579) (xy 1.858585 3.096941) (xy 1.853705 3.125290) (xy 1.852153 3.175963) (xy 1.852486 3.238500) (xy 1.851783 3.321663) (xy 1.846512 3.381325) (xy 1.835158 3.427714)
     (xy 1.818767 3.466004) (xy 1.783334 3.536875) (xy 0.828286 3.536875) (xy 0.827796 3.524020) (xy 0.817766 3.494909) (xy 0.793318 3.475440) (xy 0.772141 3.464796) (xy 0.729570 3.446808)
     (xy 0.698961 3.437731) (xy 0.695800 3.437467) (xy 0.676422 3.426059) (xy 0.640050 3.395467) (xy 0.592932 3.351141) (xy 0.566461 3.324678) (xy 0.509899 3.269349) (xy 0.471249 3.237703)
     (xy 0.446994 3.227199) (xy 0.436759 3.231001) (xy 0.426571 3.254829) (xy -0.172485 3.254829) (xy -0.168692 3.248443) (xy -0.133590 3.184627) (xy -0.106616 3.132595) (xy -0.090991 3.098754)
     (xy -0.088622 3.089200) (xy -0.105222 3.093790) (xy -0.149701 3.109599) (xy -0.218494 3.135267) (xy -0.308036 3.169435) (xy -0.414762 3.210741) (xy -0.535106 3.257826) (xy -0.659118 3.306799)
     (xy -1.223411 3.530600) (xy -1.297505 3.722821) (xy -1.331140 3.810866) (xy -1.353482 3.872201) (xy -1.365780 3.911577) (xy -1.369282 3.933745) (xy -1.600690 3.933745) (xy -1.603423 3.927083)
     (xy -1.636517 3.853068) (xy -1.679747 3.760493) (xy -1.731323 3.653208) (xy -1.789456 3.535062) (xy -1.835555 3.443083) (xy -2.096310 2.926782) (xy -2.072276 2.818990) (xy -1.945537 2.818990)
     (xy -1.943627 2.885598) (xy -1.941124 2.925483) (xy -1.937401 2.960398) (xy -1.930783 2.994565) (xy -1.919596 3.032203) (xy -1.902165 3.077535) (xy -1.876814 3.134780) (xy -1.841869 3.208161)
     (xy -1.795656 3.301897) (xy -1.736500 3.420211) (xy -1.712615 3.467834) (xy -1.655710 3.580115) (xy -1.603237 3.681438) (xy -1.557182 3.768143) (xy -1.519534 3.836566) (xy -1.492277 3.883047)
     (xy -1.477399 3.903923) (xy -1.475633 3.904637) (xy -1.464863 3.886362) (xy -1.445340 3.842584) (xy -1.419751 3.779678) (xy -1.390780 3.704020) (xy -1.388039 3.696643) (xy -1.314085 3.497079)
     (xy -1.364862 3.397544) (xy -1.168400 3.397544) (xy -1.156138 3.401365) (xy -1.147233 3.398671) (xy -1.126867 3.390565) (xy -1.078894 3.371530) (xy -1.007194 3.343105) (xy -0.915651 3.306827)
     (xy -0.808144 3.264235) (xy -0.688555 3.216866) (xy -0.608946 3.185339) (xy -0.458475 3.125628) (xy -0.335795 3.076035) (xy -0.286435 3.055057) (xy 3.088419 3.055057) (xy 3.090523 3.065532)
     (xy 3.112680 3.107520) (xy 3.153438 3.162565) (xy 3.205293 3.222152) (xy 3.260737 3.277766) (xy 3.312265 3.320894) (xy 3.320995 3.326975) (xy 3.390611 3.375630) (xy 3.435442 3.413533)
     (xy 3.460403 3.446217) (xy 3.470404 3.479215) (xy 3.471334 3.496299) (xy 3.477264 3.540023) (xy 3.490994 3.568888) (xy 3.507780 3.595720) (xy 3.528350 3.641840) (xy 3.538646 3.669560)
     (xy 3.559946 3.721060) (xy 3.585969 3.751774) (xy 3.628330 3.774070) (xy 3.641752 3.779365) (xy 3.717202 3.802888) (xy 3.775820 3.806538) (xy 3.828129 3.790410) (xy 3.845048 3.781209)
     (xy 3.893788 3.752417) (xy 3.833370 3.641509) (xy 3.796203 3.579664) (xy 3.756888 3.524221) (xy 3.724000 3.487249) (xy 3.692909 3.456401) (xy 3.684130 3.431005) (xy 3.693290 3.395659)
     (xy 3.695953 3.388514) (xy 3.707852 3.349081) (xy 3.702669 3.325941) (xy 3.683993 3.309099) (xy 3.641024 3.290153) (xy 3.607000 3.285067) (xy 3.559269 3.269103) (xy 3.501003 3.221408)
     (xy 3.495937 3.216267) (xy 3.447030 3.170149) (xy 3.396855 3.129153) (xy 3.373967 3.113286) (xy 3.336149 3.083752) (xy 3.321001 3.049010) (xy 3.318934 3.014826) (xy 3.325517 2.965420)
     (xy 3.342062 2.931586) (xy 3.344334 2.929467) (xy 3.367667 2.896418) (xy 3.357397 2.863313) (xy 3.327996 2.838281) (xy 3.283859 2.815770) (xy 3.247743 2.817079) (xy 3.209862 2.844420)
     (xy 3.185538 2.870429) (xy 3.130455 2.942132) (xy 3.097269 3.005343) (xy 3.088419 3.055057) (xy -0.286435 3.055057) (xy -0.237236 3.034148) (xy -0.159126 2.997553) (xy -0.097795 2.963840)
     (xy -0.049570 2.930595) (xy -0.010780 2.895407) (xy 0.022246 2.855862) (xy 0.053179 2.809549) (xy 0.059925 2.798034) (xy 3.721892 2.798034) (xy 3.728523 2.824039) (xy 3.753151 2.862382)
     (xy 3.772784 2.888272) (xy 3.835400 2.968900) (xy 3.840992 2.911492) (xy 3.836996 2.859159) (xy 3.814452 2.828066) (xy 3.781778 2.795061) (xy 3.766096 2.773057) (xy 3.751891 2.753709)
     (xy 3.738565 2.762784) (xy 3.730020 2.775855) (xy 3.721892 2.798034) (xy 0.059925 2.798034) (xy 0.085691 2.754055) (xy 0.108154 2.714154) (xy 0.150945 2.635445) (xy 0.176134 2.582343)
     (xy 0.184645 2.552100) (xy 0.177401 2.541973) (xy 0.165100 2.544710) (xy 0.144938 2.552670) (xy 0.096968 2.571618) (xy 0.024881 2.600097) (xy -0.067632 2.636648) (xy -0.176883 2.679814)
     (xy -0.299181 2.728137) (xy -0.423333 2.777193) (xy -0.554482 2.829012) (xy -0.675998 2.877017) (xy -0.784203 2.919757) (xy -0.875422 2.955779) (xy -0.945978 2.983633) (xy -0.992194 3.001865)
     (xy -1.010190 3.008945) (xy -1.021485 3.025887) (xy -1.041383 3.067023) (xy -1.066793 3.124765) (xy -1.094626 3.191522) (xy -1.121791 3.259706) (xy -1.145199 3.321727) (xy -1.161761 3.369996)
     (xy -1.168385 3.396922) (xy -1.168400 3.397544) (xy -1.364862 3.397544) (xy -1.584127 2.967739) (xy -1.647255 2.844644) (xy -1.705823 2.731687) (xy -1.758008 2.632285) (xy -1.801987 2.549860)
     (xy -1.835940 2.487830) (xy -1.858042 2.449615) (xy -1.866231 2.438400) (xy -1.877828 2.453040) (xy -1.891704 2.489439) (xy -1.895271 2.501900) (xy -1.924102 2.621908) (xy -1.940339 2.723490)
     (xy -1.945537 2.818990) (xy -2.072276 2.818990) (xy -2.065460 2.788424) (xy -2.050100 2.719178) (xy -2.029951 2.627829) (xy -2.007431 2.525366) (xy -1.984959 2.422777) (xy -1.980972 2.404534)
     (xy -1.961653 2.316969) (xy -1.944481 2.240025) (xy -1.811962 2.240025) (xy -1.808109 2.266081) (xy -1.795808 2.305406) (xy -1.773863 2.360681) (xy -1.741073 2.434587) (xy -1.696239 2.529805)
     (xy -1.638163 2.649018) (xy -1.565645 2.794907) (xy -1.548833 2.828458) (xy -1.486873 2.951174) (xy -1.429293 3.063692) (xy -1.377922 3.162555) (xy -1.334586 3.244309) (xy -1.301114 3.305499)
     (xy -1.279334 3.342668) (xy -1.271444 3.352800) (xy -1.260181 3.337911) (xy -1.240369 3.297454) (xy -1.214881 3.237746) (xy -1.188707 3.170767) (xy -1.120325 2.988734) (xy -1.184046 2.863180)
     (xy -0.965200 2.863180) (xy -0.952503 2.878418) (xy -0.949742 2.878667) (xy -0.930984 2.872640) (xy -0.884345 2.855480) (xy -0.813416 2.828570) (xy -0.721785 2.793291) (xy -0.613041 2.751027)
     (xy -0.490775 2.703159) (xy -0.358575 2.651069) (xy -0.352842 2.648803) (xy -0.192797 2.585172) (xy -0.061560 2.532111) (xy 0.043775 2.488320) (xy 0.126120 2.452497) (xy 0.188382 2.423343)
     (xy 0.233470 2.399558) (xy 0.264294 2.379839) (xy 0.281585 2.365170) (xy 0.305643 2.335342) (xy 0.337630 2.288442) (xy 0.342185 2.281201) (xy 0.477138 2.281201) (xy 0.482549 2.294282)
     (xy 0.505668 2.291516) (xy 0.534434 2.295888) (xy 0.546682 2.319519) (xy 0.556162 2.355768) (xy 0.624540 2.320884) (xy 0.672756 2.299452) (xy 0.712451 2.287150) (xy 0.722134 2.286000)
     (xy 0.754825 2.297006) (xy 0.789681 2.322009) (xy 0.828796 2.349663) (xy 0.856407 2.347291) (xy 0.873298 2.314082) (xy 0.880255 2.249225) (xy 0.880534 2.228091) (xy 0.884557 2.151808)
     (xy 0.894903 2.072740) (xy 0.904207 2.028593) (xy 0.918572 1.974026) (xy 0.929828 1.931055) (xy 0.933840 1.915584) (xy 0.923726 1.893945) (xy 0.889000 1.875371) (xy 0.839625 1.851097)
     (xy 0.794737 1.818026) (xy 0.751273 1.777610) (xy 0.670215 1.931348) (xy 0.628143 2.016057) (xy 0.604120 2.077199) (xy 0.596648 2.118861) (xy 0.597634 2.129436) (xy 0.599995 2.183710)
     (xy 0.580901 2.212547) (xy 0.554622 2.218267) (xy 0.516736 2.230992) (xy 0.497705 2.247900) (xy 0.477138 2.281201) (xy 0.342185 2.281201) (xy 0.373756 2.231015) (xy 0.410233 2.169608)
     (xy 0.443270 2.110767) (xy 0.469078 2.061039) (xy 0.483867 2.026968) (xy 0.484257 2.015067) (xy 0.464441 2.021200) (xy 0.417363 2.038516) (xy 0.347071 2.065393) (xy 0.257611 2.100208)
     (xy 0.153029 2.141337) (xy 0.037371 2.187159) (xy -0.085316 2.236050) (xy -0.210986 2.286386) (xy -0.335591 2.336547) (xy -0.455087 2.384907) (xy -0.565427 2.429845) (xy -0.662563 2.469737)
     (xy -0.742450 2.502961) (xy -0.801042 2.527894) (xy -0.834291 2.542913) (xy -0.840243 2.546287) (xy -0.853554 2.569154) (xy -0.874392 2.614839) (xy -0.899145 2.674178) (xy -0.924198 2.738009)
     (xy -0.945938 2.797167) (xy -0.960752 2.842489) (xy -0.965200 2.863180) (xy -1.184046 2.863180) (xy -1.410372 2.417234) (xy -1.475924 2.289032) (xy -1.537284 2.170862) (xy -1.592668 2.066025)
     (xy -1.640289 1.977822) (xy -1.678364 1.909552) (xy -1.705106 1.864517) (xy -1.718730 1.846018) (xy -1.719478 1.845734) (xy -1.730940 1.861172) (xy -1.745969 1.902365) (xy -1.762763 1.961627)
     (xy -1.779520 2.031276) (xy -1.794437 2.103626) (xy -1.805711 2.170994) (xy -1.811541 2.225696) (xy -1.811962 2.240025) (xy -1.944481 2.240025) (xy -1.936572 2.204593) (xy -1.907573 2.075595)
     (xy -1.876500 1.938166) (xy -1.845198 1.800496) (xy -1.827267 1.722027) (xy -1.803745 1.618538) (xy -1.676400 1.618538) (xy -1.669219 1.648847) (xy -1.648958 1.702988) (xy -1.617536 1.777134)
     (xy -1.576873 1.867457) (xy -1.528889 1.970129) (xy -1.475504 2.081323) (xy -1.418639 2.197211) (xy -1.360212 2.313966) (xy -1.302145 2.427759) (xy -1.246358 2.534764) (xy -1.194769 2.631153)
     (xy -1.149300 2.713097) (xy -1.111871 2.776770) (xy -1.084401 2.818343) (xy -1.068810 2.833989) (xy -1.066996 2.833405) (xy -1.055712 2.812097) (xy -1.036275 2.767097) (xy -1.012125 2.706533)
     (xy -1.001345 2.678253) (xy -0.977578 2.613067) (xy -0.959311 2.559182) (xy -0.949324 2.524969) (xy -0.948267 2.518456) (xy -0.955763 2.500133) (xy -0.976924 2.455669) (xy -1.009754 2.388955)
     (xy -1.046387 2.315634) (xy -0.761943 2.315634) (xy -0.758369 2.318393) (xy -0.745777 2.316852) (xy -0.721549 2.310042) (xy -0.683065 2.296989) (xy -0.627707 2.276723) (xy -0.552855 2.248272)
     (xy -0.455891 2.210665) (xy -0.334195 2.162931) (xy -0.185149 2.104098) (xy -0.089132 2.066089) (xy 0.072838 2.001739) (xy 0.206315 1.948188) (xy 0.314396 1.904031) (xy 0.400180 1.867868)
     (xy 0.466767 1.838296) (xy 0.517255 1.813913) (xy 0.554743 1.793317) (xy 0.582330 1.775105) (xy 0.603114 1.757875) (xy 0.612500 1.748589) (xy 0.649866 1.703844) (xy 0.690470 1.646006)
     (xy 0.731135 1.580980) (xy 0.768682 1.514669) (xy 0.799934 1.452979) (xy 0.821711 1.401813) (xy 0.830837 1.367078) (xy 0.824534 1.354667) (xy 0.808232 1.360723) (xy 0.763615 1.378063)
     (xy 0.693832 1.405444) (xy 0.602032 1.441623) (xy 0.491366 1.485358) (xy 0.364982 1.535405) (xy 0.226029 1.590522) (xy 0.101991 1.639793) (xy -0.615353 1.924920) (xy -0.688620 2.118160)
     (xy -0.716745 2.192654) (xy -0.739882 2.254538) (xy -0.755715 2.297569) (xy -0.761926 2.315507) (xy -0.761943 2.315634) (xy -1.046387 2.315634) (xy -1.052260 2.303881) (xy -1.102447 2.204337)
     (xy -1.158322 2.094212) (xy -1.217890 1.977395) (xy -1.279157 1.857778) (xy -1.340129 1.739249) (xy -1.398812 1.625699) (xy -1.453211 1.521017) (xy -1.501334 1.429093) (xy -1.541185 1.353817)
     (xy -1.570770 1.299078) (xy -1.588095 1.268766) (xy -1.591245 1.264247) (xy -1.600408 1.272856) (xy -1.613561 1.307301) (xy -1.628894 1.360054) (xy -1.644599 1.423585) (xy -1.658864 1.490365)
     (xy -1.669880 1.552865) (xy -1.675838 1.603554) (xy -1.676400 1.618538) (xy -1.803745 1.618538) (xy -1.800503 1.604276) (xy -1.776440 1.496722) (xy -1.756078 1.403975) (xy -1.740419 1.330647)
     (xy -1.730464 1.281349) (xy -1.727200 1.261017) (xy -1.732356 1.248909) (xy -1.750689 1.244515) (xy -1.786495 1.248456) (xy -1.844069 1.261355) (xy -1.927709 1.283835) (xy -1.972733 1.296595)
     (xy -2.106834 1.339470) (xy -2.232646 1.388224) (xy -2.343425 1.439798) (xy -2.432430 1.491132) (xy -2.479562 1.526507) (xy -2.522782 1.560622) (xy -2.557427 1.580909) (xy -2.573573 1.583448)
     (xy -2.590497 1.554516) (xy -2.587998 1.505479) (xy -2.568567 1.442056) (xy -2.534694 1.369967) (xy -2.488867 1.294929) (xy -2.433576 1.222662) (xy -2.401086 1.187234) (xy -2.302607 1.099599)
     (xy -2.180889 1.011178) (xy -2.045734 0.928596) (xy -2.038078 0.924654) (xy -1.507067 0.924654) (xy -1.507067 1.038289) (xy -1.189700 1.662145) (xy -1.121285 1.796160) (xy -1.057443 1.920308)
     (xy -0.999831 2.031438) (xy -0.950101 2.126401) (xy -0.909909 2.202048) (xy -0.880908 2.255227) (xy -0.864752 2.282790) (xy -0.862078 2.286000) (xy -0.852613 2.271082) (xy -0.834303 2.230409)
     (xy -0.809741 2.170102) (xy -0.781519 2.096283) (xy -0.780056 2.092341) (xy -0.708291 1.898682) (xy -0.764916 1.788559) (xy -0.556996 1.788559) (xy -0.554476 1.794526) (xy -0.552268 1.794934)
     (xy -0.535671 1.788868) (xy -0.490859 1.771525) (xy -0.421070 1.744181) (xy -0.329541 1.708114) (xy -0.219511 1.664602) (xy -0.094218 1.614921) (xy 0.043100 1.560350) (xy 0.136361 1.523225)
     (xy 0.302860 1.456762) (xy 0.440995 1.401199) (xy 0.553938 1.355088) (xy 0.644863 1.316984) (xy 0.716941 1.285441) (xy 0.773345 1.259014) (xy 0.817248 1.236254) (xy 0.851821 1.215718)
     (xy 0.880238 1.195958) (xy 0.905671 1.175529) (xy 0.912996 1.169225) (xy 0.973898 1.106508) (xy 1.033696 1.028049) (xy 1.087709 0.941981) (xy 1.131256 0.856436) (xy 1.159655 0.779547)
     (xy 1.168400 0.725493) (xy 1.167425 0.684097) (xy 1.165000 0.661841) (xy 1.164167 0.660607) (xy 1.148075 0.666703) (xy 1.103561 0.684104) (xy 1.033676 0.711604) (xy 0.941469 0.747999)
     (xy 0.829990 0.792083) (xy 0.702289 0.842652) (xy 0.561416 0.898499) (xy 0.410420 0.958420) (xy 0.397934 0.963378) (xy -0.364067 1.265943) (xy -0.460789 1.517738) (xy -0.499178 1.618093)
     (xy -0.526602 1.691135) (xy -0.544451 1.741081) (xy -0.554118 1.772150) (xy -0.556996 1.788559) (xy -0.764916 1.788559) (xy -1.061112 1.212535) (xy -1.148753 1.042695) (xy -1.222425 0.901331)
     (xy -1.283179 0.786563) (xy -1.332065 0.696513) (xy -1.370132 0.629302) (xy -1.398433 0.583053) (xy -1.418017 0.555885) (xy -1.429936 0.545922) (xy -1.433371 0.546828) (xy -1.450083 0.578960)
     (xy -1.467303 0.636073) (xy -1.483312 0.709356) (xy -1.496391 0.789998) (xy -1.504823 0.869187) (xy -1.507067 0.924654) (xy -2.038078 0.924654) (xy -1.931004 0.869529) (xy -1.852793 0.831264)
     (xy -1.769629 0.788158) (xy -1.699313 0.749443) (xy -1.698367 0.748896) (xy -1.593335 0.688167) (xy -1.542229 0.475317) (xy -1.525275 0.403629) (xy -1.502385 0.305248) (xy -1.501011 0.299286)
     (xy -1.356125 0.299286) (xy -1.354677 0.322380) (xy -1.351645 0.353959) (xy -1.347320 0.383583) (xy -1.340302 0.414425) (xy -1.329190 0.449656) (xy -1.312586 0.492449) (xy -1.289089 0.545975)
     (xy -1.257299 0.613406) (xy -1.215816 0.697914) (xy -1.163241 0.802671) (xy -1.098174 0.930849) (xy -1.019215 1.085619) (xy -1.009037 1.105547) (xy -0.938596 1.242972) (xy -0.872689 1.370608)
     (xy -0.812937 1.485386) (xy -0.760958 1.584239) (xy -0.718372 1.664099) (xy -0.686800 1.721897) (xy -0.667861 1.754565) (xy -0.663080 1.760870) (xy -0.653655 1.745785) (xy -0.634945 1.704292)
     (xy -0.609219 1.641817) (xy -0.578743 1.563787) (xy -0.560211 1.514684) (xy -0.528519 1.428322) (xy -0.501570 1.352272) (xy -0.481427 1.292571) (xy -0.470158 1.255257) (xy -0.468489 1.246583)
     (xy -0.475985 1.227909) (xy -0.497238 1.182815) (xy -0.526533 1.122833) (xy -0.300725 1.122833) (xy -0.298107 1.131324) (xy -0.290986 1.132391) (xy -0.280304 1.129065) (xy -0.277701 1.128094)
     (xy -0.255669 1.119500) (xy -0.205504 1.099716) (xy -0.130546 1.070066) (xy -0.034132 1.031872) (xy 0.080401 0.986458) (xy 0.209712 0.935145) (xy 0.350465 0.879258) (xy 0.460744 0.835448)
     (xy 1.167022 0.554811) (xy 1.347501 0.361505) (xy 1.405355 0.298883) (xy 1.452870 0.245022) (xy 1.493837 0.194363) (xy 1.532045 0.141347) (xy 1.571286 0.080412) (xy 1.615350 0.005999)
     (xy 1.668028 -0.087451) (xy 1.729190 -0.198357) (xy 1.784707 -0.300108) (xy 1.834358 -0.392277) (xy 1.875921 -0.470647) (xy 1.907177 -0.531001) (xy 1.925908 -0.569124) (xy 1.930400 -0.580602)
     (xy 1.918427 -0.589865) (xy 1.909234 -0.587702) (xy 1.889794 -0.579979) (xy 1.841895 -0.561013) (xy 1.768573 -0.532007) (xy 1.672866 -0.494162) (xy 1.557813 -0.448677) (xy 1.426450 -0.396755)
     (xy 1.281815 -0.339597) (xy 1.126947 -0.278403) (xy 1.075267 -0.257984) (xy 0.914485 -0.194452) (xy 0.760314 -0.133515) (xy 0.616195 -0.076536) (xy 0.485571 -0.024876) (xy 0.371884 0.020104)
     (xy 0.278576 0.057041) (xy 0.209089 0.084575) (xy 0.166863 0.101343) (xy 0.161355 0.103540) (xy 0.060243 0.143934) (xy -0.113835 0.601134) (xy -0.169114 0.746394) (xy -0.213297 0.863029)
     (xy -0.247325 0.954067) (xy -0.272139 1.022538) (xy -0.288683 1.071470) (xy -0.297898 1.103892) (xy -0.300725 1.122833) (xy -0.526533 1.122833) (xy -0.530391 1.114935) (xy -0.573589 1.027903)
     (xy -0.624975 0.925353) (xy -0.682693 0.810919) (xy -0.744888 0.688234) (xy -0.809704 0.560933) (xy -0.875285 0.432650) (xy -0.939774 0.307018) (xy -1.001317 0.187671) (xy -1.058057 0.078243)
     (xy -1.108139 -0.017631) (xy -1.149705 -0.096319) (xy -1.180902 -0.154187) (xy -1.199872 -0.187599) (xy -1.204261 -0.194075) (xy -1.226769 -0.195856) (xy -1.255369 -0.174557) (xy -1.282121 -0.131916)
     (xy -1.307097 -0.063695) (xy -1.328641 0.021822) (xy -1.345098 0.116348) (xy -1.354811 0.211598) (xy -1.356125 0.299286) (xy -1.501011 0.299286) (xy -1.475018 0.186530) (xy -1.444633 0.053832)
     (xy -1.412688 -0.086490) (xy -1.380643 -0.228080) (xy -1.372892 -0.262466) (xy -1.340919 -0.404419) (xy -1.308668 -0.547612) (xy -1.277615 -0.685483) (xy -1.252603 -0.796534) (xy -1.154726 -0.796534)
     (xy -1.131074 -0.279400) (xy -0.834166 0.304800) (xy -0.743632 0.482734) (xy -0.667080 0.632639) (xy -0.603292 0.756749) (xy -0.551051 0.857298) (xy -0.509137 0.936520) (xy -0.476333 0.996650)
     (xy -0.451420 1.039921) (xy -0.433179 1.068568) (xy -0.420393 1.084826) (xy -0.411842 1.090927) (xy -0.406395 1.089204) (xy -0.397442 1.070418) (xy -0.378158 1.023923) (xy -0.350118 0.953716)
     (xy -0.314894 0.863793) (xy -0.274060 0.758151) (xy -0.229191 0.640788) (xy -0.210972 0.592794) (xy -0.028188 0.110320) (xy -0.478705 -0.778454) (xy -0.560501 -0.939446) (xy -0.606921 -1.030378)
     (xy -0.558800 -1.030378) (xy -0.548928 -0.996014) (xy -0.522597 -0.943530) (xy -0.484732 -0.881067) (xy -0.440257 -0.816767) (xy -0.395368 -0.760233) (xy -0.349691 -0.698750) (xy -0.292255 -0.606477)
     (xy -0.223524 -0.484205) (xy -0.143962 -0.332729) (xy -0.135466 -0.316080) (xy -0.084238 -0.216817) (xy -0.037326 -0.128497) (xy 0.002912 -0.055353) (xy 0.034117 -0.001615) (xy 0.053934 0.028485)
     (xy 0.059267 0.033445) (xy 0.077739 0.027421) (xy 0.124789 0.009993) (xy 0.197527 -0.017717) (xy 0.293066 -0.054587) (xy 0.408518 -0.099494) (xy 0.540995 -0.151316) (xy 0.687608 -0.208932)
     (xy 0.845470 -0.271219) (xy 0.956734 -0.315260) (xy 1.122013 -0.380695) (xy 1.279140 -0.442767) (xy 1.425056 -0.500280) (xy 1.556707 -0.552035) (xy 1.671036 -0.596832) (xy 1.764987 -0.633475)
     (xy 1.835504 -0.660764) (xy 1.879532 -0.677502) (xy 1.892300 -0.682092) (xy 1.929243 -0.697059) (xy 1.947045 -0.710125) (xy 1.947334 -0.711390) (xy 1.939788 -0.731033) (xy 1.918253 -0.777182)
     (xy 1.884382 -0.846637) (xy 1.839826 -0.936202) (xy 1.786238 -1.042679) (xy 1.725271 -1.162868) (xy 1.658576 -1.293574) (xy 1.587807 -1.431597) (xy 1.514615 -1.573739) (xy 1.440654 -1.716804)
     (xy 1.367574 -1.857592) (xy 1.297030 -1.992906) (xy 1.230673 -2.119548) (xy 1.170156 -2.234319) (xy 1.117130 -2.334023) (xy 1.073249 -2.415461) (xy 1.040165 -2.475434) (xy 1.019530 -2.510746)
     (xy 1.013266 -2.519116) (xy 0.992751 -2.514113) (xy 0.944534 -2.497870) (xy 0.872338 -2.471774) (xy 0.779882 -2.437217) (xy 0.670890 -2.395586) (xy 0.549083 -2.348271) (xy 0.432139 -2.302200)
     (xy 0.274604 -2.240348) (xy 0.140593 -2.189011) (xy 0.031556 -2.148706) (xy -0.051053 -2.119952) (xy -0.105785 -2.103267) (xy -0.131188 -2.099172) (xy -0.132826 -2.100277) (xy -0.151750 -2.130587)
     (xy -0.189104 -2.174100) (xy -0.236834 -2.222911) (xy -0.286885 -2.269118) (xy -0.331202 -2.304815) (xy -0.357309 -2.320574) (xy -0.404309 -2.332979) (xy -0.447089 -2.323603) (xy -0.452980 -2.321012)
     (xy -0.498035 -2.300484) (xy -0.442912 -2.273788) (xy -0.372397 -2.223356) (xy -0.303570 -2.143464) (xy -0.238457 -2.038515) (xy -0.179086 -1.912915) (xy -0.127482 -1.771067) (xy -0.085672 -1.617376)
     (xy -0.055682 -1.456245) (xy -0.051127 -1.422286) (xy -0.042742 -1.343226) (xy -0.037435 -1.268775) (xy -0.035961 -1.210842) (xy -0.036684 -1.194070) (xy -0.042333 -1.126607) (xy -0.300567 -1.086244)
     (xy -0.389321 -1.071422) (xy -0.464907 -1.056989) (xy -0.521608 -1.044182) (xy -0.553704 -1.034237) (xy -0.558800 -1.030378) (xy -0.606921 -1.030378) (xy -0.637973 -1.091203) (xy -0.709739 -1.231069)
     (xy -0.774419 -1.356385) (xy -0.830630 -1.464492) (xy -0.876991 -1.552732) (xy -0.912119 -1.618446) (xy -0.934634 -1.658976) (xy -0.942978 -1.671726) (xy -0.950180 -1.657123) (xy -0.963486 -1.613667)
     (xy -0.981799 -1.545594) (xy -1.004021 -1.457144) (xy -1.029054 -1.352554) (xy -1.055729 -1.236378) (xy -1.154726 -0.796534) (xy -1.252603 -0.796534) (xy -1.249238 -0.811473) (xy -1.225015 -0.919019)
     (xy -1.206424 -1.001562) (xy -1.203172 -1.016000) (xy -1.183636 -1.102646) (xy -1.166171 -1.179939) (xy -1.152430 -1.240574) (xy -1.144066 -1.277249) (xy -1.143031 -1.281723) (xy -1.142448 -1.299448)
     (xy -1.152917 -1.316427) (xy -1.179280 -1.336213) (xy -1.226384 -1.362360) (xy -1.299070 -1.398421) (xy -1.308022 -1.402753) (xy -1.585601 -1.555158) (xy -1.842341 -1.733070) (xy -2.077006 -1.934422)
     (xy -2.288356 -2.157148) (xy -2.475156 -2.399181) (xy -2.636166 -2.658455) (xy -2.770150 -2.932903) (xy -2.875869 -3.220461) (xy -2.952087 -3.519060) (xy -2.997565 -3.826634) (xy -3.007828 -4.065708)
     (xy -0.982133 -4.065708) (xy -0.980310 -4.040664) (xy -0.975060 -3.985104) (xy -0.966715 -3.902170) (xy -0.955606 -3.795003) (xy -0.942064 -3.666746) (xy -0.926421 -3.520539) (xy -0.909008 -3.359524)
     (xy -0.890156 -3.186843) (xy -0.873795 -3.038190) (xy -0.853716 -2.855735) (xy -0.834560 -2.680361) (xy -0.816691 -2.515498) (xy -0.800475 -2.364570) (xy -0.786276 -2.231007) (xy -0.774459 -2.118234)
     (xy -0.765390 -2.029679) (xy -0.759433 -1.968769) (xy -0.757219 -1.943193) (xy -0.748981 -1.828986) (xy -0.814757 -1.809279) (xy -0.855860 -1.795235) (xy -0.878804 -1.784036) (xy -0.880533 -1.781734)
     (xy -0.873230 -1.763026) (xy -0.853760 -1.722791) (xy -0.825780 -1.667899) (xy -0.792946 -1.605218) (xy -0.758915 -1.541617) (xy -0.727345 -1.483963) (xy -0.701893 -1.439125) (xy -0.686215 -1.413972)
     (xy -0.683122 -1.410967) (xy -0.682582 -1.429219) (xy -0.686170 -1.472867) (xy -0.693154 -1.533790) (xy -0.696471 -1.559218) (xy -0.705481 -1.659215) (xy -0.708152 -1.769741) (xy -0.704926 -1.881385)
     (xy -0.696244 -1.984738) (xy -0.682548 -2.070389) (xy -0.670424 -2.114195) (xy -0.664826 -2.131199) (xy -0.660584 -2.149832) (xy -0.657928 -2.172903) (xy -0.657086 -2.203219) (xy -0.658286 -2.243587)
     (xy -0.661757 -2.296816) (xy -0.667726 -2.365712) (xy -0.676421 -2.453085) (xy -0.688072 -2.561741) (xy -0.702906 -2.694488) (xy -0.721151 -2.854134) (xy -0.743036 -3.043486) (xy -0.752835 -3.127957)
     (xy -0.773209 -3.302562) (xy -0.792592 -3.466886) (xy -0.810610 -3.617885) (xy -0.826890 -3.752517) (xy -0.841059 -3.867738) (xy -0.852744 -3.960505) (xy -0.861572 -4.027775) (xy -0.867171 -4.066505)
     (xy -0.868939 -4.074984) (xy -0.888504 -4.084036) (xy -0.926408 -4.096448) (xy -0.929033 -4.097207) (xy -0.965309 -4.105312) (xy -0.979630 -4.096578) (xy -0.982133 -4.065708) (xy -3.007828 -4.065708)
     (xy -3.011066 -4.141119) (xy -3.008477 -4.241800) (xy -2.978611 -4.564140) (xy -2.916984 -4.874943) (xy -2.823947 -5.173420) (xy -2.699855 -5.458783) (xy -2.545061 -5.730243) (xy -2.359918 -5.987011)
     (xy -2.144779 -6.228300) (xy -2.096966 -6.275816) (xy -2.004462 -6.364564) (xy -1.929226 -6.432458) (xy -1.865290 -6.483281) (xy -1.806687 -6.520816) (xy -1.747447 -6.548847) (xy -1.681605 -6.571158)
     (xy -1.603191 -6.591533) (xy -1.596466 -6.593129) (xy -1.263757 -6.664283) (xy -0.943267 -6.716726) (xy -0.620443 -6.752492) (xy -0.317500 -6.772032) (xy 0.162342 -6.777770) (xy 0.635214 -6.750964) )(layer F.SilkS) (width  0.010000)
  )
  (fp_poly (pts (xy -4.299488 5.893924) (xy -4.280981 5.907439) (xy -4.267290 5.921110) (xy -4.258266 5.939413) (xy -4.253758 5.966821) (xy -4.253615 6.007810) (xy -4.257687 6.066854) (xy -4.265824 6.148430)
     (xy -4.277876 6.257011) (xy -4.285135 6.321172) (xy -4.298993 6.442945) (xy -4.310170 6.534704) (xy -4.319899 6.600075) (xy -4.329414 6.642684) (xy -4.339949 6.666158) (xy -4.352738 6.674121)
     (xy -4.369015 6.670201) (xy -4.390014 6.658022) (xy -4.398027 6.652913) (xy -4.428788 6.631402) (xy -4.444031 6.610102) (xy -4.447663 6.577780) (xy -4.443591 6.523199) (xy -4.443492 6.522161)
     (xy -4.434331 6.426200) (xy -4.597667 6.309647) (xy -4.761004 6.193093) (xy -4.842827 6.231417) (xy -4.924649 6.269741) (xy -4.980362 6.230070) (xy -5.036074 6.190399) (xy -4.924425 6.136549)
     (xy -4.654921 6.136549) (xy -4.541959 6.217874) (xy -4.488548 6.255428) (xy -4.445815 6.283801) (xy -4.420953 6.298274) (xy -4.418013 6.299200) (xy -4.409927 6.283990) (xy -4.400901 6.244904)
     (xy -4.395569 6.210300) (xy -4.386679 6.143936) (xy -4.377508 6.079368) (xy -4.374125 6.056868) (xy -4.364141 5.992337) (xy -4.654921 6.136549) (xy -4.924425 6.136549) (xy -4.348710 5.858875)
     (xy -4.299488 5.893924) )(layer F.SilkS) (width  0.010000)
  )
  (fp_poly (pts (xy 4.551606 5.788014) (xy 4.583848 5.824763) (xy 4.625943 5.879262) (xy 4.674077 5.945884) (xy 4.724435 6.019002) (xy 4.773202 6.092988) (xy 4.816563 6.162215) (xy 4.850706 6.221054)
     (xy 4.871814 6.263878) (xy 4.876800 6.281797) (xy 4.873021 6.307803) (xy 4.859322 6.334634) (xy 4.832156 6.365649) (xy 4.787981 6.404211) (xy 4.723250 6.453680) (xy 4.634419 6.517418)
     (xy 4.610768 6.534056) (xy 4.518072 6.596547) (xy 4.446676 6.638147) (xy 4.392543 6.660435) (xy 4.351635 6.664990) (xy 4.319915 6.653391) (xy 4.314925 6.649753) (xy 4.295763 6.628831)
     (xy 4.261104 6.585397) (xy 4.214923 6.524647) (xy 4.161196 6.451778) (xy 4.123685 6.399780) (xy 3.960920 6.172200) (xy 4.008227 6.134184) (xy 4.041982 6.108976) (xy 4.063495 6.096402)
     (xy 4.065089 6.096084) (xy 4.077608 6.109183) (xy 4.105820 6.145353) (xy 4.146151 6.199812) (xy 4.195027 6.267779) (xy 4.223078 6.307505) (xy 4.275633 6.381613) (xy 4.322090 6.445664)
     (xy 4.358688 6.494586) (xy 4.381668 6.523307) (xy 4.386911 6.528528) (xy 4.407270 6.523822) (xy 4.446984 6.502254) (xy 4.499660 6.468498) (xy 4.558900 6.427230) (xy 4.618310 6.383123)
     (xy 4.671493 6.340851) (xy 4.712055 6.305091) (xy 4.733599 6.280514) (xy 4.735259 6.273928) (xy 4.722855 6.252926) (xy 4.694371 6.209865) (xy 4.653500 6.150181) (xy 4.603938 6.079307)
     (xy 4.579314 6.044550) (xy 4.431832 5.837225) (xy 4.472283 5.806123) (xy 4.507736 5.783571) (xy 4.533032 5.774643) (xy 4.551606 5.788014) )(layer F.SilkS) (width  0.010000)
  )
  (fp_poly (pts (xy 5.444218 5.012409) (xy 5.487248 5.052833) (xy 5.275500 5.266481) (xy 5.662612 5.654695) (xy 5.622355 5.697548) (xy 5.590345 5.726308) (xy 5.565691 5.739578) (xy 5.563882 5.739689)
     (xy 5.546574 5.727714) (xy 5.510619 5.695110) (xy 5.460386 5.646094) (xy 5.400242 5.584882) (xy 5.360997 5.543824) (xy 5.176327 5.348671) (xy 5.068137 5.455636) (xy 4.959947 5.562600)
     (xy 4.927241 5.520267) (xy 4.905668 5.488524) (xy 4.898356 5.469819) (xy 4.898483 5.469467) (xy 4.911228 5.455590) (xy 4.944554 5.421700) (xy 4.994809 5.371444) (xy 5.058343 5.308467)
     (xy 5.131504 5.236416) (xy 5.151809 5.216493) (xy 5.401189 4.971985) (xy 5.444218 5.012409) )(layer F.SilkS) (width  0.010000)
  )
  (fp_poly (pts (xy -5.126567 5.195226) (xy -5.041191 5.281918) (xy -4.978501 5.349280) (xy -4.937197 5.401895) (xy -4.915979 5.444341) (xy -4.913547 5.481201) (xy -4.928603 5.517053) (xy -4.959846 5.556480)
     (xy -5.005977 5.604062) (xy -5.009557 5.607643) (xy -5.063109 5.659063) (xy -5.106662 5.691831) (xy -5.145829 5.704974) (xy -5.186226 5.697517) (xy -5.233466 5.668488) (xy -5.293162 5.616913)
     (xy -5.367012 5.545667) (xy -5.428172 5.486675) (xy -5.481380 5.437404) (xy -5.521737 5.402241) (xy -5.544343 5.385572) (xy -5.546674 5.384808) (xy -5.565033 5.396768) (xy -5.597727 5.428082)
     (xy -5.636880 5.471070) (xy -5.711159 5.557323) (xy -5.816047 5.452435) (xy -5.656055 5.292052) (xy -5.452533 5.292052) (xy -5.441170 5.309793) (xy -5.411098 5.344569) (xy -5.368341 5.390308)
     (xy -5.318923 5.440939) (xy -5.268868 5.490392) (xy -5.224200 5.532595) (xy -5.190945 5.561478) (xy -5.175667 5.571067) (xy -5.158225 5.560847) (xy -5.125181 5.534930) (xy -5.105989 5.518513)
     (xy -5.070416 5.483528) (xy -5.048975 5.455201) (xy -5.046133 5.446921) (xy -5.057551 5.427546) (xy -5.087774 5.391367) (xy -5.130755 5.344519) (xy -5.180448 5.293136) (xy -5.230805 5.243353)
     (xy -5.275780 5.201306) (xy -5.309326 5.173129) (xy -5.324330 5.164667) (xy -5.347523 5.176350) (xy -5.381737 5.204889) (xy -5.417142 5.240520) (xy -5.443911 5.273475) (xy -5.452533 5.292052)
     (xy -5.656055 5.292052) (xy -5.579257 5.215067) (xy -5.342467 4.977700) (xy -5.126567 5.195226) )(layer F.SilkS) (width  0.010000)
  )
  (fp_poly (pts (xy 4.633327 4.916014) (xy 4.636271 4.935861) (xy 4.610563 4.973082) (xy 4.556302 5.027491) (xy 4.525433 5.055067) (xy 4.479849 5.093873) (xy 4.450157 5.117270) (xy 4.439976 5.122535)
     (xy 4.444801 5.115783) (xy 4.472866 5.077608) (xy 4.505831 5.024930) (xy 4.521001 4.998009) (xy 4.560448 4.939717) (xy 4.597935 4.914422) (xy 4.601633 4.913722) (xy 4.633327 4.916014) )(layer F.SilkS) (width  0.010000)
  )
  (fp_poly (pts (xy 6.160842 4.056532) (xy 6.197771 4.082412) (xy 6.251578 4.120939) (xy 6.317103 4.168341) (xy 6.389189 4.220847) (xy 6.462678 4.274688) (xy 6.532412 4.326093) (xy 6.593233 4.371292)
     (xy 6.639983 4.406514) (xy 6.667504 4.427988) (xy 6.670348 4.430391) (xy 6.669133 4.448591) (xy 6.653864 4.480119) (xy 6.632111 4.512239) (xy 6.611443 4.532212) (xy 6.609221 4.533256)
     (xy 6.586744 4.527385) (xy 6.546164 4.504611) (xy 6.495519 4.469563) (xy 6.485797 4.462188) (xy 6.434920 4.425167) (xy 6.393627 4.399026) (xy 6.369568 4.388520) (xy 6.367577 4.388683)
     (xy 6.351697 4.403997) (xy 6.321318 4.440655) (xy 6.281154 4.492260) (xy 6.235919 4.552411) (xy 6.190327 4.614711) (xy 6.149092 4.672761) (xy 6.116928 4.720161) (xy 6.098548 4.750514)
     (xy 6.096000 4.757325) (xy 6.108750 4.773777) (xy 6.142600 4.803951) (xy 6.190948 4.842083) (xy 6.205297 4.852750) (xy 6.314594 4.933001) (xy 6.280344 4.981101) (xy 6.252060 5.013169)
     (xy 6.228207 5.027954) (xy 6.226080 5.028075) (xy 6.206746 5.017906) (xy 6.165256 4.990344) (xy 6.106274 4.948680) (xy 6.034465 4.896201) (xy 5.960533 4.840783) (xy 5.881902 4.780626)
     (xy 5.813144 4.726999) (xy 5.758642 4.683403) (xy 5.722776 4.653338) (xy 5.709977 4.640571) (xy 5.716604 4.619611) (xy 5.739428 4.586607) (xy 5.743843 4.581348) (xy 5.782733 4.536169)
     (xy 5.884333 4.612332) (xy 5.934193 4.647338) (xy 5.973435 4.670487) (xy 5.994755 4.677566) (xy 5.996120 4.676814) (xy 6.020979 4.646119) (xy 6.057310 4.598582) (xy 6.100623 4.540399)
     (xy 6.146429 4.477762) (xy 6.190237 4.416867) (xy 6.227557 4.363907) (xy 6.253899 4.325076) (xy 6.264773 4.306569) (xy 6.264840 4.306117) (xy 6.251845 4.290296) (xy 6.218017 4.261062)
     (xy 6.170307 4.224366) (xy 6.163597 4.219465) (xy 6.062847 4.146331) (xy 6.099541 4.096699) (xy 6.126019 4.064130) (xy 6.144161 4.047586) (xy 6.145947 4.047067) (xy 6.160842 4.056532) )(layer F.SilkS) (width  0.010000)
  )
  (fp_poly (pts (xy -6.099917 4.063341) (xy -6.057257 4.099066) (xy -6.006467 4.157173) (xy -5.943445 4.239888) (xy -5.898005 4.302324) (xy -5.840999 4.383495) (xy -5.803824 4.444017) (xy -5.784997 4.489558)
     (xy -5.783032 4.525784) (xy -5.796445 4.558363) (xy -5.822308 4.591354) (xy -5.873111 4.648200) (xy -5.917240 4.606755) (xy -5.945513 4.578138) (xy -5.950829 4.559812) (xy -5.935195 4.539183)
     (xy -5.929002 4.532943) (xy -5.916026 4.518270) (xy -5.911223 4.503099) (xy -5.917006 4.481924) (xy -5.935790 4.449240) (xy -5.969988 4.399544) (xy -6.014784 4.337321) (xy -6.061188 4.273358)
     (xy -6.099988 4.220172) (xy -6.127098 4.183340) (xy -6.138417 4.168462) (xy -6.156361 4.171747) (xy -6.191393 4.190970) (xy -6.234143 4.220926) (xy -6.237334 4.223409) (xy -6.248655 4.234736)
     (xy -6.251837 4.249014) (xy -6.244512 4.271033) (xy -6.224310 4.305583) (xy -6.188863 4.357454) (xy -6.135801 4.431433) (xy -6.131500 4.437378) (xy -6.068499 4.526987) (xy -6.025919 4.595432)
     (xy -6.002420 4.647499) (xy -5.996663 4.687975) (xy -6.007308 4.721646) (xy -6.033015 4.753298) (xy -6.040966 4.760841) (xy -6.121688 4.828399) (xy -6.187863 4.868261) (xy -6.242644 4.881604)
     (xy -6.289184 4.869606) (xy -6.304552 4.859291) (xy -6.332616 4.831019) (xy -6.374373 4.781492) (xy -6.424694 4.717608) (xy -6.478450 4.646267) (xy -6.530512 4.574368) (xy -6.575750 4.508810)
     (xy -6.609035 4.456491) (xy -6.622209 4.432029) (xy -6.631116 4.375441) (xy -6.608816 4.320933) (xy -6.562563 4.277811) (xy -6.535545 4.264807) (xy -6.510495 4.270176) (xy -6.476534 4.294355)
     (xy -6.426339 4.334379) (xy -6.464370 4.361016) (xy -6.492419 4.385154) (xy -6.502400 4.401411) (xy -6.493241 4.417924) (xy -6.468778 4.455409) (xy -6.433533 4.507382) (xy -6.392027 4.567359)
     (xy -6.348783 4.628856) (xy -6.308322 4.685388) (xy -6.275165 4.730471) (xy -6.254755 4.756549) (xy -6.238902 4.751762) (xy -6.204875 4.732056) (xy -6.181299 4.716372) (xy -6.113585 4.669446)
     (xy -6.150851 4.616490) (xy -6.177404 4.579258) (xy -6.217209 4.524036) (xy -6.263520 4.460166) (xy -6.285992 4.429301) (xy -6.342771 4.345435) (xy -6.374872 4.279565) (xy -6.382052 4.226238)
     (xy -6.364069 4.180000) (xy -6.320677 4.135398) (xy -6.271297 4.099728) (xy -6.220137 4.068190) (xy -6.177255 4.050129) (xy -6.138549 4.047770) (xy -6.099917 4.063341) )(layer F.SilkS) (width  0.010000)
  )
  (fp_poly (pts (xy -2.949901 1.054170) (xy -2.946400 1.065415) (xy -2.955469 1.102870) (xy -2.985725 1.142203) (xy -3.041741 1.189152) (xy -3.049752 1.195086) (xy -3.102861 1.237914) (xy -3.127314 1.269654)
     (xy -3.124549 1.294758) (xy -3.096002 1.317675) (xy -3.090333 1.320800) (xy -3.059316 1.345863) (xy -3.048000 1.369802) (xy -3.059665 1.390249) (xy -3.091801 1.429047) (xy -3.140117 1.481447)
     (xy -3.200320 1.542695) (xy -3.232732 1.574374) (xy -3.303908 1.643524) (xy -3.354569 1.694892) (xy -3.388788 1.733986) (xy -3.410638 1.766312) (xy -3.424193 1.797377) (xy -3.433526 1.832689)
     (xy -3.437344 1.850986) (xy -3.474195 1.954967) (xy -3.537752 2.039165) (xy -3.622130 2.098929) (xy -3.687650 2.140402) (xy -3.729417 2.190461) (xy -3.756661 2.260787) (xy -3.759942 2.273314)
     (xy -3.795273 2.355947) (xy -3.838003 2.404547) (xy -3.885279 2.438229) (xy -3.926252 2.453770) (xy -3.954113 2.449755) (xy -3.962400 2.430368) (xy -3.976135 2.406237) (xy -4.009567 2.381076)
     (xy -4.013200 2.379134) (xy -4.047766 2.355610) (xy -4.063852 2.333533) (xy -4.064000 2.331855) (xy -4.050474 2.312887) (xy -4.015192 2.284193) (xy -3.970996 2.255218) (xy -3.899398 2.205647)
     (xy -3.858808 2.162250) (xy -3.849198 2.126688) (xy -3.870539 2.100623) (xy -3.922804 2.085718) (xy -3.973894 2.082800) (xy -4.030875 2.085205) (xy -4.068164 2.096006) (xy -4.099802 2.120585)
     (xy -4.115466 2.137058) (xy -4.175088 2.215406) (xy -4.204876 2.286408) (xy -4.203935 2.347856) (xy -4.202487 2.352346) (xy -4.193615 2.384474) (xy -4.196771 2.408844) (xy -4.216777 2.431701)
     (xy -4.258458 2.459290) (xy -4.306023 2.486385) (xy -4.368199 2.518088) (xy -4.407666 2.529347) (xy -4.428882 2.519933) (xy -4.436307 2.489619) (xy -4.436533 2.479734) (xy -4.443374 2.446912)
     (xy -4.464902 2.437616) (xy -4.502623 2.452534) (xy -4.558047 2.492354) (xy -4.632679 2.557765) (xy -4.656667 2.580231) (xy -4.727704 2.644050) (xy -4.782456 2.684626) (xy -4.825799 2.705160)
     (xy -4.853374 2.709334) (xy -4.881883 2.722533) (xy -4.927579 2.760247) (xy -4.987663 2.819648) (xy -5.059339 2.897907) (xy -5.139809 2.992197) (xy -5.171646 3.031067) (xy -5.210140 3.074312)
     (xy -5.242230 3.102786) (xy -5.262308 3.112047) (xy -5.266267 3.106025) (xy -5.255652 3.081394) (xy -5.225811 3.035011) (xy -5.179747 2.970674) (xy -5.120466 2.892180) (xy -5.050971 2.803326)
     (xy -4.974266 2.707909) (xy -4.893357 2.609726) (xy -4.811246 2.512575) (xy -4.730939 2.420253) (xy -4.670171 2.352598) (xy -4.446328 2.123214) (xy -4.196471 1.894954) (xy -3.928113 1.673743)
     (xy -3.648766 1.465503) (xy -3.365941 1.276157) (xy -3.118140 1.128751) (xy -3.043869 1.088125) (xy -2.994094 1.063268) (xy -2.964283 1.052507) (xy -2.949901 1.054170) )(layer F.SilkS) (width  0.010000)
  )
  (fp_poly (pts (xy 6.135600 1.584446) (xy 6.139569 1.595627) (xy 6.159498 1.631279) (xy 6.193968 1.672551) (xy 6.203819 1.682210) (xy 6.256085 1.731034) (xy 6.213327 1.767217) (xy 6.175834 1.808342)
     (xy 6.150581 1.849967) (xy 6.128418 1.887199) (xy 6.106031 1.891821) (xy 6.080739 1.863588) (xy 6.068935 1.842514) (xy 6.038997 1.795845) (xy 6.005628 1.758386) (xy 6.005001 1.757848)
     (xy 5.969000 1.727200) (xy 6.005001 1.696553) (xy 6.038266 1.659523) (xy 6.068446 1.612826) (xy 6.068935 1.611886) (xy 6.096128 1.569889) (xy 6.117947 1.560835) (xy 6.135600 1.584446) )(layer F.SilkS) (width  0.010000)
  )
  (fp_poly (pts (xy -1.986324 0.642943) (xy -2.021004 0.668649) (xy -2.023533 0.670404) (xy -2.064217 0.700366) (xy -2.091224 0.723640) (xy -2.096685 0.730497) (xy -2.116926 0.752352) (xy -2.161143 0.785517)
     (xy -2.222971 0.826257) (xy -2.296046 0.870834) (xy -2.374005 0.915511) (xy -2.450482 0.956551) (xy -2.519114 0.990216) (xy -2.573537 1.012771) (xy -2.582333 1.015674) (xy -2.639929 1.040336)
     (xy -2.699105 1.075657) (xy -2.712672 1.085660) (xy -2.768959 1.124587) (xy -2.821764 1.152275) (xy -2.864514 1.166282) (xy -2.890637 1.164161) (xy -2.895600 1.153699) (xy -2.885889 1.134280)
     (xy -2.860089 1.095715) (xy -2.823202 1.045359) (xy -2.811575 1.030156) (xy -2.772440 0.981197) (xy -2.738457 0.945686) (xy -2.701184 0.917654) (xy -2.652179 0.891130) (xy -2.583002 0.860143)
     (xy -2.553341 0.847511) (xy -2.463953 0.810449) (xy -2.365393 0.770918) (xy -2.264876 0.731675) (xy -2.169619 0.695477) (xy -2.086835 0.665081) (xy -2.023740 0.643244) (xy -1.998133 0.635341)
     (xy -1.979185 0.632509) (xy -1.986324 0.642943) )(layer F.SilkS) (width  0.010000)
  )
  (fp_poly (pts (xy -1.845811 0.595664) (xy -1.858378 0.606802) (xy -1.862667 0.609600) (xy -1.901113 0.623253) (xy -1.921933 0.625084) (xy -1.955800 0.624153) (xy -1.921933 0.609600) (xy -1.882373 0.597069)
     (xy -1.862667 0.594116) (xy -1.845811 0.595664) )(layer F.SilkS) (width  0.010000)
  )
  (fp_poly (pts (xy -6.055968 0.329342) (xy -6.032202 0.350316) (xy -6.004507 0.381000) (xy -5.966472 0.425769) (xy -5.948900 0.454414) (xy -5.949314 0.475722) (xy -5.965234 0.498480) (xy -5.969873 0.503767)
     (xy -6.000491 0.540658) (xy -6.025301 0.572841) (xy -6.047368 0.599396) (xy -6.063384 0.600024) (xy -6.083695 0.579975) (xy -6.105955 0.549808) (xy -6.112933 0.531907) (xy -6.125735 0.511720)
     (xy -6.147707 0.494430) (xy -6.182482 0.472713) (xy -6.143474 0.424892) (xy -6.110992 0.383079) (xy -6.085368 0.346833) (xy -6.084305 0.345169) (xy -6.070894 0.328723) (xy -6.055968 0.329342) )(layer F.SilkS) (width  0.010000)
  )
  (fp_poly (pts (xy -3.801709 -0.964253) (xy -3.768936 -0.917346) (xy -3.727430 -0.884288) (xy -3.723856 -0.882594) (xy -3.684827 -0.859466) (xy -3.678807 -0.836799) (xy -3.705734 -0.810897) (xy -3.722447 -0.800659)
     (xy -3.766609 -0.764893) (xy -3.797859 -0.725247) (xy -3.825463 -0.687121) (xy -3.848090 -0.681773) (xy -3.869318 -0.709211) (xy -3.876620 -0.725446) (xy -3.907923 -0.767840) (xy -3.957481 -0.802606)
     (xy -3.958914 -0.803298) (xy -4.021280 -0.833038) (xy -3.981497 -0.865252) (xy -3.945442 -0.888533) (xy -3.918191 -0.897467) (xy -3.896952 -0.910905) (xy -3.894666 -0.920991) (xy -3.884662 -0.950345)
     (xy -3.862452 -0.984297) (xy -3.830238 -1.024080) (xy -3.801709 -0.964253) )(layer F.SilkS) (width  0.010000)
  )
  (fp_poly (pts (xy 2.955360 -1.602053) (xy 2.967567 -1.583922) (xy 2.993447 -1.549547) (xy 3.029429 -1.508389) (xy 3.035300 -1.502186) (xy 3.069463 -1.463137) (xy 3.078823 -1.437407) (xy 3.063990 -1.415929)
     (xy 3.042131 -1.400259) (xy 3.007000 -1.365632) (xy 2.980810 -1.322112) (xy 2.960289 -1.282252) (xy 2.941877 -1.274171) (xy 2.921149 -1.298168) (xy 2.906184 -1.327196) (xy 2.875722 -1.374229)
     (xy 2.838571 -1.410845) (xy 2.836054 -1.412559) (xy 2.793066 -1.440726) (xy 2.848566 -1.495199) (xy 2.887648 -1.536378) (xy 2.918626 -1.573845) (xy 2.925234 -1.583403) (xy 2.942451 -1.607054)
     (xy 2.955360 -1.602053) )(layer F.SilkS) (width  0.010000)
  )
  (fp_poly (pts (xy -4.259599 -3.128367) (xy -4.242471 -3.094513) (xy -4.224725 -3.030324) (xy -4.217713 -2.997008) (xy -4.198044 -2.924227) (xy -4.168526 -2.877054) (xy -4.121265 -2.847286) (xy -4.055260 -2.828205)
     (xy -3.984301 -2.811960) (xy -3.940683 -2.799857) (xy -3.918454 -2.789841) (xy -3.911661 -2.779856) (xy -3.911600 -2.778606) (xy -3.926334 -2.765997) (xy -3.962863 -2.750904) (xy -4.009676 -2.736982)
     (xy -4.055263 -2.727888) (xy -4.076381 -2.726266) (xy -4.125150 -2.711441) (xy -4.170668 -2.673689) (xy -4.202135 -2.623100) (xy -4.208025 -2.603293) (xy -4.228554 -2.511796) (xy -4.246469 -2.451497)
     (xy -4.261431 -2.423461) (xy -4.265842 -2.421466) (xy -4.278062 -2.436304) (xy -4.292633 -2.473873) (xy -4.299056 -2.496698) (xy -4.310716 -2.549803) (xy -4.317389 -2.593371) (xy -4.318000 -2.603813)
     (xy -4.334257 -2.647729) (xy -4.380372 -2.687646) (xy -4.452357 -2.720805) (xy -4.510940 -2.737382) (xy -4.567012 -2.751918) (xy -4.607151 -2.765653) (xy -4.622795 -2.775652) (xy -4.622800 -2.775768)
     (xy -4.608048 -2.788320) (xy -4.571433 -2.803307) (xy -4.524418 -2.817132) (xy -4.478467 -2.826202) (xy -4.456680 -2.827866) (xy -4.402458 -2.843974) (xy -4.356263 -2.889702) (xy -4.321223 -2.961162)
     (xy -4.307029 -3.013916) (xy -4.294341 -3.070429) (xy -4.282708 -3.112625) (xy -4.275359 -3.130152) (xy -4.259599 -3.128367) )(layer F.SilkS) (width  0.010000)
  )
  (fp_poly (pts (xy 3.837898 -3.955756) (xy 3.863609 -3.921976) (xy 3.870372 -3.909463) (xy 3.903266 -3.860067) (xy 3.941055 -3.819274) (xy 3.984364 -3.782021) (xy 3.931049 -3.744057) (xy 3.896482 -3.714769)
     (xy 3.878084 -3.690094) (xy 3.877195 -3.686080) (xy 3.867249 -3.657405) (xy 3.853443 -3.635451) (xy 3.835167 -3.615746) (xy 3.820132 -3.621121) (xy 3.803182 -3.643452) (xy 3.783132 -3.677618)
     (xy 3.776134 -3.698832) (xy 3.764047 -3.719747) (xy 3.734493 -3.748716) (xy 3.729958 -3.752414) (xy 3.683782 -3.789233) (xy 3.736048 -3.838057) (xy 3.772374 -3.878213) (xy 3.797188 -3.916833)
     (xy 3.800298 -3.924640) (xy 3.817164 -3.956564) (xy 3.837898 -3.955756) )(layer F.SilkS) (width  0.010000)
  )
  (fp_poly (pts (xy -4.739793 -5.967524) (xy -4.640118 -5.931594) (xy -4.548603 -5.898615) (xy -4.471095 -5.870694) (xy -4.413444 -5.849938) (xy -4.381498 -5.838454) (xy -4.380644 -5.838148) (xy -4.348714 -5.824611)
     (xy -4.345166 -5.810515) (xy -4.363522 -5.787677) (xy -4.409608 -5.746338) (xy -4.453338 -5.733105) (xy -4.505941 -5.745059) (xy -4.514414 -5.748478) (xy -4.560711 -5.765259) (xy -4.596636 -5.773937)
     (xy -4.601458 -5.774266) (xy -4.623888 -5.763570) (xy -4.664896 -5.734625) (xy -4.718168 -5.692152) (xy -4.764490 -5.652388) (xy -4.821709 -5.601842) (xy -4.869704 -5.559625) (xy -4.902704 -5.530799)
     (xy -4.914394 -5.520814) (xy -4.917241 -5.500400) (xy -4.911499 -5.458334) (xy -4.903490 -5.423558) (xy -4.891077 -5.371227) (xy -4.889348 -5.340790) (xy -4.898748 -5.321860) (xy -4.908229 -5.313077)
     (xy -4.933495 -5.292031) (xy -4.953151 -5.278289) (xy -4.968924 -5.275188) (xy -4.982541 -5.286060) (xy -4.995731 -5.314242) (xy -5.010220 -5.363066) (xy -5.027735 -5.435869) (xy -5.050005 -5.535984)
     (xy -5.069352 -5.624123) (xy -5.092652 -5.731298) (xy -5.112846 -5.826685) (xy -5.128980 -5.905571) (xy -5.135591 -5.939856) (xy -5.020653 -5.939856) (xy -5.019166 -5.922129) (xy -5.011275 -5.881085)
     (xy -4.999112 -5.825697) (xy -4.984808 -5.764938) (xy -4.970495 -5.707781) (xy -4.958302 -5.663200) (xy -4.950362 -5.640167) (xy -4.949155 -5.638800) (xy -4.934127 -5.649185) (xy -4.900400 -5.676743)
     (xy -4.854528 -5.716077) (xy -4.841799 -5.727233) (xy -4.794643 -5.769981) (xy -4.759359 -5.804324) (xy -4.742107 -5.824199) (xy -4.741333 -5.826184) (xy -4.755715 -5.835971) (xy -4.793058 -5.853831)
     (xy -4.844659 -5.876223) (xy -4.901816 -5.899604) (xy -4.955826 -5.920433) (xy -4.997985 -5.935168) (xy -5.019591 -5.940267) (xy -5.020653 -5.939856) (xy -5.135591 -5.939856) (xy -5.140101 -5.963243)
     (xy -5.145256 -5.994987) (xy -5.145280 -5.999675) (xy -5.129773 -6.011887) (xy -5.099792 -6.037536) (xy -5.095393 -6.041388) (xy -5.051520 -6.079910) (xy -4.739793 -5.967524) )(layer F.SilkS) (width  0.010000)
  )
  (fp_poly (pts (xy 5.123253 -6.086565) (xy 5.202248 -6.017755) (xy 5.273794 -5.955737) (xy 5.333492 -5.904300) (xy 5.376943 -5.867234) (xy 5.399747 -5.848327) (xy 5.400700 -5.847598) (xy 5.415645 -5.831263)
     (xy 5.409952 -5.811896) (xy 5.386351 -5.784385) (xy 5.345569 -5.740974) (xy 5.237516 -5.835839) (xy 5.197224 -5.872082) (xy 5.166669 -5.897516) (xy 5.141258 -5.910185) (xy 5.116398 -5.908129)
     (xy 5.087495 -5.889391) (xy 5.049955 -5.852012) (xy 4.999185 -5.794035) (xy 4.930591 -5.713500) (xy 4.919133 -5.700114) (xy 4.863323 -5.635649) (xy 4.815429 -5.581539) (xy 4.779677 -5.542463)
     (xy 4.760290 -5.523102) (xy 4.758267 -5.521835) (xy 4.741289 -5.531601) (xy 4.710104 -5.556364) (xy 4.702447 -5.562999) (xy 4.655094 -5.604662) (xy 4.833680 -5.808812) (xy 4.894084 -5.878632)
     (xy 4.945632 -5.939685) (xy 4.984575 -5.987414) (xy 5.007167 -6.017259) (xy 5.011315 -6.024847) (xy 4.998775 -6.040634) (xy 4.966412 -6.071727) (xy 4.920652 -6.112027) (xy 4.909715 -6.121280)
     (xy 4.862082 -6.162605) (xy 4.826623 -6.195867) (xy 4.809680 -6.215049) (xy 4.809067 -6.216771) (xy 4.818673 -6.236474) (xy 4.840653 -6.266722) (xy 4.872239 -6.305729) (xy 5.123253 -6.086565) )(layer F.SilkS) (width  0.010000)
  )
  (fp_poly (pts (xy 4.008838 -6.882373) (xy 4.064000 -6.852667) (xy 4.062162 -6.563233) (xy 4.060892 -6.459445) (xy 4.058573 -6.359985) (xy 4.055473 -6.272999) (xy 4.051862 -6.206633) (xy 4.049462 -6.179215)
     (xy 4.038600 -6.084630) (xy 3.987800 -6.115379) (xy 3.957962 -6.137422) (xy 3.941092 -6.164958) (xy 3.931982 -6.209213) (xy 3.928534 -6.243124) (xy 3.920067 -6.340119) (xy 3.753499 -6.438193)
     (xy 3.685903 -6.477220) (xy 3.628564 -6.508882) (xy 3.587965 -6.529694) (xy 3.571129 -6.536266) (xy 3.548453 -6.527862) (xy 3.509049 -6.506565) (xy 3.487321 -6.493336) (xy 3.445005 -6.468083)
     (xy 3.417719 -6.459847) (xy 3.392132 -6.467131) (xy 3.369124 -6.480054) (xy 3.335425 -6.502811) (xy 3.319195 -6.519374) (xy 3.318934 -6.520645) (xy 3.332810 -6.532157) (xy 3.371650 -6.558267)
     (xy 3.431275 -6.596324) (xy 3.442174 -6.603095) (xy 3.700493 -6.603095) (xy 3.718922 -6.588060) (xy 3.757879 -6.562839) (xy 3.807928 -6.532888) (xy 3.859636 -6.503661) (xy 3.903568 -6.480614)
     (xy 3.930288 -6.469201) (xy 3.932767 -6.468794) (xy 3.938342 -6.484349) (xy 3.942672 -6.526252) (xy 3.945132 -6.586990) (xy 3.945467 -6.621933) (xy 3.944395 -6.696633) (xy 3.940736 -6.741936)
     (xy 3.933827 -6.762258) (xy 3.924300 -6.762849) (xy 3.838751 -6.710758) (xy 3.770748 -6.666030) (xy 3.723812 -6.631180) (xy 3.701463 -6.608720) (xy 3.700493 -6.603095) (xy 3.442174 -6.603095)
     (xy 3.507504 -6.643678) (xy 3.596155 -6.697679) (xy 3.636305 -6.721834) (xy 3.953676 -6.912080) (xy 4.008838 -6.882373) )(layer F.SilkS) (width  0.010000)
  )
  (fp_poly (pts (xy -3.447641 -7.072432) (xy -3.416156 -7.038082) (xy -3.391146 -6.997817) (xy -3.353798 -6.931364) (xy -3.403413 -6.894682) (xy -3.438202 -6.870561) (xy -3.460027 -6.858364) (xy -3.461746 -6.858000)
     (xy -3.474318 -6.871504) (xy -3.494173 -6.904813) (xy -3.498452 -6.913033) (xy -3.517736 -6.950246) (xy -3.529334 -6.971312) (xy -3.530167 -6.972535) (xy -3.545244 -6.966592) (xy -3.582550 -6.947474)
     (xy -3.635083 -6.919111) (xy -3.695842 -6.885429) (xy -3.757824 -6.850359) (xy -3.814028 -6.817828) (xy -3.857451 -6.791765) (xy -3.881092 -6.776097) (xy -3.882562 -6.774827) (xy -3.879732 -6.756104)
     (xy -3.862480 -6.714133) (xy -3.833549 -6.654860) (xy -3.795681 -6.584230) (xy -3.789735 -6.573617) (xy -3.683612 -6.385251) (xy -3.615573 -6.425004) (xy -3.565574 -6.453657) (xy -3.500049 -6.490478)
     (xy -3.433584 -6.527273) (xy -3.319634 -6.589789) (xy -3.354522 -6.658176) (xy -3.375358 -6.707087) (xy -3.373334 -6.736517) (xy -3.345471 -6.754404) (xy -3.315217 -6.762873) (xy -3.277126 -6.762262)
     (xy -3.245345 -6.737879) (xy -3.216244 -6.685898) (xy -3.198550 -6.639839) (xy -3.187962 -6.596460) (xy -3.196165 -6.563848) (xy -3.210918 -6.541841) (xy -3.238378 -6.517134) (xy -3.288677 -6.482107)
     (xy -3.355028 -6.440561) (xy -3.430646 -6.396296) (xy -3.508742 -6.353113) (xy -3.582531 -6.314813) (xy -3.645225 -6.285195) (xy -3.690037 -6.268060) (xy -3.704702 -6.265333) (xy -3.743518 -6.277384)
     (xy -3.781175 -6.306013) (xy -3.806445 -6.339809) (xy -3.840811 -6.394097) (xy -3.880555 -6.461989) (xy -3.921962 -6.536595) (xy -3.961313 -6.611026) (xy -3.994892 -6.678391) (xy -4.018981 -6.731803)
     (xy -4.029864 -6.764370) (xy -4.030133 -6.767431) (xy -4.024246 -6.794034) (xy -4.004164 -6.822300) (xy -3.966260 -6.855145) (xy -3.906904 -6.895483) (xy -3.822469 -6.946232) (xy -3.770913 -6.975742)
     (xy -3.668642 -7.031773) (xy -3.589830 -7.069187) (xy -3.529827 -7.088255) (xy -3.483981 -7.089246) (xy -3.447641 -7.072432) )(layer F.SilkS) (width  0.010000)
  )
  (fp_poly (pts (xy 2.323221 -7.614437) (xy 2.390453 -7.600910) (xy 2.481090 -7.574287) (xy 2.546896 -7.552790) (xy 2.653445 -7.515274) (xy 2.730677 -7.482427) (xy 2.782297 -7.451393) (xy 2.812007 -7.419314)
     (xy 2.823512 -7.383332) (xy 2.820695 -7.341547) (xy 2.810657 -7.302569) (xy 2.792652 -7.285518) (xy 2.755052 -7.281398) (xy 2.742852 -7.281333) (xy 2.700605 -7.282715) (xy 2.684955 -7.291228)
     (xy 2.688637 -7.313422) (xy 2.693293 -7.326015) (xy 2.704093 -7.359338) (xy 2.705574 -7.374218) (xy 2.688729 -7.380852) (xy 2.646194 -7.396390) (xy 2.584249 -7.418567) (xy 2.509176 -7.445118)
     (xy 2.503202 -7.447219) (xy 2.305537 -7.516698) (xy 2.280187 -7.442301) (xy 2.254838 -7.367904) (xy 2.467256 -7.297115) (xy 2.549488 -7.268148) (xy 2.622064 -7.239689) (xy 2.677758 -7.214774)
     (xy 2.709345 -7.196437) (xy 2.711437 -7.194563) (xy 2.735945 -7.156076) (xy 2.741188 -7.104771) (xy 2.727314 -7.034312) (xy 2.716094 -6.998292) (xy 2.682187 -6.921406) (xy 2.641304 -6.868097)
     (xy 2.597197 -6.842807) (xy 2.583615 -6.841350) (xy 2.555604 -6.846818) (xy 2.502399 -6.861659) (xy 2.430696 -6.883851) (xy 2.347193 -6.911370) (xy 2.312016 -6.923407) (xy 2.203078 -6.962601)
     (xy 2.123243 -6.995829) (xy 2.068910 -7.025924) (xy 2.036479 -7.055721) (xy 2.022348 -7.088052) (xy 2.022917 -7.125753) (xy 2.027535 -7.147294) (xy 2.041497 -7.185990) (xy 2.064749 -7.203808)
     (xy 2.107046 -7.210514) (xy 2.171666 -7.215895) (xy 2.161008 -7.159081) (xy 2.150350 -7.102268) (xy 2.340942 -7.036554) (xy 2.417110 -7.010288) (xy 2.482228 -6.987823) (xy 2.529221 -6.971602)
     (xy 2.550747 -6.964158) (xy 2.566725 -6.974688) (xy 2.586168 -7.008958) (xy 2.596564 -7.035557) (xy 2.611220 -7.086005) (xy 2.611506 -7.112625) (xy 2.602751 -7.120868) (xy 2.467041 -7.169017)
     (xy 2.359959 -7.207693) (xy 2.278229 -7.238780) (xy 2.218575 -7.264164) (xy 2.177718 -7.285726) (xy 2.152384 -7.305353) (xy 2.139294 -7.324928) (xy 2.135173 -7.346335) (xy 2.136742 -7.371458)
     (xy 2.138853 -7.387605) (xy 2.151928 -7.441953) (xy 2.175047 -7.505271) (xy 2.187094 -7.531632) (xy 2.211331 -7.573466) (xy 2.238722 -7.601012) (xy 2.274332 -7.614570) (xy 2.323221 -7.614437) )(layer F.SilkS) (width  0.010000)
  )
  (fp_poly (pts (xy -1.928741 -7.709122) (xy -1.918676 -7.687665) (xy -1.901721 -7.640350) (xy -1.879920 -7.573987) (xy -1.855314 -7.495386) (xy -1.829948 -7.411358) (xy -1.805864 -7.328711) (xy -1.785105 -7.254256)
     (xy -1.769713 -7.194803) (xy -1.761732 -7.157161) (xy -1.761067 -7.150182) (xy -1.767319 -7.119072) (xy -1.788657 -7.091064) (xy -1.828954 -7.063913) (xy -1.892084 -7.035376) (xy -1.981918 -7.003210)
     (xy -2.055566 -6.979574) (xy -2.166751 -6.946105) (xy -2.250909 -6.924092) (xy -2.312682 -6.912996) (xy -2.356711 -6.912275) (xy -2.387639 -6.921389) (xy -2.408909 -6.938433) (xy -2.422711 -6.964068)
     (xy -2.443920 -7.016038) (xy -2.470270 -7.088224) (xy -2.499497 -7.174503) (xy -2.520139 -7.239000) (xy -2.604811 -7.509933) (xy -2.544250 -7.531167) (xy -2.503726 -7.543324) (xy -2.479364 -7.546780)
     (xy -2.477267 -7.545978) (xy -2.470348 -7.528399) (xy -2.455462 -7.484098) (xy -2.434452 -7.418769) (xy -2.409162 -7.338104) (xy -2.393610 -7.287677) (xy -2.366804 -7.200943) (xy -2.343364 -7.126401)
     (xy -2.325104 -7.069713) (xy -2.313836 -7.036541) (xy -2.311237 -7.030326) (xy -2.293338 -7.032114) (xy -2.251108 -7.042807) (xy -2.191979 -7.060005) (xy -2.123384 -7.081306) (xy -2.052758 -7.104308)
     (xy -1.987533 -7.126610) (xy -1.935143 -7.145809) (xy -1.903022 -7.159505) (xy -1.896533 -7.164309) (xy -1.901316 -7.184158) (xy -1.914494 -7.230377) (xy -1.934315 -7.297024) (xy -1.959025 -7.378158)
     (xy -1.972733 -7.422518) (xy -1.999191 -7.508250) (xy -2.021660 -7.582036) (xy -2.038394 -7.638071) (xy -2.047652 -7.670552) (xy -2.048933 -7.676182) (xy -2.034539 -7.688585) (xy -2.000984 -7.701255)
     (xy -1.962709 -7.710233) (xy -1.934155 -7.711563) (xy -1.928741 -7.709122) )(layer F.SilkS) (width  0.010000)
  )
  (fp_poly (pts (xy 0.736018 -7.936328) (xy 0.787896 -7.931742) (xy 0.861420 -7.923942) (xy 0.950626 -7.913553) (xy 1.032934 -7.903332) (xy 1.329267 -7.865533) (xy 1.323387 -7.814733) (xy 1.318030 -7.777562)
     (xy 1.313425 -7.759616) (xy 1.296096 -7.759947) (xy 1.251225 -7.763785) (xy 1.184885 -7.770534) (xy 1.103152 -7.779599) (xy 1.068090 -7.783672) (xy 0.965963 -7.795161) (xy 0.892815 -7.801031)
     (xy 0.844045 -7.800072) (xy 0.815055 -7.791075) (xy 0.801243 -7.772829) (xy 0.798010 -7.744124) (xy 0.799922 -7.713133) (xy 0.803222 -7.688462) (xy 0.812461 -7.672525) (xy 0.834483 -7.662197)
     (xy 0.876131 -7.654355) (xy 0.944249 -7.645873) (xy 0.948267 -7.645400) (xy 1.092200 -7.628467) (xy 1.092200 -7.577666) (xy 1.088940 -7.543575) (xy 1.072313 -7.529711) (xy 1.032934 -7.527346)
     (xy 0.981538 -7.529840) (xy 0.915472 -7.535687) (xy 0.877342 -7.540071) (xy 0.781016 -7.552318) (xy 0.769395 -7.474819) (xy 0.765406 -7.425882) (xy 0.768717 -7.391472) (xy 0.772587 -7.384024)
     (xy 0.794684 -7.376708) (xy 0.842746 -7.367396) (xy 0.909033 -7.357435) (xy 0.965200 -7.350448) (xy 1.073314 -7.337940) (xy 1.152314 -7.328050) (xy 1.206754 -7.319733) (xy 1.241188 -7.311944)
     (xy 1.260170 -7.303640) (xy 1.268256 -7.293776) (xy 1.269998 -7.281308) (xy 1.270000 -7.280554) (xy 1.263055 -7.233702) (xy 1.245443 -7.204099) (xy 1.230088 -7.198840) (xy 1.207620 -7.201578)
     (xy 1.157440 -7.207811) (xy 1.085438 -7.216804) (xy 0.997504 -7.227819) (xy 0.919353 -7.237631) (xy 0.823817 -7.250056) (xy 0.740417 -7.261698) (xy 0.674777 -7.271706) (xy 0.632522 -7.279232)
     (xy 0.619264 -7.282958) (xy 0.618459 -7.301709) (xy 0.621405 -7.348725) (xy 0.627624 -7.418669) (xy 0.636638 -7.506205) (xy 0.647971 -7.605997) (xy 0.648724 -7.612340) (xy 0.663271 -7.729675)
     (xy 0.675571 -7.816881) (xy 0.686326 -7.877565) (xy 0.696236 -7.915337) (xy 0.706002 -7.933804) (xy 0.711747 -7.937072) (xy 0.736018 -7.936328) )(layer F.SilkS) (width  0.010000)
  )
  (fp_poly (pts (xy -0.337543 -7.947008) (xy -0.297487 -7.918986) (xy -0.295563 -7.917103) (xy -0.270838 -7.886246) (xy -0.258242 -7.849468) (xy -0.254130 -7.794437) (xy -0.254000 -7.776556) (xy -0.257517 -7.716895)
     (xy -0.266749 -7.672282) (xy -0.275025 -7.656548) (xy -0.286518 -7.634160) (xy -0.277560 -7.623528) (xy -0.244529 -7.583311) (xy -0.224844 -7.517463) (xy -0.220133 -7.454731) (xy -0.222855 -7.407040)
     (xy -0.233363 -7.368815) (xy -0.255173 -7.338657) (xy -0.291800 -7.315164) (xy -0.346761 -7.296935) (xy -0.423570 -7.282568) (xy -0.525742 -7.270664) (xy -0.656793 -7.259820) (xy -0.720520 -7.255298)
     (xy -0.890708 -7.243583) (xy -0.911799 -7.490784) (xy -0.779591 -7.490784) (xy -0.769949 -7.426999) (xy -0.768514 -7.419736) (xy -0.758094 -7.367639) (xy -0.645747 -7.377088) (xy -0.570551 -7.384054)
     (xy -0.494033 -7.392143) (xy -0.448733 -7.397579) (xy -0.398584 -7.405449) (xy -0.372888 -7.416929) (xy -0.362448 -7.439423) (xy -0.358937 -7.469871) (xy -0.359273 -7.519439) (xy -0.373544 -7.551061)
     (xy -0.406702 -7.567459) (xy -0.463701 -7.571357) (xy -0.535256 -7.566818) (xy -0.607297 -7.560754) (xy -0.673309 -7.556030) (xy -0.720226 -7.553569) (xy -0.723900 -7.553471) (xy -0.758606 -7.547905)
     (xy -0.776490 -7.529048) (xy -0.779591 -7.490784) (xy -0.911799 -7.490784) (xy -0.918638 -7.570929) (xy -0.926970 -7.672334) (xy -0.932090 -7.740318) (xy -0.795867 -7.740318) (xy -0.793828 -7.696794)
     (xy -0.788790 -7.670218) (xy -0.787416 -7.667994) (xy -0.765836 -7.664509) (xy -0.716201 -7.665278) (xy -0.644010 -7.669977) (xy -0.554765 -7.678285) (xy -0.491067 -7.685367) (xy -0.397933 -7.696343)
     (xy -0.397933 -7.831667) (xy -0.524933 -7.827504) (xy -0.599394 -7.824058) (xy -0.671332 -7.819070) (xy -0.723900 -7.813766) (xy -0.768932 -7.806013) (xy -0.789693 -7.792409) (xy -0.795573 -7.763373)
     (xy -0.795867 -7.740318) (xy -0.932090 -7.740318) (xy -0.933692 -7.761584) (xy -0.938459 -7.833426) (xy -0.940926 -7.882609) (xy -0.940747 -7.903882) (xy -0.940554 -7.904290) (xy -0.922734 -7.907680)
     (xy -0.877987 -7.913249) (xy -0.813132 -7.920342) (xy -0.734991 -7.928305) (xy -0.650383 -7.936483) (xy -0.566131 -7.944223) (xy -0.489053 -7.950869) (xy -0.425970 -7.955768) (xy -0.383703 -7.958266)
     (xy -0.375997 -7.958450) (xy -0.337543 -7.947008) )(layer F.SilkS) (width  0.010000)
  )
  (fp_poly (pts (xy 1.655550 4.282194) (xy 1.708006 4.287543) (xy 1.750013 4.295393) (xy 1.769534 4.303690) (xy 1.773136 4.324248) (xy 1.751930 4.345375) (xy 1.714441 4.361653) (xy 1.669193 4.367660)
     (xy 1.668930 4.367654) (xy 1.617516 4.360633) (xy 1.579034 4.348133) (xy 1.546916 4.325703) (xy 1.542526 4.297823) (xy 1.545167 4.288550) (xy 1.563162 4.281957) (xy 1.603612 4.280085)
     (xy 1.655550 4.282194) )(layer F.SilkS) (width  0.010000)
  )
  (fp_poly (pts (xy 2.510467 4.181873) (xy 2.500192 4.211270) (xy 2.486240 4.228208) (xy 2.435895 4.274003) (xy 2.396536 4.290697) (xy 2.371093 4.284397) (xy 2.361102 4.262276) (xy 2.372816 4.230555)
     (xy 2.399911 4.198645) (xy 2.436066 4.175956) (xy 2.446119 4.172742) (xy 2.491792 4.168130) (xy 2.510467 4.181873) )(layer F.SilkS) (width  0.010000)
  )
  (fp_poly (pts (xy 0.142818 3.546776) (xy 0.152400 3.573774) (xy 0.145258 3.611607) (xy 0.127902 3.654783) (xy 0.106438 3.691063) (xy 0.086975 3.708208) (xy 0.085231 3.708400) (xy 0.062877 3.696063)
     (xy 0.058672 3.690504) (xy 0.054460 3.659470) (xy 0.062661 3.614848) (xy 0.079608 3.572859) (xy 0.088102 3.560328) (xy 0.117664 3.540452) (xy 0.142818 3.546776) )(layer F.SilkS) (width  0.010000)
  )
  (fp_poly (pts (xy 0.740947 2.060893) (xy 0.742873 2.089610) (xy 0.727048 2.124342) (xy 0.711553 2.141747) (xy 0.686143 2.161337) (xy 0.673224 2.157075) (xy 0.667916 2.145695) (xy 0.667422 2.109545)
     (xy 0.684416 2.072944) (xy 0.710919 2.050642) (xy 0.720263 2.048934) (xy 0.740947 2.060893) )(layer F.SilkS) (width  0.010000)
  )
)
