(module "D37P23A6GX00LF" (layer F.Cu)
  (descr "D37P23A6GX00LF-2")
  (tags "Connector")
  (fp_text reference J** (at 24.840 8.765) (layer F.SilkS)
    (effects (font (size 1.27 1.27) (thickness 0.254)))
  )
  (fp_text user %R (at 24.840 8.765) (layer F.Fab)
    (effects (font (size 1.27 1.27) (thickness 0.254)))
  )
  (fp_text value "D37P23A6GX00LF" (at 24.840 8.765) (layer F.SilkS) hide
    (effects (font (size 1.27 1.27) (thickness 0.254)))
  )
  (fp_line (start -9.82 -1.41) (end 59.5 -1.41) (layer F.Fab) (width 0.1))
  (fp_line (start 59.5 -1.41) (end 59.5 13.24) (layer F.Fab) (width 0.1))
  (fp_line (start 59.5 13.24) (end -9.82 13.24) (layer F.Fab) (width 0.1))
  (fp_line (start -9.82 13.24) (end -9.82 -1.41) (layer F.Fab) (width 0.1))
  (fp_line (start -10.82 -2.41) (end 60.5 -2.41) (layer F.CrtYd) (width 0.1))
  (fp_line (start 60.5 -2.41) (end 60.5 19.94) (layer F.CrtYd) (width 0.1))
  (fp_line (start 60.5 19.94) (end -10.82 19.94) (layer F.CrtYd) (width 0.1))
  (fp_line (start -10.82 19.94) (end -10.82 -2.41) (layer F.CrtYd) (width 0.1))
  (fp_line (start -2.81 13.24) (end -2.81 18.94) (layer F.Fab) (width 0.1))
  (fp_line (start -2.81 18.94) (end 52.49 18.94) (layer F.Fab) (width 0.1))
  (fp_line (start 52.49 18.94) (end 52.49 13.24) (layer F.Fab) (width 0.1))
  (fp_line (start -9.82 4.765) (end -9.82 13.24) (layer F.SilkS) (width 0.2))
  (fp_line (start -9.82 13.24) (end 59.5 13.24) (layer F.SilkS) (width 0.2))
  (fp_line (start 59.5 13.24) (end 59.5 4.765) (layer F.SilkS) (width 0.2))
  (fp_line (start -2.81 13.24) (end -2.81 18.94) (layer F.SilkS) (width 0.2))
  (fp_line (start -2.81 18.94) (end 52.49 18.94) (layer F.SilkS) (width 0.2))
  (fp_line (start 52.49 18.94) (end 52.49 13.24) (layer F.SilkS) (width 0.2))
  (fp_line (start 0 -2) (end 0 -2) (layer F.SilkS) (width 0.1))
  (fp_line (start 0 -1.9) (end 0 -1.9) (layer F.SilkS) (width 0.1))
  (fp_arc (start 0 -1.95) (end 0.000 -2) (angle -180) (layer F.SilkS) (width 0.1))
  (fp_arc (start 0 -1.95) (end 0.000 -1.9) (angle -180) (layer F.SilkS) (width 0.1))
  (pad 1 thru_hole rect (at 0.000 -0) (size 1.400 1.400) (drill 0.9) (layers *.Cu *.Mask))
  (pad 2 thru_hole circle (at 2.760 -0) (size 1.400 1.400) (drill 0.9) (layers *.Cu *.Mask))
  (pad 3 thru_hole circle (at 5.520 -0) (size 1.400 1.400) (drill 0.9) (layers *.Cu *.Mask))
  (pad 4 thru_hole circle (at 8.280 -0) (size 1.400 1.400) (drill 0.9) (layers *.Cu *.Mask))
  (pad 5 thru_hole circle (at 11.040 -0) (size 1.400 1.400) (drill 0.9) (layers *.Cu *.Mask))
  (pad 6 thru_hole circle (at 13.800 -0) (size 1.400 1.400) (drill 0.9) (layers *.Cu *.Mask))
  (pad 7 thru_hole circle (at 16.560 -0) (size 1.400 1.400) (drill 0.9) (layers *.Cu *.Mask))
  (pad 8 thru_hole circle (at 19.320 -0) (size 1.400 1.400) (drill 0.9) (layers *.Cu *.Mask))
  (pad 9 thru_hole circle (at 22.080 -0) (size 1.400 1.400) (drill 0.9) (layers *.Cu *.Mask))
  (pad 10 thru_hole circle (at 24.840 -0) (size 1.400 1.400) (drill 0.9) (layers *.Cu *.Mask))
  (pad 11 thru_hole circle (at 27.600 -0) (size 1.400 1.400) (drill 0.9) (layers *.Cu *.Mask))
  (pad 12 thru_hole circle (at 30.360 -0) (size 1.400 1.400) (drill 0.9) (layers *.Cu *.Mask))
  (pad 13 thru_hole circle (at 33.120 -0) (size 1.400 1.400) (drill 0.9) (layers *.Cu *.Mask))
  (pad 14 thru_hole circle (at 35.880 -0) (size 1.400 1.400) (drill 0.9) (layers *.Cu *.Mask))
  (pad 15 thru_hole circle (at 38.640 -0) (size 1.400 1.400) (drill 0.9) (layers *.Cu *.Mask))
  (pad 16 thru_hole circle (at 41.400 -0) (size 1.400 1.400) (drill 0.9) (layers *.Cu *.Mask))
  (pad 17 thru_hole circle (at 44.160 -0) (size 1.400 1.400) (drill 0.9) (layers *.Cu *.Mask))
  (pad 18 thru_hole circle (at 46.920 -0) (size 1.400 1.400) (drill 0.9) (layers *.Cu *.Mask))
  (pad 19 thru_hole circle (at 49.680 -0) (size 1.400 1.400) (drill 0.9) (layers *.Cu *.Mask))
  (pad 20 thru_hole circle (at 1.380 2.84) (size 1.400 1.400) (drill 0.9) (layers *.Cu *.Mask))
  (pad 21 thru_hole circle (at 4.140 2.84) (size 1.400 1.400) (drill 0.9) (layers *.Cu *.Mask))
  (pad 22 thru_hole circle (at 6.900 2.84) (size 1.400 1.400) (drill 0.9) (layers *.Cu *.Mask))
  (pad 23 thru_hole circle (at 9.660 2.84) (size 1.400 1.400) (drill 0.9) (layers *.Cu *.Mask))
  (pad 24 thru_hole circle (at 12.420 2.84) (size 1.400 1.400) (drill 0.9) (layers *.Cu *.Mask))
  (pad 25 thru_hole circle (at 15.180 2.84) (size 1.400 1.400) (drill 0.9) (layers *.Cu *.Mask))
  (pad 26 thru_hole circle (at 17.940 2.84) (size 1.400 1.400) (drill 0.9) (layers *.Cu *.Mask))
  (pad 27 thru_hole circle (at 20.700 2.84) (size 1.400 1.400) (drill 0.9) (layers *.Cu *.Mask))
  (pad 28 thru_hole circle (at 23.460 2.84) (size 1.400 1.400) (drill 0.9) (layers *.Cu *.Mask))
  (pad 29 thru_hole circle (at 26.220 2.84) (size 1.400 1.400) (drill 0.9) (layers *.Cu *.Mask))
  (pad 30 thru_hole circle (at 28.980 2.84) (size 1.400 1.400) (drill 0.9) (layers *.Cu *.Mask))
  (pad 31 thru_hole circle (at 31.740 2.84) (size 1.400 1.400) (drill 0.9) (layers *.Cu *.Mask))
  (pad 32 thru_hole circle (at 34.500 2.84) (size 1.400 1.400) (drill 0.9) (layers *.Cu *.Mask))
  (pad 33 thru_hole circle (at 37.260 2.84) (size 1.400 1.400) (drill 0.9) (layers *.Cu *.Mask))
  (pad 34 thru_hole circle (at 40.020 2.84) (size 1.400 1.400) (drill 0.9) (layers *.Cu *.Mask))
  (pad 35 thru_hole circle (at 42.780 2.84) (size 1.400 1.400) (drill 0.9) (layers *.Cu *.Mask))
  (pad 36 thru_hole circle (at 45.540 2.84) (size 1.400 1.400) (drill 0.9) (layers *.Cu *.Mask))
  (pad 37 thru_hole circle (at 48.300 2.84) (size 1.400 1.400) (drill 0.9) (layers *.Cu *.Mask))
  (pad MH1 thru_hole circle (at -6.910 1.42) (size 4.650 4.650) (drill 3.1) (layers *.Cu *.Mask))
  (pad MH2 thru_hole circle (at 56.590 1.42) (size 4.650 4.650) (drill 3.1) (layers *.Cu *.Mask))
)
