(module LOGO (layer F.Cu)
  (at 0 0)
 (fp_text reference "G***" (at 0 0) (layer F.SilkS) hide
  (effects (font (thickness 0.3)))
  )
  (fp_text value "LOGO" (at 0.75 0) (layer F.SilkS) hide
  (effects (font (thickness 0.3)))
  )
  (fp_poly (pts (xy -7.908917 -1.131576) (xy -7.889607 -1.127799) (xy -7.886836 -1.126180) (xy -7.876257 -1.108720) (xy -7.875032 -1.087163) (xy -7.883498 -1.070036) (xy -7.884583 -1.069128) (xy -7.896785 -1.065157)
     (xy -7.922143 -1.060441) (xy -7.956932 -1.055576) (xy -7.996767 -1.051218) (xy -8.131859 -1.030248) (xy -8.260323 -0.994108) (xy -8.381273 -0.943396) (xy -8.493822 -0.878713) (xy -8.597083 -0.800659)
     (xy -8.690169 -0.709836) (xy -8.772193 -0.606843) (xy -8.842268 -0.492281) (xy -8.852999 -0.471559) (xy -8.905101 -0.350184) (xy -8.941137 -0.225489) (xy -8.961308 -0.098855) (xy -8.965815 0.028336)
     (xy -8.954858 0.154704) (xy -8.928640 0.278867) (xy -8.887362 0.399443) (xy -8.831223 0.515051) (xy -8.760427 0.624310) (xy -8.679266 0.721509) (xy -8.584067 0.810601) (xy -8.477857 0.887822)
     (xy -8.362745 0.952009) (xy -8.240838 1.001999) (xy -8.114245 1.036627) (xy -8.104927 1.038512) (xy -8.045273 1.047059) (xy -7.975085 1.051978) (xy -7.900164 1.053265) (xy -7.826306 1.050914)
     (xy -7.759309 1.044920) (xy -7.721235 1.038880) (xy -7.591742 1.004945) (xy -7.469065 0.956191) (xy -7.354299 0.893574) (xy -7.248543 0.818053) (xy -7.152891 0.730582) (xy -7.068443 0.632120)
     (xy -6.996294 0.523622) (xy -6.937542 0.406046) (xy -6.908725 0.330200) (xy -6.893555 0.278524) (xy -6.879854 0.219648) (xy -6.868665 0.159263) (xy -6.861036 0.103061) (xy -6.858012 0.056733)
     (xy -6.858000 0.054177) (xy -6.854768 0.008575) (xy -6.845233 -0.022210) (xy -6.829638 -0.037824) (xy -6.808225 -0.037911) (xy -6.798120 -0.033538) (xy -6.790175 -0.027253) (xy -6.785290 -0.016371)
     (xy -6.782754 0.002737) (xy -6.781858 0.033704) (xy -6.781800 0.049989) (xy -6.789129 0.158310) (xy -6.810799 0.272149) (xy -6.836730 0.361189) (xy -6.887907 0.488236) (xy -6.953121 0.606669)
     (xy -7.031315 0.715553) (xy -7.121434 0.813951) (xy -7.222420 0.900929) (xy -7.333219 0.975550) (xy -7.452773 1.036879) (xy -7.580027 1.083979) (xy -7.681521 1.109741) (xy -7.725841 1.117033)
     (xy -7.780065 1.123198) (xy -7.839502 1.127971) (xy -7.899457 1.131085) (xy -7.955236 1.132276) (xy -8.002146 1.131278) (xy -8.026400 1.129236) (xy -8.168206 1.103306) (xy -8.302269 1.062871)
     (xy -8.427836 1.008608) (xy -8.544153 0.941194) (xy -8.650467 0.861306) (xy -8.746023 0.769623) (xy -8.830069 0.666821) (xy -8.901851 0.553578) (xy -8.960614 0.430570) (xy -9.005607 0.298475)
     (xy -9.021452 0.234935) (xy -9.028822 0.190714) (xy -9.034590 0.134436) (xy -9.038593 0.070917) (xy -9.040670 0.004972) (xy -9.040657 -0.058582) (xy -9.038392 -0.114931) (xy -9.034567 -0.153614)
     (xy -9.011388 -0.271797) (xy -8.976340 -0.387953) (xy -8.931101 -0.497104) (xy -8.897033 -0.561923) (xy -8.822766 -0.674247) (xy -8.735951 -0.776808) (xy -8.638120 -0.868507) (xy -8.530806 -0.948242)
     (xy -8.415542 -1.014914) (xy -8.293860 -1.067423) (xy -8.167294 -1.104670) (xy -8.129922 -1.112454) (xy -8.079774 -1.120745) (xy -8.029405 -1.126983) (xy -7.982010 -1.130987) (xy -7.940783 -1.132578)
     (xy -7.908917 -1.131576) )(layer F.SilkS) (width  0.010000)
  )
  (fp_poly (pts (xy -4.646813 -1.105593) (xy -4.621049 -1.093658) (xy -4.606720 -1.071354) (xy -4.601712 -1.036707) (xy -4.601633 -1.030337) (xy -4.604814 -0.991947) (xy -4.615940 -0.967120) (xy -4.637389 -0.953427)
     (xy -4.671540 -0.948438) (xy -4.681967 -0.948266) (xy -4.754394 -0.942632) (xy -4.819082 -0.926317) (xy -4.873985 -0.900200) (xy -4.917057 -0.865162) (xy -4.937633 -0.838200) (xy -4.954162 -0.808072)
     (xy -4.966745 -0.776735) (xy -4.975798 -0.741474) (xy -4.981737 -0.699576) (xy -4.984976 -0.648327) (xy -4.985933 -0.585013) (xy -4.985379 -0.526506) (xy -4.984562 -0.472859) (xy -4.983222 -0.427653)
     (xy -4.980139 -0.389438) (xy -4.974094 -0.356763) (xy -4.963868 -0.328178) (xy -4.948243 -0.302231) (xy -4.925998 -0.277472) (xy -4.895916 -0.252451) (xy -4.856776 -0.225717) (xy -4.807360 -0.195819)
     (xy -4.746448 -0.161307) (xy -4.672822 -0.120730) (xy -4.620031 -0.091767) (xy -4.540455 -0.047664) (xy -4.474339 -0.010022) (xy -4.420012 0.022303) (xy -4.375804 0.050452) (xy -4.340045 0.075571)
     (xy -4.311065 0.098800) (xy -4.287192 0.121285) (xy -4.266758 0.144167) (xy -4.256749 0.156849) (xy -4.237024 0.183753) (xy -4.221394 0.208349) (xy -4.209354 0.233093) (xy -4.200395 0.260442)
     (xy -4.194012 0.292852) (xy -4.189698 0.332779) (xy -4.186947 0.382679) (xy -4.185251 0.445009) (xy -4.184279 0.508230) (xy -4.183595 0.582526) (xy -4.183699 0.642258) (xy -4.184677 0.689782)
     (xy -4.186611 0.727454) (xy -4.189585 0.757627) (xy -4.193683 0.782659) (xy -4.194108 0.784730) (xy -4.218369 0.866194) (xy -4.254605 0.935752) (xy -4.302642 0.993228) (xy -4.362306 1.038444)
     (xy -4.433422 1.071222) (xy -4.491567 1.087010) (xy -4.552251 1.096485) (xy -4.621073 1.102475) (xy -4.690734 1.104622) (xy -4.753935 1.102568) (xy -4.772887 1.100823) (xy -4.865393 1.084335)
     (xy -4.945642 1.057084) (xy -5.013283 1.019280) (xy -5.067964 0.971133) (xy -5.109336 0.912856) (xy -5.119364 0.892851) (xy -5.132921 0.860370) (xy -5.143569 0.827263) (xy -5.151630 0.790963)
     (xy -5.157427 0.748907) (xy -5.161280 0.698530) (xy -5.163511 0.637268) (xy -5.164441 0.562557) (xy -5.164519 0.532759) (xy -5.164525 0.469621) (xy -5.164307 0.421215) (xy -5.163667 0.385339)
     (xy -5.162411 0.359790) (xy -5.160341 0.342369) (xy -5.157261 0.330871) (xy -5.152975 0.323097) (xy -5.147286 0.316844) (xy -5.145071 0.314743) (xy -5.120800 0.301664) (xy -5.087787 0.295715)
     (xy -5.052697 0.297007) (xy -5.022201 0.305652) (xy -5.011088 0.312498) (xy -5.004790 0.318027) (xy -4.999919 0.324585) (xy -4.996232 0.334336) (xy -4.993483 0.349445) (xy -4.991426 0.372076)
     (xy -4.989817 0.404394) (xy -4.988411 0.448565) (xy -4.986963 0.506751) (xy -4.986408 0.530514) (xy -4.984190 0.606806) (xy -4.981093 0.668481) (xy -4.976572 0.717852) (xy -4.970078 0.757234)
     (xy -4.961066 0.788940) (xy -4.948989 0.815283) (xy -4.933301 0.838577) (xy -4.913454 0.861135) (xy -4.906656 0.868056) (xy -4.867792 0.900061) (xy -4.823527 0.922369) (xy -4.770760 0.936007)
     (xy -4.706389 0.942002) (xy -4.682067 0.942478) (xy -4.601747 0.938358) (xy -4.534762 0.924641) (xy -4.480043 0.900628) (xy -4.436517 0.865621) (xy -4.403114 0.818921) (xy -4.378763 0.759829)
     (xy -4.373473 0.741171) (xy -4.368774 0.713732) (xy -4.365044 0.673546) (xy -4.362315 0.624224) (xy -4.360620 0.569377) (xy -4.359991 0.512613) (xy -4.360463 0.457544) (xy -4.362066 0.407778)
     (xy -4.364835 0.366926) (xy -4.368801 0.338598) (xy -4.369784 0.334597) (xy -4.378905 0.307325) (xy -4.391270 0.282174) (xy -4.408304 0.257990) (xy -4.431430 0.233622) (xy -4.462070 0.207916)
     (xy -4.501647 0.179721) (xy -4.551585 0.147884) (xy -4.613306 0.111253) (xy -4.688234 0.068675) (xy -4.720167 0.050863) (xy -4.794025 0.009761) (xy -4.854680 -0.024170) (xy -4.903768 -0.051917)
     (xy -4.942922 -0.074467) (xy -4.973779 -0.092808) (xy -4.997974 -0.107927) (xy -5.017141 -0.120810) (xy -5.032917 -0.132446) (xy -5.046936 -0.143821) (xy -5.056850 -0.152395) (xy -5.105347 -0.205703)
     (xy -5.139043 -0.267212) (xy -5.153148 -0.312018) (xy -5.156916 -0.337422) (xy -5.159966 -0.376390) (xy -5.162274 -0.425567) (xy -5.163819 -0.481598) (xy -5.164578 -0.541128) (xy -5.164527 -0.600801)
     (xy -5.163645 -0.657264) (xy -5.161908 -0.707159) (xy -5.159294 -0.747134) (xy -5.156253 -0.771428) (xy -5.142939 -0.819495) (xy -5.121286 -0.871273) (xy -5.094128 -0.921414) (xy -5.064303 -0.964570)
     (xy -5.039688 -0.991138) (xy -4.984820 -1.030503) (xy -4.917784 -1.063294) (xy -4.842504 -1.088201) (xy -4.762906 -1.103914) (xy -4.686129 -1.109133) (xy -4.646813 -1.105593) )(layer F.SilkS) (width  0.010000)
  )
  (fp_poly (pts (xy 1.078845 -1.105736) (xy 1.173748 -1.093307) (xy 1.257862 -1.069157) (xy 1.330676 -1.033514) (xy 1.391677 -0.986606) (xy 1.440355 -0.928661) (xy 1.463755 -0.888038) (xy 1.479110 -0.853261)
     (xy 1.491246 -0.816669) (xy 1.500492 -0.775811) (xy 1.507179 -0.728236) (xy 1.511640 -0.671493) (xy 1.514204 -0.603132) (xy 1.515203 -0.520702) (xy 1.515238 -0.506821) (xy 1.515248 -0.438267)
     (xy 1.514565 -0.384777) (xy 1.512474 -0.344483) (xy 1.508260 -0.315515) (xy 1.501208 -0.296005) (xy 1.490604 -0.284084) (xy 1.475733 -0.277883) (xy 1.455880 -0.275534) (xy 1.430330 -0.275166)
     (xy 1.426634 -0.275166) (xy 1.399460 -0.275509) (xy 1.378479 -0.277828) (xy 1.362889 -0.284063) (xy 1.351889 -0.296152) (xy 1.344680 -0.316035) (xy 1.340460 -0.345650) (xy 1.338429 -0.386936)
     (xy 1.337786 -0.441832) (xy 1.337734 -0.490449) (xy 1.336855 -0.575614) (xy 1.333912 -0.646036) (xy 1.328442 -0.703828) (xy 1.319983 -0.751104) (xy 1.308072 -0.789978) (xy 1.292247 -0.822565)
     (xy 1.272046 -0.850977) (xy 1.254770 -0.869798) (xy 1.213043 -0.900821) (xy 1.159082 -0.924369) (xy 1.096197 -0.939687) (xy 1.027700 -0.946018) (xy 0.956900 -0.942607) (xy 0.943738 -0.940837)
     (xy 0.872832 -0.925262) (xy 0.815607 -0.901034) (xy 0.770552 -0.866978) (xy 0.736157 -0.821921) (xy 0.710910 -0.764692) (xy 0.708903 -0.758486) (xy 0.690034 -0.698500) (xy 0.690034 -0.008467)
     (xy 0.690041 0.121104) (xy 0.690109 0.234892) (xy 0.690306 0.334052) (xy 0.690699 0.419734) (xy 0.691357 0.493091) (xy 0.692347 0.555274) (xy 0.693738 0.607437) (xy 0.695598 0.650730)
     (xy 0.697995 0.686306) (xy 0.700996 0.715317) (xy 0.704670 0.738915) (xy 0.709086 0.758251) (xy 0.714310 0.774479) (xy 0.720411 0.788749) (xy 0.727457 0.802215) (xy 0.735517 0.816027)
     (xy 0.739082 0.821979) (xy 0.772783 0.865799) (xy 0.815623 0.898891) (xy 0.868990 0.921845) (xy 0.934270 0.935250) (xy 1.012850 0.939699) (xy 1.015662 0.939700) (xy 1.094855 0.935215)
     (xy 1.160762 0.921470) (xy 1.214738 0.897708) (xy 1.258141 0.863170) (xy 1.292329 0.817100) (xy 1.313070 0.773691) (xy 1.318933 0.758065) (xy 1.323551 0.742739) (xy 1.327106 0.725426)
     (xy 1.329783 0.703838) (xy 1.331768 0.675688) (xy 1.333243 0.638689) (xy 1.334393 0.590555) (xy 1.335403 0.528996) (xy 1.335949 0.489806) (xy 1.336972 0.415194) (xy 1.338189 0.355782)
     (xy 1.340181 0.309839) (xy 1.343527 0.275637) (xy 1.348806 0.251447) (xy 1.356599 0.235538) (xy 1.367485 0.226182) (xy 1.382044 0.221648) (xy 1.400856 0.220208) (xy 1.424500 0.220132)
     (xy 1.426349 0.220133) (xy 1.456811 0.220871) (xy 1.475753 0.224237) (xy 1.488563 0.231965) (xy 1.498782 0.243417) (xy 1.504029 0.250512) (xy 1.508133 0.258251) (xy 1.511199 0.268604)
     (xy 1.513333 0.283542) (xy 1.514640 0.305037) (xy 1.515226 0.335058) (xy 1.515196 0.375577) (xy 1.514656 0.428565) (xy 1.513712 0.495992) (xy 1.513409 0.516467) (xy 1.512141 0.591769)
     (xy 1.510735 0.652238) (xy 1.509057 0.699975) (xy 1.506977 0.737079) (xy 1.504364 0.765652) (xy 1.501085 0.787794) (xy 1.497010 0.805606) (xy 1.494872 0.812800) (xy 1.463404 0.890865)
     (xy 1.422536 0.955212) (xy 1.371154 1.006890) (xy 1.308144 1.046949) (xy 1.232392 1.076437) (xy 1.207805 1.083180) (xy 1.146800 1.094683) (xy 1.075731 1.101795) (xy 1.000981 1.104146)
     (xy 0.928935 1.101365) (xy 0.915329 1.100152) (xy 0.821713 1.084467) (xy 0.740238 1.057164) (xy 0.671004 1.018312) (xy 0.614111 0.967982) (xy 0.569659 0.906241) (xy 0.539600 0.838729)
     (xy 0.520700 0.783167) (xy 0.518366 0.023425) (xy 0.517987 -0.110044) (xy 0.517730 -0.227656) (xy 0.517610 -0.330483) (xy 0.517639 -0.419601) (xy 0.517832 -0.496084) (xy 0.518203 -0.561007)
     (xy 0.518766 -0.615444) (xy 0.519533 -0.660469) (xy 0.520520 -0.697158) (xy 0.521740 -0.726585) (xy 0.523206 -0.749824) (xy 0.524933 -0.767950) (xy 0.526934 -0.782037) (xy 0.528845 -0.791567)
     (xy 0.555080 -0.870306) (xy 0.594598 -0.938721) (xy 0.646872 -0.996282) (xy 0.711376 -1.042465) (xy 0.787581 -1.076741) (xy 0.825500 -1.088128) (xy 0.855567 -1.094062) (xy 0.896446 -1.099643)
     (xy 0.942020 -1.104123) (xy 0.973667 -1.106216) (xy 1.078845 -1.105736) )(layer F.SilkS) (width  0.010000)
  )
  (fp_poly (pts (xy 6.852492 -1.102816) (xy 6.906520 -1.098518) (xy 6.949610 -1.091912) (xy 6.959600 -1.089515) (xy 7.041713 -1.061692) (xy 7.109738 -1.025605) (xy 7.165033 -0.979940) (xy 7.208951 -0.923378)
     (xy 7.242850 -0.854605) (xy 7.262067 -0.795866) (xy 7.264700 -0.785268) (xy 7.267009 -0.773248) (xy 7.269015 -0.758686) (xy 7.270737 -0.740462) (xy 7.272199 -0.717453) (xy 7.273420 -0.688540)
     (xy 7.274422 -0.652602) (xy 7.275227 -0.608518) (xy 7.275855 -0.555167) (xy 7.276328 -0.491428) (xy 7.276666 -0.416181) (xy 7.276891 -0.328305) (xy 7.277024 -0.226678) (xy 7.277087 -0.110180)
     (xy 7.277100 0.000000) (xy 7.277081 0.129851) (xy 7.277009 0.243890) (xy 7.276862 0.343237) (xy 7.276621 0.429013) (xy 7.276263 0.502339) (xy 7.275767 0.564337) (xy 7.275113 0.616126)
     (xy 7.274278 0.658828) (xy 7.273243 0.693564) (xy 7.271985 0.721455) (xy 7.270483 0.743620) (xy 7.268717 0.761182) (xy 7.266665 0.775261) (xy 7.264305 0.786979) (xy 7.262057 0.795867)
     (xy 7.232335 0.876431) (xy 7.190635 0.945123) (xy 7.137305 1.001612) (xy 7.072697 1.045569) (xy 6.997162 1.076661) (xy 6.952466 1.087882) (xy 6.894235 1.096694) (xy 6.826400 1.102315)
     (xy 6.756042 1.104447) (xy 6.690243 1.102792) (xy 6.659034 1.100213) (xy 6.566986 1.083558) (xy 6.486126 1.055197) (xy 6.416969 1.015479) (xy 6.360029 0.964751) (xy 6.315819 0.903362)
     (xy 6.291612 0.851304) (xy 6.285524 0.834233) (xy 6.280168 0.816841) (xy 6.275504 0.797996) (xy 6.271489 0.776567) (xy 6.268083 0.751421) (xy 6.265243 0.721425) (xy 6.262929 0.685449)
     (xy 6.261098 0.642359) (xy 6.259709 0.591024) (xy 6.258720 0.530312) (xy 6.258091 0.459091) (xy 6.257780 0.376228) (xy 6.257744 0.280592) (xy 6.257943 0.171050) (xy 6.258335 0.046470)
     (xy 6.258687 -0.046567) (xy 6.259210 -0.174247) (xy 6.259474 -0.231915) (xy 6.435741 -0.231915) (xy 6.435967 -0.109144) (xy 6.436435 0.029633) (xy 6.436937 0.157847) (xy 6.437413 0.270277)
     (xy 6.437947 0.368070) (xy 6.438625 0.452376) (xy 6.439533 0.524343) (xy 6.440755 0.585119) (xy 6.442378 0.635853) (xy 6.444485 0.677693) (xy 6.447164 0.711789) (xy 6.450499 0.739287)
     (xy 6.454575 0.761337) (xy 6.459479 0.779088) (xy 6.465294 0.793687) (xy 6.472107 0.806283) (xy 6.480003 0.818025) (xy 6.489068 0.830061) (xy 6.496663 0.839943) (xy 6.530203 0.876098)
     (xy 6.569929 0.903205) (xy 6.618011 0.921991) (xy 6.676621 0.933185) (xy 6.747931 0.937514) (xy 6.787316 0.937367) (xy 6.833140 0.936268) (xy 6.866217 0.934603) (xy 6.890734 0.931588)
     (xy 6.910877 0.926437) (xy 6.930830 0.918368) (xy 6.954781 0.906596) (xy 6.956649 0.905646) (xy 6.993530 0.884596) (xy 7.019780 0.863145) (xy 7.041141 0.836558) (xy 7.042071 0.835176)
     (xy 7.052096 0.820342) (xy 7.060866 0.806967) (xy 7.068471 0.793867) (xy 7.074997 0.779862) (xy 7.080534 0.763769) (xy 7.085171 0.744408) (xy 7.088996 0.720596) (xy 7.092097 0.691151)
     (xy 7.094564 0.654892) (xy 7.096484 0.610637) (xy 7.097947 0.557205) (xy 7.099040 0.493413) (xy 7.099853 0.418080) (xy 7.100474 0.330024) (xy 7.100991 0.228063) (xy 7.101493 0.111016)
     (xy 7.101802 0.038100) (xy 7.102310 -0.103033) (xy 7.102540 -0.227776) (xy 7.102486 -0.336670) (xy 7.102145 -0.430257) (xy 7.101511 -0.509078) (xy 7.100579 -0.573673) (xy 7.099344 -0.624584)
     (xy 7.097801 -0.662353) (xy 7.095946 -0.687520) (xy 7.095102 -0.694266) (xy 7.077967 -0.766699) (xy 7.050221 -0.826166) (xy 7.011534 -0.873157) (xy 6.961576 -0.908161) (xy 6.945912 -0.915709)
     (xy 6.898655 -0.930978) (xy 6.840732 -0.940961) (xy 6.777741 -0.945082) (xy 6.715283 -0.942763) (xy 6.699944 -0.941050) (xy 6.626737 -0.926460) (xy 6.567199 -0.902710) (xy 6.520094 -0.868669)
     (xy 6.484184 -0.823208) (xy 6.458231 -0.765200) (xy 6.443415 -0.706966) (xy 6.441476 -0.690758) (xy 6.439829 -0.663528) (xy 6.438469 -0.624620) (xy 6.437388 -0.573377) (xy 6.436581 -0.509141)
     (xy 6.436042 -0.431257) (xy 6.435764 -0.339067) (xy 6.435741 -0.231915) (xy 6.259474 -0.231915) (xy 6.259723 -0.286121) (xy 6.260252 -0.383315) (xy 6.260825 -0.466958) (xy 6.261467 -0.538176)
     (xy 6.262207 -0.598096) (xy 6.263071 -0.647845) (xy 6.264085 -0.688551) (xy 6.265277 -0.721340) (xy 6.266673 -0.747340) (xy 6.268301 -0.767677) (xy 6.270187 -0.783479) (xy 6.272358 -0.795872)
     (xy 6.274840 -0.805985) (xy 6.276940 -0.812800) (xy 6.309562 -0.891742) (xy 6.351170 -0.956809) (xy 6.403010 -1.009154) (xy 6.466332 -1.049934) (xy 6.542382 -1.080302) (xy 6.575960 -1.089623)
     (xy 6.617102 -1.096890) (xy 6.669831 -1.101842) (xy 6.729642 -1.104479) (xy 6.792031 -1.104803) (xy 6.852492 -1.102816) )(layer F.SilkS) (width  0.010000)
  )
  (fp_poly (pts (xy -3.060100 -1.083248) (xy -2.998768 -1.082715) (xy -2.922653 -1.081876) (xy -2.901230 -1.081629) (xy -2.814805 -1.080529) (xy -2.743266 -1.079259) (xy -2.684564 -1.077580) (xy -2.636652 -1.075251)
     (xy -2.597482 -1.072035) (xy -2.565005 -1.067690) (xy -2.537175 -1.061979) (xy -2.511943 -1.054661) (xy -2.487261 -1.045497) (xy -2.461082 -1.034248) (xy -2.448961 -1.028759) (xy -2.404857 -1.002550)
     (xy -2.360183 -0.965710) (xy -2.320458 -0.923407) (xy -2.291444 -0.881256) (xy -2.276406 -0.851639) (xy -2.264251 -0.822234) (xy -2.254686 -0.790840) (xy -2.247420 -0.755257) (xy -2.242162 -0.713284)
     (xy -2.238620 -0.662721) (xy -2.236502 -0.601368) (xy -2.235516 -0.527024) (xy -2.235347 -0.457962) (xy -2.235680 -0.372644) (xy -2.236747 -0.302047) (xy -2.238815 -0.243962) (xy -2.242149 -0.196185)
     (xy -2.247016 -0.156507) (xy -2.253680 -0.122722) (xy -2.262410 -0.092624) (xy -2.273470 -0.064006) (xy -2.286149 -0.036646) (xy -2.319140 0.014858) (xy -2.364219 0.063038) (xy -2.416591 0.103262)
     (xy -2.450495 0.122114) (xy -2.480976 0.135751) (xy -2.510217 0.146693) (xy -2.540656 0.155280) (xy -2.574732 0.161849) (xy -2.614883 0.166741) (xy -2.663549 0.170294) (xy -2.723168 0.172848)
     (xy -2.796179 0.174741) (xy -2.834216 0.175471) (xy -3.064933 0.179578) (xy -3.064933 0.601624) (xy -3.065095 0.711476) (xy -3.065586 0.804860) (xy -3.066417 0.882242) (xy -3.067598 0.944085)
     (xy -3.069138 0.990851) (xy -3.071047 1.023006) (xy -3.073335 1.041012) (xy -3.074333 1.044301) (xy -3.092601 1.065756) (xy -3.121095 1.079500) (xy -3.154647 1.084881) (xy -3.188092 1.081246)
     (xy -3.216262 1.067942) (xy -3.221951 1.062952) (xy -3.242733 1.042170) (xy -3.242733 0.016933) (xy -2.986617 0.016672) (xy -2.918885 0.016333) (xy -2.853547 0.015504) (xy -2.793391 0.014258)
     (xy -2.741206 0.012668) (xy -2.699778 0.010808) (xy -2.671897 0.008751) (xy -2.667947 0.008291) (xy -2.594576 -0.007807) (xy -2.533592 -0.035447) (xy -2.484987 -0.074634) (xy -2.448754 -0.125375)
     (xy -2.436723 -0.151377) (xy -2.431015 -0.166609) (xy -2.426529 -0.181895) (xy -2.423082 -0.199532) (xy -2.420495 -0.221817) (xy -2.418583 -0.251047) (xy -2.417168 -0.289520) (xy -2.416065 -0.339533)
     (xy -2.415095 -0.403383) (xy -2.414755 -0.429244) (xy -2.413988 -0.501752) (xy -2.413814 -0.559644) (xy -2.414322 -0.605227) (xy -2.415598 -0.640810) (xy -2.417729 -0.668703) (xy -2.420801 -0.691212)
     (xy -2.424901 -0.710648) (xy -2.425411 -0.712668) (xy -2.447531 -0.776158) (xy -2.478717 -0.826225) (xy -2.520627 -0.864671) (xy -2.574917 -0.893300) (xy -2.599504 -0.902098) (xy -2.617994 -0.907063)
     (xy -2.640557 -0.911012) (xy -2.669533 -0.914114) (xy -2.707256 -0.916541) (xy -2.756064 -0.918462) (xy -2.818294 -0.920049) (xy -2.855383 -0.920774) (xy -3.064933 -0.924580) (xy -3.064933 -0.722407)
     (xy -3.064945 -0.652481) (xy -3.065448 -0.597653) (xy -3.067145 -0.556089) (xy -3.070740 -0.525956) (xy -3.076935 -0.505420) (xy -3.086433 -0.492646) (xy -3.099937 -0.485803) (xy -3.118150 -0.483054)
     (xy -3.141775 -0.482568) (xy -3.156853 -0.482600) (xy -3.193796 -0.483949) (xy -3.220345 -0.487692) (xy -3.232573 -0.492760) (xy -3.235609 -0.500802) (xy -3.238046 -0.519018) (xy -3.239925 -0.548592)
     (xy -3.241289 -0.590710) (xy -3.242181 -0.646558) (xy -3.242643 -0.717319) (xy -3.242733 -0.776393) (xy -3.242699 -0.851689) (xy -3.242521 -0.911886) (xy -3.242088 -0.958817) (xy -3.241290 -0.994318)
     (xy -3.240015 -1.020222) (xy -3.238152 -1.038363) (xy -3.235589 -1.050575) (xy -3.232215 -1.058694) (xy -3.227920 -1.064552) (xy -3.225080 -1.067520) (xy -3.220059 -1.072129) (xy -3.214022 -1.075834)
     (xy -3.205248 -1.078708) (xy -3.192017 -1.080826) (xy -3.172608 -1.082265) (xy -3.145299 -1.083098) (xy -3.108371 -1.083401) (xy -3.060100 -1.083248) )(layer F.SilkS) (width  0.010000)
  )
  (fp_poly (pts (xy -0.894799 -1.082734) (xy -0.869586 -1.079267) (xy -0.853164 -1.072628) (xy -0.848144 -1.068916) (xy -0.844983 -1.064307) (xy -0.840897 -1.054672) (xy -0.835694 -1.039220) (xy -0.829183 -1.017159)
     (xy -0.821175 -0.987699) (xy -0.811480 -0.950049) (xy -0.799907 -0.903417) (xy -0.786267 -0.847013) (xy -0.770367 -0.780046) (xy -0.752020 -0.701724) (xy -0.731034 -0.611257) (xy -0.707219 -0.507853)
     (xy -0.680384 -0.390722) (xy -0.650341 -0.259073) (xy -0.616897 -0.112114) (xy -0.597439 -0.026471) (xy -0.568104 0.102926) (xy -0.539833 0.228060) (xy -0.512855 0.347904) (xy -0.487396 0.461431)
     (xy -0.463684 0.567614) (xy -0.441944 0.665427) (xy -0.422404 0.753842) (xy -0.405291 0.831833) (xy -0.390833 0.898373) (xy -0.379255 0.952435) (xy -0.370785 0.992993) (xy -0.365650 1.019020)
     (xy -0.364066 1.029265) (xy -0.369611 1.055561) (xy -0.387111 1.072813) (xy -0.417869 1.081849) (xy -0.449679 1.083734) (xy -0.470622 1.083650) (xy -0.487787 1.082330) (xy -0.501953 1.078172)
     (xy -0.513903 1.069573) (xy -0.524416 1.054930) (xy -0.534273 1.032641) (xy -0.544255 1.001102) (xy -0.555142 0.958712) (xy -0.567716 0.903867) (xy -0.582757 0.834965) (xy -0.592239 0.791072)
     (xy -0.648838 0.529167) (xy -0.801826 0.526863) (xy -0.954815 0.524559) (xy -0.939058 0.454896) (xy -0.931825 0.422317) (xy -0.926285 0.396222) (xy -0.923336 0.380890) (xy -0.923084 0.378883)
     (xy -0.915041 0.376601) (xy -0.893103 0.374682) (xy -0.860306 0.373290) (xy -0.819687 0.372587) (xy -0.804333 0.372533) (xy -0.761732 0.372335) (xy -0.725924 0.371789) (xy -0.699937 0.370971)
     (xy -0.686801 0.369958) (xy -0.685800 0.369574) (xy -0.687526 0.360595) (xy -0.692472 0.336753) (xy -0.700289 0.299670) (xy -0.710627 0.250971) (xy -0.723137 0.192278) (xy -0.737469 0.125215)
     (xy -0.753274 0.051404) (xy -0.770204 -0.027529) (xy -0.787907 -0.109963) (xy -0.806036 -0.194273) (xy -0.824241 -0.278837) (xy -0.842172 -0.362030) (xy -0.859480 -0.442231) (xy -0.875816 -0.517814)
     (xy -0.890830 -0.587158) (xy -0.904174 -0.648638) (xy -0.915497 -0.700631) (xy -0.924450 -0.741514) (xy -0.930685 -0.769664) (xy -0.933851 -0.783457) (xy -0.934172 -0.784594) (xy -0.936199 -0.776770)
     (xy -0.941575 -0.753445) (xy -0.950068 -0.715669) (xy -0.961448 -0.664492) (xy -0.975485 -0.600963) (xy -0.991948 -0.526132) (xy -1.010607 -0.441050) (xy -1.031230 -0.346766) (xy -1.053589 -0.244330)
     (xy -1.077451 -0.134791) (xy -1.102587 -0.019201) (xy -1.128766 0.101393) (xy -1.134861 0.129495) (xy -1.166483 0.275191) (xy -1.194776 0.405197) (xy -1.219943 0.520387) (xy -1.242187 0.621632)
     (xy -1.261709 0.709804) (xy -1.278714 0.785775) (xy -1.293403 0.850418) (xy -1.305979 0.904603) (xy -1.316645 0.949205) (xy -1.325603 0.985093) (xy -1.333056 1.013141) (xy -1.339206 1.034221)
     (xy -1.344257 1.049204) (xy -1.348410 1.058963) (xy -1.351869 1.064369) (xy -1.352165 1.064684) (xy -1.368377 1.076825) (xy -1.389867 1.082537) (xy -1.415898 1.083734) (xy -1.449812 1.080872)
     (xy -1.475319 1.073186) (xy -1.479783 1.070553) (xy -1.494486 1.052853) (xy -1.498600 1.027188) (xy -1.496788 1.016389) (xy -1.491534 0.990297) (xy -1.483111 0.950139) (xy -1.471791 0.897144)
     (xy -1.457847 0.832539) (xy -1.441552 0.757553) (xy -1.423178 0.673412) (xy -1.402997 0.581346) (xy -1.381283 0.482581) (xy -1.358308 0.378346) (xy -1.334344 0.269867) (xy -1.309664 0.158374)
     (xy -1.284541 0.045094) (xy -1.259248 -0.068745) (xy -1.234056 -0.181915) (xy -1.209239 -0.293190) (xy -1.185070 -0.401339) (xy -1.161820 -0.505137) (xy -1.139762 -0.603355) (xy -1.119170 -0.694766)
     (xy -1.100315 -0.778140) (xy -1.083470 -0.852252) (xy -1.068909 -0.915872) (xy -1.056902 -0.967773) (xy -1.047724 -1.006728) (xy -1.041647 -1.031508) (xy -1.040761 -1.034906) (xy -1.032645 -1.056652)
     (xy -1.019948 -1.070944) (xy -0.999445 -1.079243) (xy -0.967908 -1.083006) (xy -0.932828 -1.083733) (xy -0.894799 -1.082734) )(layer F.SilkS) (width  0.010000)
  )
  (fp_poly (pts (xy 2.983795 -1.083712) (xy 3.060174 -1.083606) (xy 3.122614 -1.083355) (xy 3.172613 -1.082895) (xy 3.211669 -1.082167) (xy 3.241279 -1.081106) (xy 3.262941 -1.079652) (xy 3.278153 -1.077743)
     (xy 3.288411 -1.075318) (xy 3.295214 -1.072313) (xy 3.300059 -1.068667) (xy 3.302000 -1.066800) (xy 3.312950 -1.050484) (xy 3.318061 -1.026643) (xy 3.318933 -1.003300) (xy 3.316982 -0.971236)
     (xy 3.310171 -0.950371) (xy 3.302000 -0.939800) (xy 3.297082 -0.935467) (xy 3.290746 -0.931943) (xy 3.281321 -0.929145) (xy 3.267136 -0.926990) (xy 3.246520 -0.925393) (xy 3.217802 -0.924272)
     (xy 3.179311 -0.923542) (xy 3.129377 -0.923121) (xy 3.066328 -0.922924) (xy 2.988494 -0.922868) (xy 2.963333 -0.922866) (xy 2.641600 -0.922866) (xy 2.641600 -0.102266) (xy 2.917524 -0.099816)
     (xy 3.193447 -0.097367) (xy 3.209624 -0.077379) (xy 3.222650 -0.048847) (xy 3.225800 -0.016933) (xy 3.220828 0.021791) (xy 3.209624 0.043512) (xy 3.193447 0.063500) (xy 2.917524 0.065950)
     (xy 2.641600 0.068399) (xy 2.641600 0.913824) (xy 2.966687 0.916229) (xy 3.054293 0.916845) (xy 3.126461 0.917508) (xy 3.184684 0.918562) (xy 3.230453 0.920353) (xy 3.265262 0.923228)
     (xy 3.290603 0.927531) (xy 3.307969 0.933608) (xy 3.318852 0.941805) (xy 3.324745 0.952467) (xy 3.327140 0.965941) (xy 3.327530 0.982571) (xy 3.327400 0.999765) (xy 3.326384 1.028967)
     (xy 3.322035 1.047102) (xy 3.312403 1.059979) (xy 3.305092 1.066186) (xy 3.299427 1.070303) (xy 3.292831 1.073721) (xy 3.283776 1.076504) (xy 3.270734 1.078716) (xy 3.252177 1.080425)
     (xy 3.226579 1.081694) (xy 3.192412 1.082588) (xy 3.148148 1.083174) (xy 3.092260 1.083516) (xy 3.023221 1.083680) (xy 2.939502 1.083730) (xy 2.894074 1.083734) (xy 2.505364 1.083734)
     (xy 2.463800 1.042170) (xy 2.463800 0.001527) (xy 2.463803 -0.152738) (xy 2.463820 -0.290970) (xy 2.463868 -0.414071) (xy 2.463960 -0.522940) (xy 2.464112 -0.618479) (xy 2.464339 -0.701589)
     (xy 2.464655 -0.773170) (xy 2.465075 -0.834122) (xy 2.465614 -0.885348) (xy 2.466288 -0.927747) (xy 2.467110 -0.962220) (xy 2.468096 -0.989668) (xy 2.469261 -1.010992) (xy 2.470619 -1.027092)
     (xy 2.472185 -1.038870) (xy 2.473975 -1.047226) (xy 2.476003 -1.053060) (xy 2.478284 -1.057274) (xy 2.480833 -1.060768) (xy 2.481348 -1.061425) (xy 2.498896 -1.083733) (xy 2.891981 -1.083733)
     (xy 2.983795 -1.083712) )(layer F.SilkS) (width  0.010000)
  )
  (fp_poly (pts (xy 4.583702 -1.081646) (xy 4.667423 -1.080611) (xy 4.736054 -1.079471) (xy 4.791439 -1.078134) (xy 4.835421 -1.076508) (xy 4.869845 -1.074503) (xy 4.896554 -1.072025) (xy 4.917391 -1.068984)
     (xy 4.934201 -1.065289) (xy 4.938844 -1.064007) (xy 5.020811 -1.033687) (xy 5.089186 -0.993677) (xy 5.144801 -0.943159) (xy 5.188487 -0.881312) (xy 5.221077 -0.807317) (xy 5.230492 -0.776687)
     (xy 5.233091 -0.766192) (xy 5.235365 -0.753962) (xy 5.237335 -0.738865) (xy 5.239024 -0.719766) (xy 5.240451 -0.695534) (xy 5.241639 -0.665036) (xy 5.242609 -0.627138) (xy 5.243382 -0.580708)
     (xy 5.243981 -0.524613) (xy 5.244426 -0.457721) (xy 5.244738 -0.378897) (xy 5.244940 -0.287010) (xy 5.245052 -0.180927) (xy 5.245097 -0.059514) (xy 5.245100 -0.004233) (xy 5.245102 0.126574)
     (xy 5.245063 0.241610) (xy 5.244920 0.342034) (xy 5.244608 0.429009) (xy 5.244063 0.503695) (xy 5.243220 0.567254) (xy 5.242015 0.620846) (xy 5.240384 0.665634) (xy 5.238262 0.702778)
     (xy 5.235584 0.733439) (xy 5.232287 0.758779) (xy 5.228305 0.779958) (xy 5.223576 0.798139) (xy 5.218033 0.814481) (xy 5.211613 0.830147) (xy 5.204251 0.846298) (xy 5.197080 0.861540)
     (xy 5.158183 0.925142) (xy 5.106122 0.978200) (xy 5.040831 1.020765) (xy 4.962243 1.052888) (xy 4.938814 1.059756) (xy 4.919546 1.064649) (xy 4.900070 1.068630) (xy 4.878309 1.071826)
     (xy 4.852187 1.074362) (xy 4.819626 1.076364) (xy 4.778549 1.077959) (xy 4.726880 1.079274) (xy 4.662541 1.080433) (xy 4.583455 1.081564) (xy 4.578853 1.081625) (xy 4.285138 1.085508)
     (xy 4.241800 1.042170) (xy 4.241800 0.914400) (xy 4.419600 0.914400) (xy 4.621021 0.914400) (xy 4.693816 0.914080) (xy 4.751809 0.913049) (xy 4.797124 0.911200) (xy 4.831881 0.908426)
     (xy 4.858203 0.904620) (xy 4.870784 0.901809) (xy 4.931046 0.879934) (xy 4.978944 0.848031) (xy 5.016527 0.804231) (xy 5.045843 0.746665) (xy 5.048580 0.739602) (xy 5.052028 0.730253)
     (xy 5.055029 0.720917) (xy 5.057620 0.710399) (xy 5.059835 0.697504) (xy 5.061711 0.681038) (xy 5.063285 0.659805) (xy 5.064591 0.632610) (xy 5.065667 0.598259) (xy 5.066547 0.555557)
     (xy 5.067268 0.503307) (xy 5.067867 0.440317) (xy 5.068378 0.365390) (xy 5.068838 0.277332) (xy 5.069283 0.174947) (xy 5.069750 0.057041) (xy 5.069839 0.033867) (xy 5.070276 -0.106298)
     (xy 5.070435 -0.229998) (xy 5.070310 -0.337703) (xy 5.069898 -0.429878) (xy 5.069193 -0.506992) (xy 5.068192 -0.569512) (xy 5.066889 -0.617905) (xy 5.065280 -0.652638) (xy 5.063361 -0.674180)
     (xy 5.062913 -0.677104) (xy 5.044911 -0.747900) (xy 5.017161 -0.805185) (xy 4.978692 -0.849927) (xy 4.928535 -0.883097) (xy 4.865719 -0.905662) (xy 4.825949 -0.913818) (xy 4.800320 -0.916578)
     (xy 4.761400 -0.918998) (xy 4.712826 -0.920935) (xy 4.658240 -0.922248) (xy 4.601282 -0.922795) (xy 4.595283 -0.922803) (xy 4.419600 -0.922866) (xy 4.419600 0.914400) (xy 4.241800 0.914400)
     (xy 4.241800 -1.039116) (xy 4.259852 -1.062066) (xy 4.277905 -1.085016) (xy 4.583702 -1.081646) )(layer F.SilkS) (width  0.010000)
  )
  (fp_poly (pts (xy 8.823505 -1.092144) (xy 8.884390 -1.091564) (xy 8.933422 -1.090366) (xy 8.971872 -1.088350) (xy 9.001010 -1.085314) (xy 9.022105 -1.081057) (xy 9.036428 -1.075376) (xy 9.045248 -1.068071)
     (xy 9.049836 -1.058939) (xy 9.051462 -1.047780) (xy 9.051396 -1.034391) (xy 9.050907 -1.018572) (xy 9.050867 -1.013831) (xy 9.049759 -0.985000) (xy 9.045071 -0.967066) (xy 9.034751 -0.954062)
     (xy 9.028558 -0.948881) (xy 9.020229 -0.943059) (xy 9.010468 -0.938687) (xy 8.996887 -0.935558) (xy 8.977094 -0.933466) (xy 8.948700 -0.932205) (xy 8.909315 -0.931569) (xy 8.856549 -0.931350)
     (xy 8.825358 -0.931333) (xy 8.644467 -0.931333) (xy 8.644467 0.054096) (xy 8.644510 0.207547) (xy 8.644595 0.344950) (xy 8.644656 0.467185) (xy 8.644627 0.575138) (xy 8.644442 0.669690)
     (xy 8.644034 0.751725) (xy 8.643338 0.822127) (xy 8.642286 0.881778) (xy 8.640814 0.931562) (xy 8.638854 0.972362) (xy 8.636341 1.005061) (xy 8.633209 1.030543) (xy 8.629391 1.049690)
     (xy 8.624820 1.063386) (xy 8.619432 1.072515) (xy 8.613160 1.077959) (xy 8.605937 1.080601) (xy 8.597698 1.081325) (xy 8.588376 1.081014) (xy 8.577906 1.080551) (xy 8.567557 1.080728)
     (xy 8.537944 1.080927) (xy 8.512780 1.078293) (xy 8.503204 1.075669) (xy 8.484385 1.062167) (xy 8.475687 1.050901) (xy 8.474133 1.041010) (xy 8.472734 1.017243) (xy 8.471487 0.979308)
     (xy 8.470390 0.926913) (xy 8.469440 0.859764) (xy 8.468634 0.777570) (xy 8.467970 0.680038) (xy 8.467446 0.566876) (xy 8.467058 0.437791) (xy 8.466803 0.292492) (xy 8.466680 0.130685)
     (xy 8.466667 0.051357) (xy 8.466667 -0.931333) (xy 8.285775 -0.931333) (xy 8.225643 -0.931423) (xy 8.180053 -0.931831) (xy 8.146616 -0.932762) (xy 8.122942 -0.934425) (xy 8.106641 -0.937023)
     (xy 8.095322 -0.940766) (xy 8.086595 -0.945857) (xy 8.082575 -0.948881) (xy 8.069611 -0.961305) (xy 8.062894 -0.976115) (xy 8.060475 -0.999121) (xy 8.060267 -1.015302) (xy 8.059910 -1.031457)
     (xy 8.059686 -1.045187) (xy 8.060861 -1.056688) (xy 8.064703 -1.066157) (xy 8.072478 -1.073789) (xy 8.085454 -1.079781) (xy 8.104898 -1.084329) (xy 8.132077 -1.087629) (xy 8.168259 -1.089877)
     (xy 8.214710 -1.091269) (xy 8.272698 -1.092002) (xy 8.343491 -1.092271) (xy 8.428354 -1.092274) (xy 8.528556 -1.092205) (xy 8.557038 -1.092200) (xy 8.661099 -1.092261) (xy 8.749499 -1.092310)
     (xy 8.823505 -1.092144) )(layer F.SilkS) (width  0.010000)
  )
  (fp_poly (pts (xy -7.871059 -0.343601) (xy -7.800114 -0.327364) (xy -7.766554 -0.313755) (xy -7.702516 -0.275012) (xy -7.649844 -0.225265) (xy -7.609308 -0.166717) (xy -7.581675 -0.101572) (xy -7.567714 -0.032033)
     (xy -7.568195 0.039697) (xy -7.583886 0.111414) (xy -7.602423 0.156610) (xy -7.641471 0.217541) (xy -7.692244 0.268059) (xy -7.752312 0.307044) (xy -7.819246 0.333379) (xy -7.890615 0.345944)
     (xy -7.963991 0.343621) (xy -7.995770 0.337716) (xy -8.057947 0.314990) (xy -8.116954 0.278048) (xy -8.169520 0.229610) (xy -8.212374 0.172391) (xy -8.227100 0.145561) (xy -8.237498 0.123014)
     (xy -8.244319 0.102969) (xy -8.248305 0.080850) (xy -8.250201 0.052080) (xy -8.250752 0.012084) (xy -8.250766 0.000000) (xy -8.250433 -0.043459) (xy -8.248937 -0.074566) (xy -8.245533 -0.097896)
     (xy -8.239479 -0.118027) (xy -8.230030 -0.139534) (xy -8.227100 -0.145561) (xy -8.186891 -0.209782) (xy -8.136138 -0.262574) (xy -8.077011 -0.303143) (xy -8.011676 -0.330699) (xy -7.942302 -0.344449)
     (xy -7.871059 -0.343601) )(layer F.SilkS) (width  0.010000)
  )
  (fp_poly (pts (xy -7.045847 -0.968135) (xy -7.002361 -0.944907) (xy -6.966148 -0.909731) (xy -6.954004 -0.891672) (xy -6.935346 -0.844161) (xy -6.930590 -0.792590) (xy -6.939125 -0.741268) (xy -6.960340 -0.694505)
     (xy -6.986408 -0.662921) (xy -7.025320 -0.637304) (xy -7.072898 -0.622272) (xy -7.124053 -0.618532) (xy -7.173695 -0.626797) (xy -7.193032 -0.634092) (xy -7.233751 -0.661363) (xy -7.265933 -0.700246)
     (xy -7.287472 -0.746687) (xy -7.296264 -0.796635) (xy -7.294186 -0.828828) (xy -7.286103 -0.855966) (xy -7.271956 -0.887102) (xy -7.263611 -0.901580) (xy -7.230375 -0.939582) (xy -7.188872 -0.965139)
     (xy -7.142211 -0.978351) (xy -7.093500 -0.979316) (xy -7.045847 -0.968135) )(layer F.SilkS) (width  0.010000)
  )
)
