ISO-10303-21;
HEADER;
FILE_DESCRIPTION (( 'STEP AP214' ),
    '1' );
FILE_NAME ('150080VS75000.STEP',
    '2023-01-25T08:29:49',
    ( '' ),
    ( '' ),
    'SwSTEP 2.0',
    'SolidWorks 2019',
    '' );
FILE_SCHEMA (( 'AUTOMOTIVE_DESIGN' ));
ENDSEC;

DATA;
#1 = MECHANICAL_DESIGN_GEOMETRIC_PRESENTATION_REPRESENTATION (  '', ( #451 ), #1291 ) ;
#2 = ORIENTED_EDGE ( 'NONE', *, *, #195, .T. ) ;
#3 = EDGE_CURVE ( 'NONE', #335, #925, #791, .T. ) ;
#4 = LINE ( 'NONE', #317, #1137 ) ;
#5 = FILL_AREA_STYLE ('',( #217 ) ) ;
#6 = CARTESIAN_POINT ( 'NONE',  ( -0.6999999999999998446, 0.2999999999999999889, 0.5000000000000000000 ) ) ;
#7 = ORIENTED_EDGE ( 'NONE', *, *, #524, .F. ) ;
#8 =( GEOMETRIC_REPRESENTATION_CONTEXT ( 3 ) GLOBAL_UNCERTAINTY_ASSIGNED_CONTEXT ( ( #184 ) ) GLOBAL_UNIT_ASSIGNED_CONTEXT ( ( #606, #712, #396 ) ) REPRESENTATION_CONTEXT ( 'NONE', 'WORKASPACE' ) );
#9 = VERTEX_POINT ( 'NONE', #97 ) ;
#10 = CARTESIAN_POINT ( 'NONE',  ( -1.000000000000000000, 0.2999999999999999889, 0.5000000000000000000 ) ) ;
#11 = FILL_AREA_STYLE_COLOUR ( '', #1067 ) ;
#12 = DIRECTION ( 'NONE',  ( -0.000000000000000000, 1.000000000000000000, -0.000000000000000000 ) ) ;
#13 = ORIENTED_EDGE ( 'NONE', *, *, #52, .T. ) ;
#14 = SURFACE_STYLE_USAGE ( .BOTH. , #512 ) ;
#15 = ORIENTED_EDGE ( 'NONE', *, *, #415, .F. ) ;
#16 = PRODUCT_DEFINITION ( 'UNKNOWN', '', #834, #1196 ) ;
#17 = EDGE_LOOP ( 'NONE', ( #351, #51, #199, #371 ) ) ;
#18 = CIRCLE ( 'NONE', #737, 0.2000000000000000111 ) ;
#19 = SURFACE_STYLE_USAGE ( .BOTH. , #201 ) ;
#20 = CARTESIAN_POINT ( 'NONE',  ( 0.7000000000000000666, 0.6999999999999999556, -0.5000000000000000000 ) ) ;
#21 = ORIENTED_EDGE ( 'NONE', *, *, #1170, .T. ) ;
#22 = COLOUR_RGB ( '',0.9411764705882352811, 0.9607843137254902244, 0.9686274509803921573 ) ;
#23 = VECTOR ( 'NONE', #130, 1000.000000000000000 ) ;
#24 =( GEOMETRIC_REPRESENTATION_CONTEXT ( 3 ) GLOBAL_UNCERTAINTY_ASSIGNED_CONTEXT ( ( #35 ) ) GLOBAL_UNIT_ASSIGNED_CONTEXT ( ( #866, #296, #166 ) ) REPRESENTATION_CONTEXT ( 'NONE', 'WORKASPACE' ) );
#25 = CARTESIAN_POINT ( 'NONE',  ( 1.676296954624746903E-16, -0.9164894359474625718, -0.4122962788466856821 ) ) ;
#26 = VERTEX_POINT ( 'NONE', #93 ) ;
#27 = MECHANICAL_DESIGN_GEOMETRIC_PRESENTATION_REPRESENTATION (  '', ( #1187 ), #509 ) ;
#28 = SURFACE_SIDE_STYLE ('',( #1055 ) ) ;
#29 =( LENGTH_UNIT ( ) NAMED_UNIT ( * ) SI_UNIT ( .MILLI., .METRE. ) );
#30 = ORIENTED_EDGE ( 'NONE', *, *, #882, .T. ) ;
#31 = CARTESIAN_POINT ( 'NONE',  ( -1.000000000000000000, 0.000000000000000000, -0.4122962788466861261 ) ) ;
#32 = CARTESIAN_POINT ( 'NONE',  ( 0.7000000000000000666, 0.6999999999999999556, 0.5000000000000000000 ) ) ;
#33 = ORIENTED_EDGE ( 'NONE', *, *, #48, .F. ) ;
#34 = SURFACE_STYLE_USAGE ( .BOTH. , #247 ) ;
#35 = UNCERTAINTY_MEASURE_WITH_UNIT (LENGTH_MEASURE( 1.000000000000000082E-05 ), #866, 'distance_accuracy_value', 'NONE');
#36 = CARTESIAN_POINT ( 'NONE',  ( 0.000000000000000000, -0.9164894359474625718, 0.4122962788466863482 ) ) ;
#37 =( NAMED_UNIT ( * ) SI_UNIT ( $, .STERADIAN. ) SOLID_ANGLE_UNIT ( ) );
#38 = LINE ( 'NONE', #1057, #847 ) ;
#39 = FACE_OUTER_BOUND ( 'NONE', #1060, .T. ) ;
#40 = SURFACE_SIDE_STYLE ('',( #1165 ) ) ;
#41 =( NAMED_UNIT ( * ) PLANE_ANGLE_UNIT ( ) SI_UNIT ( $, .RADIAN. ) );
#42 = ORIENTED_EDGE ( 'NONE', *, *, #915, .T. ) ;
#43 = DIRECTION ( 'NONE',  ( 0.000000000000000000, -0.000000000000000000, 1.000000000000000000 ) ) ;
#44 = CARTESIAN_POINT ( 'NONE',  ( -1.000000000000000000, 0.000000000000000000, 2.168404344971008868E-16 ) ) ;
#45 = ADVANCED_FACE ( 'NONE', ( #306 ), #1238, .F. ) ;
#46 = DIRECTION ( 'NONE',  ( 0.000000000000000000, -0.000000000000000000, 1.000000000000000000 ) ) ;
#47 = STYLED_ITEM ( 'NONE', ( #375 ), #595 ) ;
#48 = EDGE_CURVE ( 'NONE', #1015, #623, #885, .T. ) ;
#49 =( LENGTH_UNIT ( ) NAMED_UNIT ( * ) SI_UNIT ( .MILLI., .METRE. ) );
#50 = STYLED_ITEM ( 'NONE', ( #132 ), #355 ) ;
#51 = ORIENTED_EDGE ( 'NONE', *, *, #785, .T. ) ;
#52 = EDGE_CURVE ( 'NONE', #480, #1149, #690, .T. ) ;
#53 = VECTOR ( 'NONE', #1063, 1000.000000000000000 ) ;
#54 =( LENGTH_UNIT ( ) NAMED_UNIT ( * ) SI_UNIT ( .MILLI., .METRE. ) );
#55 = CARTESIAN_POINT ( 'NONE',  ( 0.7000000000000000666, 0.2999999999999999889, -0.5000000000000000000 ) ) ;
#56 = CARTESIAN_POINT ( 'NONE',  ( 0.5999999999999999778, 0.000000000000000000, -7.889002846581611863E-17 ) ) ;
#57 = ORIENTED_EDGE ( 'NONE', *, *, #918, .F. ) ;
#58 = VERTEX_POINT ( 'NONE', #32 ) ;
#59 = CARTESIAN_POINT ( 'NONE',  ( -1.000000000000000000, 0.000000000000000000, -0.2000000000000005107 ) ) ;
#60 = EDGE_LOOP ( 'NONE', ( #1218, #686, #656, #472 ) ) ;
#61 = DIRECTION ( 'NONE',  ( 0.000000000000000000, 1.000000000000000000, 0.000000000000000000 ) ) ;
#62 =( NAMED_UNIT ( * ) PLANE_ANGLE_UNIT ( ) SI_UNIT ( $, .RADIAN. ) );
#63 = EDGE_CURVE ( 'NONE', #252, #1015, #432, .T. ) ;
#64 = VECTOR ( 'NONE', #456, 1000.000000000000000 ) ;
#65 = ADVANCED_FACE ( 'NONE', ( #548 ), #354, .F. ) ;
#66 = DIRECTION ( 'NONE',  ( 0.000000000000000000, 0.000000000000000000, 1.000000000000000000 ) ) ;
#67 = FACE_OUTER_BOUND ( 'NONE', #454, .T. ) ;
#68 = SURFACE_STYLE_FILL_AREA ( #290 ) ;
#69 = EDGE_CURVE ( 'NONE', #157, #949, #459, .T. ) ;
#70 = STYLED_ITEM ( 'NONE', ( #886 ), #257 ) ;
#71 = ORIENTED_EDGE ( 'NONE', *, *, #958, .F. ) ;
#72 = STYLED_ITEM ( 'NONE', ( #890 ), #770 ) ;
#73 = FILL_AREA_STYLE ('',( #572 ) ) ;
#74 = FACE_OUTER_BOUND ( 'NONE', #17, .T. ) ;
#75 = DIRECTION ( 'NONE',  ( 0.000000000000000000, 1.000000000000000000, 0.000000000000000000 ) ) ;
#76 =( NAMED_UNIT ( * ) SI_UNIT ( $, .STERADIAN. ) SOLID_ANGLE_UNIT ( ) );
#77 = PLANE ( 'NONE',  #717 ) ;
#78 = DIRECTION ( 'NONE',  ( 0.000000000000000000, 1.000000000000000000, -0.000000000000000000 ) ) ;
#79 = EDGE_CURVE ( 'NONE', #480, #803, #864, .T. ) ;
#80 = SURFACE_STYLE_FILL_AREA ( #1203 ) ;
#81 = EDGE_CURVE ( 'NONE', #893, #528, #1284, .T. ) ;
#82 = UNCERTAINTY_MEASURE_WITH_UNIT (LENGTH_MEASURE( 1.000000000000000082E-05 ), #519, 'distance_accuracy_value', 'NONE');
#83 = PRESENTATION_STYLE_ASSIGNMENT (( #596 ) ) ;
#84 =( LENGTH_UNIT ( ) NAMED_UNIT ( * ) SI_UNIT ( .MILLI., .METRE. ) );
#85 = FILL_AREA_STYLE_COLOUR ( '', #561 ) ;
#86 = CARTESIAN_POINT ( 'NONE',  ( -1.000000000000000000, 0.000000000000000000, 0.5000000000000000000 ) ) ;
#87 = CLOSED_SHELL ( 'NONE', ( #1217, #441, #789, #45, #479, #327 ) ) ;
#88 =( GEOMETRIC_REPRESENTATION_CONTEXT ( 3 ) GLOBAL_UNCERTAINTY_ASSIGNED_CONTEXT ( ( #230 ) ) GLOBAL_UNIT_ASSIGNED_CONTEXT ( ( #745, #946, #854 ) ) REPRESENTATION_CONTEXT ( 'NONE', 'WORKASPACE' ) );
#89 = EDGE_CURVE ( 'NONE', #1233, #1122, #646, .T. ) ;
#90 = AXIS2_PLACEMENT_3D ( 'NONE', #1298, #1003, #985 ) ;
#91 = SURFACE_STYLE_FILL_AREA ( #1188 ) ;
#92 = LINE ( 'NONE', #289, #110 ) ;
#93 = CARTESIAN_POINT ( 'NONE',  ( 0.9999999999999997780, 0.2999999999999999889, -0.5000000000000000000 ) ) ;
#94 =( GEOMETRIC_REPRESENTATION_CONTEXT ( 3 ) GLOBAL_UNCERTAINTY_ASSIGNED_CONTEXT ( ( #499 ) ) GLOBAL_UNIT_ASSIGNED_CONTEXT ( ( #1273, #41, #442 ) ) REPRESENTATION_CONTEXT ( 'NONE', 'WORKASPACE' ) );
#95 = CARTESIAN_POINT ( 'NONE',  ( -0.6999999999999998446, 0.2999999999999999889, 0.5000000000000000000 ) ) ;
#96 =( NAMED_UNIT ( * ) PLANE_ANGLE_UNIT ( ) SI_UNIT ( $, .RADIAN. ) );
#97 = CARTESIAN_POINT ( 'NONE',  ( 1.000000000000000000, 0.2999999999999999889, -0.2000000000000005107 ) ) ;
#98 = DIRECTION ( 'NONE',  ( 1.000000000000000000, 0.000000000000000000, 4.065758146820642121E-16 ) ) ;
#99 =( NAMED_UNIT ( * ) PLANE_ANGLE_UNIT ( ) SI_UNIT ( $, .RADIAN. ) );
#100 = EDGE_CURVE ( 'NONE', #949, #1233, #855, .T. ) ;
#101 =( LENGTH_UNIT ( ) NAMED_UNIT ( * ) SI_UNIT ( .MILLI., .METRE. ) );
#102 = ORIENTED_EDGE ( 'NONE', *, *, #302, .T. ) ;
#103 = UNCERTAINTY_MEASURE_WITH_UNIT (LENGTH_MEASURE( 1.000000000000000082E-05 ), #105, 'distance_accuracy_value', 'NONE');
#104 = SURFACE_STYLE_FILL_AREA ( #1011 ) ;
#105 =( LENGTH_UNIT ( ) NAMED_UNIT ( * ) SI_UNIT ( .MILLI., .METRE. ) );
#106 = EDGE_CURVE ( 'NONE', #473, #26, #860, .T. ) ;
#107 =( NAMED_UNIT ( * ) SI_UNIT ( $, .STERADIAN. ) SOLID_ANGLE_UNIT ( ) );
#108 = ORIENTED_EDGE ( 'NONE', *, *, #565, .T. ) ;
#109 =( NAMED_UNIT ( * ) SI_UNIT ( $, .STERADIAN. ) SOLID_ANGLE_UNIT ( ) );
#110 = VECTOR ( 'NONE', #387, 1000.000000000000000 ) ;
#111 = FILL_AREA_STYLE_COLOUR ( '', #1178 ) ;
#112 = VECTOR ( 'NONE', #213, 1000.000000000000000 ) ;
#113 = VECTOR ( 'NONE', #883, 1000.000000000000000 ) ;
#114 = SURFACE_STYLE_USAGE ( .BOTH. , #1017 ) ;
#115 = LINE ( 'NONE', #1014, #867 ) ;
#116 = DIRECTION ( 'NONE',  ( 0.000000000000000000, -0.000000000000000000, 1.000000000000000000 ) ) ;
#117 = ORIENTED_EDGE ( 'NONE', *, *, #1047, .F. ) ;
#118 = EDGE_CURVE ( 'NONE', #121, #1015, #739, .T. ) ;
#119 = DIRECTION ( 'NONE',  ( 1.000000000000000000, 0.000000000000000000, 4.065758146820641134E-16 ) ) ;
#120 = EDGE_LOOP ( 'NONE', ( #1026, #427, #33, #357, #436, #1094, #857, #1269 ) ) ;
#121 = VERTEX_POINT ( 'NONE', #369 ) ;
#122 = COLOUR_RGB ( '',0.6666666666666666297, 0.6980392156862744724, 0.7686274509803920907 ) ;
#123 = SURFACE_STYLE_USAGE ( .BOTH. , #332 ) ;
#124 = DIRECTION ( 'NONE',  ( -2.168404344971009361E-16, 0.000000000000000000, -1.000000000000000000 ) ) ;
#125 = ORIENTED_EDGE ( 'NONE', *, *, #1078, .T. ) ;
#126 = ORIENTED_EDGE ( 'NONE', *, *, #180, .F. ) ;
#127 = AXIS2_PLACEMENT_3D ( 'NONE', #146, #753, #930 ) ;
#128 = DIRECTION ( 'NONE',  ( 2.168404344971009361E-16, -0.000000000000000000, 1.000000000000000000 ) ) ;
#129 = CIRCLE ( 'NONE', #366, 0.2000000000000000111 ) ;
#130 = DIRECTION ( 'NONE',  ( -0.000000000000000000, -1.000000000000000000, -0.000000000000000000 ) ) ;
#131 =( GEOMETRIC_REPRESENTATION_CONTEXT ( 3 ) GLOBAL_UNCERTAINTY_ASSIGNED_CONTEXT ( ( #181 ) ) GLOBAL_UNIT_ASSIGNED_CONTEXT ( ( #1028, #1140, #209 ) ) REPRESENTATION_CONTEXT ( 'NONE', 'WORKASPACE' ) );
#132 = PRESENTATION_STYLE_ASSIGNMENT (( #348 ) ) ;
#133 = PRESENTATION_LAYER_ASSIGNMENT (  '', '', ( #370 ) ) ;
#134 = VECTOR ( 'NONE', #895, 1000.000000000000000 ) ;
#135 = CARTESIAN_POINT ( 'NONE',  ( -1.000000000000000000, 0.000000000000000000, -0.2000000000000000111 ) ) ;
#136 = SURFACE_STYLE_FILL_AREA ( #636 ) ;
#137 = SURFACE_STYLE_USAGE ( .BOTH. , #932 ) ;
#138 = FACE_OUTER_BOUND ( 'NONE', #120, .T. ) ;
#139 = FILL_AREA_STYLE ('',( #336 ) ) ;
#140 = CARTESIAN_POINT ( 'NONE',  ( 0.000000000000000000, 0.6999999999999999556, 0.000000000000000000 ) ) ;
#141 = DIRECTION ( 'NONE',  ( -1.000000000000000000, -0.000000000000000000, -0.000000000000000000 ) ) ;
#142 = STYLED_ITEM ( 'NONE', ( #655 ), #1051 ) ;
#143 = ADVANCED_FACE ( 'NONE', ( #1268 ), #659, .F. ) ;
#144 = AXIS2_PLACEMENT_3D ( 'NONE', #1300, #182, #586 ) ;
#145 = DIRECTION ( 'NONE',  ( 0.000000000000000000, 1.000000000000000000, -0.000000000000000000 ) ) ;
#146 = CARTESIAN_POINT ( 'NONE',  ( 0.000000000000000000, 0.2999999999999999889, 0.000000000000000000 ) ) ;
#147 = DIRECTION ( 'NONE',  ( 0.000000000000000000, 1.000000000000000000, 0.000000000000000000 ) ) ;
#148 = VERTEX_POINT ( 'NONE', #135 ) ;
#149 = PLANE ( 'NONE',  #409 ) ;
#150 = PRODUCT ( '150080VS75000', '150080VS75000', '', ( #504 ) ) ;
#151 =( NAMED_UNIT ( * ) SI_UNIT ( $, .STERADIAN. ) SOLID_ANGLE_UNIT ( ) );
#152 = VECTOR ( 'NONE', #218, 1000.000000000000000 ) ;
#153 = COLOUR_RGB ( '',0.3176470588235293935, 0.2470588235294117752, 0.2078431372549019440 ) ;
#154 =( NAMED_UNIT ( * ) PLANE_ANGLE_UNIT ( ) SI_UNIT ( $, .RADIAN. ) );
#155 = CARTESIAN_POINT ( 'NONE',  ( -1.000000000000000000, -0.9164894359474625718, 0.000000000000000000 ) ) ;
#156 = FILL_AREA_STYLE_COLOUR ( '', #304 ) ;
#157 = VERTEX_POINT ( 'NONE', #350 ) ;
#158 = DIRECTION ( 'NONE',  ( 0.000000000000000000, 1.000000000000000000, 0.000000000000000000 ) ) ;
#159 = DIRECTION ( 'NONE',  ( 1.314833807763602224E-16, 0.000000000000000000, 1.000000000000000000 ) ) ;
#160 = SURFACE_STYLE_FILL_AREA ( #984 ) ;
#161 = SURFACE_STYLE_FILL_AREA ( #869 ) ;
#162 = ORIENTED_EDGE ( 'NONE', *, *, #385, .F. ) ;
#163 = ORIENTED_EDGE ( 'NONE', *, *, #880, .T. ) ;
#164 =( LENGTH_UNIT ( ) NAMED_UNIT ( * ) SI_UNIT ( .MILLI., .METRE. ) );
#165 = LINE ( 'NONE', #983, #1204 ) ;
#166 =( NAMED_UNIT ( * ) SI_UNIT ( $, .STERADIAN. ) SOLID_ANGLE_UNIT ( ) );
#167 = AXIS2_PLACEMENT_3D ( 'NONE', #1215, #688, #597 ) ;
#168 = CARTESIAN_POINT ( 'NONE',  ( 0.9999999999999997780, 0.2999999999999999889, -0.5000000000000000000 ) ) ;
#169 = ORIENTED_EDGE ( 'NONE', *, *, #859, .T. ) ;
#170 = AXIS2_PLACEMENT_3D ( 'NONE', #1054, #347, #858 ) ;
#171 = DIRECTION ( 'NONE',  ( 1.000000000000000000, 0.000000000000000000, 0.000000000000000000 ) ) ;
#172 = PRESENTATION_LAYER_ASSIGNMENT (  '', '', ( #242 ) ) ;
#173 = SURFACE_STYLE_FILL_AREA ( #573 ) ;
#174 = ADVANCED_FACE ( 'NONE', ( #232 ), #936, .T. ) ;
#175 =( NAMED_UNIT ( * ) PLANE_ANGLE_UNIT ( ) SI_UNIT ( $, .RADIAN. ) );
#176 = VERTEX_POINT ( 'NONE', #979 ) ;
#177 = SURFACE_STYLE_FILL_AREA ( #295 ) ;
#178 = CARTESIAN_POINT ( 'NONE',  ( 0.9999999999999997780, 0.000000000000000000, -0.5000000000000000000 ) ) ;
#179 = FACE_OUTER_BOUND ( 'NONE', #292, .T. ) ;
#180 = EDGE_CURVE ( 'NONE', #1144, #719, #1076, .T. ) ;
#181 = UNCERTAINTY_MEASURE_WITH_UNIT (LENGTH_MEASURE( 1.000000000000000082E-05 ), #1028, 'distance_accuracy_value', 'NONE');
#182 = DIRECTION ( 'NONE',  ( -1.000000000000000000, 0.000000000000000000, 0.000000000000000000 ) ) ;
#183 = LINE ( 'NONE', #469, #515 ) ;
#184 = UNCERTAINTY_MEASURE_WITH_UNIT (LENGTH_MEASURE( 1.000000000000000082E-05 ), #606, 'distance_accuracy_value', 'NONE');
#185 = AXIS2_PLACEMENT_3D ( 'NONE', #411, #216, #533 ) ;
#186 = PRESENTATION_LAYER_ASSIGNMENT (  '', '', ( #1127 ) ) ;
#187 = PRESENTATION_LAYER_ASSIGNMENT (  '', '', ( #760 ) ) ;
#188 = DIRECTION ( 'NONE',  ( 1.000000000000000000, 0.000000000000000000, 0.000000000000000000 ) ) ;
#189 = UNCERTAINTY_MEASURE_WITH_UNIT (LENGTH_MEASURE( 1.000000000000000082E-05 ), #29, 'distance_accuracy_value', 'NONE');
#190 = CARTESIAN_POINT ( 'NONE',  ( 1.000000000000000000, 0.000000000000000000, -0.4122962788466862372 ) ) ;
#191 = PRESENTATION_LAYER_ASSIGNMENT (  '', '', ( #517 ) ) ;
#192 = LINE ( 'NONE', #1035, #1318 ) ;
#193 =( NAMED_UNIT ( * ) SI_UNIT ( $, .STERADIAN. ) SOLID_ANGLE_UNIT ( ) );
#194 = LINE ( 'NONE', #1116, #650 ) ;
#195 = EDGE_CURVE ( 'NONE', #521, #272, #297, .T. ) ;
#196 = SURFACE_SIDE_STYLE ('',( #899 ) ) ;
#197 = LINE ( 'NONE', #313, #152 ) ;
#198 =( NAMED_UNIT ( * ) PLANE_ANGLE_UNIT ( ) SI_UNIT ( $, .RADIAN. ) );
#199 = ORIENTED_EDGE ( 'NONE', *, *, #1251, .F. ) ;
#200 = VECTOR ( 'NONE', #849, 1000.000000000000000 ) ;
#201 = SURFACE_SIDE_STYLE ('',( #1117 ) ) ;
#202 = FACE_OUTER_BOUND ( 'NONE', #425, .T. ) ;
#203 = ORIENTED_EDGE ( 'NONE', *, *, #622, .F. ) ;
#204 = FILL_AREA_STYLE ('',( #610 ) ) ;
#205 = ORIENTED_EDGE ( 'NONE', *, *, #1315, .F. ) ;
#206 =( GEOMETRIC_REPRESENTATION_CONTEXT ( 3 ) GLOBAL_UNCERTAINTY_ASSIGNED_CONTEXT ( ( #395 ) ) GLOBAL_UNIT_ASSIGNED_CONTEXT ( ( #728, #96, #852 ) ) REPRESENTATION_CONTEXT ( 'NONE', 'WORKASPACE' ) );
#207 = DIRECTION ( 'NONE',  ( 0.000000000000000000, 0.000000000000000000, 1.000000000000000000 ) ) ;
#208 = ADVANCED_FACE ( 'NONE', ( #179 ), #790, .F. ) ;
#209 =( NAMED_UNIT ( * ) SI_UNIT ( $, .STERADIAN. ) SOLID_ANGLE_UNIT ( ) );
#210 = VECTOR ( 'NONE', #12, 1000.000000000000000 ) ;
#211 = PRESENTATION_STYLE_ASSIGNMENT (( #1128 ) ) ;
#212 = ORIENTED_EDGE ( 'NONE', *, *, #785, .F. ) ;
#213 = DIRECTION ( 'NONE',  ( 2.168404344971009361E-16, -0.000000000000000000, 1.000000000000000000 ) ) ;
#214 = ORIENTED_EDGE ( 'NONE', *, *, #302, .F. ) ;
#215 = ORIENTED_EDGE ( 'NONE', *, *, #648, .T. ) ;
#216 = DIRECTION ( 'NONE',  ( -1.000000000000000000, 0.000000000000000000, 1.314833807763602224E-16 ) ) ;
#217 = FILL_AREA_STYLE_COLOUR ( '', #1207 ) ;
#218 = DIRECTION ( 'NONE',  ( 0.000000000000000000, 1.000000000000000000, 0.000000000000000000 ) ) ;
#219 = ORIENTED_EDGE ( 'NONE', *, *, #579, .T. ) ;
#220 = DIRECTION ( 'NONE',  ( -4.065758146820641134E-16, 0.000000000000000000, 1.000000000000000000 ) ) ;
#221 = ORIENTED_EDGE ( 'NONE', *, *, #474, .T. ) ;
#222 = VECTOR ( 'NONE', #1110, 1000.000000000000000 ) ;
#223 = EDGE_LOOP ( 'NONE', ( #126, #1244, #727, #1133 ) ) ;
#224 = EDGE_CURVE ( 'NONE', #856, #362, #1081, .T. ) ;
#225 = ORIENTED_EDGE ( 'NONE', *, *, #1078, .F. ) ;
#226 = PLANE ( 'NONE',  #259 ) ;
#227 =( NAMED_UNIT ( * ) PLANE_ANGLE_UNIT ( ) SI_UNIT ( $, .RADIAN. ) );
#228 = CARTESIAN_POINT ( 'NONE',  ( 1.000000000000000000, 0.2999999999999999889, -2.168404344971008868E-16 ) ) ;
#229 = ORIENTED_EDGE ( 'NONE', *, *, #291, .F. ) ;
#230 = UNCERTAINTY_MEASURE_WITH_UNIT (LENGTH_MEASURE( 1.000000000000000082E-05 ), #745, 'distance_accuracy_value', 'NONE');
#231 =( LENGTH_UNIT ( ) NAMED_UNIT ( * ) SI_UNIT ( .MILLI., .METRE. ) );
#232 = FACE_OUTER_BOUND ( 'NONE', #1064, .T. ) ;
#233 = ADVANCED_FACE ( 'NONE', ( #881 ), #376, .F. ) ;
#234 = STYLED_ITEM ( 'NONE', ( #824 ), #441 ) ;
#235 = FACE_OUTER_BOUND ( 'NONE', #420, .T. ) ;
#236 =( NAMED_UNIT ( * ) SI_UNIT ( $, .STERADIAN. ) SOLID_ANGLE_UNIT ( ) );
#237 = SURFACE_STYLE_FILL_AREA ( #359 ) ;
#238 = VECTOR ( 'NONE', #1293, 1000.000000000000000 ) ;
#239 = AXIS2_PLACEMENT_3D ( 'NONE', #960, #61, #46 ) ;
#240 = PRESENTATION_LAYER_ASSIGNMENT (  '', '', ( #72 ) ) ;
#241 = DIRECTION ( 'NONE',  ( 0.000000000000000000, 0.000000000000000000, 1.000000000000000000 ) ) ;
#242 = STYLED_ITEM ( 'NONE', ( #211 ), #922 ) ;
#243 = PRESENTATION_STYLE_ASSIGNMENT (( #1176 ) ) ;
#244 = CARTESIAN_POINT ( 'NONE',  ( 1.000000000000000000, -0.9164894359474625718, -2.168404344971008868E-16 ) ) ;
#245 = ADVANCED_FACE ( 'NONE', ( #876 ), #691, .F. ) ;
#246 = DIRECTION ( 'NONE',  ( -2.168404344971008868E-16, -0.000000000000000000, -1.000000000000000000 ) ) ;
#247 = SURFACE_SIDE_STYLE ('',( #833 ) ) ;
#248 = FILL_AREA_STYLE_COLOUR ( '', #846 ) ;
#249 = ORIENTED_EDGE ( 'NONE', *, *, #1179, .T. ) ;
#250 = ORIENTED_EDGE ( 'NONE', *, *, #1168, .F. ) ;
#251 = CARTESIAN_POINT ( 'NONE',  ( -0.6999999999999998446, 0.6999999999999999556, -0.5000000000000000000 ) ) ;
#252 = VERTEX_POINT ( 'NONE', #86 ) ;
#253 = CARTESIAN_POINT ( 'NONE',  ( -1.676296954624748382E-16, -0.9164894359474625718, 0.4122962788466859041 ) ) ;
#254 = AXIS2_PLACEMENT_3D ( 'NONE', #643, #839, #832 ) ;
#255 = DIRECTION ( 'NONE',  ( 1.000000000000000000, 0.000000000000000000, -0.000000000000000000 ) ) ;
#256 = CARTESIAN_POINT ( 'NONE',  ( 1.000000000000000000, -2.168404344971008868E-16, 0.4122962788466862372 ) ) ;
#257 = ADVANCED_FACE ( 'NONE', ( #1313 ), #383, .F. ) ;
#258 = DIRECTION ( 'NONE',  ( -1.000000000000000000, 0.000000000000000000, -4.065758146820641134E-16 ) ) ;
#259 = AXIS2_PLACEMENT_3D ( 'NONE', #140, #750, #43 ) ;
#260 = DIRECTION ( 'NONE',  ( -4.065758146820642614E-16, 0.000000000000000000, 1.000000000000000000 ) ) ;
#261 = COLOUR_RGB ( '',0.3176470588235293935, 0.2470588235294117752, 0.2078431372549019440 ) ;
#262 = DIRECTION ( 'NONE',  ( 1.314833807763602224E-16, 0.000000000000000000, 1.000000000000000000 ) ) ;
#263 = ORIENTED_EDGE ( 'NONE', *, *, #81, .T. ) ;
#264 = EDGE_LOOP ( 'NONE', ( #337, #1175, #1036, #2 ) ) ;
#265 = FILL_AREA_STYLE_COLOUR ( '', #823 ) ;
#266 = VERTEX_POINT ( 'NONE', #1113 ) ;
#267 = ORIENTED_EDGE ( 'NONE', *, *, #309, .F. ) ;
#268 = CYLINDRICAL_SURFACE ( 'NONE', #926, 0.2000000000000000111 ) ;
#269 = CARTESIAN_POINT ( 'NONE',  ( 0.5999999999999999778, 0.2999999999999999889, -7.889002846581611863E-17 ) ) ;
#270 = PLANE ( 'NONE',  #700 ) ;
#271 = VERTEX_POINT ( 'NONE', #794 ) ;
#272 = VERTEX_POINT ( 'NONE', #1134 ) ;
#273 = VERTEX_POINT ( 'NONE', #535 ) ;
#274 =( LENGTH_UNIT ( ) NAMED_UNIT ( * ) SI_UNIT ( .MILLI., .METRE. ) );
#275 = LINE ( 'NONE', #792, #113 ) ;
#276 = CARTESIAN_POINT ( 'NONE',  ( -1.000000000000000000, -0.9164894359474625718, -0.4122962788466860151 ) ) ;
#277 = EDGE_LOOP ( 'NONE', ( #404, #1246, #57, #169, #956, #944 ) ) ;
#278 = PRESENTATION_LAYER_ASSIGNMENT (  '', '', ( #384 ) ) ;
#279 = CARTESIAN_POINT ( 'NONE',  ( -1.000000000000000000, 0.000000000000000000, 0.000000000000000000 ) ) ;
#280 = SURFACE_SIDE_STYLE ('',( #91 ) ) ;
#281 = PLANE ( 'NONE',  #1132 ) ;
#282 =( NAMED_UNIT ( * ) SI_UNIT ( $, .STERADIAN. ) SOLID_ANGLE_UNIT ( ) );
#283 = VERTEX_POINT ( 'NONE', #904 ) ;
#284 =( GEOMETRIC_REPRESENTATION_CONTEXT ( 3 ) GLOBAL_UNCERTAINTY_ASSIGNED_CONTEXT ( ( #1005 ) ) GLOBAL_UNIT_ASSIGNED_CONTEXT ( ( #49, #62, #151 ) ) REPRESENTATION_CONTEXT ( 'NONE', 'WORKASPACE' ) );
#285 = VECTOR ( 'NONE', #477, 1000.000000000000000 ) ;
#286 = PRESENTATION_LAYER_ASSIGNMENT (  '', '', ( #50 ) ) ;
#287 = AXIS2_PLACEMENT_3D ( 'NONE', #608, #1126, #1007 ) ;
#288 = SURFACE_STYLE_USAGE ( .BOTH. , #475 ) ;
#289 = CARTESIAN_POINT ( 'NONE',  ( 1.000000000000000000, 0.2999999999999999889, -2.168404344971008868E-16 ) ) ;
#290 = FILL_AREA_STYLE ('',( #967 ) ) ;
#291 = EDGE_CURVE ( 'NONE', #272, #335, #1143, .T. ) ;
#292 = EDGE_LOOP ( 'NONE', ( #912, #460, #1077, #329 ) ) ;
#293 = SURFACE_STYLE_USAGE ( .BOTH. , #1096 ) ;
#294 = PLANE ( 'NONE',  #458 ) ;
#295 = FILL_AREA_STYLE ('',( #1309 ) ) ;
#296 =( NAMED_UNIT ( * ) PLANE_ANGLE_UNIT ( ) SI_UNIT ( $, .RADIAN. ) );
#297 = LINE ( 'NONE', #1210, #663 ) ;
#298 = VECTOR ( 'NONE', #141, 1000.000000000000000 ) ;
#299 = UNCERTAINTY_MEASURE_WITH_UNIT (LENGTH_MEASURE( 1.000000000000000082E-05 ), #333, 'distance_accuracy_value', 'NONE');
#300 = DIRECTION ( 'NONE',  ( -1.000000000000000000, -0.000000000000000000, -0.000000000000000000 ) ) ;
#301 = SURFACE_STYLE_USAGE ( .BOTH. , #28 ) ;
#302 = EDGE_CURVE ( 'NONE', #320, #473, #1325, .T. ) ;
#303 = COLOUR_RGB ( '',0.3176470588235293935, 0.2470588235294117752, 0.2078431372549019440 ) ;
#304 = COLOUR_RGB ( '',0.3176470588235293935, 0.2470588235294117752, 0.2078431372549019440 ) ;
#305 =( NAMED_UNIT ( * ) SI_UNIT ( $, .STERADIAN. ) SOLID_ANGLE_UNIT ( ) );
#306 = FACE_OUTER_BOUND ( 'NONE', #605, .T. ) ;
#307 = CARTESIAN_POINT ( 'NONE',  ( 0.5999999999999999778, 0.2999999999999999889, -0.4122962788466861261 ) ) ;
#308 = SURFACE_SIDE_STYLE ('',( #520 ) ) ;
#309 = EDGE_CURVE ( 'NONE', #462, #481, #403, .T. ) ;
#310 = SURFACE_STYLE_FILL_AREA ( #204 ) ;
#311 = EDGE_LOOP ( 'NONE', ( #933, #671, #757, #250, #921, #1181 ) ) ;
#312 =( LENGTH_UNIT ( ) NAMED_UNIT ( * ) SI_UNIT ( .MILLI., .METRE. ) );
#313 = CARTESIAN_POINT ( 'NONE',  ( -1.000000000000000000, -0.9164894359474625718, 0.1999999999999995393 ) ) ;
#314 = PRESENTATION_STYLE_ASSIGNMENT (( #726 ) ) ;
#315 = VERTEX_POINT ( 'NONE', #631 ) ;
#316 = VECTOR ( 'NONE', #246, 1000.000000000000000 ) ;
#317 = CARTESIAN_POINT ( 'NONE',  ( 0.7000000000000000666, 0.6999999999999999556, 0.5000000000000000000 ) ) ;
#318 =( NAMED_UNIT ( * ) PLANE_ANGLE_UNIT ( ) SI_UNIT ( $, .RADIAN. ) );
#319 = CARTESIAN_POINT ( 'NONE',  ( -1.000000000000000222, 0.2999999999999999889, -0.5000000000000000000 ) ) ;
#320 = VERTEX_POINT ( 'NONE', #913 ) ;
#321 = SURFACE_SIDE_STYLE ('',( #1245 ) ) ;
#322 = ORIENTED_EDGE ( 'NONE', *, *, #100, .F. ) ;
#323 = ORIENTED_EDGE ( 'NONE', *, *, #309, .T. ) ;
#324 = MECHANICAL_DESIGN_GEOMETRIC_PRESENTATION_REPRESENTATION (  '', ( #72 ), #24 ) ;
#325 = SURFACE_STYLE_USAGE ( .BOTH. , #196 ) ;
#326 = FILL_AREA_STYLE ('',( #433 ) ) ;
#327 = ADVANCED_FACE ( 'NONE', ( #1038 ), #413, .F. ) ;
#328 = EDGE_LOOP ( 'NONE', ( #117, #652, #555, #819 ) ) ;
#329 = ORIENTED_EDGE ( 'NONE', *, *, #844, .F. ) ;
#330 = CARTESIAN_POINT ( 'NONE',  ( -0.6999999999999998446, 0.6999999999999999556, 0.5000000000000000000 ) ) ;
#331 = EDGE_LOOP ( 'NONE', ( #589, #1280, #843, #229 ) ) ;
#332 = SURFACE_SIDE_STYLE ('',( #430 ) ) ;
#333 =( LENGTH_UNIT ( ) NAMED_UNIT ( * ) SI_UNIT ( .MILLI., .METRE. ) );
#334 =( NAMED_UNIT ( * ) SI_UNIT ( $, .STERADIAN. ) SOLID_ANGLE_UNIT ( ) );
#335 = VERTEX_POINT ( 'NONE', #1236 ) ;
#336 = FILL_AREA_STYLE_COLOUR ( '', #820 ) ;
#337 = ORIENTED_EDGE ( 'NONE', *, *, #291, .T. ) ;
#338 = MANIFOLD_SOLID_BREP ( 'Boss-Extrude3[1]', #1027 ) ;
#339 = DIRECTION ( 'NONE',  ( 1.000000000000000000, 0.000000000000000000, 0.000000000000000000 ) ) ;
#340 = LINE ( 'NONE', #1068, #987 ) ;
#341 = UNCERTAINTY_MEASURE_WITH_UNIT (LENGTH_MEASURE( 1.000000000000000082E-05 ), #642, 'distance_accuracy_value', 'NONE');
#342 = DIRECTION ( 'NONE',  ( 0.000000000000000000, 1.000000000000000000, -0.000000000000000000 ) ) ;
#343 = SURFACE_STYLE_USAGE ( .BOTH. , #961 ) ;
#344 = EDGE_CURVE ( 'NONE', #1122, #719, #1152, .T. ) ;
#345 = CARTESIAN_POINT ( 'NONE',  ( -0.5999999999999998668, -0.9164894359474625718, 0.4122962788466863482 ) ) ;
#346 = COLOUR_RGB ( '',0.3176470588235293935, 0.2470588235294117752, 0.2078431372549019440 ) ;
#347 = DIRECTION ( 'NONE',  ( -0.000000000000000000, -1.000000000000000000, 0.000000000000000000 ) ) ;
#348 = SURFACE_STYLE_USAGE ( .BOTH. , #40 ) ;
#349 = COLOUR_RGB ( '',0.3176470588235293935, 0.2470588235294117752, 0.2078431372549019440 ) ;
#350 = CARTESIAN_POINT ( 'NONE',  ( -0.5999999999999998668, 0.000000000000000000, 0.4122962788466863482 ) ) ;
#351 = ORIENTED_EDGE ( 'NONE', *, *, #81, .F. ) ;
#352 = LINE ( 'NONE', #654, #1240 ) ;
#353 = LINE ( 'NONE', #1257, #989 ) ;
#354 = PLANE ( 'NONE',  #641 ) ;
#355 = ADVANCED_FACE ( 'NONE', ( #1227 ), #1265, .T. ) ;
#356 = MANIFOLD_SOLID_BREP ( 'Boss-Extrude2', #87 ) ;
#357 = ORIENTED_EDGE ( 'NONE', *, *, #63, .F. ) ;
#358 = PLANE ( 'NONE',  #127 ) ;
#359 = FILL_AREA_STYLE ('',( #609 ) ) ;
#360 = SURFACE_SIDE_STYLE ('',( #1059 ) ) ;
#361 = CARTESIAN_POINT ( 'NONE',  ( -0.5999999999999999778, 0.2999999999999999889, 7.889002846581611863E-17 ) ) ;
#362 = VERTEX_POINT ( 'NONE', #525 ) ;
#363 = DIRECTION ( 'NONE',  ( 1.000000000000000000, 0.000000000000000000, -0.000000000000000000 ) ) ;
#364 = DIRECTION ( 'NONE',  ( -1.000000000000000000, 0.000000000000000000, 1.314833807763602224E-16 ) ) ;
#365 = DIRECTION ( 'NONE',  ( 0.000000000000000000, 1.000000000000000000, 0.000000000000000000 ) ) ;
#366 = AXIS2_PLACEMENT_3D ( 'NONE', #397, #680, #1088 ) ;
#367 = ADVANCED_FACE ( 'NONE', ( #909 ), #916, .F. ) ;
#368 = VECTOR ( 'NONE', #841, 1000.000000000000000 ) ;
#369 = CARTESIAN_POINT ( 'NONE',  ( 1.000000000000000000, 0.2999999999999999889, 0.5000000000000000000 ) ) ;
#370 = STYLED_ITEM ( 'NONE', ( #1184 ), #356 ) ;
#371 = ORIENTED_EDGE ( 'NONE', *, *, #603, .F. ) ;
#372 = ORIENTED_EDGE ( 'NONE', *, *, #658, .T. ) ;
#373 = CARTESIAN_POINT ( 'NONE',  ( 1.000000000000000000, 0.2999999999999999889, 0.1999999999999995393 ) ) ;
#374 = DIRECTION ( 'NONE',  ( 1.000000000000000000, 0.000000000000000000, -2.168404344971008868E-16 ) ) ;
#375 = PRESENTATION_STYLE_ASSIGNMENT (( #1292 ) ) ;
#376 = PLANE ( 'NONE',  #1223 ) ;
#377 = EDGE_LOOP ( 'NONE', ( #523, #1023, #981, #203 ) ) ;
#378 = ORIENTED_EDGE ( 'NONE', *, *, #488, .T. ) ;
#379 = CARTESIAN_POINT ( 'NONE',  ( -1.000000000000000000, 0.2999999999999999889, 0.1999999999999995393 ) ) ;
#380 = DIRECTION ( 'NONE',  ( -0.000000000000000000, 1.000000000000000000, -0.000000000000000000 ) ) ;
#381 = CARTESIAN_POINT ( 'NONE',  ( -1.000000000000000000, 0.2999999999999999889, 0.4122962788466863482 ) ) ;
#382 = MECHANICAL_DESIGN_GEOMETRIC_PRESENTATION_REPRESENTATION (  '', ( #142 ), #963 ) ;
#383 = PLANE ( 'NONE',  #681 ) ;
#384 = STYLED_ITEM ( 'NONE', ( #1092 ), #1234 ) ;
#385 = EDGE_CURVE ( 'NONE', #58, #273, #4, .T. ) ;
#386 = LINE ( 'NONE', #669, #485 ) ;
#387 = DIRECTION ( 'NONE',  ( -2.168404344971008868E-16, 0.000000000000000000, -1.000000000000000000 ) ) ;
#388 = CARTESIAN_POINT ( 'NONE',  ( -1.000000000000000000, -0.9164894359474625718, 2.168404344971008868E-16 ) ) ;
#389 = VECTOR ( 'NONE', #817, 1000.000000000000000 ) ;
#390 =( GEOMETRIC_REPRESENTATION_CONTEXT ( 3 ) GLOBAL_UNCERTAINTY_ASSIGNED_CONTEXT ( ( #103 ) ) GLOBAL_UNIT_ASSIGNED_CONTEXT ( ( #105, #619, #305 ) ) REPRESENTATION_CONTEXT ( 'NONE', 'WORKASPACE' ) );
#391 = PRESENTATION_LAYER_ASSIGNMENT (  '', '', ( #765 ) ) ;
#392 = FILL_AREA_STYLE_COLOUR ( '', #945 ) ;
#393 = DIRECTION ( 'NONE',  ( 0.000000000000000000, 0.000000000000000000, -1.000000000000000000 ) ) ;
#394 = DIRECTION ( 'NONE',  ( -1.000000000000000000, 0.000000000000000000, 2.168404344971009361E-16 ) ) ;
#395 = UNCERTAINTY_MEASURE_WITH_UNIT (LENGTH_MEASURE( 1.000000000000000082E-05 ), #728, 'distance_accuracy_value', 'NONE');
#396 =( NAMED_UNIT ( * ) SI_UNIT ( $, .STERADIAN. ) SOLID_ANGLE_UNIT ( ) );
#397 = CARTESIAN_POINT ( 'NONE',  ( -1.000000000000000000, 0.2999999999999999889, 0.000000000000000000 ) ) ;
#398 = DIRECTION ( 'NONE',  ( 0.000000000000000000, -0.000000000000000000, 1.000000000000000000 ) ) ;
#399 =( NAMED_UNIT ( * ) SI_UNIT ( $, .STERADIAN. ) SOLID_ANGLE_UNIT ( ) );
#400 = LINE ( 'NONE', #1329, #1310 ) ;
#401 = DIRECTION ( 'NONE',  ( 0.000000000000000000, 0.000000000000000000, 1.000000000000000000 ) ) ;
#402 = DIRECTION ( 'NONE',  ( -0.000000000000000000, -1.000000000000000000, -0.000000000000000000 ) ) ;
#403 = LINE ( 'NONE', #1232, #112 ) ;
#404 = ORIENTED_EDGE ( 'NONE', *, *, #344, .F. ) ;
#405 = MECHANICAL_DESIGN_GEOMETRIC_PRESENTATION_REPRESENTATION (  '', ( #428 ), #1101 ) ;
#406 = STYLED_ITEM ( 'NONE', ( #651 ), #174 ) ;
#407 = STYLED_ITEM ( 'NONE', ( #467 ), #546 ) ;
#408 = SURFACE_STYLE_USAGE ( .BOTH. , #506 ) ;
#409 = AXIS2_PLACEMENT_3D ( 'NONE', #562, #1164, #398 ) ;
#410 = ORIENTED_EDGE ( 'NONE', *, *, #974, .F. ) ;
#411 = CARTESIAN_POINT ( 'NONE',  ( -0.5999999999999999778, -0.9164894359474625718, 7.889002846581611863E-17 ) ) ;
#412 = LINE ( 'NONE', #424, #1136 ) ;
#413 = PLANE ( 'NONE',  #976 ) ;
#414 = ORIENTED_EDGE ( 'NONE', *, *, #1072, .T. ) ;
#415 = EDGE_CURVE ( 'NONE', #176, #812, #704, .T. ) ;
#416 =( NAMED_UNIT ( * ) PLANE_ANGLE_UNIT ( ) SI_UNIT ( $, .RADIAN. ) );
#417 = DIRECTION ( 'NONE',  ( 2.168404344971008868E-16, 0.000000000000000000, 1.000000000000000000 ) ) ;
#418 = PLANE ( 'NONE',  #1025 ) ;
#419 = EDGE_CURVE ( 'NONE', #266, #252, #400, .T. ) ;
#420 = EDGE_LOOP ( 'NONE', ( #30, #1066, #1071, #1254 ) ) ;
#421 = ADVANCED_FACE ( 'NONE', ( #724 ), #614, .F. ) ;
#422 = CARTESIAN_POINT ( 'NONE',  ( -2.793828257707912081E-16, 0.2999999999999999889, -0.4122962788466856821 ) ) ;
#423 = FILL_AREA_STYLE ('',( #11 ) ) ;
#424 = CARTESIAN_POINT ( 'NONE',  ( -1.676296954624748382E-16, 0.2999999999999999889, 0.4122962788466859041 ) ) ;
#425 = EDGE_LOOP ( 'NONE', ( #267, #575, #225, #1228 ) ) ;
#426 = ORIENTED_EDGE ( 'NONE', *, *, #1130, .F. ) ;
#427 = ORIENTED_EDGE ( 'NONE', *, *, #1315, .T. ) ;
#428 = STYLED_ITEM ( 'NONE', ( #585 ), #511 ) ;
#429 = CLOSED_SHELL ( 'NONE', ( #1234, #595, #828, #208, #797, #629, #355, #653 ) ) ;
#430 = SURFACE_STYLE_FILL_AREA ( #705 ) ;
#431 = STYLED_ITEM ( 'NONE', ( #701 ), #327 ) ;
#432 = LINE ( 'NONE', #729, #953 ) ;
#433 = FILL_AREA_STYLE_COLOUR ( '', #471 ) ;
#434 = ORIENTED_EDGE ( 'NONE', *, *, #385, .T. ) ;
#435 =( NAMED_UNIT ( * ) PLANE_ANGLE_UNIT ( ) SI_UNIT ( $, .RADIAN. ) );
#436 = ORIENTED_EDGE ( 'NONE', *, *, #419, .F. ) ;
#437 = SURFACE_SIDE_STYLE ('',( #635 ) ) ;
#438 = LINE ( 'NONE', #647, #1248 ) ;
#439 = DIRECTION ( 'NONE',  ( 0.000000000000000000, 1.000000000000000000, 0.000000000000000000 ) ) ;
#440 = CARTESIAN_POINT ( 'NONE',  ( 0.000000000000000000, 0.2999999999999999889, 0.4122962788466863482 ) ) ;
#441 = ADVANCED_FACE ( 'NONE', ( #1012 ), #923, .F. ) ;
#442 =( NAMED_UNIT ( * ) SI_UNIT ( $, .STERADIAN. ) SOLID_ANGLE_UNIT ( ) );
#443 = SURFACE_SIDE_STYLE ('',( #837 ) ) ;
#444 = SURFACE_STYLE_USAGE ( .BOTH. , #547 ) ;
#445 = DIRECTION ( 'NONE',  ( 0.000000000000000000, 0.000000000000000000, 1.000000000000000000 ) ) ;
#446 = CARTESIAN_POINT ( 'NONE',  ( 0.9999999999999997780, 0.2999999999999999889, -0.5000000000000000000 ) ) ;
#447 = ORIENTED_EDGE ( 'NONE', *, *, #565, .F. ) ;
#448 = FACE_OUTER_BOUND ( 'NONE', #464, .T. ) ;
#449 = PRESENTATION_LAYER_ASSIGNMENT (  '', '', ( #542 ) ) ;
#450 = PRESENTATION_LAYER_ASSIGNMENT (  '', '', ( #906 ) ) ;
#451 = STYLED_ITEM ( 'NONE', ( #1155 ), #828 ) ;
#452 = DIRECTION ( 'NONE',  ( -2.168404344971009361E-16, 0.000000000000000000, -1.000000000000000000 ) ) ;
#453 = DIRECTION ( 'NONE',  ( 0.000000000000000000, 0.000000000000000000, -1.000000000000000000 ) ) ;
#454 = EDGE_LOOP ( 'NONE', ( #632, #71, #914, #522 ) ) ;
#455 = ADVANCED_FACE ( 'NONE', ( #661 ), #358, .T. ) ;
#456 = DIRECTION ( 'NONE',  ( -0.000000000000000000, 1.000000000000000000, -0.000000000000000000 ) ) ;
#457 = PLANE ( 'NONE',  #239 ) ;
#458 = AXIS2_PLACEMENT_3D ( 'NONE', #996, #364, #159 ) ;
#459 = LINE ( 'NONE', #1260, #368 ) ;
#460 = ORIENTED_EDGE ( 'NONE', *, *, #495, .T. ) ;
#461 = ORIENTED_EDGE ( 'NONE', *, *, #918, .T. ) ;
#462 = VERTEX_POINT ( 'NONE', #1056 ) ;
#463 = ORIENTED_EDGE ( 'NONE', *, *, #495, .F. ) ;
#464 = EDGE_LOOP ( 'NONE', ( #1163, #21, #410, #163 ) ) ;
#465 = CARTESIAN_POINT ( 'NONE',  ( 0.5999999999999999778, 0.000000000000000000, -0.4122962788466861261 ) ) ;
#466 = FACE_OUTER_BOUND ( 'NONE', #1185, .T. ) ;
#467 = PRESENTATION_STYLE_ASSIGNMENT (( #774 ) ) ;
#468 = MECHANICAL_DESIGN_GEOMETRIC_PRESENTATION_REPRESENTATION (  '', ( #1127 ), #947 ) ;
#469 = CARTESIAN_POINT ( 'NONE',  ( -1.000000000000000222, 0.2999999999999999889, -0.5000000000000000000 ) ) ;
#470 = CARTESIAN_POINT ( 'NONE',  ( 1.000000000000000000, -0.9164894359474625718, 0.000000000000000000 ) ) ;
#471 = COLOUR_RGB ( '',0.3176470588235293935, 0.2470588235294117752, 0.2078431372549019440 ) ;
#472 = ORIENTED_EDGE ( 'NONE', *, *, #862, .T. ) ;
#473 = VERTEX_POINT ( 'NONE', #1261 ) ;
#474 = EDGE_CURVE ( 'NONE', #481, #893, #566, .T. ) ;
#475 = SURFACE_SIDE_STYLE ('',( #576 ) ) ;
#476 = LINE ( 'NONE', #494, #998 ) ;
#477 = DIRECTION ( 'NONE',  ( 1.000000000000000000, 0.000000000000000000, 0.000000000000000000 ) ) ;
#478 =( NAMED_UNIT ( * ) PLANE_ANGLE_UNIT ( ) SI_UNIT ( $, .RADIAN. ) );
#479 = ADVANCED_FACE ( 'NONE', ( #235 ), #226, .T. ) ;
#480 = VERTEX_POINT ( 'NONE', #1270 ) ;
#481 = VERTEX_POINT ( 'NONE', #256 ) ;
#482 =( NAMED_UNIT ( * ) SI_UNIT ( $, .STERADIAN. ) SOLID_ANGLE_UNIT ( ) );
#483 = CIRCLE ( 'NONE', #811, 0.2000000000000000111 ) ;
#484 = FILL_AREA_STYLE_COLOUR ( '', #346 ) ;
#485 = VECTOR ( 'NONE', #1074, 1000.000000000000000 ) ;
#486 = CARTESIAN_POINT ( 'NONE',  ( -0.5999999999999999778, 0.2999999999999999889, -0.4122962788466859041 ) ) ;
#487 = CARTESIAN_POINT ( 'NONE',  ( -0.6999999999999998446, 0.6999999999999999556, 0.5000000000000000000 ) ) ;
#488 = EDGE_CURVE ( 'NONE', #1149, #121, #352, .T. ) ;
#489 = VECTOR ( 'NONE', #75, 1000.000000000000000 ) ;
#490 = FILL_AREA_STYLE_COLOUR ( '', #1085 ) ;
#491 = AXIS2_PLACEMENT_3D ( 'NONE', #388, #394, #1189 ) ;
#492 = STYLED_ITEM ( 'NONE', ( #910 ), #797 ) ;
#493 =( GEOMETRIC_REPRESENTATION_CONTEXT ( 3 ) GLOBAL_UNCERTAINTY_ASSIGNED_CONTEXT ( ( #611 ) ) GLOBAL_UNIT_ASSIGNED_CONTEXT ( ( #231, #435, #935 ) ) REPRESENTATION_CONTEXT ( 'NONE', 'WORKASPACE' ) );
#494 = CARTESIAN_POINT ( 'NONE',  ( 0.5999999999999999778, -0.9164894359474625718, -0.4122962788466861261 ) ) ;
#495 = EDGE_CURVE ( 'NONE', #1299, #9, #982, .T. ) ;
#496 = SURFACE_SIDE_STYLE ('',( #68 ) ) ;
#497 = UNCERTAINTY_MEASURE_WITH_UNIT (LENGTH_MEASURE( 1.000000000000000082E-05 ), #1052, 'distance_accuracy_value', 'NONE');
#498 = ORIENTED_EDGE ( 'NONE', *, *, #224, .T. ) ;
#499 = UNCERTAINTY_MEASURE_WITH_UNIT (LENGTH_MEASURE( 1.000000000000000082E-05 ), #1273, 'distance_accuracy_value', 'NONE');
#500 = FILL_AREA_STYLE_COLOUR ( '', #22 ) ;
#501 =( NAMED_UNIT ( * ) SI_UNIT ( $, .STERADIAN. ) SOLID_ANGLE_UNIT ( ) );
#502 = CARTESIAN_POINT ( 'NONE',  ( -1.000000000000000222, 0.2999999999999999889, -0.5000000000000000000 ) ) ;
#503 = DIRECTION ( 'NONE',  ( -1.000000000000000000, -0.000000000000000000, -0.000000000000000000 ) ) ;
#504 = PRODUCT_CONTEXT ( 'NONE', #816, 'mechanical' ) ;
#505 =( GEOMETRIC_REPRESENTATION_CONTEXT ( 3 ) GLOBAL_UNCERTAINTY_ASSIGNED_CONTEXT ( ( #1002 ) ) GLOBAL_UNIT_ASSIGNED_CONTEXT ( ( #164, #1200, #888 ) ) REPRESENTATION_CONTEXT ( 'NONE', 'WORKASPACE' ) );
#506 = SURFACE_SIDE_STYLE ('',( #104 ) ) ;
#507 = DIRECTION ( 'NONE',  ( -1.000000000000000000, 0.000000000000000000, -0.000000000000000000 ) ) ;
#508 = DIRECTION ( 'NONE',  ( 1.000000000000000000, 0.000000000000000000, 0.000000000000000000 ) ) ;
#509 =( GEOMETRIC_REPRESENTATION_CONTEXT ( 3 ) GLOBAL_UNCERTAINTY_ASSIGNED_CONTEXT ( ( #887 ) ) GLOBAL_UNIT_ASSIGNED_CONTEXT ( ( #312, #518, #1139 ) ) REPRESENTATION_CONTEXT ( 'NONE', 'WORKASPACE' ) );
#510 = DIRECTION ( 'NONE',  ( -0.000000000000000000, -0.000000000000000000, -1.000000000000000000 ) ) ;
#511 = ADVANCED_FACE ( 'NONE', ( #1191 ), #268, .F. ) ;
#512 = SURFACE_SIDE_STYLE ('',( #310 ) ) ;
#513 = VERTEX_POINT ( 'NONE', #373 ) ;
#514 = PRESENTATION_LAYER_ASSIGNMENT (  '', '', ( #70 ) ) ;
#515 = VECTOR ( 'NONE', #578, 1000.000000000000000 ) ;
#516 = MECHANICAL_DESIGN_GEOMETRIC_PRESENTATION_REPRESENTATION (  '', ( #906 ), #683 ) ;
#517 = STYLED_ITEM ( 'NONE', ( #1239 ), #813 ) ;
#518 =( NAMED_UNIT ( * ) PLANE_ANGLE_UNIT ( ) SI_UNIT ( $, .RADIAN. ) );
#519 =( LENGTH_UNIT ( ) NAMED_UNIT ( * ) SI_UNIT ( .MILLI., .METRE. ) );
#520 = SURFACE_STYLE_FILL_AREA ( #326 ) ;
#521 = VERTEX_POINT ( 'NONE', #673 ) ;
#522 = ORIENTED_EDGE ( 'NONE', *, *, #1328, .F. ) ;
#523 = ORIENTED_EDGE ( 'NONE', *, *, #1090, .F. ) ;
#524 = EDGE_CURVE ( 'NONE', #473, #628, #1157, .T. ) ;
#525 = CARTESIAN_POINT ( 'NONE',  ( -1.000000000000000000, 0.2999999999999999889, -0.4122962788466860151 ) ) ;
#526 = CARTESIAN_POINT ( 'NONE',  ( -1.000000000000000000, 0.2999999999999999889, -0.2000000000000005107 ) ) ;
#527 = CARTESIAN_POINT ( 'NONE',  ( 0.000000000000000000, 0.000000000000000000, 0.000000000000000000 ) ) ;
#528 = VERTEX_POINT ( 'NONE', #465 ) ;
#529 = DIRECTION ( 'NONE',  ( -0.000000000000000000, 1.000000000000000000, -0.000000000000000000 ) ) ;
#530 = EDGE_LOOP ( 'NONE', ( #731, #570, #1021, #215 ) ) ;
#531 = SHAPE_DEFINITION_REPRESENTATION ( #672, #1312 ) ;
#532 = VECTOR ( 'NONE', #128, 1000.000000000000000 ) ;
#533 = DIRECTION ( 'NONE',  ( 1.314833807763602224E-16, 0.000000000000000000, 1.000000000000000000 ) ) ;
#534 = CARTESIAN_POINT ( 'NONE',  ( -1.000000000000000222, 0.000000000000000000, -0.5000000000000000000 ) ) ;
#535 = CARTESIAN_POINT ( 'NONE',  ( 0.7000000000000000666, 0.2999999999999999889, 0.5000000000000000000 ) ) ;
#536 = ORIENTED_EDGE ( 'NONE', *, *, #1272, .F. ) ;
#537 = MECHANICAL_DESIGN_GEOMETRIC_PRESENTATION_REPRESENTATION (  '', ( #234 ), #206 ) ;
#538 = ORIENTED_EDGE ( 'NONE', *, *, #118, .T. ) ;
#539 =( GEOMETRIC_REPRESENTATION_CONTEXT ( 3 ) GLOBAL_UNCERTAINTY_ASSIGNED_CONTEXT ( ( #189 ) ) GLOBAL_UNIT_ASSIGNED_CONTEXT ( ( #29, #416, #399 ) ) REPRESENTATION_CONTEXT ( 'NONE', 'WORKASPACE' ) );
#540 = VECTOR ( 'NONE', #439, 1000.000000000000000 ) ;
#541 = CARTESIAN_POINT ( 'NONE',  ( -0.6999999999999998446, 0.6999999999999999556, -0.5000000000000000000 ) ) ;
#542 = STYLED_ITEM ( 'NONE', ( #1212 ), #789 ) ;
#543 = PLANE ( 'NONE',  #805 ) ;
#544 = DIRECTION ( 'NONE',  ( 0.000000000000000000, 1.000000000000000000, 0.000000000000000000 ) ) ;
#545 = PRESENTATION_STYLE_ASSIGNMENT (( #1258 ) ) ;
#546 = ADVANCED_FACE ( 'NONE', ( #1079 ), #865, .F. ) ;
#547 = SURFACE_SIDE_STYLE ('',( #136 ) ) ;
#548 = FACE_OUTER_BOUND ( 'NONE', #223, .T. ) ;
#549 = LINE ( 'NONE', #345, #732 ) ;
#550 = CARTESIAN_POINT ( 'NONE',  ( 0.000000000000000000, 0.000000000000000000, 0.000000000000000000 ) ) ;
#551 =( GEOMETRIC_REPRESENTATION_CONTEXT ( 3 ) GLOBAL_UNCERTAINTY_ASSIGNED_CONTEXT ( ( #1316 ) ) GLOBAL_UNIT_ASSIGNED_CONTEXT ( ( #101, #1032, #109 ) ) REPRESENTATION_CONTEXT ( 'NONE', 'WORKASPACE' ) );
#552 = VECTOR ( 'NONE', #637, 1000.000000000000000 ) ;
#553 = LINE ( 'NONE', #687, #793 ) ;
#554 = DIRECTION ( 'NONE',  ( 0.000000000000000000, 0.000000000000000000, 1.000000000000000000 ) ) ;
#555 = ORIENTED_EDGE ( 'NONE', *, *, #1199, .F. ) ;
#556 = COLOUR_RGB ( '',0.9411764705882352811, 0.9607843137254902244, 0.9686274509803921573 ) ;
#557 = MECHANICAL_DESIGN_GEOMETRIC_PRESENTATION_REPRESENTATION (  '', ( #1305 ), #88 ) ;
#558 = LINE ( 'NONE', #959, #316 ) ;
#559 = ORIENTED_EDGE ( 'NONE', *, *, #1179, .F. ) ;
#560 = VECTOR ( 'NONE', #1070, 1000.000000000000000 ) ;
#561 = COLOUR_RGB ( '',0.9411764705882352811, 0.9607843137254902244, 0.9686274509803921573 ) ;
#562 = CARTESIAN_POINT ( 'NONE',  ( 0.000000000000000000, 0.2999999999999999889, 0.000000000000000000 ) ) ;
#563 = PRESENTATION_LAYER_ASSIGNMENT (  '', '', ( #451 ) ) ;
#564 = MECHANICAL_DESIGN_GEOMETRIC_PRESENTATION_REPRESENTATION (  '', ( #929 ), #94 ) ;
#565 = EDGE_CURVE ( 'NONE', #9, #176, #92, .T. ) ;
#566 = LINE ( 'NONE', #741, #840 ) ;
#567 = DIRECTION ( 'NONE',  ( 0.000000000000000000, 0.000000000000000000, 1.000000000000000000 ) ) ;
#568 = FILL_AREA_STYLE ('',( #764 ) ) ;
#569 = FILL_AREA_STYLE_COLOUR ( '', #303 ) ;
#570 = ORIENTED_EDGE ( 'NONE', *, *, #943, .F. ) ;
#571 = EDGE_LOOP ( 'NONE', ( #1145, #676, #1195, #920 ) ) ;
#572 = FILL_AREA_STYLE_COLOUR ( '', #995 ) ;
#573 = FILL_AREA_STYLE ('',( #694 ) ) ;
#574 =( LENGTH_UNIT ( ) NAMED_UNIT ( * ) SI_UNIT ( .MILLI., .METRE. ) );
#575 = ORIENTED_EDGE ( 'NONE', *, *, #844, .T. ) ;
#576 = SURFACE_STYLE_FILL_AREA ( #786 ) ;
#577 =( GEOMETRIC_REPRESENTATION_CONTEXT ( 3 ) GLOBAL_UNCERTAINTY_ASSIGNED_CONTEXT ( ( #1264 ) ) GLOBAL_UNIT_ASSIGNED_CONTEXT ( ( #1193, #591, #1301 ) ) REPRESENTATION_CONTEXT ( 'NONE', 'WORKASPACE' ) );
#578 = DIRECTION ( 'NONE',  ( -1.000000000000000000, -0.000000000000000000, -0.000000000000000000 ) ) ;
#579 = EDGE_CURVE ( 'NONE', #1295, #176, #1208, .T. ) ;
#580 = MECHANICAL_DESIGN_GEOMETRIC_PRESENTATION_REPRESENTATION (  '', ( #406 ), #284 ) ;
#581 = AXIS2_PLACEMENT_3D ( 'NONE', #699, #875, #787 ) ;
#582 = DIRECTION ( 'NONE',  ( -1.000000000000000000, 0.000000000000000000, 2.168404344971008868E-16 ) ) ;
#583 = AXIS2_PLACEMENT_3D ( 'NONE', #799, #1013, #620 ) ;
#584 = EDGE_CURVE ( 'NONE', #1144, #157, #165, .T. ) ;
#585 = PRESENTATION_STYLE_ASSIGNMENT (( #863 ) ) ;
#586 = DIRECTION ( 'NONE',  ( 0.000000000000000000, 0.000000000000000000, 1.000000000000000000 ) ) ;
#587 = SURFACE_STYLE_USAGE ( .BOTH. , #670 ) ;
#588 = DIRECTION ( 'NONE',  ( 0.000000000000000000, 0.000000000000000000, 1.000000000000000000 ) ) ;
#589 = ORIENTED_EDGE ( 'NONE', *, *, #1072, .F. ) ;
#590 = EDGE_CURVE ( 'NONE', #623, #628, #1314, .T. ) ;
#591 =( NAMED_UNIT ( * ) PLANE_ANGLE_UNIT ( ) SI_UNIT ( $, .RADIAN. ) );
#592 = CARTESIAN_POINT ( 'NONE',  ( -1.000000000000000000, 0.000000000000000000, 0.000000000000000000 ) ) ;
#593 = EDGE_CURVE ( 'NONE', #1019, #1287, #129, .T. ) ;
#594 = MECHANICAL_DESIGN_GEOMETRIC_PRESENTATION_REPRESENTATION (  '', ( #384 ), #505 ) ;
#595 = ADVANCED_FACE ( 'NONE', ( #1098 ), #990, .T. ) ;
#596 = SURFACE_STYLE_USAGE ( .BOTH. , #280 ) ;
#597 = DIRECTION ( 'NONE',  ( -1.000000000000000000, 0.000000000000000000, 6.776263578034403699E-16 ) ) ;
#598 = FILL_AREA_STYLE ('',( #85 ) ) ;
#599 = PRESENTATION_LAYER_ASSIGNMENT (  '', '', ( #234 ) ) ;
#600 = PRESENTATION_LAYER_ASSIGNMENT (  '', '', ( #431 ) ) ;
#601 = COLOUR_RGB ( '',0.6666666666666666297, 0.6980392156862744724, 0.7686274509803920907 ) ;
#602 = AXIS2_PLACEMENT_3D ( 'NONE', #615, #1225, #1118 ) ;
#603 = EDGE_CURVE ( 'NONE', #528, #812, #476, .T. ) ;
#604 = PRESENTATION_LAYER_ASSIGNMENT (  '', '', ( #1187 ) ) ;
#605 = EDGE_LOOP ( 'NONE', ( #905, #162, #870, #1039 ) ) ;
#606 =( LENGTH_UNIT ( ) NAMED_UNIT ( * ) SI_UNIT ( .MILLI., .METRE. ) );
#607 = CARTESIAN_POINT ( 'NONE',  ( -0.6999999999999998446, 0.2999999999999999889, -0.5000000000000000000 ) ) ;
#608 = CARTESIAN_POINT ( 'NONE',  ( -1.000000000000000000, -0.9164894359474625718, 2.168404344971008868E-16 ) ) ;
#609 = FILL_AREA_STYLE_COLOUR ( '', #1097 ) ;
#610 = FILL_AREA_STYLE_COLOUR ( '', #722 ) ;
#611 = UNCERTAINTY_MEASURE_WITH_UNIT (LENGTH_MEASURE( 1.000000000000000082E-05 ), #231, 'distance_accuracy_value', 'NONE');
#612 = FILL_AREA_STYLE_COLOUR ( '', #122 ) ;
#613 = PRESENTATION_LAYER_ASSIGNMENT (  '', '', ( #892 ) ) ;
#614 = PLANE ( 'NONE',  #185 ) ;
#615 = CARTESIAN_POINT ( 'NONE',  ( 1.000000000000000000, -0.9164894359474625718, -2.168404344971008868E-16 ) ) ;
#616 = CARTESIAN_POINT ( 'NONE',  ( 0.6000000000000000888, 0.000000000000000000, 0.4122962788466861817 ) ) ;
#617 = FILL_AREA_STYLE_COLOUR ( '', #1087 ) ;
#618 = EDGE_LOOP ( 'NONE', ( #263, #877, #249, #872, #323, #221 ) ) ;
#619 =( NAMED_UNIT ( * ) PLANE_ANGLE_UNIT ( ) SI_UNIT ( $, .RADIAN. ) );
#620 = DIRECTION ( 'NONE',  ( 0.000000000000000000, 0.000000000000000000, 1.000000000000000000 ) ) ;
#621 = CARTESIAN_POINT ( 'NONE',  ( -1.000000000000000222, 0.2999999999999999889, -0.5000000000000000000 ) ) ;
#622 = EDGE_CURVE ( 'NONE', #148, #1019, #889, .T. ) ;
#623 = VERTEX_POINT ( 'NONE', #755 ) ;
#624 = VECTOR ( 'NONE', #380, 1000.000000000000000 ) ;
#625 = VECTOR ( 'NONE', #1160, 1000.000000000000000 ) ;
#626 = STYLED_ITEM ( 'NONE', ( #1302 ), #779 ) ;
#627 = ORIENTED_EDGE ( 'NONE', *, *, #524, .T. ) ;
#628 = VERTEX_POINT ( 'NONE', #955 ) ;
#629 = ADVANCED_FACE ( 'NONE', ( #1173 ), #270, .T. ) ;
#630 = CARTESIAN_POINT ( 'NONE',  ( -0.5999999999999999778, -2.168404344971008868E-16, -0.4122962788466859041 ) ) ;
#631 = CARTESIAN_POINT ( 'NONE',  ( -0.6999999999999998446, 0.6999999999999999556, 0.5000000000000000000 ) ) ;
#632 = ORIENTED_EDGE ( 'NONE', *, *, #52, .F. ) ;
#633 = FILL_AREA_STYLE ('',( #265 ) ) ;
#634 = ORIENTED_EDGE ( 'NONE', *, *, #937, .F. ) ;
#635 = SURFACE_STYLE_FILL_AREA ( #1281 ) ;
#636 = FILL_AREA_STYLE ('',( #734 ) ) ;
#637 = DIRECTION ( 'NONE',  ( -2.168404344971008868E-16, 0.000000000000000000, -1.000000000000000000 ) ) ;
#638 = EDGE_LOOP ( 'NONE', ( #721, #1249, #125, #372, #108, #1153 ) ) ;
#639 = PRESENTATION_STYLE_ASSIGNMENT (( #301 ) ) ;
#640 = MECHANICAL_DESIGN_GEOMETRIC_PRESENTATION_REPRESENTATION (  '', ( #759 ), #678 ) ;
#641 = AXIS2_PLACEMENT_3D ( 'NONE', #36, #453, #1174 ) ;
#642 =( LENGTH_UNIT ( ) NAMED_UNIT ( * ) SI_UNIT ( .MILLI., .METRE. ) );
#643 = CARTESIAN_POINT ( 'NONE',  ( -1.000000000000000222, 0.2999999999999999889, -0.5000000000000000000 ) ) ;
#644 = UNCERTAINTY_MEASURE_WITH_UNIT (LENGTH_MEASURE( 1.000000000000000082E-05 ), #274, 'distance_accuracy_value', 'NONE');
#645 = DIRECTION ( 'NONE',  ( -1.000000000000000000, 0.000000000000000000, 0.000000000000000000 ) ) ;
#646 = LINE ( 'NONE', #361, #950 ) ;
#647 = CARTESIAN_POINT ( 'NONE',  ( -1.000000000000000000, 0.2999999999999999889, 2.168404344971008868E-16 ) ) ;
#648 = EDGE_CURVE ( 'NONE', #1135, #335, #850, .T. ) ;
#649 = CARTESIAN_POINT ( 'NONE',  ( -1.000000000000000000, 0.2999999999999999889, 0.5000000000000000000 ) ) ;
#650 = VECTOR ( 'NONE', #1221, 1000.000000000000000 ) ;
#651 = PRESENTATION_STYLE_ASSIGNMENT (( #343 ) ) ;
#652 = ORIENTED_EDGE ( 'NONE', *, *, #180, .T. ) ;
#653 = ADVANCED_FACE ( 'NONE', ( #736 ), #457, .F. ) ;
#654 = CARTESIAN_POINT ( 'NONE',  ( -1.000000000000000000, 0.2999999999999999889, 0.5000000000000000000 ) ) ;
#655 = PRESENTATION_STYLE_ASSIGNMENT (( #137 ) ) ;
#656 = ORIENTED_EDGE ( 'NONE', *, *, #751, .F. ) ;
#657 = FILL_AREA_STYLE ('',( #156 ) ) ;
#658 = EDGE_CURVE ( 'NONE', #513, #9, #740, .T. ) ;
#659 = PLANE ( 'NONE',  #702 ) ;
#660 = VECTOR ( 'NONE', #973, 1000.000000000000000 ) ;
#661 = FACE_OUTER_BOUND ( 'NONE', #277, .T. ) ;
#662 = MECHANICAL_DESIGN_GEOMETRIC_PRESENTATION_REPRESENTATION (  '', ( #47 ), #577 ) ;
#663 = VECTOR ( 'NONE', #969, 1000.000000000000000 ) ;
#664 = MECHANICAL_DESIGN_GEOMETRIC_PRESENTATION_REPRESENTATION (  '', ( #492 ), #131 ) ;
#665 = CIRCLE ( 'NONE', #583, 0.2000000000000000111 ) ;
#666 = VECTOR ( 'NONE', #993, 1000.000000000000000 ) ;
#667 = CARTESIAN_POINT ( 'NONE',  ( 1.000000000000000000, 0.2999999999999999889, 0.5000000000000000000 ) ) ;
#668 = CARTESIAN_POINT ( 'NONE',  ( 1.000000000000000000, -0.9164894359474625718, -0.2000000000000005107 ) ) ;
#669 = CARTESIAN_POINT ( 'NONE',  ( -2.793828257707912081E-16, 0.000000000000000000, -0.4122962788466856821 ) ) ;
#670 = SURFACE_SIDE_STYLE ('',( #160 ) ) ;
#671 = ORIENTED_EDGE ( 'NONE', *, *, #1090, .T. ) ;
#672 = PRODUCT_DEFINITION_SHAPE ( 'NONE', 'NONE',  #16 ) ;
#673 = CARTESIAN_POINT ( 'NONE',  ( 0.7000000000000000666, 0.6999999999999999556, -0.5000000000000000000 ) ) ;
#674 = DIRECTION ( 'NONE',  ( -2.168404344971008868E-16, 0.000000000000000000, -1.000000000000000000 ) ) ;
#675 = SURFACE_STYLE_USAGE ( .BOTH. , #496 ) ;
#676 = ORIENTED_EDGE ( 'NONE', *, *, #1170, .F. ) ;
#677 = DIRECTION ( 'NONE',  ( 0.000000000000000000, 0.000000000000000000, 1.000000000000000000 ) ) ;
#678 =( GEOMETRIC_REPRESENTATION_CONTEXT ( 3 ) GLOBAL_UNCERTAINTY_ASSIGNED_CONTEXT ( ( #697 ) ) GLOBAL_UNIT_ASSIGNED_CONTEXT ( ( #54, #154, #37 ) ) REPRESENTATION_CONTEXT ( 'NONE', 'WORKASPACE' ) );
#679 = FILL_AREA_STYLE_COLOUR ( '', #965 ) ;
#680 = DIRECTION ( 'NONE',  ( -0.000000000000000000, -1.000000000000000000, 0.000000000000000000 ) ) ;
#681 = AXIS2_PLACEMENT_3D ( 'NONE', #25, #220, #119 ) ;
#682 = CIRCLE ( 'NONE', #951, 0.2000000000000000111 ) ;
#683 =( GEOMETRIC_REPRESENTATION_CONTEXT ( 3 ) GLOBAL_UNCERTAINTY_ASSIGNED_CONTEXT ( ( #1109 ) ) GLOBAL_UNIT_ASSIGNED_CONTEXT ( ( #1219, #198, #1121 ) ) REPRESENTATION_CONTEXT ( 'NONE', 'WORKASPACE' ) );
#684 =( GEOMETRIC_REPRESENTATION_CONTEXT ( 3 ) GLOBAL_UNCERTAINTY_ASSIGNED_CONTEXT ( ( #1100 ) ) GLOBAL_UNIT_ASSIGNED_CONTEXT ( ( #707, #1141, #334 ) ) REPRESENTATION_CONTEXT ( 'NONE', 'WORKASPACE' ) );
#685 = SURFACE_SIDE_STYLE ('',( #80 ) ) ;
#686 = ORIENTED_EDGE ( 'NONE', *, *, #880, .F. ) ;
#687 = CARTESIAN_POINT ( 'NONE',  ( -1.000000000000000000, 0.2999999999999999889, 2.168404344971008868E-16 ) ) ;
#688 = DIRECTION ( 'NONE',  ( -6.776263578034403699E-16, 0.000000000000000000, -1.000000000000000000 ) ) ;
#689 = LINE ( 'NONE', #487, #285 ) ;
#690 = LINE ( 'NONE', #1095, #53 ) ;
#691 = PLANE ( 'NONE',  #90 ) ;
#692 = UNCERTAINTY_MEASURE_WITH_UNIT (LENGTH_MEASURE( 1.000000000000000082E-05 ), #999, 'distance_accuracy_value', 'NONE');
#693 = ADVANCED_FACE ( 'NONE', ( #138 ), #1283, .F. ) ;
#694 = FILL_AREA_STYLE_COLOUR ( '', #261 ) ;
#695 = UNCERTAINTY_MEASURE_WITH_UNIT (LENGTH_MEASURE( 1.000000000000000082E-05 ), #1086, 'distance_accuracy_value', 'NONE');
#696 = PRESENTATION_LAYER_ASSIGNMENT (  '', '', ( #776 ) ) ;
#697 = UNCERTAINTY_MEASURE_WITH_UNIT (LENGTH_MEASURE( 1.000000000000000082E-05 ), #54, 'distance_accuracy_value', 'NONE');
#698 = CARTESIAN_POINT ( 'NONE',  ( 1.000000000000000000, 0.000000000000000000, -0.2000000000000000111 ) ) ;
#699 = CARTESIAN_POINT ( 'NONE',  ( 1.000000000000000000, 0.000000000000000000, 0.000000000000000000 ) ) ;
#700 = AXIS2_PLACEMENT_3D ( 'NONE', #253, #260, #1042 ) ;
#701 = PRESENTATION_STYLE_ASSIGNMENT (( #14 ) ) ;
#702 = AXIS2_PLACEMENT_3D ( 'NONE', #766, #554, #255 ) ;
#703 =( GEOMETRIC_REPRESENTATION_CONTEXT ( 3 ) GLOBAL_UNCERTAINTY_ASSIGNED_CONTEXT ( ( #692 ) ) GLOBAL_UNIT_ASSIGNED_CONTEXT ( ( #999, #917, #501 ) ) REPRESENTATION_CONTEXT ( 'NONE', 'WORKASPACE' ) );
#704 = LINE ( 'NONE', #422, #822 ) ;
#705 = FILL_AREA_STYLE ('',( #500 ) ) ;
#706 = CARTESIAN_POINT ( 'NONE',  ( -0.6999999999999998446, 0.6999999999999999556, -0.5000000000000000000 ) ) ;
#707 =( LENGTH_UNIT ( ) NAMED_UNIT ( * ) SI_UNIT ( .MILLI., .METRE. ) );
#708 = ADVANCED_FACE ( 'NONE', ( #39 ), #149, .T. ) ;
#709 = ORIENTED_EDGE ( 'NONE', *, *, #48, .T. ) ;
#710 = APPLICATION_PROTOCOL_DEFINITION ( 'draft international standard', 'automotive_design', 1998, #816 ) ;
#711 = ORIENTED_EDGE ( 'NONE', *, *, #1328, .T. ) ;
#712 =( NAMED_UNIT ( * ) PLANE_ANGLE_UNIT ( ) SI_UNIT ( $, .RADIAN. ) );
#713 = EDGE_CURVE ( 'NONE', #266, #283, #682, .T. ) ;
#714 = LINE ( 'NONE', #1029, #1048 ) ;
#715 = EDGE_LOOP ( 'NONE', ( #720, #214, #42, #806 ) ) ;
#716 = VECTOR ( 'NONE', #452, 1000.000000000000000 ) ;
#717 = AXIS2_PLACEMENT_3D ( 'NONE', #780, #374, #674 ) ;
#718 = FILL_AREA_STYLE ('',( #1033 ) ) ;
#719 = VERTEX_POINT ( 'NONE', #381 ) ;
#720 = ORIENTED_EDGE ( 'NONE', *, *, #106, .F. ) ;
#721 = ORIENTED_EDGE ( 'NONE', *, *, #1251, .T. ) ;
#722 = COLOUR_RGB ( '',0.9411764705882352811, 0.9607843137254902244, 0.9686274509803921573 ) ;
#723 = MECHANICAL_DESIGN_GEOMETRIC_PRESENTATION_REPRESENTATION (  '', ( #626 ), #763 ) ;
#724 = FACE_OUTER_BOUND ( 'NONE', #1083, .T. ) ;
#725 = CARTESIAN_POINT ( 'NONE',  ( 1.000000000000000000, 0.000000000000000000, 0.5000000000000000000 ) ) ;
#726 = SURFACE_STYLE_USAGE ( .BOTH. , #321 ) ;
#727 = ORIENTED_EDGE ( 'NONE', *, *, #1069, .T. ) ;
#728 =( LENGTH_UNIT ( ) NAMED_UNIT ( * ) SI_UNIT ( .MILLI., .METRE. ) );
#729 = CARTESIAN_POINT ( 'NONE',  ( -1.000000000000000000, 0.000000000000000000, 0.5000000000000000000 ) ) ;
#730 = SURFACE_SIDE_STYLE ('',( #746 ) ) ;
#731 = ORIENTED_EDGE ( 'NONE', *, *, #3, .T. ) ;
#732 = VECTOR ( 'NONE', #147, 1000.000000000000000 ) ;
#733 = FILL_AREA_STYLE_COLOUR ( '', #1303 ) ;
#734 = FILL_AREA_STYLE_COLOUR ( '', #349 ) ;
#735 = CARTESIAN_POINT ( 'NONE',  ( -1.000000000000000000, 0.000000000000000000, 0.4122962788466863482 ) ) ;
#736 = FACE_OUTER_BOUND ( 'NONE', #618, .T. ) ;
#737 = AXIS2_PLACEMENT_3D ( 'NONE', #796, #897, #1006 ) ;
#738 = EDGE_CURVE ( 'NONE', #481, #809, #275, .T. ) ;
#739 = LINE ( 'NONE', #667, #560 ) ;
#740 = CIRCLE ( 'NONE', #170, 0.2000000000000000111 ) ;
#741 = CARTESIAN_POINT ( 'NONE',  ( -1.676296954624748382E-16, 0.000000000000000000, 0.4122962788466859041 ) ) ;
#742 = CARTESIAN_POINT ( 'NONE',  ( 1.000000000000000000, -0.9164894359474625718, 0.1999999999999995393 ) ) ;
#743 = VECTOR ( 'NONE', #510, 1000.000000000000000 ) ;
#744 = CARTESIAN_POINT ( 'NONE',  ( -1.000000000000000000, 0.000000000000000000, 0.000000000000000000 ) ) ;
#745 =( LENGTH_UNIT ( ) NAMED_UNIT ( * ) SI_UNIT ( .MILLI., .METRE. ) );
#746 = SURFACE_STYLE_FILL_AREA ( #139 ) ;
#747 = EDGE_CURVE ( 'NONE', #315, #58, #689, .T. ) ;
#748 = SURFACE_STYLE_FILL_AREA ( #851 ) ;
#749 = ORIENTED_EDGE ( 'NONE', *, *, #79, .F. ) ;
#750 = DIRECTION ( 'NONE',  ( 0.000000000000000000, 1.000000000000000000, 0.000000000000000000 ) ) ;
#751 = EDGE_CURVE ( 'NONE', #26, #1030, #183, .T. ) ;
#752 = CARTESIAN_POINT ( 'NONE',  ( 1.000000000000000000, 0.000000000000000000, -2.168404344971008868E-16 ) ) ;
#753 = DIRECTION ( 'NONE',  ( 0.000000000000000000, 1.000000000000000000, -0.000000000000000000 ) ) ;
#754 = DIRECTION ( 'NONE',  ( 0.000000000000000000, 0.000000000000000000, 1.000000000000000000 ) ) ;
#755 = CARTESIAN_POINT ( 'NONE',  ( 1.000000000000000000, 0.000000000000000000, 0.1999999999999995393 ) ) ;
#756 = DIRECTION ( 'NONE',  ( -1.314833807763602224E-16, 0.000000000000000000, -1.000000000000000000 ) ) ;
#757 = ORIENTED_EDGE ( 'NONE', *, *, #1130, .T. ) ;
#758 = ORIENTED_EDGE ( 'NONE', *, *, #1082, .T. ) ;
#759 = STYLED_ITEM ( 'NONE', ( #1255 ), #455 ) ;
#760 = STYLED_ITEM ( 'NONE', ( #545 ), #653 ) ;
#761 = LINE ( 'NONE', #269, #968 ) ;
#762 = MECHANICAL_DESIGN_GEOMETRIC_PRESENTATION_REPRESENTATION (  '', ( #70 ), #1266 ) ;
#763 =( GEOMETRIC_REPRESENTATION_CONTEXT ( 3 ) GLOBAL_UNCERTAINTY_ASSIGNED_CONTEXT ( ( #835 ) ) GLOBAL_UNIT_ASSIGNED_CONTEXT ( ( #781, #769, #76 ) ) REPRESENTATION_CONTEXT ( 'NONE', 'WORKASPACE' ) );
#764 = FILL_AREA_STYLE_COLOUR ( '', #948 ) ;
#765 = STYLED_ITEM ( 'NONE', ( #1148 ), #45 ) ;
#766 = CARTESIAN_POINT ( 'NONE',  ( -1.000000000000000222, 0.2999999999999999889, -0.5000000000000000000 ) ) ;
#767 = CARTESIAN_POINT ( 'NONE',  ( 1.000000000000000000, 0.2999999999999999889, 0.000000000000000000 ) ) ;
#768 = CARTESIAN_POINT ( 'NONE',  ( 1.000000000000000000, 0.000000000000000000, 0.1999999999999995115 ) ) ;
#769 =( NAMED_UNIT ( * ) PLANE_ANGLE_UNIT ( ) SI_UNIT ( $, .RADIAN. ) );
#770 = MANIFOLD_SOLID_BREP ( 'Cut-Extrude1', #1104 ) ;
#771 = DIRECTION ( 'NONE',  ( 0.000000000000000000, 1.000000000000000000, 0.000000000000000000 ) ) ;
#772 = ORIENTED_EDGE ( 'NONE', *, *, #738, .T. ) ;
#773 = DIRECTION ( 'NONE',  ( 1.314833807763602224E-16, 0.000000000000000000, 1.000000000000000000 ) ) ;
#774 = SURFACE_STYLE_USAGE ( .BOTH. , #1103 ) ;
#775 = CARTESIAN_POINT ( 'NONE',  ( 0.6000000000000000888, -0.9164894359474625718, 0.4122962788466861817 ) ) ;
#776 = STYLED_ITEM ( 'NONE', ( #83 ), #1217 ) ;
#777 = DIRECTION ( 'NONE',  ( 2.168404344971008868E-16, 0.000000000000000000, 1.000000000000000000 ) ) ;
#778 = ORIENTED_EDGE ( 'NONE', *, *, #622, .T. ) ;
#779 = MANIFOLD_SOLID_BREP ( 'Boss-Extrude3[2]', #429 ) ;
#780 = CARTESIAN_POINT ( 'NONE',  ( -1.000000000000000222, 0.2999999999999999889, -0.5000000000000000000 ) ) ;
#781 =( LENGTH_UNIT ( ) NAMED_UNIT ( * ) SI_UNIT ( .MILLI., .METRE. ) );
#782 =( GEOMETRIC_REPRESENTATION_CONTEXT ( 3 ) GLOBAL_UNCERTAINTY_ASSIGNED_CONTEXT ( ( #1319 ) ) GLOBAL_UNIT_ASSIGNED_CONTEXT ( ( #574, #478, #282 ) ) REPRESENTATION_CONTEXT ( 'NONE', 'WORKASPACE' ) );
#783 = VECTOR ( 'NONE', #402, 1000.000000000000000 ) ;
#784 = CARTESIAN_POINT ( 'NONE',  ( -1.000000000000000000, -0.9164894359474625718, 0.4122962788466863482 ) ) ;
#785 = EDGE_CURVE ( 'NONE', #893, #1235, #991, .T. ) ;
#786 = FILL_AREA_STYLE ('',( #392 ) ) ;
#787 = DIRECTION ( 'NONE',  ( 0.000000000000000000, 0.000000000000000000, 1.000000000000000000 ) ) ;
#788 = SURFACE_STYLE_USAGE ( .BOTH. , #1089 ) ;
#789 = ADVANCED_FACE ( 'NONE', ( #1216 ), #281, .F. ) ;
#790 = CYLINDRICAL_SURFACE ( 'NONE', #902, 0.2000000000000000111 ) ;
#791 = LINE ( 'NONE', #607, #1182 ) ;
#792 = CARTESIAN_POINT ( 'NONE',  ( 1.000000000000000000, -0.9164894359474625718, 0.4122962788466862372 ) ) ;
#793 = VECTOR ( 'NONE', #878, 1000.000000000000000 ) ;
#794 = CARTESIAN_POINT ( 'NONE',  ( -1.000000000000000222, 0.000000000000000000, -0.5000000000000000000 ) ) ;
#795 = UNCERTAINTY_MEASURE_WITH_UNIT (LENGTH_MEASURE( 1.000000000000000082E-05 ), #1022, 'distance_accuracy_value', 'NONE');
#796 = CARTESIAN_POINT ( 'NONE',  ( 1.000000000000000000, 0.000000000000000000, 0.000000000000000000 ) ) ;
#797 = ADVANCED_FACE ( 'NONE', ( #202 ), #1321, .T. ) ;
#798 = SURFACE_STYLE_FILL_AREA ( #718 ) ;
#799 = CARTESIAN_POINT ( 'NONE',  ( 1.000000000000000000, 0.000000000000000000, 0.000000000000000000 ) ) ;
#800 = FACE_OUTER_BOUND ( 'NONE', #311, .T. ) ;
#801 =( GEOMETRIC_REPRESENTATION_CONTEXT ( 3 ) GLOBAL_UNCERTAINTY_ASSIGNED_CONTEXT ( ( #1043 ) ) GLOBAL_UNIT_ASSIGNED_CONTEXT ( ( #1156, #934, #1263 ) ) REPRESENTATION_CONTEXT ( 'NONE', 'WORKASPACE' ) );
#802 = DIRECTION ( 'NONE',  ( 0.000000000000000000, 1.000000000000000000, 0.000000000000000000 ) ) ;
#803 = VERTEX_POINT ( 'NONE', #526 ) ;
#804 = EDGE_CURVE ( 'NONE', #1299, #462, #665, .T. ) ;
#805 = AXIS2_PLACEMENT_3D ( 'NONE', #244, #1150, #938 ) ;
#806 = ORIENTED_EDGE ( 'NONE', *, *, #862, .F. ) ;
#807 = ORIENTED_EDGE ( 'NONE', *, *, #89, .T. ) ;
#808 = FILL_AREA_STYLE ('',( #617 ) ) ;
#809 = VERTEX_POINT ( 'NONE', #825 ) ;
#810 = DIRECTION ( 'NONE',  ( -2.168404344971008868E-16, -0.000000000000000000, -1.000000000000000000 ) ) ;
#811 = AXIS2_PLACEMENT_3D ( 'NONE', #744, #544, #445 ) ;
#812 = VERTEX_POINT ( 'NONE', #307 ) ;
#813 = ADVANCED_FACE ( 'NONE', ( #815 ), #1105, .T. ) ;
#814 = PRESENTATION_STYLE_ASSIGNMENT (( #1125 ) ) ;
#815 = FACE_OUTER_BOUND ( 'NONE', #328, .T. ) ;
#816 = APPLICATION_CONTEXT ( 'automotive_design' ) ;
#817 = DIRECTION ( 'NONE',  ( 2.168404344971008868E-16, 0.000000000000000000, 1.000000000000000000 ) ) ;
#818 = CARTESIAN_POINT ( 'NONE',  ( -0.6999999999999998446, 0.2999999999999999889, -0.5000000000000000000 ) ) ;
#819 = ORIENTED_EDGE ( 'NONE', *, *, #1031, .F. ) ;
#820 = COLOUR_RGB ( '',0.6666666666666666297, 0.6980392156862744724, 0.7686274509803920907 ) ;
#821 = MECHANICAL_DESIGN_GEOMETRIC_PRESENTATION_REPRESENTATION (  '', ( #517 ), #908 ) ;
#822 = VECTOR ( 'NONE', #1016, 1000.000000000000000 ) ;
#823 = COLOUR_RGB ( '',0.3176470588235293935, 0.2470588235294117752, 0.2078431372549019440 ) ;
#824 = PRESENTATION_STYLE_ASSIGNMENT (( #19 ) ) ;
#825 = CARTESIAN_POINT ( 'NONE',  ( 1.000000000000000000, 0.2999999999999999889, 0.4122962788466862372 ) ) ;
#826 = DIRECTION ( 'NONE',  ( 0.000000000000000000, -0.000000000000000000, 1.000000000000000000 ) ) ;
#827 = ORIENTED_EDGE ( 'NONE', *, *, #1168, .T. ) ;
#828 = ADVANCED_FACE ( 'NONE', ( #1161 ), #543, .T. ) ;
#829 = ORIENTED_EDGE ( 'NONE', *, *, #69, .T. ) ;
#830 =( NAMED_UNIT ( * ) PLANE_ANGLE_UNIT ( ) SI_UNIT ( $, .RADIAN. ) );
#831 = DIRECTION ( 'NONE',  ( -0.000000000000000000, -1.000000000000000000, -0.000000000000000000 ) ) ;
#832 = DIRECTION ( 'NONE',  ( -2.168404344971008868E-16, 0.000000000000000000, -1.000000000000000000 ) ) ;
#833 = SURFACE_STYLE_FILL_AREA ( #568 ) ;
#834 = PRODUCT_DEFINITION_FORMATION_WITH_SPECIFIED_SOURCE ( 'ANY', '', #150, .NOT_KNOWN. ) ;
#835 = UNCERTAINTY_MEASURE_WITH_UNIT (LENGTH_MEASURE( 1.000000000000000082E-05 ), #781, 'distance_accuracy_value', 'NONE');
#836 = CARTESIAN_POINT ( 'NONE',  ( -0.5999999999999999778, -0.9164894359474625718, -0.4122962788466859041 ) ) ;
#837 = SURFACE_STYLE_FILL_AREA ( #952 ) ;
#838 = DIRECTION ( 'NONE',  ( 0.000000000000000000, 1.000000000000000000, 0.000000000000000000 ) ) ;
#839 = DIRECTION ( 'NONE',  ( 1.000000000000000000, 0.000000000000000000, -2.168404344971008868E-16 ) ) ;
#840 = VECTOR ( 'NONE', #957, 1000.000000000000000 ) ;
#841 = DIRECTION ( 'NONE',  ( -1.314833807763602224E-16, 0.000000000000000000, -1.000000000000000000 ) ) ;
#842 = ORIENTED_EDGE ( 'NONE', *, *, #118, .F. ) ;
#843 = ORIENTED_EDGE ( 'NONE', *, *, #3, .F. ) ;
#844 = EDGE_CURVE ( 'NONE', #462, #513, #931, .T. ) ;
#845 = PRESENTATION_LAYER_ASSIGNMENT (  '', '', ( #1286 ) ) ;
#846 = COLOUR_RGB ( '',0.3176470588235293935, 0.2470588235294117752, 0.2078431372549019440 ) ;
#847 = VECTOR ( 'NONE', #831, 1000.000000000000000 ) ;
#848 = AXIS2_PLACEMENT_3D ( 'NONE', #330, #393, #1209 ) ;
#849 = DIRECTION ( 'NONE',  ( -0.000000000000000000, -0.000000000000000000, -1.000000000000000000 ) ) ;
#850 = LINE ( 'NONE', #1276, #23 ) ;
#851 = FILL_AREA_STYLE ('',( #569 ) ) ;
#852 =( NAMED_UNIT ( * ) SI_UNIT ( $, .STERADIAN. ) SOLID_ANGLE_UNIT ( ) );
#853 = PLANE ( 'NONE',  #254 ) ;
#854 =( NAMED_UNIT ( * ) SI_UNIT ( $, .STERADIAN. ) SOLID_ANGLE_UNIT ( ) );
#855 = LINE ( 'NONE', #836, #1158 ) ;
#856 = VERTEX_POINT ( 'NONE', #31 ) ;
#857 = ORIENTED_EDGE ( 'NONE', *, *, #986, .F. ) ;
#858 = DIRECTION ( 'NONE',  ( 0.000000000000000000, 0.000000000000000000, 1.000000000000000000 ) ) ;
#859 = EDGE_CURVE ( 'NONE', #362, #1019, #438, .T. ) ;
#860 = LINE ( 'NONE', #446, #625 ) ;
#861 = EDGE_LOOP ( 'NONE', ( #970, #842, #1285, #711 ) ) ;
#862 = EDGE_CURVE ( 'NONE', #26, #1279, #38, .T. ) ;
#863 = SURFACE_STYLE_USAGE ( .BOTH. , #964 ) ;
#864 = CIRCLE ( 'NONE', #1205, 0.2000000000000000111 ) ;
#865 = CYLINDRICAL_SURFACE ( 'NONE', #581, 0.2000000000000000111 ) ;
#866 =( LENGTH_UNIT ( ) NAMED_UNIT ( * ) SI_UNIT ( .MILLI., .METRE. ) );
#867 = VECTOR ( 'NONE', #810, 1000.000000000000000 ) ;
#868 = AXIS2_PLACEMENT_3D ( 'NONE', #10, #1320, #507 ) ;
#869 = FILL_AREA_STYLE ('',( #484 ) ) ;
#870 = ORIENTED_EDGE ( 'NONE', *, *, #747, .F. ) ;
#871 = ORIENTED_EDGE ( 'NONE', *, *, #474, .F. ) ;
#872 = ORIENTED_EDGE ( 'NONE', *, *, #804, .T. ) ;
#873 = SURFACE_STYLE_FILL_AREA ( #73 ) ;
#874 = PRODUCT_RELATED_PRODUCT_CATEGORY ( 'part', '', ( #150 ) ) ;
#875 = DIRECTION ( 'NONE',  ( -0.000000000000000000, 1.000000000000000000, -0.000000000000000000 ) ) ;
#876 = FACE_OUTER_BOUND ( 'NONE', #715, .T. ) ;
#877 = ORIENTED_EDGE ( 'NONE', *, *, #1272, .T. ) ;
#878 = DIRECTION ( 'NONE',  ( 2.168404344971008868E-16, 0.000000000000000000, 1.000000000000000000 ) ) ;
#879 = SURFACE_STYLE_FILL_AREA ( #598 ) ;
#880 = EDGE_CURVE ( 'NONE', #1030, #271, #1256, .T. ) ;
#881 = FACE_OUTER_BOUND ( 'NONE', #1142, .T. ) ;
#882 = EDGE_CURVE ( 'NONE', #58, #521, #1018, .T. ) ;
#883 = DIRECTION ( 'NONE',  ( 0.000000000000000000, 1.000000000000000000, 0.000000000000000000 ) ) ;
#884 = APPLICATION_CONTEXT ( 'automotive_design' ) ;
#885 = LINE ( 'NONE', #178, #666 ) ;
#886 = PRESENTATION_STYLE_ASSIGNMENT (( #1091 ) ) ;
#887 = UNCERTAINTY_MEASURE_WITH_UNIT (LENGTH_MEASURE( 1.000000000000000082E-05 ), #312, 'distance_accuracy_value', 'NONE');
#888 =( NAMED_UNIT ( * ) SI_UNIT ( $, .STERADIAN. ) SOLID_ANGLE_UNIT ( ) );
#889 = LINE ( 'NONE', #942, #540 ) ;
#890 = PRESENTATION_STYLE_ASSIGNMENT (( #587 ) ) ;
#891 =( LENGTH_UNIT ( ) NAMED_UNIT ( * ) SI_UNIT ( .MILLI., .METRE. ) );
#892 = STYLED_ITEM ( 'NONE', ( #1317 ), #1312 ) ;
#893 = VERTEX_POINT ( 'NONE', #616 ) ;
#894 = DIRECTION ( 'NONE',  ( 0.000000000000000000, 0.000000000000000000, -1.000000000000000000 ) ) ;
#895 = DIRECTION ( 'NONE',  ( -0.000000000000000000, -1.000000000000000000, -0.000000000000000000 ) ) ;
#896 = MECHANICAL_DESIGN_GEOMETRIC_PRESENTATION_REPRESENTATION (  '', ( #776 ), #992 ) ;
#897 = DIRECTION ( 'NONE',  ( 0.000000000000000000, 1.000000000000000000, 0.000000000000000000 ) ) ;
#898 = DIRECTION ( 'NONE',  ( -0.000000000000000000, -1.000000000000000000, -0.000000000000000000 ) ) ;
#899 = SURFACE_STYLE_FILL_AREA ( #423 ) ;
#900 = CARTESIAN_POINT ( 'NONE',  ( -1.000000000000000000, 0.000000000000000000, 0.1999999999999995115 ) ) ;
#901 = MECHANICAL_DESIGN_GEOMETRIC_PRESENTATION_REPRESENTATION (  '', ( #407 ), #1224 ) ;
#902 = AXIS2_PLACEMENT_3D ( 'NONE', #470, #994, #588 ) ;
#903 = PRESENTATION_LAYER_ASSIGNMENT (  '', '', ( #626 ) ) ;
#904 = CARTESIAN_POINT ( 'NONE',  ( -1.000000000000000222, 0.000000000000000000, -0.2000000000000005107 ) ) ;
#905 = ORIENTED_EDGE ( 'NONE', *, *, #1323, .T. ) ;
#906 = STYLED_ITEM ( 'NONE', ( #314 ), #338 ) ;
#907 = MECHANICAL_DESIGN_GEOMETRIC_PRESENTATION_REPRESENTATION (  '', ( #242 ), #684 ) ;
#908 =( GEOMETRIC_REPRESENTATION_CONTEXT ( 3 ) GLOBAL_UNCERTAINTY_ASSIGNED_CONTEXT ( ( #82 ) ) GLOBAL_UNIT_ASSIGNED_CONTEXT ( ( #519, #318, #1034 ) ) REPRESENTATION_CONTEXT ( 'NONE', 'WORKASPACE' ) );
#909 = FACE_OUTER_BOUND ( 'NONE', #861, .T. ) ;
#910 = PRESENTATION_STYLE_ASSIGNMENT (( #325 ) ) ;
#911 = DIRECTION ( 'NONE',  ( 0.000000000000000000, 1.000000000000000000, 0.000000000000000000 ) ) ;
#912 = ORIENTED_EDGE ( 'NONE', *, *, #804, .F. ) ;
#913 = CARTESIAN_POINT ( 'NONE',  ( 1.000000000000000000, 0.000000000000000000, -0.2000000000000005107 ) ) ;
#914 = ORIENTED_EDGE ( 'NONE', *, *, #419, .T. ) ;
#915 = EDGE_CURVE ( 'NONE', #320, #1279, #115, .T. ) ;
#916 = PLANE ( 'NONE',  #868 ) ;
#917 =( NAMED_UNIT ( * ) PLANE_ANGLE_UNIT ( ) SI_UNIT ( $, .RADIAN. ) );
#918 = EDGE_CURVE ( 'NONE', #362, #1233, #714, .T. ) ;
#919 = CARTESIAN_POINT ( 'NONE',  ( 1.000000000000000000, 0.000000000000000000, -0.2000000000000005107 ) ) ;
#920 = ORIENTED_EDGE ( 'NONE', *, *, #958, .T. ) ;
#921 = ORIENTED_EDGE ( 'NONE', *, *, #69, .F. ) ;
#922 = ADVANCED_FACE ( 'NONE', ( #800 ), #418, .F. ) ;
#923 = PLANE ( 'NONE',  #1124 ) ;
#924 = FACE_OUTER_BOUND ( 'NONE', #377, .T. ) ;
#925 = VERTEX_POINT ( 'NONE', #6 ) ;
#926 = AXIS2_PLACEMENT_3D ( 'NONE', #279, #1073, #677 ) ;
#927 = VECTOR ( 'NONE', #1202, 1000.000000000000000 ) ;
#928 = VECTOR ( 'NONE', #645, 1000.000000000000000 ) ;
#929 = STYLED_ITEM ( 'NONE', ( #639 ), #65 ) ;
#930 = DIRECTION ( 'NONE',  ( 0.000000000000000000, 0.000000000000000000, 1.000000000000000000 ) ) ;
#931 = LINE ( 'NONE', #742, #978 ) ;
#932 = SURFACE_SIDE_STYLE ('',( #237 ) ) ;
#933 = ORIENTED_EDGE ( 'NONE', *, *, #1047, .T. ) ;
#934 =( NAMED_UNIT ( * ) PLANE_ANGLE_UNIT ( ) SI_UNIT ( $, .RADIAN. ) );
#935 =( NAMED_UNIT ( * ) SI_UNIT ( $, .STERADIAN. ) SOLID_ANGLE_UNIT ( ) );
#936 = PLANE ( 'NONE',  #491 ) ;
#937 = EDGE_CURVE ( 'NONE', #1235, #809, #412, .T. ) ;
#938 = DIRECTION ( 'NONE',  ( -2.168404344971009361E-16, 0.000000000000000000, -1.000000000000000000 ) ) ;
#939 = LINE ( 'NONE', #55, #200 ) ;
#940 = PRESENTATION_STYLE_ASSIGNMENT (( #34 ) ) ;
#941 = UNCERTAINTY_MEASURE_WITH_UNIT (LENGTH_MEASURE( 1.000000000000000082E-05 ), #84, 'distance_accuracy_value', 'NONE');
#942 = CARTESIAN_POINT ( 'NONE',  ( -1.000000000000000000, -0.9164894359474625718, -0.2000000000000000111 ) ) ;
#943 = EDGE_CURVE ( 'NONE', #315, #925, #1008, .T. ) ;
#944 = ORIENTED_EDGE ( 'NONE', *, *, #1199, .T. ) ;
#945 = COLOUR_RGB ( '',0.3176470588235293935, 0.2470588235294117752, 0.2078431372549019440 ) ;
#946 =( NAMED_UNIT ( * ) PLANE_ANGLE_UNIT ( ) SI_UNIT ( $, .RADIAN. ) );
#947 =( GEOMETRIC_REPRESENTATION_CONTEXT ( 3 ) GLOBAL_UNCERTAINTY_ASSIGNED_CONTEXT ( ( #341 ) ) GLOBAL_UNIT_ASSIGNED_CONTEXT ( ( #642, #830, #1049 ) ) REPRESENTATION_CONTEXT ( 'NONE', 'WORKASPACE' ) );
#948 = COLOUR_RGB ( '',0.3176470588235293935, 0.2470588235294117752, 0.2078431372549019440 ) ;
#949 = VERTEX_POINT ( 'NONE', #630 ) ;
#950 = VECTOR ( 'NONE', #262, 1000.000000000000000 ) ;
#951 = AXIS2_PLACEMENT_3D ( 'NONE', #592, #78, #1297 ) ;
#952 = FILL_AREA_STYLE ('',( #733 ) ) ;
#953 = VECTOR ( 'NONE', #339, 1000.000000000000000 ) ;
#954 = CARTESIAN_POINT ( 'NONE',  ( -0.5999999999999998668, 0.2999999999999999889, 0.4122962788466863482 ) ) ;
#955 = CARTESIAN_POINT ( 'NONE',  ( 1.000000000000000000, 0.2999999999999999889, 0.1999999999999995115 ) ) ;
#956 = ORIENTED_EDGE ( 'NONE', *, *, #593, .T. ) ;
#957 = DIRECTION ( 'NONE',  ( -1.000000000000000000, 0.000000000000000000, -4.065758146820642614E-16 ) ) ;
#958 = EDGE_CURVE ( 'NONE', #266, #480, #1322, .T. ) ;
#959 = CARTESIAN_POINT ( 'NONE',  ( 0.9999999999999997780, 0.2999999999999999889, -0.5000000000000000000 ) ) ;
#960 = CARTESIAN_POINT ( 'NONE',  ( 0.000000000000000000, 0.000000000000000000, 0.000000000000000000 ) ) ;
#961 = SURFACE_SIDE_STYLE ('',( #748 ) ) ;
#962 = ORIENTED_EDGE ( 'NONE', *, *, #603, .T. ) ;
#963 =( GEOMETRIC_REPRESENTATION_CONTEXT ( 3 ) GLOBAL_UNCERTAINTY_ASSIGNED_CONTEXT ( ( #497 ) ) GLOBAL_UNIT_ASSIGNED_CONTEXT ( ( #1052, #1282, #1275 ) ) REPRESENTATION_CONTEXT ( 'NONE', 'WORKASPACE' ) );
#964 = SURFACE_SIDE_STYLE ('',( #873 ) ) ;
#965 = COLOUR_RGB ( '',0.9411764705882352811, 0.9607843137254902244, 0.9686274509803921573 ) ;
#966 = SURFACE_SIDE_STYLE ('',( #173 ) ) ;
#967 = FILL_AREA_STYLE_COLOUR ( '', #1267 ) ;
#968 = VECTOR ( 'NONE', #773, 1000.000000000000000 ) ;
#969 = DIRECTION ( 'NONE',  ( -0.000000000000000000, -1.000000000000000000, -0.000000000000000000 ) ) ;
#970 = ORIENTED_EDGE ( 'NONE', *, *, #63, .T. ) ;
#971 = EDGE_LOOP ( 'NONE', ( #322, #827, #498, #461 ) ) ;
#972 = PRESENTATION_LAYER_ASSIGNMENT (  '', '', ( #759 ) ) ;
#973 = DIRECTION ( 'NONE',  ( 0.000000000000000000, 1.000000000000000000, 0.000000000000000000 ) ) ;
#974 = EDGE_CURVE ( 'NONE', #1030, #803, #1112, .T. ) ;
#975 =( NAMED_UNIT ( * ) SI_UNIT ( $, .STERADIAN. ) SOLID_ANGLE_UNIT ( ) );
#976 = AXIS2_PLACEMENT_3D ( 'NONE', #1108, #802, #116 ) ;
#977 = MECHANICAL_DESIGN_GEOMETRIC_PRESENTATION_REPRESENTATION (  '', ( #370 ), #390 ) ;
#978 = VECTOR ( 'NONE', #838, 1000.000000000000000 ) ;
#979 = CARTESIAN_POINT ( 'NONE',  ( 1.000000000000000000, 0.2999999999999999889, -0.4122962788466862372 ) ) ;
#980 = ORIENTED_EDGE ( 'NONE', *, *, #859, .F. ) ;
#981 = ORIENTED_EDGE ( 'NONE', *, *, #593, .F. ) ;
#982 = LINE ( 'NONE', #668, #660 ) ;
#983 = CARTESIAN_POINT ( 'NONE',  ( 0.000000000000000000, 0.000000000000000000, 0.4122962788466863482 ) ) ;
#984 = FILL_AREA_STYLE ('',( #1075 ) ) ;
#985 = DIRECTION ( 'NONE',  ( 2.168404344971008868E-16, 0.000000000000000000, 1.000000000000000000 ) ) ;
#986 = EDGE_CURVE ( 'NONE', #271, #283, #1226, .T. ) ;
#987 = VECTOR ( 'NONE', #754, 1000.000000000000000 ) ;
#988 = PLANE ( 'NONE',  #144 ) ;
#989 = VECTOR ( 'NONE', #258, 1000.000000000000000 ) ;
#990 = PLANE ( 'NONE',  #167 ) ;
#991 = LINE ( 'NONE', #775, #927 ) ;
#992 =( GEOMETRIC_REPRESENTATION_CONTEXT ( 3 ) GLOBAL_UNCERTAINTY_ASSIGNED_CONTEXT ( ( #695 ) ) GLOBAL_UNIT_ASSIGNED_CONTEXT ( ( #1086, #1192, #975 ) ) REPRESENTATION_CONTEXT ( 'NONE', 'WORKASPACE' ) );
#993 = DIRECTION ( 'NONE',  ( -2.168404344971008868E-16, -0.000000000000000000, -1.000000000000000000 ) ) ;
#994 = DIRECTION ( 'NONE',  ( 0.000000000000000000, 1.000000000000000000, 0.000000000000000000 ) ) ;
#995 = COLOUR_RGB ( '',0.3176470588235293935, 0.2470588235294117752, 0.2078431372549019440 ) ;
#996 = CARTESIAN_POINT ( 'NONE',  ( 0.5999999999999999778, -0.9164894359474625718, -7.889002846581611863E-17 ) ) ;
#997 = CARTESIAN_POINT ( 'NONE',  ( 1.000000000000000000, -0.9164894359474625718, -0.4122962788466862372 ) ) ;
#998 = VECTOR ( 'NONE', #1093, 1000.000000000000000 ) ;
#999 =( LENGTH_UNIT ( ) NAMED_UNIT ( * ) SI_UNIT ( .MILLI., .METRE. ) );
#1000 = VECTOR ( 'NONE', #503, 1000.000000000000000 ) ;
#1001 = AXIS2_PLACEMENT_3D ( 'NONE', #550, #365, #1065 ) ;
#1002 = UNCERTAINTY_MEASURE_WITH_UNIT (LENGTH_MEASURE( 1.000000000000000082E-05 ), #164, 'distance_accuracy_value', 'NONE');
#1003 = DIRECTION ( 'NONE',  ( -1.000000000000000000, 0.000000000000000000, 2.168404344971008868E-16 ) ) ;
#1004 = EDGE_LOOP ( 'NONE', ( #536, #962, #15, #1278 ) ) ;
#1005 = UNCERTAINTY_MEASURE_WITH_UNIT (LENGTH_MEASURE( 1.000000000000000082E-05 ), #49, 'distance_accuracy_value', 'NONE');
#1006 = DIRECTION ( 'NONE',  ( 0.000000000000000000, 0.000000000000000000, 1.000000000000000000 ) ) ;
#1007 = DIRECTION ( 'NONE',  ( 2.168404344971009361E-16, 0.000000000000000000, 1.000000000000000000 ) ) ;
#1008 = LINE ( 'NONE', #1231, #783 ) ;
#1009 = ORIENTED_EDGE ( 'NONE', *, *, #100, .T. ) ;
#1010 = ORIENTED_EDGE ( 'NONE', *, *, #751, .T. ) ;
#1011 = FILL_AREA_STYLE ('',( #612 ) ) ;
#1012 = FACE_OUTER_BOUND ( 'NONE', #264, .T. ) ;
#1013 = DIRECTION ( 'NONE',  ( 0.000000000000000000, 1.000000000000000000, 0.000000000000000000 ) ) ;
#1014 = CARTESIAN_POINT ( 'NONE',  ( 0.9999999999999997780, 0.000000000000000000, -0.5000000000000000000 ) ) ;
#1015 = VERTEX_POINT ( 'NONE', #725 ) ;
#1016 = DIRECTION ( 'NONE',  ( -1.000000000000000000, 0.000000000000000000, 6.776263578034402713E-16 ) ) ;
#1017 = SURFACE_SIDE_STYLE ('',( #1111 ) ) ;
#1018 = LINE ( 'NONE', #20, #743 ) ;
#1019 = VERTEX_POINT ( 'NONE', #1252 ) ;
#1020 = MECHANICAL_DESIGN_GEOMETRIC_PRESENTATION_REPRESENTATION (  '', ( #1286 ), #782 ) ;
#1021 = ORIENTED_EDGE ( 'NONE', *, *, #1099, .F. ) ;
#1022 =( LENGTH_UNIT ( ) NAMED_UNIT ( * ) SI_UNIT ( .MILLI., .METRE. ) );
#1023 = ORIENTED_EDGE ( 'NONE', *, *, #1031, .T. ) ;
#1024 = MECHANICAL_DESIGN_GEOMETRIC_PRESENTATION_REPRESENTATION (  '', ( #50 ), #493 ) ;
#1025 = AXIS2_PLACEMENT_3D ( 'NONE', #527, #911, #826 ) ;
#1026 = ORIENTED_EDGE ( 'NONE', *, *, #915, .F. ) ;
#1027 = CLOSED_SHELL ( 'NONE', ( #455, #421, #257, #174, #1051, #813, #65, #922 ) ) ;
#1028 =( LENGTH_UNIT ( ) NAMED_UNIT ( * ) SI_UNIT ( .MILLI., .METRE. ) );
#1029 = CARTESIAN_POINT ( 'NONE',  ( 1.676296954624746903E-16, 0.2999999999999999889, -0.4122962788466856821 ) ) ;
#1030 = VERTEX_POINT ( 'NONE', #621 ) ;
#1031 = EDGE_CURVE ( 'NONE', #1183, #1287, #197, .T. ) ;
#1032 =( NAMED_UNIT ( * ) PLANE_ANGLE_UNIT ( ) SI_UNIT ( $, .RADIAN. ) );
#1033 = FILL_AREA_STYLE_COLOUR ( '', #153 ) ;
#1034 =( NAMED_UNIT ( * ) SI_UNIT ( $, .STERADIAN. ) SOLID_ANGLE_UNIT ( ) );
#1035 = CARTESIAN_POINT ( 'NONE',  ( -1.000000000000000000, 0.000000000000000000, 2.168404344971008868E-16 ) ) ;
#1036 = ORIENTED_EDGE ( 'NONE', *, *, #1197, .F. ) ;
#1037 = PRESENTATION_LAYER_ASSIGNMENT (  '', '', ( #142 ) ) ;
#1038 = FACE_OUTER_BOUND ( 'NONE', #331, .T. ) ;
#1039 = ORIENTED_EDGE ( 'NONE', *, *, #943, .T. ) ;
#1040 = LINE ( 'NONE', #752, #532 ) ;
#1041 = ORIENTED_EDGE ( 'NONE', *, *, #882, .F. ) ;
#1042 = DIRECTION ( 'NONE',  ( 1.000000000000000000, 0.000000000000000000, 4.065758146820642614E-16 ) ) ;
#1043 = UNCERTAINTY_MEASURE_WITH_UNIT (LENGTH_MEASURE( 1.000000000000000082E-05 ), #1156, 'distance_accuracy_value', 'NONE');
#1044 = SURFACE_STYLE_USAGE ( .BOTH. , #730 ) ;
#1045 = MECHANICAL_DESIGN_GEOMETRIC_PRESENTATION_REPRESENTATION (  '', ( #760 ), #801 ) ;
#1046 = CARTESIAN_POINT ( 'NONE',  ( -1.000000000000000000, 0.2999999999999999889, 0.000000000000000000 ) ) ;
#1047 = EDGE_CURVE ( 'NONE', #1144, #1183, #192, .T. ) ;
#1048 = VECTOR ( 'NONE', #1120, 1000.000000000000000 ) ;
#1049 =( NAMED_UNIT ( * ) SI_UNIT ( $, .STERADIAN. ) SOLID_ANGLE_UNIT ( ) );
#1050 = DIRECTION ( 'NONE',  ( 2.168404344971008868E-16, 0.000000000000000000, 1.000000000000000000 ) ) ;
#1051 = ADVANCED_FACE ( 'NONE', ( #924 ), #1107, .F. ) ;
#1052 =( LENGTH_UNIT ( ) NAMED_UNIT ( * ) SI_UNIT ( .MILLI., .METRE. ) );
#1053 = EDGE_LOOP ( 'NONE', ( #627, #1146, #205, #102 ) ) ;
#1054 = CARTESIAN_POINT ( 'NONE',  ( 1.000000000000000000, 0.2999999999999999889, 0.000000000000000000 ) ) ;
#1055 = SURFACE_STYLE_FILL_AREA ( #633 ) ;
#1056 = CARTESIAN_POINT ( 'NONE',  ( 1.000000000000000000, 0.000000000000000000, 0.1999999999999995393 ) ) ;
#1057 = CARTESIAN_POINT ( 'NONE',  ( 0.9999999999999997780, 0.2999999999999999889, -0.5000000000000000000 ) ) ;
#1058 = CARTESIAN_POINT ( 'NONE',  ( -0.6999999999999998446, 0.6999999999999999556, -0.5000000000000000000 ) ) ;
#1059 = SURFACE_STYLE_FILL_AREA ( #657 ) ;
#1060 = EDGE_LOOP ( 'NONE', ( #7, #1169, #1010, #1237, #749, #13, #378, #758 ) ) ;
#1061 = ORIENTED_EDGE ( 'NONE', *, *, #224, .F. ) ;
#1062 = SURFACE_STYLE_USAGE ( .BOTH. , #443 ) ;
#1063 = DIRECTION ( 'NONE',  ( 2.168404344971008868E-16, 0.000000000000000000, 1.000000000000000000 ) ) ;
#1064 = EDGE_LOOP ( 'NONE', ( #426, #778, #980, #1061 ) ) ;
#1065 = DIRECTION ( 'NONE',  ( 0.000000000000000000, -0.000000000000000000, 1.000000000000000000 ) ) ;
#1066 = ORIENTED_EDGE ( 'NONE', *, *, #1197, .T. ) ;
#1067 = COLOUR_RGB ( '',0.3176470588235293935, 0.2470588235294117752, 0.2078431372549019440 ) ;
#1068 = CARTESIAN_POINT ( 'NONE',  ( -0.6999999999999998446, 0.6999999999999999556, -0.5000000000000000000 ) ) ;
#1069 = EDGE_CURVE ( 'NONE', #157, #1122, #549, .T. ) ;
#1070 = DIRECTION ( 'NONE',  ( -0.000000000000000000, -1.000000000000000000, -0.000000000000000000 ) ) ;
#1071 = ORIENTED_EDGE ( 'NONE', *, *, #1099, .T. ) ;
#1072 = EDGE_CURVE ( 'NONE', #273, #272, #939, .T. ) ;
#1073 = DIRECTION ( 'NONE',  ( -0.000000000000000000, 1.000000000000000000, -0.000000000000000000 ) ) ;
#1074 = DIRECTION ( 'NONE',  ( 1.000000000000000000, 0.000000000000000000, -6.776263578034403699E-16 ) ) ;
#1075 = FILL_AREA_STYLE_COLOUR ( '', #601 ) ;
#1076 = LINE ( 'NONE', #784, #1106 ) ;
#1077 = ORIENTED_EDGE ( 'NONE', *, *, #658, .F. ) ;
#1078 = EDGE_CURVE ( 'NONE', #809, #513, #1271, .T. ) ;
#1079 = FACE_OUTER_BOUND ( 'NONE', #1053, .T. ) ;
#1080 = CARTESIAN_POINT ( 'NONE',  ( 0.9999999999999997780, 0.000000000000000000, -0.5000000000000000000 ) ) ;
#1081 = LINE ( 'NONE', #276, #238 ) ;
#1082 = EDGE_CURVE ( 'NONE', #121, #628, #558, .T. ) ;
#1083 = EDGE_LOOP ( 'NONE', ( #1114, #829, #1009, #807 ) ) ;
#1084 = AXIS2_PLACEMENT_3D ( 'NONE', #767, #158, #66 ) ;
#1085 = COLOUR_RGB ( '',0.3176470588235293935, 0.2470588235294117752, 0.2078431372549019440 ) ;
#1086 =( LENGTH_UNIT ( ) NAMED_UNIT ( * ) SI_UNIT ( .MILLI., .METRE. ) );
#1087 = COLOUR_RGB ( '',0.6666666666666666297, 0.6980392156862744724, 0.7686274509803920907 ) ;
#1088 = DIRECTION ( 'NONE',  ( 0.000000000000000000, 0.000000000000000000, 1.000000000000000000 ) ) ;
#1089 = SURFACE_SIDE_STYLE ('',( #879 ) ) ;
#1090 = EDGE_CURVE ( 'NONE', #1183, #148, #483, .T. ) ;
#1091 = SURFACE_STYLE_USAGE ( .BOTH. , #685 ) ;
#1092 = PRESENTATION_STYLE_ASSIGNMENT (( #288 ) ) ;
#1093 = DIRECTION ( 'NONE',  ( 0.000000000000000000, 1.000000000000000000, 0.000000000000000000 ) ) ;
#1094 = ORIENTED_EDGE ( 'NONE', *, *, #713, .T. ) ;
#1095 = CARTESIAN_POINT ( 'NONE',  ( -1.000000000000000222, 0.2999999999999999889, -0.5000000000000000000 ) ) ;
#1096 = SURFACE_SIDE_STYLE ('',( #161 ) ) ;
#1097 = COLOUR_RGB ( '',0.3176470588235293935, 0.2470588235294117752, 0.2078431372549019440 ) ;
#1098 = FACE_OUTER_BOUND ( 'NONE', #1004, .T. ) ;
#1099 = EDGE_CURVE ( 'NONE', #1135, #315, #340, .T. ) ;
#1100 = UNCERTAINTY_MEASURE_WITH_UNIT (LENGTH_MEASURE( 1.000000000000000082E-05 ), #707, 'distance_accuracy_value', 'NONE');
#1101 =( GEOMETRIC_REPRESENTATION_CONTEXT ( 3 ) GLOBAL_UNCERTAINTY_ASSIGNED_CONTEXT ( ( #644 ) ) GLOBAL_UNIT_ASSIGNED_CONTEXT ( ( #274, #1290, #1198 ) ) REPRESENTATION_CONTEXT ( 'NONE', 'WORKASPACE' ) );
#1102 = CARTESIAN_POINT ( 'NONE',  ( -1.000000000000000222, 0.000000000000000000, -0.5000000000000000000 ) ) ;
#1103 = SURFACE_SIDE_STYLE ('',( #177 ) ) ;
#1104 = CLOSED_SHELL ( 'NONE', ( #233, #1166, #245, #143, #1274, #367, #708, #693, #511, #546 ) ) ;
#1105 = PLANE ( 'NONE',  #287 ) ;
#1106 = VECTOR ( 'NONE', #771, 1000.000000000000000 ) ;
#1107 = CYLINDRICAL_SURFACE ( 'NONE', #1119, 0.2000000000000000111 ) ;
#1108 = CARTESIAN_POINT ( 'NONE',  ( 0.000000000000000000, 0.2999999999999999889, 0.000000000000000000 ) ) ;
#1109 = UNCERTAINTY_MEASURE_WITH_UNIT (LENGTH_MEASURE( 1.000000000000000082E-05 ), #1219, 'distance_accuracy_value', 'NONE');
#1110 = DIRECTION ( 'NONE',  ( 1.000000000000000000, 0.000000000000000000, 0.000000000000000000 ) ) ;
#1111 = SURFACE_STYLE_FILL_AREA ( #5 ) ;
#1112 = LINE ( 'NONE', #502, #389 ) ;
#1113 = CARTESIAN_POINT ( 'NONE',  ( -1.000000000000000000, 0.000000000000000000, 0.1999999999999995115 ) ) ;
#1114 = ORIENTED_EDGE ( 'NONE', *, *, #1069, .F. ) ;
#1115 = APPLICATION_PROTOCOL_DEFINITION ( 'draft international standard', 'automotive_design', 1998, #884 ) ;
#1116 = CARTESIAN_POINT ( 'NONE',  ( -1.000000000000000000, 0.2999999999999999889, 0.5000000000000000000 ) ) ;
#1117 = SURFACE_STYLE_FILL_AREA ( #1230 ) ;
#1118 = DIRECTION ( 'NONE',  ( -2.168404344971009361E-16, 0.000000000000000000, -1.000000000000000000 ) ) ;
#1119 = AXIS2_PLACEMENT_3D ( 'NONE', #155, #1151, #567 ) ;
#1120 = DIRECTION ( 'NONE',  ( 1.000000000000000000, 0.000000000000000000, 4.065758146820640641E-16 ) ) ;
#1121 =( NAMED_UNIT ( * ) SI_UNIT ( $, .STERADIAN. ) SOLID_ANGLE_UNIT ( ) );
#1122 = VERTEX_POINT ( 'NONE', #954 ) ;
#1123 = CARTESIAN_POINT ( 'NONE',  ( 0.000000000000000000, 0.000000000000000000, 0.000000000000000000 ) ) ;
#1124 = AXIS2_PLACEMENT_3D ( 'NONE', #541, #1171, #363 ) ;
#1125 = SURFACE_STYLE_USAGE ( .BOTH. , #1222 ) ;
#1126 = DIRECTION ( 'NONE',  ( -1.000000000000000000, 0.000000000000000000, 2.168404344971009361E-16 ) ) ;
#1127 = STYLED_ITEM ( 'NONE', ( #243 ), #479 ) ;
#1128 = SURFACE_STYLE_USAGE ( .BOTH. , #308 ) ;
#1129 = PRESENTATION_LAYER_ASSIGNMENT (  '', '', ( #1305 ) ) ;
#1130 = EDGE_CURVE ( 'NONE', #148, #856, #1177, .T. ) ;
#1131 = VECTOR ( 'NONE', #756, 1000.000000000000000 ) ;
#1132 = AXIS2_PLACEMENT_3D ( 'NONE', #706, #508, #894 ) ;
#1133 = ORIENTED_EDGE ( 'NONE', *, *, #344, .T. ) ;
#1134 = CARTESIAN_POINT ( 'NONE',  ( 0.7000000000000000666, 0.2999999999999999889, -0.5000000000000000000 ) ) ;
#1135 = VERTEX_POINT ( 'NONE', #251 ) ;
#1136 = VECTOR ( 'NONE', #98, 1000.000000000000000 ) ;
#1137 = VECTOR ( 'NONE', #898, 1000.000000000000000 ) ;
#1138 = PRESENTATION_LAYER_ASSIGNMENT (  '', '', ( #929 ) ) ;
#1139 =( NAMED_UNIT ( * ) SI_UNIT ( $, .STERADIAN. ) SOLID_ANGLE_UNIT ( ) );
#1140 =( NAMED_UNIT ( * ) PLANE_ANGLE_UNIT ( ) SI_UNIT ( $, .RADIAN. ) );
#1141 =( NAMED_UNIT ( * ) PLANE_ANGLE_UNIT ( ) SI_UNIT ( $, .RADIAN. ) );
#1142 = EDGE_LOOP ( 'NONE', ( #709, #1326, #1194, #538 ) ) ;
#1143 = LINE ( 'NONE', #818, #1000 ) ;
#1144 = VERTEX_POINT ( 'NONE', #735 ) ;
#1145 = ORIENTED_EDGE ( 'NONE', *, *, #79, .T. ) ;
#1146 = ORIENTED_EDGE ( 'NONE', *, *, #590, .F. ) ;
#1147 = AXIS2_PLACEMENT_3D ( 'NONE', #1123, #207, #188 ) ;
#1148 = PRESENTATION_STYLE_ASSIGNMENT (( #123 ) ) ;
#1149 = VERTEX_POINT ( 'NONE', #649 ) ;
#1150 = DIRECTION ( 'NONE',  ( 1.000000000000000000, 0.000000000000000000, -2.168404344971009361E-16 ) ) ;
#1151 = DIRECTION ( 'NONE',  ( 0.000000000000000000, 1.000000000000000000, 0.000000000000000000 ) ) ;
#1152 = LINE ( 'NONE', #440, #928 ) ;
#1153 = ORIENTED_EDGE ( 'NONE', *, *, #415, .T. ) ;
#1154 = FILL_AREA_STYLE_COLOUR ( '', #556 ) ;
#1155 = PRESENTATION_STYLE_ASSIGNMENT (( #444 ) ) ;
#1156 =( LENGTH_UNIT ( ) NAMED_UNIT ( * ) SI_UNIT ( .MILLI., .METRE. ) );
#1157 = CIRCLE ( 'NONE', #1084, 0.2000000000000000111 ) ;
#1158 = VECTOR ( 'NONE', #1167, 1000.000000000000000 ) ;
#1159 = PRESENTATION_LAYER_ASSIGNMENT (  '', '', ( #407 ) ) ;
#1160 = DIRECTION ( 'NONE',  ( -2.168404344971008868E-16, -0.000000000000000000, -1.000000000000000000 ) ) ;
#1161 = FACE_OUTER_BOUND ( 'NONE', #1190, .T. ) ;
#1162 = CARTESIAN_POINT ( 'NONE',  ( -1.000000000000000000, 0.000000000000000000, 0.2000000000000000111 ) ) ;
#1163 = ORIENTED_EDGE ( 'NONE', *, *, #986, .T. ) ;
#1164 = DIRECTION ( 'NONE',  ( 0.000000000000000000, 1.000000000000000000, 0.000000000000000000 ) ) ;
#1165 = SURFACE_STYLE_FILL_AREA ( #1259 ) ;
#1166 = ADVANCED_FACE ( 'NONE', ( #448 ), #853, .F. ) ;
#1167 = DIRECTION ( 'NONE',  ( 0.000000000000000000, 1.000000000000000000, 0.000000000000000000 ) ) ;
#1168 = EDGE_CURVE ( 'NONE', #949, #856, #353, .T. ) ;
#1169 = ORIENTED_EDGE ( 'NONE', *, *, #106, .T. ) ;
#1170 = EDGE_CURVE ( 'NONE', #283, #803, #1262, .T. ) ;
#1171 = DIRECTION ( 'NONE',  ( 0.000000000000000000, 0.000000000000000000, 1.000000000000000000 ) ) ;
#1172 = LINE ( 'NONE', #1058, #298 ) ;
#1173 = FACE_OUTER_BOUND ( 'NONE', #1250, .T. ) ;
#1174 = DIRECTION ( 'NONE',  ( -1.000000000000000000, 0.000000000000000000, -0.000000000000000000 ) ) ;
#1175 = ORIENTED_EDGE ( 'NONE', *, *, #648, .F. ) ;
#1176 = SURFACE_STYLE_USAGE ( .BOTH. , #437 ) ;
#1177 = LINE ( 'NONE', #44, #716 ) ;
#1178 = COLOUR_RGB ( '',0.9411764705882352811, 0.9607843137254902244, 0.9686274509803921573 ) ;
#1179 = EDGE_CURVE ( 'NONE', #1295, #1299, #1040, .T. ) ;
#1180 = PRESENTATION_LAYER_ASSIGNMENT (  '', '', ( #428 ) ) ;
#1181 = ORIENTED_EDGE ( 'NONE', *, *, #584, .F. ) ;
#1182 = VECTOR ( 'NONE', #401, 1000.000000000000000 ) ;
#1183 = VERTEX_POINT ( 'NONE', #1162 ) ;
#1184 = PRESENTATION_STYLE_ASSIGNMENT (( #1044 ) ) ;
#1185 = EDGE_LOOP ( 'NONE', ( #414, #1220, #1041, #434 ) ) ;
#1186 =( GEOMETRIC_REPRESENTATION_CONTEXT ( 3 ) GLOBAL_UNCERTAINTY_ASSIGNED_CONTEXT ( ( #795 ) ) GLOBAL_UNIT_ASSIGNED_CONTEXT ( ( #1022, #99, #193 ) ) REPRESENTATION_CONTEXT ( 'NONE', 'WORKASPACE' ) );
#1187 = STYLED_ITEM ( 'NONE', ( #814 ), #421 ) ;
#1188 = FILL_AREA_STYLE ('',( #679 ) ) ;
#1189 = DIRECTION ( 'NONE',  ( 2.168404344971009361E-16, 0.000000000000000000, 1.000000000000000000 ) ) ;
#1190 = EDGE_LOOP ( 'NONE', ( #559, #219, #447, #463 ) ) ;
#1191 = FACE_OUTER_BOUND ( 'NONE', #571, .T. ) ;
#1192 =( NAMED_UNIT ( * ) PLANE_ANGLE_UNIT ( ) SI_UNIT ( $, .RADIAN. ) );
#1193 =( LENGTH_UNIT ( ) NAMED_UNIT ( * ) SI_UNIT ( .MILLI., .METRE. ) );
#1194 = ORIENTED_EDGE ( 'NONE', *, *, #1082, .F. ) ;
#1195 = ORIENTED_EDGE ( 'NONE', *, *, #713, .F. ) ;
#1196 = PRODUCT_DEFINITION_CONTEXT ( 'detailed design', #884, 'design' ) ;
#1197 = EDGE_CURVE ( 'NONE', #521, #1135, #1172, .T. ) ;
#1198 =( NAMED_UNIT ( * ) SI_UNIT ( $, .STERADIAN. ) SOLID_ANGLE_UNIT ( ) );
#1199 = EDGE_CURVE ( 'NONE', #1287, #719, #553, .T. ) ;
#1200 =( NAMED_UNIT ( * ) PLANE_ANGLE_UNIT ( ) SI_UNIT ( $, .RADIAN. ) );
#1201 =( NAMED_UNIT ( * ) PLANE_ANGLE_UNIT ( ) SI_UNIT ( $, .RADIAN. ) );
#1202 = DIRECTION ( 'NONE',  ( 0.000000000000000000, 1.000000000000000000, 0.000000000000000000 ) ) ;
#1203 = FILL_AREA_STYLE ('',( #490 ) ) ;
#1204 = VECTOR ( 'NONE', #1211, 1000.000000000000000 ) ;
#1205 = AXIS2_PLACEMENT_3D ( 'NONE', #1046, #145, #1277 ) ;
#1206 = LINE ( 'NONE', #1102, #1324 ) ;
#1207 = COLOUR_RGB ( '',0.3176470588235293935, 0.2470588235294117752, 0.2078431372549019440 ) ;
#1208 = LINE ( 'NONE', #997, #489 ) ;
#1209 = DIRECTION ( 'NONE',  ( -1.000000000000000000, 0.000000000000000000, -0.000000000000000000 ) ) ;
#1210 = CARTESIAN_POINT ( 'NONE',  ( 0.7000000000000000666, 0.6999999999999999556, -0.5000000000000000000 ) ) ;
#1211 = DIRECTION ( 'NONE',  ( 1.000000000000000000, -0.000000000000000000, 0.000000000000000000 ) ) ;
#1212 = PRESENTATION_STYLE_ASSIGNMENT (( #788 ) ) ;
#1213 = MECHANICAL_DESIGN_GEOMETRIC_PRESENTATION_REPRESENTATION (  '', ( #892 ), #551 ) ;
#1214 = UNCERTAINTY_MEASURE_WITH_UNIT (LENGTH_MEASURE( 1.000000000000000082E-05 ), #891, 'distance_accuracy_value', 'NONE');
#1215 = CARTESIAN_POINT ( 'NONE',  ( -2.793828257707912081E-16, -0.9164894359474625718, -0.4122962788466856821 ) ) ;
#1216 = FACE_OUTER_BOUND ( 'NONE', #530, .T. ) ;
#1217 = ADVANCED_FACE ( 'NONE', ( #466 ), #988, .F. ) ;
#1218 = ORIENTED_EDGE ( 'NONE', *, *, #1294, .T. ) ;
#1219 =( LENGTH_UNIT ( ) NAMED_UNIT ( * ) SI_UNIT ( .MILLI., .METRE. ) );
#1220 = ORIENTED_EDGE ( 'NONE', *, *, #195, .F. ) ;
#1221 = DIRECTION ( 'NONE',  ( -0.000000000000000000, -1.000000000000000000, -0.000000000000000000 ) ) ;
#1222 = SURFACE_SIDE_STYLE ('',( #798 ) ) ;
#1223 = AXIS2_PLACEMENT_3D ( 'NONE', #168, #582, #777 ) ;
#1224 =( GEOMETRIC_REPRESENTATION_CONTEXT ( 3 ) GLOBAL_UNCERTAINTY_ASSIGNED_CONTEXT ( ( #941 ) ) GLOBAL_UNIT_ASSIGNED_CONTEXT ( ( #84, #1201, #482 ) ) REPRESENTATION_CONTEXT ( 'NONE', 'WORKASPACE' ) );
#1225 = DIRECTION ( 'NONE',  ( 1.000000000000000000, 0.000000000000000000, -2.168404344971009361E-16 ) ) ;
#1226 = LINE ( 'NONE', #534, #1308 ) ;
#1227 = FACE_OUTER_BOUND ( 'NONE', #638, .T. ) ;
#1228 = ORIENTED_EDGE ( 'NONE', *, *, #738, .F. ) ;
#1229 = LINE ( 'NONE', #95, #222 ) ;
#1230 = FILL_AREA_STYLE ('',( #111 ) ) ;
#1231 = CARTESIAN_POINT ( 'NONE',  ( -0.6999999999999998446, 0.6999999999999999556, 0.5000000000000000000 ) ) ;
#1232 = CARTESIAN_POINT ( 'NONE',  ( 1.000000000000000000, 0.000000000000000000, -2.168404344971008868E-16 ) ) ;
#1233 = VERTEX_POINT ( 'NONE', #486 ) ;
#1234 = ADVANCED_FACE ( 'NONE', ( #74 ), #294, .T. ) ;
#1235 = VERTEX_POINT ( 'NONE', #1296 ) ;
#1236 = CARTESIAN_POINT ( 'NONE',  ( -0.6999999999999998446, 0.2999999999999999889, -0.5000000000000000000 ) ) ;
#1237 = ORIENTED_EDGE ( 'NONE', *, *, #974, .T. ) ;
#1238 = PLANE ( 'NONE',  #848 ) ;
#1239 = PRESENTATION_STYLE_ASSIGNMENT (( #114 ) ) ;
#1240 = VECTOR ( 'NONE', #171, 1000.000000000000000 ) ;
#1241 = DIRECTION ( 'NONE',  ( 2.168404344971008868E-16, 0.000000000000000000, 1.000000000000000000 ) ) ;
#1242 = PRESENTATION_LAYER_ASSIGNMENT (  '', '', ( #406 ) ) ;
#1243 = PRESENTATION_LAYER_ASSIGNMENT (  '', '', ( #492 ) ) ;
#1244 = ORIENTED_EDGE ( 'NONE', *, *, #584, .T. ) ;
#1245 = SURFACE_STYLE_FILL_AREA ( #808 ) ;
#1246 = ORIENTED_EDGE ( 'NONE', *, *, #89, .F. ) ;
#1247 = AXIS2_PLACEMENT_3D ( 'NONE', #1253, #342, #241 ) ;
#1248 = VECTOR ( 'NONE', #1050, 1000.000000000000000 ) ;
#1249 = ORIENTED_EDGE ( 'NONE', *, *, #937, .T. ) ;
#1250 = EDGE_LOOP ( 'NONE', ( #871, #772, #634, #212 ) ) ;
#1251 = EDGE_CURVE ( 'NONE', #812, #1235, #761, .T. ) ;
#1252 = CARTESIAN_POINT ( 'NONE',  ( -1.000000000000000000, 0.2999999999999999889, -0.2000000000000000111 ) ) ;
#1253 = CARTESIAN_POINT ( 'NONE',  ( 0.000000000000000000, 0.2999999999999999889, 0.000000000000000000 ) ) ;
#1254 = ORIENTED_EDGE ( 'NONE', *, *, #747, .T. ) ;
#1255 = PRESENTATION_STYLE_ASSIGNMENT (( #1062 ) ) ;
#1256 = LINE ( 'NONE', #319, #134 ) ;
#1257 = CARTESIAN_POINT ( 'NONE',  ( 1.676296954624746903E-16, 0.000000000000000000, -0.4122962788466856821 ) ) ;
#1258 = SURFACE_STYLE_USAGE ( .BOTH. , #360 ) ;
#1259 = FILL_AREA_STYLE ('',( #248 ) ) ;
#1260 = CARTESIAN_POINT ( 'NONE',  ( -0.5999999999999999778, 0.000000000000000000, 7.889002846581611863E-17 ) ) ;
#1261 = CARTESIAN_POINT ( 'NONE',  ( 1.000000000000000000, 0.2999999999999999889, -0.2000000000000005107 ) ) ;
#1262 = LINE ( 'NONE', #59, #64 ) ;
#1263 =( NAMED_UNIT ( * ) SI_UNIT ( $, .STERADIAN. ) SOLID_ANGLE_UNIT ( ) );
#1264 = UNCERTAINTY_MEASURE_WITH_UNIT (LENGTH_MEASURE( 1.000000000000000082E-05 ), #1193, 'distance_accuracy_value', 'NONE');
#1265 = PLANE ( 'NONE',  #1247 ) ;
#1266 =( GEOMETRIC_REPRESENTATION_CONTEXT ( 3 ) GLOBAL_UNCERTAINTY_ASSIGNED_CONTEXT ( ( #1214 ) ) GLOBAL_UNIT_ASSIGNED_CONTEXT ( ( #891, #175, #107 ) ) REPRESENTATION_CONTEXT ( 'NONE', 'WORKASPACE' ) );
#1267 = COLOUR_RGB ( '',0.6666666666666666297, 0.6980392156862744724, 0.7686274509803920907 ) ;
#1268 = FACE_OUTER_BOUND ( 'NONE', #60, .T. ) ;
#1269 = ORIENTED_EDGE ( 'NONE', *, *, #1294, .F. ) ;
#1270 = CARTESIAN_POINT ( 'NONE',  ( -1.000000000000000000, 0.2999999999999999889, 0.1999999999999995115 ) ) ;
#1271 = LINE ( 'NONE', #228, #552 ) ;
#1272 = EDGE_CURVE ( 'NONE', #528, #1295, #386, .T. ) ;
#1273 =( LENGTH_UNIT ( ) NAMED_UNIT ( * ) SI_UNIT ( .MILLI., .METRE. ) );
#1274 = ADVANCED_FACE ( 'NONE', ( #67 ), #77, .F. ) ;
#1275 =( NAMED_UNIT ( * ) SI_UNIT ( $, .STERADIAN. ) SOLID_ANGLE_UNIT ( ) );
#1276 = CARTESIAN_POINT ( 'NONE',  ( -0.6999999999999998446, 0.6999999999999999556, -0.5000000000000000000 ) ) ;
#1277 = DIRECTION ( 'NONE',  ( 0.000000000000000000, 0.000000000000000000, -1.000000000000000000 ) ) ;
#1278 = ORIENTED_EDGE ( 'NONE', *, *, #579, .F. ) ;
#1279 = VERTEX_POINT ( 'NONE', #1080 ) ;
#1280 = ORIENTED_EDGE ( 'NONE', *, *, #1323, .F. ) ;
#1281 = FILL_AREA_STYLE ('',( #1154 ) ) ;
#1282 =( NAMED_UNIT ( * ) PLANE_ANGLE_UNIT ( ) SI_UNIT ( $, .RADIAN. ) );
#1283 = PLANE ( 'NONE',  #1001 ) ;
#1284 = LINE ( 'NONE', #56, #1131 ) ;
#1285 = ORIENTED_EDGE ( 'NONE', *, *, #488, .F. ) ;
#1286 = STYLED_ITEM ( 'NONE', ( #1304 ), #208 ) ;
#1287 = VERTEX_POINT ( 'NONE', #379 ) ;
#1288 = PRESENTATION_LAYER_ASSIGNMENT (  '', '', ( #47 ) ) ;
#1289 = MECHANICAL_DESIGN_GEOMETRIC_PRESENTATION_REPRESENTATION (  '', ( #431 ), #1186 ) ;
#1290 =( NAMED_UNIT ( * ) PLANE_ANGLE_UNIT ( ) SI_UNIT ( $, .RADIAN. ) );
#1291 =( GEOMETRIC_REPRESENTATION_CONTEXT ( 3 ) GLOBAL_UNCERTAINTY_ASSIGNED_CONTEXT ( ( #299 ) ) GLOBAL_UNIT_ASSIGNED_CONTEXT ( ( #333, #227, #236 ) ) REPRESENTATION_CONTEXT ( 'NONE', 'WORKASPACE' ) );
#1292 = SURFACE_STYLE_USAGE ( .BOTH. , #966 ) ;
#1293 = DIRECTION ( 'NONE',  ( 0.000000000000000000, 1.000000000000000000, 0.000000000000000000 ) ) ;
#1294 = EDGE_CURVE ( 'NONE', #1279, #271, #1206, .T. ) ;
#1295 = VERTEX_POINT ( 'NONE', #190 ) ;
#1296 = CARTESIAN_POINT ( 'NONE',  ( 0.6000000000000000888, 0.2999999999999999889, 0.4122962788466861817 ) ) ;
#1297 = DIRECTION ( 'NONE',  ( 0.000000000000000000, 0.000000000000000000, -1.000000000000000000 ) ) ;
#1298 = CARTESIAN_POINT ( 'NONE',  ( 0.9999999999999997780, 0.2999999999999999889, -0.5000000000000000000 ) ) ;
#1299 = VERTEX_POINT ( 'NONE', #698 ) ;
#1300 = CARTESIAN_POINT ( 'NONE',  ( 0.7000000000000000666, 0.6999999999999999556, -0.5000000000000000000 ) ) ;
#1301 =( NAMED_UNIT ( * ) SI_UNIT ( $, .STERADIAN. ) SOLID_ANGLE_UNIT ( ) );
#1302 = PRESENTATION_STYLE_ASSIGNMENT (( #675 ) ) ;
#1303 = COLOUR_RGB ( '',0.3176470588235293935, 0.2470588235294117752, 0.2078431372549019440 ) ;
#1304 = PRESENTATION_STYLE_ASSIGNMENT (( #293 ) ) ;
#1305 = STYLED_ITEM ( 'NONE', ( #940 ), #629 ) ;
#1306 = VECTOR ( 'NONE', #529, 1000.000000000000000 ) ;
#1307 = MECHANICAL_DESIGN_GEOMETRIC_PRESENTATION_REPRESENTATION (  '', ( #542 ), #703 ) ;
#1308 = VECTOR ( 'NONE', #1241, 1000.000000000000000 ) ;
#1309 = FILL_AREA_STYLE_COLOUR ( '', #1327 ) ;
#1310 = VECTOR ( 'NONE', #417, 1000.000000000000000 ) ;
#1311 = MECHANICAL_DESIGN_GEOMETRIC_PRESENTATION_REPRESENTATION (  '', ( #765 ), #539 ) ;
#1312 = ADVANCED_BREP_SHAPE_REPRESENTATION ( '150080VS75000', ( #356, #770, #338, #779, #1147 ), #8 ) ;
#1313 = FACE_OUTER_BOUND ( 'NONE', #971, .T. ) ;
#1314 = LINE ( 'NONE', #768, #624 ) ;
#1315 = EDGE_CURVE ( 'NONE', #320, #623, #18, .T. ) ;
#1316 = UNCERTAINTY_MEASURE_WITH_UNIT (LENGTH_MEASURE( 1.000000000000000082E-05 ), #101, 'distance_accuracy_value', 'NONE');
#1317 = PRESENTATION_STYLE_ASSIGNMENT (( #408 ) ) ;
#1318 = VECTOR ( 'NONE', #124, 1000.000000000000000 ) ;
#1319 = UNCERTAINTY_MEASURE_WITH_UNIT (LENGTH_MEASURE( 1.000000000000000082E-05 ), #574, 'distance_accuracy_value', 'NONE');
#1320 = DIRECTION ( 'NONE',  ( 0.000000000000000000, 0.000000000000000000, -1.000000000000000000 ) ) ;
#1321 = PLANE ( 'NONE',  #602 ) ;
#1322 = LINE ( 'NONE', #900, #210 ) ;
#1323 = EDGE_CURVE ( 'NONE', #925, #273, #1229, .T. ) ;
#1324 = VECTOR ( 'NONE', #300, 1000.000000000000000 ) ;
#1325 = LINE ( 'NONE', #919, #1306 ) ;
#1326 = ORIENTED_EDGE ( 'NONE', *, *, #590, .T. ) ;
#1327 = COLOUR_RGB ( '',0.3176470588235293935, 0.2470588235294117752, 0.2078431372549019440 ) ;
#1328 = EDGE_CURVE ( 'NONE', #1149, #252, #194, .T. ) ;
#1329 = CARTESIAN_POINT ( 'NONE',  ( -1.000000000000000222, 0.000000000000000000, -0.5000000000000000000 ) ) ;
ENDSEC;
END-ISO-10303-21;
