(footprint "PCA" (version 20221018) (generator pcbnew)
  (layer "F.Cu")
  (descr "28-LEAD TSSOP")
  (tags "Integrated Circuit")
  (attr smd)
  (fp_text reference "IC**" (at 0 0) (layer "F.SilkS")
      (effects (font (size 1.27 1.27) (thickness 0.254)))
    (tstamp e085f2d7-68a5-47a3-8f38-19aff5b63a31)
  )
  (fp_text value "PCA" (at 0 0) (layer "F.SilkS") hide
      (effects (font (size 1.27 1.27) (thickness 0.254)))
    (tstamp dcfb50d1-c959-4e1d-a0d6-c0db71ca95a3)
  )
  (fp_text user "${REFERENCE}" (at 0 0) (layer "F.Fab")
      (effects (font (size 1.27 1.27) (thickness 0.254)))
    (tstamp 6d9433db-5d79-4050-9370-b1e9656e5aa0)
  )
  (fp_line (start -3.675 -4.8) (end -2.2 -4.8)
    (stroke (width 0.2) (type solid)) (layer "F.SilkS") (tstamp 4c0ecd0d-f8e0-4d66-aa03-4b29e0655bd6))
  (fp_line (start -1.85 -4.85) (end 1.85 -4.85)
    (stroke (width 0.2) (type solid)) (layer "F.SilkS") (tstamp 353da8e0-0987-4f6d-8655-11ed8fe65f51))
  (fp_line (start -1.85 4.85) (end -1.85 -4.85)
    (stroke (width 0.2) (type solid)) (layer "F.SilkS") (tstamp a1ac4a60-d3ad-4d3e-9b23-7279743f46ca))
  (fp_line (start 1.85 -4.85) (end 1.85 4.85)
    (stroke (width 0.2) (type solid)) (layer "F.SilkS") (tstamp 918914f8-5ac3-4209-b59a-18b042dcbbdb))
  (fp_line (start 1.85 4.85) (end -1.85 4.85)
    (stroke (width 0.2) (type solid)) (layer "F.SilkS") (tstamp 5239e6ee-9664-47a6-a6b5-942bce34e0b8))
  (fp_line (start -3.925 -5.15) (end 3.925 -5.15)
    (stroke (width 0.05) (type solid)) (layer "F.CrtYd") (tstamp 9ffdbf75-1da6-4f92-b62b-740bca45407a))
  (fp_line (start -3.925 5.15) (end -3.925 -5.15)
    (stroke (width 0.05) (type solid)) (layer "F.CrtYd") (tstamp 37c2577a-2c82-4db8-a347-be09e2758558))
  (fp_line (start 3.925 -5.15) (end 3.925 5.15)
    (stroke (width 0.05) (type solid)) (layer "F.CrtYd") (tstamp e7660100-c294-4a82-ba1a-bbc6b128269d))
  (fp_line (start 3.925 5.15) (end -3.925 5.15)
    (stroke (width 0.05) (type solid)) (layer "F.CrtYd") (tstamp 9a4b69cd-3fd5-4445-bb5c-2d596232e1a2))
  (fp_line (start -2.2 -4.85) (end 2.2 -4.85)
    (stroke (width 0.1) (type solid)) (layer "F.Fab") (tstamp 6a1a4e35-8bde-47b9-839b-1f389623246c))
  (fp_line (start -2.2 -4.2) (end -1.55 -4.85)
    (stroke (width 0.1) (type solid)) (layer "F.Fab") (tstamp 92c977c9-60a7-420c-a0be-512afa8242e0))
  (fp_line (start -2.2 4.85) (end -2.2 -4.85)
    (stroke (width 0.1) (type solid)) (layer "F.Fab") (tstamp b7444985-e44c-4b05-a32d-6831e1c81618))
  (fp_line (start 2.2 -4.85) (end 2.2 4.85)
    (stroke (width 0.1) (type solid)) (layer "F.Fab") (tstamp 6cdaec0e-de1d-4a88-ad19-5e7415dca064))
  (fp_line (start 2.2 4.85) (end -2.2 4.85)
    (stroke (width 0.1) (type solid)) (layer "F.Fab") (tstamp 974b7785-067e-4a22-aab5-ae1cc06da44f))
  (pad "1" smd rect (at -2.938 -4.225 90) (size 0.45 1.475) (layers "F.Cu" "F.Paste" "F.Mask") (tstamp 9400aed3-6815-46bb-b8ce-8d8732e25dcc))
  (pad "2" smd rect (at -2.938 -3.575 90) (size 0.45 1.475) (layers "F.Cu" "F.Paste" "F.Mask") (tstamp 2e3d7fd2-3b18-4e3f-953c-332f837e12f4))
  (pad "3" smd rect (at -2.938 -2.925 90) (size 0.45 1.475) (layers "F.Cu" "F.Paste" "F.Mask") (tstamp eb4c64d5-fc26-45c7-91c5-c1b30142dcef))
  (pad "4" smd rect (at -2.938 -2.275 90) (size 0.45 1.475) (layers "F.Cu" "F.Paste" "F.Mask") (tstamp 16e2207d-3498-4832-937a-30d5770d854e))
  (pad "5" smd rect (at -2.938 -1.625 90) (size 0.45 1.475) (layers "F.Cu" "F.Paste" "F.Mask") (tstamp db6ab9b6-998d-42c9-8e22-1067e8819592))
  (pad "6" smd rect (at -2.938 -0.975 90) (size 0.45 1.475) (layers "F.Cu" "F.Paste" "F.Mask") (tstamp 60225891-4f01-43e5-a38f-e0fd9a6ddc49))
  (pad "7" smd rect (at -2.938 -0.325 90) (size 0.45 1.475) (layers "F.Cu" "F.Paste" "F.Mask") (tstamp 9d36fd98-fc21-4f17-b9f7-2209641fd3ba))
  (pad "8" smd rect (at -2.938 0.325 90) (size 0.45 1.475) (layers "F.Cu" "F.Paste" "F.Mask") (tstamp c331ad02-4c4a-4df2-8517-da08beb8496e))
  (pad "9" smd rect (at -2.938 0.975 90) (size 0.45 1.475) (layers "F.Cu" "F.Paste" "F.Mask") (tstamp 48bc139a-be3d-415d-b3aa-fe3e68530026))
  (pad "10" smd rect (at -2.938 1.625 90) (size 0.45 1.475) (layers "F.Cu" "F.Paste" "F.Mask") (tstamp 1449970d-1c54-46dc-b690-b2213aaed461))
  (pad "11" smd rect (at -2.938 2.275 90) (size 0.45 1.475) (layers "F.Cu" "F.Paste" "F.Mask") (tstamp 0b04528c-e5b7-49f2-97ff-2819faa7867c))
  (pad "12" smd rect (at -2.938 2.925 90) (size 0.45 1.475) (layers "F.Cu" "F.Paste" "F.Mask") (tstamp 4a916728-0565-4ecc-82f2-b63f6981b3d8))
  (pad "13" smd rect (at -2.938 3.575 90) (size 0.45 1.475) (layers "F.Cu" "F.Paste" "F.Mask") (tstamp 6af0cf55-d66f-4f57-a8f5-55e317856af2))
  (pad "14" smd rect (at -2.938 4.225 90) (size 0.45 1.475) (layers "F.Cu" "F.Paste" "F.Mask") (tstamp 590422d2-24f1-44e9-b66c-2469b22b14db))
  (pad "15" smd rect (at 2.938 4.225 90) (size 0.45 1.475) (layers "F.Cu" "F.Paste" "F.Mask") (tstamp afff26a8-61c5-46f6-a8ae-6c5901f8b78a))
  (pad "16" smd rect (at 2.938 3.575 90) (size 0.45 1.475) (layers "F.Cu" "F.Paste" "F.Mask") (tstamp af7ab74d-ef61-4ca3-a75b-2c76e2d55af7))
  (pad "17" smd rect (at 2.938 2.925 90) (size 0.45 1.475) (layers "F.Cu" "F.Paste" "F.Mask") (tstamp 3d77e3be-6606-4cf3-8967-a108a3b83f2f))
  (pad "18" smd rect (at 2.938 2.275 90) (size 0.45 1.475) (layers "F.Cu" "F.Paste" "F.Mask") (tstamp 3dec21ff-1a5c-42ae-b56f-68293f7e932c))
  (pad "19" smd rect (at 2.938 1.625 90) (size 0.45 1.475) (layers "F.Cu" "F.Paste" "F.Mask") (tstamp 42904e7c-3935-4729-b7b1-d910516f0a81))
  (pad "20" smd rect (at 2.938 0.975 90) (size 0.45 1.475) (layers "F.Cu" "F.Paste" "F.Mask") (tstamp 59ca5a36-2ca4-47af-ba8c-1e9b4a96e35d))
  (pad "21" smd rect (at 2.938 0.325 90) (size 0.45 1.475) (layers "F.Cu" "F.Paste" "F.Mask") (tstamp d7adff81-a280-4ecc-9931-07cb2ee7acc8))
  (pad "22" smd rect (at 2.938 -0.325 90) (size 0.45 1.475) (layers "F.Cu" "F.Paste" "F.Mask") (tstamp 962c1f92-81f8-4657-94d5-464456283b42))
  (pad "23" smd rect (at 2.938 -0.975 90) (size 0.45 1.475) (layers "F.Cu" "F.Paste" "F.Mask") (tstamp 018059af-0b42-4f2b-a1b3-b9937a13f71f))
  (pad "24" smd rect (at 2.938 -1.625 90) (size 0.45 1.475) (layers "F.Cu" "F.Paste" "F.Mask") (tstamp 8ba8bd47-ed08-4b44-a796-0e3edcf55855))
  (pad "25" smd rect (at 2.938 -2.275 90) (size 0.45 1.475) (layers "F.Cu" "F.Paste" "F.Mask") (tstamp 52b7537d-93f1-4410-a589-5433d0cd89eb))
  (pad "26" smd rect (at 2.938 -2.925 90) (size 0.45 1.475) (layers "F.Cu" "F.Paste" "F.Mask") (tstamp 70c7a1b5-21c5-4dc4-bcf9-bf1ae8e6bdbe))
  (pad "27" smd rect (at 2.938 -3.575 90) (size 0.45 1.475) (layers "F.Cu" "F.Paste" "F.Mask") (tstamp 1618876a-007d-484f-9dc2-281ecc3968a2))
  (pad "28" smd rect (at 2.938 -4.225 90) (size 0.45 1.475) (layers "F.Cu" "F.Paste" "F.Mask") (tstamp 98976c2c-2775-4f89-881c-b167c7bf2991))
  (model "${KIPRJMOD}/3D/PCA9685PW,118.stp"
    (offset (xyz 0 0 0))
    (scale (xyz 1 1 1))
    (rotate (xyz 0 0 0))
  )
)
