(kicad_sch
	(version 20231120)
	(generator "eeschema")
	(generator_version "8.0")
	(uuid "12762faa-f3a3-40f5-b9b7-4365fa87df04")
	(paper "A4")
	(title_block
		(title "Payload PCB")
		(rev "1")
		(company "AcubeSAT")
	)
	(lib_symbols
		(symbol "Device:R"
			(pin_numbers hide)
			(pin_names
				(offset 0)
			)
			(exclude_from_sim no)
			(in_bom yes)
			(on_board yes)
			(property "Reference" "R"
				(at 2.032 0 90)
				(effects
					(font
						(size 1.27 1.27)
					)
				)
			)
			(property "Value" "R"
				(at 0 0 90)
				(effects
					(font
						(size 1.27 1.27)
					)
				)
			)
			(property "Footprint" ""
				(at -1.778 0 90)
				(effects
					(font
						(size 1.27 1.27)
					)
					(hide yes)
				)
			)
			(property "Datasheet" "~"
				(at 0 0 0)
				(effects
					(font
						(size 1.27 1.27)
					)
					(hide yes)
				)
			)
			(property "Description" "Resistor"
				(at 0 0 0)
				(effects
					(font
						(size 1.27 1.27)
					)
					(hide yes)
				)
			)
			(property "ki_keywords" "R res resistor"
				(at 0 0 0)
				(effects
					(font
						(size 1.27 1.27)
					)
					(hide yes)
				)
			)
			(property "ki_fp_filters" "R_*"
				(at 0 0 0)
				(effects
					(font
						(size 1.27 1.27)
					)
					(hide yes)
				)
			)
			(symbol "R_0_1"
				(rectangle
					(start -1.016 -2.54)
					(end 1.016 2.54)
					(stroke
						(width 0.254)
						(type default)
					)
					(fill
						(type none)
					)
				)
			)
			(symbol "R_1_1"
				(pin passive line
					(at 0 3.81 270)
					(length 1.27)
					(name "~"
						(effects
							(font
								(size 1.27 1.27)
							)
						)
					)
					(number "1"
						(effects
							(font
								(size 1.27 1.27)
							)
						)
					)
				)
				(pin passive line
					(at 0 -3.81 90)
					(length 1.27)
					(name "~"
						(effects
							(font
								(size 1.27 1.27)
							)
						)
					)
					(number "2"
						(effects
							(font
								(size 1.27 1.27)
							)
						)
					)
				)
			)
		)
		(symbol "SU-PCB-IC:SHT30-DIS-F2.5KS"
			(pin_names
				(offset 0.254)
			)
			(exclude_from_sim no)
			(in_bom yes)
			(on_board yes)
			(property "Reference" "U"
				(at 22.86 10.16 0)
				(effects
					(font
						(size 1.524 1.524)
					)
				)
			)
			(property "Value" "SHT30-DIS-F2.5KS"
				(at 22.86 7.62 0)
				(effects
					(font
						(size 1.524 1.524)
					)
				)
			)
			(property "Footprint" "SHT3x-DIS_SEN"
				(at 0 0 0)
				(effects
					(font
						(size 1.27 1.27)
						(italic yes)
					)
					(hide yes)
				)
			)
			(property "Datasheet" "SHT30-DIS-F2.5KS"
				(at 0 0 0)
				(effects
					(font
						(size 1.27 1.27)
						(italic yes)
					)
					(hide yes)
				)
			)
			(property "Description" ""
				(at 0 0 0)
				(effects
					(font
						(size 1.27 1.27)
					)
					(hide yes)
				)
			)
			(property "ki_locked" ""
				(at 0 0 0)
				(effects
					(font
						(size 1.27 1.27)
					)
				)
			)
			(property "ki_keywords" "SHT30-DIS-F2.5KS"
				(at 0 0 0)
				(effects
					(font
						(size 1.27 1.27)
					)
					(hide yes)
				)
			)
			(property "ki_fp_filters" "SHT3x-DIS_SEN SHT3x-DIS_SEN-M SHT3x-DIS_SEN-L"
				(at 0 0 0)
				(effects
					(font
						(size 1.27 1.27)
					)
					(hide yes)
				)
			)
			(symbol "SHT30-DIS-F2.5KS_0_1"
				(polyline
					(pts
						(xy 7.62 -15.24) (xy 38.1 -15.24)
					)
					(stroke
						(width 0.127)
						(type default)
					)
					(fill
						(type none)
					)
				)
				(polyline
					(pts
						(xy 7.62 5.08) (xy 7.62 -15.24)
					)
					(stroke
						(width 0.127)
						(type default)
					)
					(fill
						(type none)
					)
				)
				(polyline
					(pts
						(xy 38.1 -15.24) (xy 38.1 5.08)
					)
					(stroke
						(width 0.127)
						(type default)
					)
					(fill
						(type none)
					)
				)
				(polyline
					(pts
						(xy 38.1 5.08) (xy 7.62 5.08)
					)
					(stroke
						(width 0.127)
						(type default)
					)
					(fill
						(type none)
					)
				)
				(pin bidirectional line
					(at 0 0 0)
					(length 7.62)
					(name "SDA"
						(effects
							(font
								(size 1.27 1.27)
							)
						)
					)
					(number "1"
						(effects
							(font
								(size 1.27 1.27)
							)
						)
					)
				)
				(pin input line
					(at 0 -2.54 0)
					(length 7.62)
					(name "ADDR"
						(effects
							(font
								(size 1.27 1.27)
							)
						)
					)
					(number "2"
						(effects
							(font
								(size 1.27 1.27)
							)
						)
					)
				)
				(pin output line
					(at 0 -5.08 0)
					(length 7.62)
					(name "ALERT"
						(effects
							(font
								(size 1.27 1.27)
							)
						)
					)
					(number "3"
						(effects
							(font
								(size 1.27 1.27)
							)
						)
					)
				)
				(pin bidirectional line
					(at 0 -7.62 0)
					(length 7.62)
					(name "SCL"
						(effects
							(font
								(size 1.27 1.27)
							)
						)
					)
					(number "4"
						(effects
							(font
								(size 1.27 1.27)
							)
						)
					)
				)
				(pin power_in line
					(at 45.72 -10.16 180)
					(length 7.62)
					(name "VDD"
						(effects
							(font
								(size 1.27 1.27)
							)
						)
					)
					(number "5"
						(effects
							(font
								(size 1.27 1.27)
							)
						)
					)
				)
				(pin input line
					(at 45.72 -7.62 180)
					(length 7.62)
					(name "nRESET"
						(effects
							(font
								(size 1.27 1.27)
							)
						)
					)
					(number "6"
						(effects
							(font
								(size 1.27 1.27)
							)
						)
					)
				)
				(pin power_out line
					(at 45.72 -5.08 180)
					(length 7.62)
					(name "R"
						(effects
							(font
								(size 1.27 1.27)
							)
						)
					)
					(number "7"
						(effects
							(font
								(size 1.27 1.27)
							)
						)
					)
				)
				(pin power_out line
					(at 45.72 -2.54 180)
					(length 7.62)
					(name "VSS"
						(effects
							(font
								(size 1.27 1.27)
							)
						)
					)
					(number "8"
						(effects
							(font
								(size 1.27 1.27)
							)
						)
					)
				)
				(pin power_out line
					(at 45.72 0 180)
					(length 7.62)
					(name "VSS"
						(effects
							(font
								(size 1.27 1.27)
							)
						)
					)
					(number "9"
						(effects
							(font
								(size 1.27 1.27)
							)
						)
					)
				)
			)
		)
		(symbol "power:+3V3"
			(power)
			(pin_numbers hide)
			(pin_names
				(offset 0) hide)
			(exclude_from_sim no)
			(in_bom yes)
			(on_board yes)
			(property "Reference" "#PWR"
				(at 0 -3.81 0)
				(effects
					(font
						(size 1.27 1.27)
					)
					(hide yes)
				)
			)
			(property "Value" "+3V3"
				(at 0 3.556 0)
				(effects
					(font
						(size 1.27 1.27)
					)
				)
			)
			(property "Footprint" ""
				(at 0 0 0)
				(effects
					(font
						(size 1.27 1.27)
					)
					(hide yes)
				)
			)
			(property "Datasheet" ""
				(at 0 0 0)
				(effects
					(font
						(size 1.27 1.27)
					)
					(hide yes)
				)
			)
			(property "Description" "Power symbol creates a global label with name \"+3V3\""
				(at 0 0 0)
				(effects
					(font
						(size 1.27 1.27)
					)
					(hide yes)
				)
			)
			(property "ki_keywords" "global power"
				(at 0 0 0)
				(effects
					(font
						(size 1.27 1.27)
					)
					(hide yes)
				)
			)
			(symbol "+3V3_0_1"
				(polyline
					(pts
						(xy -0.762 1.27) (xy 0 2.54)
					)
					(stroke
						(width 0)
						(type default)
					)
					(fill
						(type none)
					)
				)
				(polyline
					(pts
						(xy 0 0) (xy 0 2.54)
					)
					(stroke
						(width 0)
						(type default)
					)
					(fill
						(type none)
					)
				)
				(polyline
					(pts
						(xy 0 2.54) (xy 0.762 1.27)
					)
					(stroke
						(width 0)
						(type default)
					)
					(fill
						(type none)
					)
				)
			)
			(symbol "+3V3_1_1"
				(pin power_in line
					(at 0 0 90)
					(length 0)
					(name "~"
						(effects
							(font
								(size 1.27 1.27)
							)
						)
					)
					(number "1"
						(effects
							(font
								(size 1.27 1.27)
							)
						)
					)
				)
			)
		)
		(symbol "power:GND"
			(power)
			(pin_numbers hide)
			(pin_names
				(offset 0) hide)
			(exclude_from_sim no)
			(in_bom yes)
			(on_board yes)
			(property "Reference" "#PWR"
				(at 0 -6.35 0)
				(effects
					(font
						(size 1.27 1.27)
					)
					(hide yes)
				)
			)
			(property "Value" "GND"
				(at 0 -3.81 0)
				(effects
					(font
						(size 1.27 1.27)
					)
				)
			)
			(property "Footprint" ""
				(at 0 0 0)
				(effects
					(font
						(size 1.27 1.27)
					)
					(hide yes)
				)
			)
			(property "Datasheet" ""
				(at 0 0 0)
				(effects
					(font
						(size 1.27 1.27)
					)
					(hide yes)
				)
			)
			(property "Description" "Power symbol creates a global label with name \"GND\" , ground"
				(at 0 0 0)
				(effects
					(font
						(size 1.27 1.27)
					)
					(hide yes)
				)
			)
			(property "ki_keywords" "global power"
				(at 0 0 0)
				(effects
					(font
						(size 1.27 1.27)
					)
					(hide yes)
				)
			)
			(symbol "GND_0_1"
				(polyline
					(pts
						(xy 0 0) (xy 0 -1.27) (xy 1.27 -1.27) (xy 0 -2.54) (xy -1.27 -1.27) (xy 0 -1.27)
					)
					(stroke
						(width 0)
						(type default)
					)
					(fill
						(type none)
					)
				)
			)
			(symbol "GND_1_1"
				(pin power_in line
					(at 0 0 270)
					(length 0)
					(name "~"
						(effects
							(font
								(size 1.27 1.27)
							)
						)
					)
					(number "1"
						(effects
							(font
								(size 1.27 1.27)
							)
						)
					)
				)
			)
		)
	)
	(junction
		(at 140.97 72.39)
		(diameter 0)
		(color 0 0 0 0)
		(uuid "d1e55bc2-ed96-44f7-97d3-f2ebb642c521")
	)
	(junction
		(at 140.97 40.64)
		(diameter 0)
		(color 0 0 0 0)
		(uuid "e3ba46c9-065a-489a-a324-7a7b45773ebf")
	)
	(no_connect
		(at 80.01 69.85)
		(uuid "09e11ee8-8fde-4c3d-8d8f-3efb8e668152")
	)
	(no_connect
		(at 80.01 38.1)
		(uuid "9e87433e-ccc3-4faf-9ab1-0a35c0e2c247")
	)
	(wire
		(pts
			(xy 125.73 40.64) (xy 140.97 40.64)
		)
		(stroke
			(width 0)
			(type default)
		)
		(uuid "13105900-9233-4de8-9a72-9c9c57af7b4c")
	)
	(wire
		(pts
			(xy 140.97 71.12) (xy 140.97 72.39)
		)
		(stroke
			(width 0)
			(type default)
		)
		(uuid "13a88ea3-fc27-48c7-8308-dd28741d9379")
	)
	(wire
		(pts
			(xy 140.97 72.39) (xy 144.78 72.39)
		)
		(stroke
			(width 0)
			(type default)
		)
		(uuid "5e7a7a64-e0b5-4e77-8f5d-d05c8e91d775")
	)
	(wire
		(pts
			(xy 125.73 72.39) (xy 140.97 72.39)
		)
		(stroke
			(width 0)
			(type default)
		)
		(uuid "84c12ca2-0f4b-44c9-ab17-89a2d259d7fc")
	)
	(wire
		(pts
			(xy 140.97 30.48) (xy 140.97 31.75)
		)
		(stroke
			(width 0)
			(type default)
		)
		(uuid "98a8e436-8422-434b-b296-8a253a835357")
	)
	(wire
		(pts
			(xy 140.97 40.64) (xy 144.78 40.64)
		)
		(stroke
			(width 0)
			(type default)
		)
		(uuid "9d4c4bdf-19ee-4b69-ae79-21fbea05117a")
	)
	(wire
		(pts
			(xy 140.97 39.37) (xy 140.97 40.64)
		)
		(stroke
			(width 0)
			(type default)
		)
		(uuid "ac8fb0bf-5203-46af-9a7f-f9964a9a5ff9")
	)
	(wire
		(pts
			(xy 140.97 62.23) (xy 140.97 63.5)
		)
		(stroke
			(width 0)
			(type default)
		)
		(uuid "bed017a8-34e5-47ed-beb7-db7d4b834e10")
	)
	(rectangle
		(start 15.24 16.51)
		(end 170.18 85.09)
		(stroke
			(width 0)
			(type default)
		)
		(fill
			(type none)
		)
		(uuid 99359ff2-fd08-43b2-ae36-b252b13d83f6)
	)
	(image
		(at 41.91 52.07)
		(scale 1.02889)
		(uuid "cab8f5a0-ecb4-43de-8152-610d84219a70")
		(data "iVBORw0KGgoAAAANSUhEUgAAAcEAAAD3CAIAAADqjXi7AAAAA3NCSVQICAjb4U/gAAAgAElEQVR4"
			"nOy9X2wTWZr3/2TmN6nyrJJUdo2oEHZwsjtKeUdKCu2QGEGaosmKClkpTrQvVDQDMep02tAvwmmi"
			"bZOeHcxK0EYKjRHdtAn0YMNoKVgpcS5CF5qwbTr0th2NNOV3L1xcjHG0HdYZrBk73tmpyuy0fxf+"
			"EyexHSfkD6HPR1wQ16mqc+rPt855znOepygejwMCgUAglsW31rsCCAQCsYFBGopAIBDLB2koAoFA"
			"LB+koQgEArF8kIYiEAjE8kEaikAgEMsHaSgCgUAsn/+v8KITExMmk+nv//7vV682iAT/8R//EY1G"
			"d+/evd4VQaw84+PjZWVlNTU1610RRE5u3rz5/e9//+bNm4UUXoKGAsB//ud/fve7311WrRBLYHJy"
			"8q//+q/RpX4l+fd///fOzk50c19m/vSnPz179qzAwkvQ0LKyMrVa/bd/+7fLqhViCfzP//zP3/zN"
			"3/zFX/zFelcEsfJ8//vfb2pqQhr6MnPgwIFvf/vbBRZG9lAEAoFYPkvQ0Gg0OjExsXpVQaT56quv"
			"fv3rX693LRCrQjQaHRsbW+9aIPLxm9/8ZrXG8t/6Fuq3rgXV1dUVFRXrXQvEqlBeXv69731vvWuB"
			"yEdlZeXXX39dYGGkiQgEArF8kIYiEAjE8kEaumF4/E5tzY7Tj1N/zjy9f76reVdtTU3tLv3bFx8v"
			"sN7EpPsX3z7UvGtHbW3truYjFt4XW/QcsftdtTU1O95+uFjRccuuml0WX9ZtYf5ITc2RofCiZ1tp"
			"fJZdNa+fz16p3MTud9Vm2+3pdX1NzaFbhVrFEN9UkIZuTJ4NHT/Y4/RhdHtnR9PW56MDb/zYMj6T"
			"3jzzlO9iW3sGRgPKJi1Na0vD3jtnDra+cz+/sMXGR3yAYdPjg+OL6y0CgYCl+tgjXhLGB/rHlIb3"
			"hm8dqQIAONV+uvWNwYuD3Xe5LQAw4+s/fmYspu24erVv35ZiAICZp3zPj8+MnDE31d84oM5x1Jnx"
			"kfHp6pZ2ZXB0cDy2b1/JWjVnhajrE355CttotUZscFA/dCMijXnDWCPHVSX/Ltnd2VKt+Mf8MwAA"
			"4ZGLfABr6LtqSQooABRXcdZ/bimdHhsYeprrqDPjo2PTlfVtbY2VG7QnWlxSUlK8eDEEYgVBGroR"
			"UTedONvXSWfIBVaKgaIoCgCER4dEpbSlu33L3J1K9nWf6uztrM/VT5sRRz6fLqVfo+mmBvX0+GCG"
			"aQAgYX890ryjtnZH89vX5wtszHfrHf2uHbW1rx+y3A/M7hgeOlK76/T9hxb9jtraXUduSQAAM88e"
			"Xnxbv6u2tnbH64dO89LssWakIcuR13fU1tTumGfjDT++/rZ+V21NTe2O5iNz9skgwx769Lq+tvni"
			"+Pitdw69Xltbu+P1I+cfPpvJtlPBhMevJ9pYu+vQO7fGw6kqX2yuqdn1TtqC/PS6vrZm1zuPN+An"
			"CLEskIZuRNR1BziuPkMjn3nHAlBZXV0CAJLPr2B1jXULO2QU1/dmW12ukbx4//MwVt9SV1xMtzSU"
			"To+PjGVoTuyh+cc9Tj/UtXAt1YGBLvNIhkZI1w8fPjfyfGtjO9cAvzC/fcWfedzY5+fMI4q2nt5U"
			"WVkNEL7f83+OD4wp2haOa9r6fOTMwa5bT1PneMM8+NXWJq6ba9EqYwNvvHFRAgCAp9e7jvePA93e"
			"3c01lv568Mxh8/1FNUoJD/a87Ziu6z579kRTqeg8/sYVabF9chJ7bDl4uH90+q+aOK5dOz16ruvw"
			"ed8MABRT3e+1q8MjV3gJACB8/9yAH2vs7duNTArfFJA99BUg9vjKgFep7m6nACD2fHIaSrZWLvUd"
			"9o1+Hsbqm+pLAKCuqR4bGRsZm9m3L6HE0kD/SFjbfe/eqbpigJm2i60HB6aTYhy7f2XAjzVdGv7o"
			"gBoAuhvfbu4ZnT2uooQruXvDfQlNn3l88dxojO69d/tNqhgATrSdbj3cf27owI220vHB0bC297Nb"
			"R7YAAMTqu17vGR2RTlHU09ERP9byyb0PdhcDALRXNrc6B8diBw7kb+N0bOt7/3rjyBYAaGvAAnvP"
			"jY09PUVVZS0bHjlzyIfN+Ul5HgDQQrL95+5MVnfeu9dXVwIAM9zFgwcHzvAdriNVULL7RG/DiHng"
			"yv02q/pi/5hCv/deW64PFeLVA/VDNzzh++Z3BycrO852UwAAigIA2JKtgtLo2CRGNzWWAACUNDbV"
			"Y9Nj6Z7o07HRANbQ2Zns2xbXdXY3pgRnZnxkbLqypTs1U6U+0N1WOefQ6oaWdKdYHBkNlzad6KSS"
			"P5TUd3dolfGRlHFg2u9PDpJLmi59+sXwKSq5ozLpT9kIqBO3v/ji6iICCgCgbWlK9dW31GnVMBl4"
			"nquoEvaL8/BPKumLMzIawBq7T9Qlz1lMdXbSmH9kLGFs2NLW16mdHr1yxnxmcLKa6+Oy6zTi1QT1"
			"Qzc2sfHzXebRmLb3k76koRPDigGUGWWRHefxdGQ0ANqO15JCWNLYRGNjqZ7oTMA/CerG6tnOlVqr"
			"rYTEiH0yMKlAdV317LG0dDXmzLADbKU2pf77LBCYhuLw6JWL3vTmgALKpH8SDtS3N6mPDx5//XNt"
			"/d+1tLe1NNUlp8Sqmlq0V/r7W394p6Gp5UB7e8vuqkJ62Zi6crbGWDEGoOS0iFZ23vu3vrq5l+S6"
			"nu0HAICZQGASMGx84GIgvXVyGmDS/xXAFgAAqru3ffCNwVFQt39yIosVBfEKgzR0AxPzXezqcvrV"
			"7VdvvJnq2EFJ5SY1jH81GQNYIDThp0+xyqosU9dPR8cCAHBub825zJ9TIqpMA2BYacaW0k2pfqgy"
			"rQCGlWaMg4tLSzHIcETFZt2NlJgCEPbeGZiVUAAAUMemAah91p9fUp+7MjQ2dsc/dqe/VNt+9ur7"
			"B7YAVL154wZ28eK1Ee/IgHdk4Ly68cTVS2/WLSakGGTOugEs8buSZlqJKTDtHxzwz/0dm04bZUvq"
			"mujSwVFla101MoR+w0AaulGZecq/3TUgljRZf/7+vkzzm7Zeiw36xnwzbbvniaXvwzcO3tn03md3"
			"j8ybsn82NuoHNd3yWnWGFE5+PuhNimhpKUBAmc7YQ3meEqSER8C0AmnBmkn4B2QDwzCAhrNf3OKy"
			"GgyLqw703TjQF3s6PjrK8wMjg2Zzff2tNjWAuv7I+3ePnA37xkZH7gzwY/09F+v/zVKX7SArTylW"
			"jIH2hOB6M+cgXRroH53GSjHxSv/jlg/QhNI3CWQP3ZjMjPcfP+OFhrM/v9Q234epsaUemx4dGJy3"
			"SjH20PmLSaiub5xXHiD8+YgI6r/r++D9TM4atDA9NjI+A1CprYZJyT/bt4z5A5PJ/1ZWV5eC35fR"
			"RQuIgVwaqq6uLAW/T8oYU4fHb128fl+KQXj81vmL958BQElVfdubH9y+1FKq+McDMCPdv3j+1vgM"
			"QLG6bh/Xd+PnvVqY9PvXbDFpcWW1GgJeMcMVYMbHn78+5EtW4Rl/3hlQt1+90akNj5wbkF7MiQqx"
			"sVhDDY35eMuR5l21tTU1tbuaj5xOu9gBADy7daimRn99gf+37/zrNbVd92eSq7Bz0Zx0gnn28GJX"
			"867amtodrx+xDC3rWX56XT/n0LW1u5oPvXP98RzvwoVrqfO2bqWZkfrPOAOV7Zc+4qoWDszVLSe4"
			"asV7/rjlcboOMelWz09HwqWN3Z0L+lLh0ft+UL92QDv356qmFi1Mjw2OzyT+63V+mJz5mZF451hK"
			"JovrWxpLwyMf8k8TFyj8cGAwADkorm9pLJ0eueJM3ZoZ38CZcwN3xpUSmAmMOAeuOHyp6zz9PKyA"
			"Wl0KMD026LwyMJJqzMzzr6YBU5di2c6wKtS1NFUqYwNXUjNfM0+d5887B8bCGABA7GH/FS80nDix"
			"u677RIs64Dyf/nzNzMRisfVX1Jlnj29ZuvSv70j45L598eHTVahURpyE8NCRmpojQ6mPzsyzhw+T"
			"93V5MQ1eatZqLB97bDn4xp0AlFZqtTSmPA94B895P/de+tePDizoFmUH20o10KlB4vOAOKlUarVJ"
			"qxxWXV0KEHt8+sfHB8PVjS2dWxXfL+6YDweU4Vtcgcefe7LZYyvTXwXEkf43xsbO3ruRTbJWpHVL"
			"YmZsYCgAmNp/pevQlYxK1534qG93CUBxXe+lXt/h/jtvvP6LalpbWRwL+MTJaahsuWpd6HUTGxsV"
			"ldKmFnp+06oaG6v7B8YGx2d27+b6Ou4cvtPVGmh5rXraOzI2XZK2jpbs6z3VMHbmzMGDYy005v/F"
			"6FeQ27OneF9vX+OYuf8gO9bSREFgbGQsUNp06f/WAUBLd8uV486u1smWpurisG90xAsNZzsoKIZu"
			"g3ak/0zrobGW+sqZwNjI6GRlu7VxDQfMdd3vtYwcd3a1+ppeqyt9Pj4y6gf6vRP7SgBmpIH+kXBl"
			"59X2LQCwr/ctevTclf6HLR/sK4Fng4f3nvmq4/YXlvq1q+t8YuPnD3c5/QqmrtbS9di0XxwdOD4+"
			"3nvj9ptrM/sVe9jT2qP0fbHvFZ1sWyMNfcr33wmom6z/eqktuX772X3zj3tGzvQ/bvpgvtkuOyW7"
			"+26l8lyG+SO7zjzvuHQ300D17NaVwcnqzpQrYnfjEdZ8ZWCcW87zqzVczTAazjwdMr9hHjlv5hvu"
			"HsliEluB1i0Jv1ecBoCwX5zb18W+UpITScXUm7eHtc7+K4NecSwAperqxo6+3lNt1ELdiY2NjitY"
			"Y0s2n/yWpuqBpIjWW+59UnLm3ODIoF9Nt116D7vyxmCq3Bbuxm3szJkro4ODxdVNfVebxg/35OyF"
			"b2m7eg/rP3dlZMTpBXV1feel93oTflEl+6w/v1R65srI4MAolFbSLWcv9SW+gFVv3rgB5887Rp2i"
			"gqm1jd1X3zuRc73VqqDe98G/fqI91+8YuyMqpZV0+9m+hAvTs8HzzkBp06Xu5PXbwp1qdxy+03+l"
			"s7Fvjcy1eQkP9bzt9Jc0vnf70pHkJFx4/HxXl7Pf3F//6WpVUd3y0S+bIDmXqDyPTSupp+sVjGlQ"
			"FI/HCywaiUR27do1NDS09LPEhrp+aA73zjXKx4a6dpn9Lbe/eL8e4NmtQ3vPKb0LzPa+868f5Ksv"
			"/fLGgcxXPKGhvcKnGaVnfBe7zP6mqzdSKvfs1qG957Cc8xe5eHpdz/Zj8ydeZsYt7OE7Sse9Lyx1"
			"8wst3rql4vV6t2zZ8pd/+ZdL3xXxstPX13f48GGtVrt40RfHd/71g07ouC1Y6jNfoKfX9Wz/ZMsn"
			"X6zkJz7MH9l1Bqxf3Jo31gnzR3adKbb+8kbbhpHOwcHBr7/+uq+vr5DCa2gPnX4+PefvksYTZ8/2"
			"tm1docMX15269emN2W7iTMD/FZSqN5UCwLNbh2prarvSIS3DQ107anZ0LSHEZXF9Z4cWwp+P5Fou"
			"uMqtQyCWwfjQyCTQhu76eUpZ1Xait/NES3otRMzHnz7yeiLSbJdlKG0tXSzsQJ44CUl76NOLzbvO"
			"eAHGzD+sef28b749dE7shHeuz04iPHyntvbt+08fnu9q3lFbW7tL/86tAuLfrgtro6ElDa/R2CRv"
			"fufW42ezF0Jd18a11a+8wXAm9kx6fP34u4MxLdfZWAwAW7g+rloZu/Lh+AwAxB5f7B9T6BNLW5FX"
			"lVjp4l94I9e2dQhEoTyT/GGorMvyFKr3vdl3ZF/Cuj/ju3j48JnBX5fWt3PtNOa7Y06HMIC8YQfy"
			"x0lInqjlRG9TJUB1S+/Z3pa5C9hSsROm/yoRO2G0//DB07PBWhTx3I9/6tvU3ne2j9M+HznXZV40"
			"NPi6sEb20C3c2d7Rw+dGzr0xcq60uqGxsaml5UBjnXru5zFwp+fQ6LxFy1+FAaphKUj9ra3OSQCs"
			"ujNtpSquO9HbMnJ88OJg9236zrnBcHXn1aWuyNtUvQkgHA4v9F0vrHUIxBrzPPAcYGt1/q7CM/68"
			"01/SlJ4A7ea7Ws8kQhioAXKHHVgkTkKSEupAWyPfP1rcyHEHSgAyZuRnxi+eG41pu2/fPlVXAgAn"
			"2iwHD9/56RUutWIsDK99cvv93cUAbS1bY3vfGBkcT0dweIlYq7F8MXXk1qf3rJ1NtFoJeEec544f"
			"3LX3yMXHc0bTyuTCRcvhJS8uUbe8d/WqtbepctLZdfB8ylWmZF/viQYQr/y054wzoG5/b+kr8jAM"
			"AJTpbJsKah0CscYooAAUY3mdwMKfj4qK1tCb9iDZwp1oq8wIYZAj7MDicRIWQ7z/ebi06UQ6CkFJ"
			"/f/tbsQmR9P2stLX0stEiqn6vwIl/Dzr67fOrKWPvbqure+ju1/88ovhT6zdLVp12Dtw/O1bGS6h"
			"2l7hyTzudS7tvgCAum7fvn1tb35071ITFuCvpN0Kt7T3dVaHx0ZFrLH31DJWkkw/VwCwTbkeyEVb"
			"h0CsMVgxBjCTc9UYAABMSr+GUq02c1CmpbWYMulPrqLIEXYge5yEJVQuHAiEoZrWZvRl1FptJYQD"
			"KcOqujodaCGxVkyZWX9f24WsmYbOtr5YTe1uO/WBS7jdUamI15yr5W9b0tjRWKr4xtKzQMXVjQ1q"
			"AFBrtamHIvbwdPPrKZq7+DySNxOeDAOmVmcdGK196xCIRams3gTwVXpJWSaxZ08Tk0MxZQZKSuZ0"
			"KYpLMQymY+nVvFnDDuSIk1A4MzMKzD9z6aZSUNKiv3aLKF6INdFQ6WJzzQ+PD80zCJfUcy2VEP5q"
			"cmUMxbGnj4f4Odkti0tKi0FR0sF6ng1eHAxjpViA70/PyE8/D0ymCExO5vliB7z+aajUaheYANak"
			"dQjE0lFr6yphcty3MDdpeNTcunfX6cczUIIVQyw25ymdmVYUKC3JL2GzcRLSu+WOk5CN4hIM5p95"
			"+vk0YCX5jQ8vHWuioZXaSkwZHxmdZx6cCYdjULq0j1duYmNXzGf6RzJ6kmF/IAbqyuTUTuzhuYsi"
			"1mS90degjPVfTEz/lbTdyDAcfJqOVrmAmXF+JADVTS0LJ6LWpHUIxDKoa2mqBL9jYF5eF3g65BSV"
			"0vqmumKopP4Kpv3+zBGYX/QrWLU2vxVtSXESsqGurFZDQPRnxk7w+yehsrr6pZs2ysuaaGhiVD12"
			"/u0M57KZZ/fPnBuZLs26QGY5bGls0oL/zkDKNyL8+OKAV6lsatECAMz4rpwbndZ29x6oaz/FVYYH"
			"+wcKTwwx83TIbL4ziTV0dmQR2TVpHSJNxuLrRQiP3085HL6Cy7QLoq77RGPp5J2e4xkpqJ49tBy/"
			"4leq27obSwDUrx2gMb/jysNUgqin/MWhyVRGg9wUHicBw2BBhxMAgD7wmnp6dDZ2Qmz8w4ExpbKx"
			"KWdP5uVkbXybSvadtbb4j484j+/lSysrK0vheSAQVkDddKl3xTLwVnG9HXfeuHP84POWxq3Tvl+M"
			"irHKjquJ+fdn/Hl+Ut3yz1wVJJ6rIbPz/FDHrfkxj1L4HccPjSTXyz8PBCanFVA3Wq3Z196vSesQ"
			"CQpffD1uae0SDcMH6r/ReTnUbVbr2MHjI2dadw3QdHUJhP2iP6yU0r2XehOXcEt7Xyd/eOB462RL"
			"S13p5NjIaEChe3sXdZ4uOE4CtkldCiNX3jji7ej7KGNxaXH9qfeaPu/pP9jqbW/cOi19PuqdrGy5"
			"euJlWCK7FNZqTkm974PhYWtnk1YN4YDfPwmVDe3v3R5e0ZgcJbst9z7pbcT8I87B8edbW967cc+y"
			"uwQAYvfPXRGBPtGbnI1Xt/Vy1Yq3/0rO5IsZXlaBWHGirjdyCe7atA4BAMnF1wWVjD2PzRas6xN+"
			"Ody70d7OFUG974Phe9aOxmolII6NiZOYtqX3k+Hbs1G7i+tO3b59tv2vno/xzsFx0HZY7914s5C+"
			"4Bbuxm1re/X0+OCgV2nou/peQ1bDVXF996mmSgh4x8XJueMH9YFL/3q1uxHzDzrvjP66tLH3k59/"
			"sPF6HWuzXh6xNNB6+ZwUvvj64du1xyfzBk5eH9Z0vTxiWbys6+UR60hi4fPDoXead9TWvv720DPI"
			"k+f96XV97evnHz682NW8o7Z2x+tHTs+GYvVZdtUeufX4VtfrtbU7Xj+dWH0X8/GnDyWWW89NCw8z"
			"zx6e72relYiq2nX+fkbcypmnQ5YjzTtqa2t3zN2SOIUvkVG+tnZH89up1QrzF18DQHj81ukjzTtq"
			"a5JnePgMIBHK8vioAv5+tqb2nccL7KHh8evvzFY4Ywn4BlqmjXhJQBr6jUEJD/70vBerq9duqqzc"
			"kifPe6LwkNk8Wtp56faNsy3wufnw8aG0Miq/vvZuv39TfX3l1urqktRy6682NbZz7TSMD7zx43eS"
			"C5tnxs//+LjTX9rAdXe305jP2fPG+eQU8VO+66D5jh+rb+e4xlK/s+dgxhlA8V873jOINZ44e7az"
			"HsYGjr/DP4OFi69npItdXedGnlc2cd3dHY2bwmPO48evPwUobeg8264FUDd2nz3LzVsrHHt8+uDh"
			"/tFEhbXK+MDx/9NzP+PcG2SZNuIlAeVT+uYwHdvUO5wc2s48Pp0rz3tiYkBRqnuvfpCYg/uodJJ9"
			"o39gvCUZQC0c01r/LVXw2a3zTr+6/eq9ZFanTv5I65lzVzr39dWBeP8Xk5Wd9+4m1j+faDq9942R"
			"IdFSXx+7f+68FxqtKSNzd9PbrT3n+x+3pGKxTc/Ql25/cEANAG1aaG4duP95mOPUcxdfzzw+z/ux"
			"lqv3kka0E9zF1taBMW/4Ta5qH9c0eH4QGtq5tioAyEiKLA2cG5ysbP/k3vu71QAww10/fLA/M9Tr"
			"BlmmjXhJQP3QbxDVLU0p2+Bied4Bo7kDqcIl9dxr6vAv7qd9AemWxtQU7LPREVHRGk6k0+JVtXc2"
			"lSYXPWMAEAsEkkPl4t19w1988X49QGxsZFypbDuRnqVTH+j+u8rpsZHx1BmwutlTVNNaDJ5PZgk+"
			"UM2dtV46kQ5oX0zRWgyeL/SiyeTpyGgAa+g+tVud2qnzRFNpMnEUAGyYZdqIlwTUD/3mgFVWptym"
			"8+Z5pwAA1FRGuJ/irdqtMPhVIAZ1AACllbMrqL/yBwDU3jsXZ3t64UlILHqmtG0tlXec5r27Bhqa"
			"2tvaWlrqE3H+J/0BBSAwcvFiOtCP8pUC04HAM9i9BQCgZKs6PWdUjGEYZFsDU7yl/kAbQOyZJPr9"
			"kujzjn8+pkBl3nn7mUBgEtRNdIYbTjFVXw0jgUA4ee4Fy7SnX8pl2oiXBKSh3yAwLDUgzZvnPVF0"
			"zoK74jnBKzIX48UUBSAwOjAw71wz09MA6rq+n3+y6Vy/Y8w72O8d7D9T2dR39RJHKbFpgPCYc2Bs"
			"7k6b0kKJFRe0viv8+Pzb7zoTKVGwSrpxayVkWxyegaIoAPNWj2FYCUB49tyFnBmBSII09BvJInne"
			"AZTpWGZvLhabk0kzMwYFhoG6PXfWtS273/xo95uxZ76x0SH+2uDoGbOzwdVYjAHWdPWXH72YlfEZ"
			"/85xp7+y5b1/7mys11aVFM88fPuH3pxJRZP1LQUIzO2qKkoMACvZcI6JiJcCZA/9RpIvz3vyT/+c"
			"dPJiANTV1VlUplpbDWG/lBnV4un9ixdvPX4GEPMNXTw/JAFAyZa6A0cst65ylRAQ/TOV2mpM8Xsz"
			"w54/e3j94vWlpeyNeUdFpbLd+sGRfXVVJcWQjMeWn+JqbSWEfZnJ6Wek8QCUVi8SqhiByA7S0G8k"
			"+fK8JxEz0skPDIwplU0t2daubGls0oLo6E8tt4ZnQ+fODDhHvyoGgMlRp7M/HcEAYuGwAiWl6uKS"
			"xhYamxy6MpRyzIw97P9p/8BIABbtl2YuvsYAQFHS+dtjjwfu+CFtOcUwgOmFttGqxqZqxTvwYTpX"
			"vHSlf3S6tLGFXuzUCEQ20Fj+m0m+PO8JsMnBrtZAS1P19PjIqF/d/kmOdcxVnX2dg13O462Bpr+r"
			"3zTt+8WIqFR3n2pXA0BTJ1c56jzeOt3SpC2Z8Y8NjsW03Z00QHFL3wn+YL+5tXWkqbEapNERb7iy"
			"/UIB6VkyF1+fbaGxscF3u8DQVD3tHxscEWdKsYStFwBK1GqYdB4/5G85dfVUho2T6n6vY+SNO12t"
			"gXTLsUZr7yrksEZ8I0D90G8qW9qu3rvUWY/9esTpHPFDfeele5cOZAQsbzp79YT2+Sg/OK7UdV79"
			"+fs5I/8X1/fdvv1e+9bp8UHn4NjzrS3v3bh9KhHOori+7+dXu+tL/SPOAX4kUNrUe+PGKaoYAIqp"
			"N2/cs3ZowTfidI78urSx+5M8p5hzttnF16VtH9zobSr99Uj/uSuDIrzWd/teXz0W9vueAgDUGXpb"
			"qrGw6PMF5qVc3W25d7u3adNXo3yq5Vdzx0JAIPKD1su/jKzzevmn1/Xsleqr/++Dfetz/lcbtF7+"
			"5Qetl0cgEIg1AmkoAoFALB+koQgEArF8ljYv/6c//WmV6oHIZGZmZj0vddWbridvrtvZX3X+93//"
			"9/e///161wKRD0VRvvOd7xRYGPVDX0bi8fjXX3+93rVArArxeBz1RV5ylvT2LaEfGo1GZ2ZmIpHI"
			"0quEWBpTU1NFRUXf/va3y8rK1rsuiBXm97///W9+8xv0Hr3M/Pa3vy381Vuab9OOHTu++93vLrdi"
			"iEL5zne+8/XXX3/rW9/64x//uN51QawwpaWl//3f/43GGS8zBEHs37+/QN+mpdlDMQzz+b55CWbX"
			"nH/6p3+qrq4+evToelcEsfL8+Mc/7urqYhhmvSuCyMlHH30UjUYLLIzsoQgEArF8lqCh0Wh006ZN"
			"i5dDvDCPHz9+/PjxetcCsSpMTk6KorjetUDk4/PPP3/06FGBhZcwli8rK3v+/Pni5RAvzO7du6ur"
			"qxcvh9iAVFZW0jQKEvVS89prr6GxPAKBQKwFSEMRCARi+SANRSBeBZ5c2F5UpGp2TmX+qNxtVhXN"
			"oiqv0DYfc/qihReAqWt7i+aiKq/a2XHNm2eoO+Vs1h59kC+lgO+0VkVrzukAACAASURBVLX9wpMl"
			"tTDqvdyxvUKlKlJVbO+4nDx/dLhDO6/Raw2KwYxAvAJMCC4Rx3E3L0Q7O+d6h5M6jqVwAAA5InkE"
			"u0Enhjzud+uwggsApTfrU1kM5JAouHgjKxPS0KHNWaqiPLJYgnrX/ny5/XCSIAgCX0IDn1xmGVOQ"
			"NlptdMhtt5nYCCF+2rmtrNWsN+stXu7jhnXLJRgvmN/97nc/+MEPCi+PWDY/+clPfvazn613LRCr"
			"wo9+9KPPPvtshQ8asjM4qecYHGf5yOzPMs/iwNhDGb9IdpYEXGeTCisQD9kZwFlezjyb7DFRADpb"
			"MFtVIjxL5Nj0AriNJFAmT7IaEcFAAmUW4/F4PB606Qh9ZqtfnA8//PDcuXMFFkZjeQRiwxN1uzxA"
			"6016WnbzQr4JZazmLYeFAY/dkWOtzKIFAABr4FgNSKKUZdsUb3dTBm7bkuq/KE88nhDJcKm+Zhmj"
			"1+FBUYoCAGzTc5Rg59dtPI80FIHY6ETdvFumGB3NMBrZzbvze+Vs1ht0ILndE8suACDLMuCQZSw+"
			"5eI9lJ5JjPGVu22qqmPOa0e3V6hU5VU7jzp9SSPprD1Uudum0vYM3+3ZW1WuUpVX7e0ZznLemnc9"
			"IdE66xEmRyKzFdjGMBoP71ovEUUaikBscBQP75Y1DFOD1bEsGXHz7vwZojdTFAlBMbjsAtEHDlcI"
			"p5mFiV4Vt+DBabpm9pegw2gJGXhRFMwat5E1DGcR+KDdYJZYm0vgzZRk44zZ5oiwzZvL0hbPKd7h"
			"AYrRJX+gGBr3CJ7F8mKvEmhOCYHY2Cge3h0hWT0NADqWIewC71Za803p4AQBeQNHzSsgSw5TjyfR"
			"6ZMjQVEQPBHKZOEWzihJHhEo0xxtJfR2/uSeMoAah0OkWIvjSevJmrl7yYTe7np3PwawhwoJpEnw"
			"KJ2tues/dddoceN6Pm0wwDS0BuweCVqz555dXZCGIhAbG5EXQoROr8MAAGNYHc4LvFvZn3deHCDb"
			"QDxngaBgtwmpPwiKNTgs1s4sE+FKMBgCkiQzj8JwbNJPANPpdbhD8ETnayjQ6S7lZo2GgFBEBshR"
			"fcV3QW90yazDluEUQGpICElBBerWYXIejeURiA2NjxdCQOk0oYmJiYmJiIamICLkH85HQhEgCKLg"
			"Aql5eTnktjKEHMF1TEPW6JpyJAI4TmQKGUmS6T8xgiTkUCg0fzecINKHwwFABjlHxSbucqzZQxpd"
			"fGfmrFUZToAsR3LttbogDUUgNjJPeCEI4DHTmgSMVQQICXwe6+CEJIWAohdaMxcrgG3e867LoQeX"
			"kcvlH79I7/aFVC764ChrcAHrED7es1DCl+JsuqIgDUUgNjATgiABZXC4ZnEYKAgJvCfXLlMCLwLN"
			"Mtn84xcvUNZqtTDgsZiyTfzgBA6yHMmU71AwlP4zGgyGcFJDLtyxACau6TlHiLYJrs4FjlNROZI4"
			"+XqANBSB2LhMCbwIlMHc2TpLp9lAQ0jgvVn3mLhrtLiBMXLzbZIFF9hmsBo1smCxPFrQ1cVIDQlz"
			"B+uy257yOprg7W6g9brl5LeZchpMbsLACyezmTxDwRCQGs36rFRCc0oIxIYlIaEm/Vy5q9FztNks"
			"8F6gAQAkh+loYlJdDolutxgCnc3+VkZfbtEC88AazBbWYXCYHeYv5xWjdTQ4REmBbWk9iwgGpk00"
			"MiDYbG7S4DYsx/3eZ7O6ZYKO8KajfOo3nDZaTzaUAYAiiUHI5mq1JiANRSA2KlE375Ep04IeYw1n"
			"0JlNLt5r1QFAyMM7EgN7nNBQrMlmtR6as8eiBRawudNqtNJWi+WB4eac+X+MYXWyzS3B/pSXEa63"
			"2UnebDbLpM7oclzas5zO4pTHIwGA6HJkBq9mdJaEhkpuj6wz69ZpwTzSUARio1J26NM/HMq2YdvJ"
			"L+MnAQAgR4EUWK4jpNn81mfxtxb+XPe+P/5+tuJ6Tmd2uCegLtXdxDWdH3/Z+fGC3f/wfrIGQ3Nq"
			"sOfm7/5QaCWSPBHcEZ1Jn9O+u8ogeygCgVg5NnMmJsi78qwTXWmeuPggY1w3CUUaikAgVpIy1qyP"
			"OOxLiw36AvgcDtlg1i9nomplQBqKQCBWEqzBYtG4rHljMK8Y0Qc2F2Uxr1/wUGQPRSAQK83mQ0P+"
			"QwAA82ydq0DZ/pv+/at7isVA/VAEAoFYPkhDEQgEYvmsjoY+6Cgvms04pficR3dWlauKVBXa5tMP"
			"5i4RUyYeXOjYq61QqVTlVdvbLjyYeDEzivdYhWrn5SyzglHnXlX50UcvdPBloAx3lBcVVfVkXzSy"
			"/kzcPZYIfqttu5Avzdg8pu62lavahrNs8Z3WqrT5so3lSlhW4A2aGj62s0JVpKo4tgyDm7enKuPp"
			"mJqaAgBQvD3anZfXbA5kQxKdmlra1c5zN5WpqcIftNSRHizp7LMsJ/ndEln9fujUXT1jcMmM2Wa3"
			"sITHqmdnWxT1ntZRrNkVIhmDwcBqIoKZ1emda+gXsdoobpdbxvGgK8fKu/VF8fawnCOiM9usHOkx"
			"s1yBCRIVr9Xiyhp+cspptkv5AkskEpaZFgvMlhOv1WQXccZgMLDUC80jPLm2lza6FQDAGkxGsFqy"
			"BQdGAABM3e2gOX5BtKVloXgv6HRmcfGCK8TSk98tmVWfU3piswg4J7hv7i8DeMvAEjRtsz4y3dyD"
			"gfLIzFkljVFwf7w/mTvgyWVWZzKZ7uqHDq2fr8JKIrqECK3Xh3jB5bvUsB4RYvMQdVkdQdYevNO5"
			"GcCgA0pntfk631+0llMOs13KFihH8VosQgQgd1CJqMvKk0Zx2RdCCUohnOVdN/OE6C2MoNsTkY2J"
			"/28zGGmL1THRenKF0wC9GgQ9npCsW5ljyZJbiiwv6MiyqDn55X+dXN1TrHY/NOrxBHGGY1JRWOv0"
			"DBmSxBAATPEWR1BjdNj2p71jsZqTNiMVERyuV6RP4OOFEKkzcgwhufjcOb7WB8XjcsuMIemcjDUY"
			"9ZqgkC+JTnK3R2aryOizvFMTDhOPs6wm91f/hROWyTIAThAr7clSpjfoJPva+TQiXiFWW0PLOoVQ"
			"0M6mn3klEpEBcDyRilCmOOM8z646s0uU+M4svdCpRxfatleVq4oW2FUnhhMJrSp2Hrs7ZyAZ9V7u"
			"2F6RMPa5Z8cij45WVBy9dq2tSqUq337Blz54hUqlKtc2ZyTFUpLmwiJVedXeY84nSvq4bdsrVEVF"
			"qortbRce5RwA+3ghSOgYHcPqcMnFv2SvaFCUZJKm0pdao6Mg6JGUKWdzeVHVsWRUHuXRsaqi8ra7"
			"qa/aE7vZRZgtHDlfKaMPLJYgazXTeSQ0M2EZQM4bBABR77WjO5NZylIX/tGxCsIgyBEHU5QwtysT"
			"wz3N2ytURUVFqortHZeTBt2os3mOBW24Q6Vqvptpz3twtJzlZVng8KJmZxQAyhg9FRRcL8MdUiaG"
			"e5q15aoiVcX2tsuzNuqJ4dPN2gqVSlWhbe4ZnshI7tZ87VHiMqoqtndcS6Z9y5vrTXniTJjBVRU7"
			"O65l2sGnHpxu01aoilTlyXfM11OlswVlj0lTtD1hSc52ayCxIdfdTBW420wmb6Cq40GiIneP7dWW"
			"q1SLvEmzh/ClT77zaGbNlSd3j+1MqoBz+PR21d5rUzDPHpqqoKq8au+xu09WyoG18JzLS8gvL3AE"
			"0FZp4YaIiyNAY/LE43HRTAHOCfLCQlmRrDSOa1iTzeGwm/UUDngypbTsMWkANKzJZrNyNIHj6cTX"
			"IQdLAEEbrHabkSFxHAfC4I7H43G3gcQJgqQ5o5EzC5G47DFRiYPb7VaOJkBjECLxRB1xgjZYHQ6H"
			"laPxZM0jvJ7ANazZ7nDYTQwJOOsI5aoz4KwjEo+H7DrIfkWysjb55d1GEp+TCFwwEDjjCMXjopmG"
			"5CbJSuM4Y0+Virg4kuSEiOzS47jelXE0yUrjtE2SRTOFU9lbKvN6nDAI6b9z3qC4ZNPhQOqMNrvd"
			"ZtQRQOr5UDwekdy8kQaCsboET1CWPSYN4JTebHc4bCZWgwNpEOR4PB5xsHPO4+LwZCR2j0mD62zB"
			"eEQSzAwOOpNLEJP3zmPS4HMSra8W+fPLRwQDmXic7TajjgQi8XBFBIMGgGSMVpvVyGgASM6VekQB"
			"J0ja6BDcgsOYfkjjMq/HcZzQsFaX2+2yshnPaYhnCSBozmp32EwMCQSTyjbvMVE4kDqj1W43sRrA"
			"aasUkdw2PQmUwSF4gnKuWxPPdzdnCYkuIw04Y3W5xUg8HuL1BOCJd9egIwCfzSCfcUUcTPpuSjYG"
			"B5zmzDabmaMJwHXJJy0iGEjAKb3ZZjOxGpwg8OTNFM0UnnzxJJsOTzQ7oSCaLCdLsqT88muqoRG3"
			"UZN6N+NuAwkao6fAk3tMmsw2S1Y6JWgOFsd1yWcgHnFxZEpDPSYNkEkxjMclqy5TQyEhFvF4PB4P"
			"OVicmNXBiItLakvIrsMps5g6p42lOT4Yj7sNRCo5QjwecRlonTlrM4J2HYAuIT+SlV6CiK6NhgoG"
			"Yq5qzIpqRDCQQBoEycESOJ2+BHHRTCVKzNfQCK8nEgqWR0PFpIIlyXmDZIEj8NmLJXtMGkjeh4Q8"
			"uuPxeFwWDATQs4dzG8nkFV5cQ+PxuJD+MdmCjFd1VcmroUGbDnDGkWxUxMUlmpj4Of0lCzpYAiiz"
			"FE9oKKQvqjx7EWRen/6oxOPxkJ0BnHMlLwJQc94lPFEuwrM4TlulxBY5+c7NuWq5b03u120OGTcw"
			"7jFpgEhJcFyWrDo8y2ds9sbIgoEAjdEdSZ+cAkLvisTjQZsu4xUO8SwBME9DZSEhOHK61UDk7MIt"
			"SUPX0D90wslx9pDO6kga7vF8eVPm03BJConW1LhfkQFP5h30CB6ZNqSif5WxRjaZBWbC4wmSrGF/"
			"cqhaw3F05gE1rC45pFQ8glum9QweTQA6Vgei4IkCQZIg8ZbLD55EAaDm5Ke/unNoGwBJkrLHZnJ6"
			"JxSAstabv/ry/YYsVZ5y8yJQemYbAEANw2hAdAkbxOWgbL/VysoOA2MSCIPNkpwCmrprtssGq3GB"
			"OVPxWSwCZbHkn22fl7As9w0SXe4IxbJk8obIGpYhgwvSnWP7bwZD7nRlooATEFl+Sp0yUoPLweB6"
			"JSlPEPUIIs4Y9clGlbXaPJJg3BZ1CyLOGNN25G2ckSUktztZWY1Ol9yCaSgNHgmlXSbm5XqLRGSA"
			"J253UMOwGjl5eUmG0UQ8bmn2XUrsgjVY3JLbMvfRznlrFnndsjHhcQdJfTpYCFZjMOrAI+TOBCUK"
			"7gjFGVN5QLAGo4GOeFwiRN2CCIwxlWd0s97ELkgWJbndIc2s6bDG6JJEO7MShvW10tCpB0dZowCc"
			"w5XK6UcQBERCkYJtEhgedF041rZ3p7ZChdPmZKaDaCgUwTXk7KwUSSWnNEJSCEhqdgZwG5U514GT"
			"6YxbkVBQBrdRQ6QgDS5ZjoQigLEWKxNxmViKKNfuPXr5QcKCUmOyGkjRbtBpiIrtbT1Ob9b3Lurm"
			"PTJJa/CJiYmJiQmCpgnwrGk8m8XAcRxkOUN0ZFkGHE9cpc2dViMVCsmMxZKM+Kh4rWYPbTYvDAA5"
			"xZsdssG6WHDdeQnLct4gJRiKgGilZ28I6wjJoeBCZ6oyEPnTR9v2btdWqAjGJiXmnJYJgePyC2jw"
			"ihAJhYDQaGZnAzbX1GzGIBQKySSV8TOm0ZAQCiZsjjhBzioGnnkNsuZ6C0lBCNpZMn15dTZJDoVC"
			"EA2FZFyTkamjbFvNtrkTE7lvTf7XLSshKQQkneGhtllDZU1Zl94hFMI1lGb2h8QXI6QEpaBMUrNh"
			"7DGNZoG5PhSM4BpqXuNWZG5yTdbLK97TrN4Rom1ux2w+U0pH4bK0MCe078Jeg4fjh96aEwU2OnyU"
			"1jsiFMMyes7E0iELY0lswedeLDz9Nz7f+WZuyfRfsgxAsFberMvcTmhIAKzu5GdB9gHvcPC84DCx"
			"PG8TvzxZs7n1phg0uhwOnncJNoPL5RbEm/vnPW1u3iNDhOc0fMavHl6YOvnWukXpmgupIcEdigAk"
			"tS8aCck4qUm+j1OiGAKQRZc72nmoDCDqstqDBCPZT58GAFmSZBkcp0+H9GadyyoAaRAspwUACLlD"
			"cshlPQ1647ut81R13q3KeYNkAJ1ZsLKZ23HN/DDlE85m2uDGaYZhDJyF0XiMeh6yoBQ82llQo5cZ"
			"fJl1lQGAMvJ2bo6HEUkDuArbO+utCS3yuhXK0nfCk//W7eu3Bho6NWzQWyXKJMxNhYIxegY3uBxe"
			"y6XMqXkf73BLJDevKz7hsDpCjF36LJl6YOJyJGEHKCNJXJaCE2khCEnBxH9IDSkHpaACyaHJVCgo"
			"gyZL/UiSxCMRgt6zJ6VtE97hIE5goEz5xAjZsP+t9/e/9b7y5JpeZ3S4npw04r4gUA2H3m049O7H"
			"0UfHdIzD4bHPzeetuHl3hGDMDtOsD5DHxlk9vGvqrZdERDWUBoKiFIW6hPwHPRJoTIl+gfLAbBYI"
			"zsS4bWaLV3+pAZMjERmCgs0qzB7BZbUGSSMViUBEclgzkqB5HFZRZuZp6GzCMgwgzw3CSJKAIGj2"
			"7El9Rqe8D8QFr6TPbhFA75KGWhPV97pTnUgcB5BlOXWiSCgiF/BuRmQZiOUK0wpBkCREgsEopFIP"
			"ey8ftRMmG0niocyflWAwJJMaEmDpnu8kSUIEyD179iR/iPoeeGQcT71LofS79MR5zBox2DLcK3Pf"
			"moJft4yKUCS4xOBs3pBoUIpAnpR1JEnKohQESPW6glJQJnQkRlIkhIKz6eWV4MLOLKkhZVEKASRf"
			"vqnhHrOHtb6//4VfxlUfy0eHTUZeZu2uS/PTmZZxZo6U7Ebzo7SDQtR72miTCDZt2UgRCUWAoKjU"
			"K/nExUvJ746OZQjRkXIbUh45hFBiwzaGoSKCQ0gefMLl8GT/UmEMq8M9dkfacemuidUb7BKAaNHr"
			"9NakWyemoTQ4Djg+5TLodMZUnq0yiiYXvqCKh3dHCMZkzkgV1mox6QnZwwvra3KbBdPpGfA4ki1R"
			"vA5XUMMmzLc+m5mXWYvtks2sC9lN9olEKPFZ0nNKvzq5bc/H/5WxJTWn9Ic788PpzEtYlvsG0Xod"
			"IfG2VMoz5ZGFYznr/LUtoVAESCrlmqV4eSGYOhFB4rKU+phOCa6sy2LwOcNeiIaCMq7RrO/nrUzH"
			"0uBxpB4R5ZHd6hBDeBnDUrJg59OLVHm7EKHyZObMB8UyZMhlTy3LUnxWA6u3uCMAOlaHi7PmJp/D"
			"ahckKEuaAQAgz60p+HXDIXXZt+kYTUiwpd4keOKwe0DH5k7pQbMMIfH2lF4oXrtDJHQsDWWMngJ3"
			"6kmGqOAQFhhlKEZHSi4+6fkFEy6r3RWUF5hNl0OBc0/xZc7LB+06HHCKNWRgtArJCbSExwYQNGsw"
			"Gg0sTQIAqeeDCw4oCwYScNpg41283cSQOADgel6Ox+OyaKZxIBmjzW410ARB4GnfJl5PAk5xVrvN"
			"xGoIgsj0bWIckfTRI26jBoDQGaxJ3yYiOQUqmikckg5VJlaTdACI8PqUa4jdatARGdORKTxGTXLG"
			"cG4rOCK3J1QGazMvH4/LbqMGcJqz2u0mJu1Hk/BSSU6Ey26jBoikH1nGngt8m1Is7tuUngvNeYNk"
			"0Uqn3FBsRh0BOG1N+AZkTOuGHCwOhM5o5128zagjcIDU/hGeJRKeLlaTniI1GmLhvHzSMcpo9ySa"
			"5jG+JL5NXPKaOGxGHZGat077NtnsSTcuzhWKx+f47sTjifeNNHriSd8mbvYOuVOOa/F40M4kL4/d"
			"ZmJIAI3RLcfj8ZSTn96ccHpKObwEbTSAhjVahVCeW5Pzbs5F4AggaM7kEDN9m+w2Y2ZF5lyROb5N"
			"uoRvkz3x5uG0VZQzLpvebLOZ9RSB4wvm5VNeWYzJlvCOxCnzhvBtkl36LIOjhFdGgojHbmAoEgfA"
			"CY2Os7pzPMURt5WlCBzHSUrHWQW3lcaTjnDxeMhtZikCxwmas7vM9Kz/jCw5DDoSx3ENYxbsHJ5D"
			"Q+PxeEgw62kSB8BJHWfzpLcFXSaWInAAnKT16cpFPHZOl6wzY3RI82+FaNKk/VczkQUDkfQYzcta"
			"aWg8Lgd5I6MhcJyk9Mlmy4KBBIJLfwBCDgbPcApJ7rccDY2H7EyGs1g85w2Kx+MRty15iTMv/BzX"
			"mHhIMDEaAscJDcUY7B6XUYOnfJ1CQvKRoPRWt9tML9TQuGTXa3BIvWBBmw4v3IH3RcivofG4LCVu"
			"CeCkzmAX05c96DKzFIkDTlCsiU89c8vR0Hg8ItoNiXMQFGtyZXRakhcuedmTz0CQN1AEnnrhctya"
			"fHczs3keK0Piqa5ERmNpvVnI9vLPdTqLeOwGXXKHzBd19uSkzuiwc0TyDZ9zfSJuG0cnL2H2kyV5"
			"CTQU8WKsnYauMSE7Q8xx639ZCDmYNZLQRTUUsXTkSCTzE5/8whe6fmchL6t/KAKx9gnLCmNK4EWd"
			"cUGOYcQGQbTQREawTY/LI1O6F4vrVThIQxFryVonLCuMCd4usaYXCIWCWF9oPUuKFq7jwjXntQvH"
			"GM4hM2v3RUQailhT1jRhWWEoXpsdTNbWVyPa4jcSbI9NcBgIj9VkMFkFnLULrrfW7IuIctIh1ph0"
			"wrKXBazhkv/L9a4E4sXAajo//qzz4/U4NeqHIhAIxPJBGopAIBDLB2koAoFALB+koQgEIj9PLmxX"
			"VZ1+2XLZvCwgDUUgEIjlgzQUgUAglg/SUAQCgVg+SEMRCMRSmHp0YTY7ZiKvp/LgaLlq57VU7Dnn"
			"XlWRNmU/VR50lJe3Db9EiypWGKShCASiYBTvaYY1CzhrsVoNdMhh0OmdE4DpWB1Ibk9CKEW3KEPQ"
			"IybifEqCR6bzRAXd8CANRSAQhRLlLTaJMrvdN989efLSkIfncMFsfaSU6VhK9ngkAIAnHlEmCJDc"
			"IgDAhNsT0uiWFy56Y4A0FIFAFIjiETyyzmBMJfUpazXpyZBbkGCbjiFDHs8UQFR0SzTH0RHRMwGg"
			"iG6RYNhXOSIW0lAEAlEgkVAoQmiojHAeGppK5HehGR0uukUFRLdI0hxHE5JHVMAjeHAdq8t9yI0P"
			"0lAEAlE4C/NSJBJrYjqWlkW39EQUZZqhaYYG0S0+8Xgir7QxFJCGIhCIgiFIEo8EpYwY2kExKCfy"
			"ym/WsVTQ43a7JY2OLiujGSokul1uSaPTvcLGUEAaikAgCgbTsTpcdNhT2TGjD+yuIMnoNAAANTod"
			"IdptHpymawBqaBr32GwegmHr8hzxFQBpKAKBKJQyzmLSSFaGOXrh2rXTHTq9Q2Ys5j2JsbqO0cmS"
			"FKIYGgCAZmg5FJJ1ib9eYZCGIhCIgsEa3ncLVkYWLEaT3UNwDvdsxHiMYWkASkdvBgDYTOsoAJpl"
			"XvX8ACiOPQKByE/Nu7/6w7vpvzbveXfoV+9mK7f5rS/jb6X/qnvfH39/9Su37qB+KAKBQCwfpKEI"
			"BAKxfJCGIhAIxPJBGopAIBDLB2koAoFALJ+ieDxeYNGJiYnm5uYtW7asaoUQAPD8+fOvv/568+ZX"
			"e33HN5SpqSlFUb73ve+td0UQOXn+/PkPf/jDTz75pJDCS/BtKisr++Mf//jhhx8ut2KIQrl8+fJf"
			"/uVftre3r3dFECvPP/7jP/7DP/xDfX39elcEkZN/+Zd/wfGFkQGyszT/UAzDKIpaepUQS0OtVldU"
			"VKBL/UpSWlr6ve99D93cl5nNmzdHo9ECCy9BQ6PR6MzMzLKqhFgav/3tb//sz/5svWuBWBVisdjk"
			"5OR61wKRj+fPn8disQILL20sX1xcvKwqIZbGn//5nyNj6KtKSUlJZWXletcCkY9NmzYVrnVoXh6B"
			"QCCWD9JQBAKBWD5IQxGIV4EnF7YXFamanVOZPyp3m1VFs6jKK7TNx5y+aOEFYOra3qK5qMqrdnZc"
			"8+aZcplyNmuPPsiXDdl3WqvafuHJkloY9V7u2F6hUhWpKrZ3XE6ePzrcoZ3X6LUGxW1CIF4BJgSX"
			"iOO4mxeinZ1zo82ROo6lcAAAOSJ5BLtBJ4Y87nfrsIILAKU361N+BHJIFFy8kZUJaehQNqO98shi"
			"Cepd+/MlAMFJgiCIQr2HAACeXGYZU5A2Wm10yG23mdgIIX7aua2s1aw36y1e7uOGdUs4Ei+Y3/3u"
			"dz/4wQ8KL49YNj/5yU9+9rOfrXctEKvCj370o88++2yFDxqyMzip5xgcZ/nI7M8yz+LA2EMZv0h2"
			"lgRcZ5MKKxAP2RnAWV7OPJvsMVEAOlswW1UiPEvk2PQCuI0kUCZPshoRwUACZRbj8Xg8HrTpCH1m"
			"q1+cDz/88Ny5cwUWRmN5BGLDE3W7PEDrTXpadvNCPsdGrOYth4UBj93hW2YBAMAaOFYDkihl2TbF"
			"292UgduWZdML8MTjCZEMl+prljF6HR4UpSgAwDY9Rwl2ft3G80hDEYiNTtTNu2WK0dEMo5HdvDu/"
			"d/hmvUEHkts9sewCALIsA54lxydMuXgPpWcSY3zlbpuq6pjz2tHtFSpVedXOo85UIqZZe6hyt02l"
			"7Rm+27O3qlylKq/a2zOc5bw173pConU2q4gcicxWYBvDaDy8a71EFGkoArHBUTy8W9YwTA1Wx7Jk"
			"xM27803nAGymKBKCYnDZBaIPHK4QTjMLl1opbiGZky5F0GG0hAy8KApmjdvIGoazCHzQbjBLrM0l"
			"8GZKsnHGbHNE2ObNZWmL5xTv8ADFpHIuUwyNewRP/lavGmhOCYHY2Cge3h0hWT0NADqWIewC71Za"
			"803p4AQBkUik4AKy5DD1eBKdPjkSFAXBE6FMFm7hjJLkEYEyzdFWQm/nT+4pA6hxOESKtTietJ6s"
			"mbuXTOjtrnf3YwB7qJBAmgSP0tmau/5Td40WN67n0wYDTENrwO6RoHU9UogiDUUgNjYiL4QInV6H"
			"AQDGsDqcF3i3sj/vvDhAtoF4zgJBwW4TUn8QFGtwWKydWSbCSDNTyAAAIABJREFUlWAwBCRJZh6F"
			"4diknwCm0+twh+CJztdQoNNdys0aDQGhiAyQo/qK74Le6JJZhy3DKYDUkBCSggrUrcPkPBrLIxAb"
			"Gh8vhIDSaUITExMTExENTUFEyD+cj4QiQBBEwQVS8/JyyG1lCDmC65iGrNk65UgEcJzIFDKSJNN/"
			"YgRJyKFQaP5uOEGkD4cDgAxyjopN3OVYs4c0uvjOzFmrMpwAWY7k2mt1QRqKQGxknvBCEMBjpjUJ"
			"GKsIEBL4PNbBCUkKAUXnDhyVqwC2ec+7LoceXEYul3/8Ir3bF1K56IOjrMEFrEP4eM9CCV+Ks+mK"
			"gjQUgdjATAiCBJTB4ZrFYaAgJPCeXLtMCbwINMvkDGqTt0BZq9XCgMdiyjbxgxM4yHIkU75DwVD6"
			"z2gwGMJJDblwxwKYuKbnHCHaJrg6FzhOReVI4uTrAdJQBGLjMiXwIlAGc2frLJ1mAw0hgfdm3WPi"
			"rtHiBsbIzbdJFlxgm8Fq1MiCxfJoQVcXIzUkzB2sy257yutogre7gdbrspoBFmHKaTC5CQMvnMxm"
			"8gwFQ0BqNOuzUgnNKSEQG5aEhJr0c+WuRs/RZrPAe4EGAJAcpqOJSXU5JLrdYgh0NvtbGX25RQvM"
			"A2swW1iHwWF2mL+cV4zW0eAQJQW2pfUsIhiYNtHIgGCzuUmD27Ac93ufzeqWCTrCm47yqd9w2mg9"
			"2VAGAIokBiGbq9WagDQUgdioRN28R6ZMC3qMNZxBZza5eK9VBwAhD+9IDOxxQkOxJpvVemjOHosW"
			"WMDmTqvRSlstlgeGm3Pm/zGG1ck2twT7U15GuN5mJ3mz2SyTOqPLcWnPcjqLUx6PBACiyyFm/Mro"
			"LAkNldweWWfWrdOCeaShCMRGpezQp384lG3DtpNfxk8CAECOAimwXEdIs/mtz+JvLfy57n1//P1s"
			"xfWczuxwT0BdqruJazo//rLz4wW7/+H9ZA2G5tRgz83f/aHQSiR5IrgjOpN+vYKWI3soAoFYOTZz"
			"JibIu/KsE11pnrj4IGNcNwlFGopAIFaSMtasjzjsS4sN+gL4HA7ZYNYvZ6JqZUAaikAgVhKswWLR"
			"uKx5YzCvGNEHNhdlMa9f8FBkD0UgECvN5kND/kMAAPNsnatA2f6b/v2re4rFQP1QBAKBWD5IQxEI"
			"BGL5IA1FIBCI5bM6Gvqgo7xoNmuf4nMe3VlVripSVWibTz+Yu8xWmXhwoWOvtkKlUpVXbW+78GDi"
			"xUzR3mMVqp2Xs3hWRJ17VeVHH73QwZdSj56qObkQK7TNPcMv2LaNheJzHt1ZoVKpKrZ3XPMV3vKJ"
			"yztVFcdmb5Qy3Kaak1dyqfkgES9OdGpqac9untdNmZrKH2g/25EeLOnssywngegSWf05pam7esbg"
			"0RjMNh14HFarniXEX72bWAYR9Z5mGKsIFKM3MEREElxmVud2eD5dGFVgI4JTLKcjAZL5Em16Fjzi"
			"pfWcQlw7og+MrMGlMVptGtFuNbIGjXRnfwH+J9EHZqtHhtmsDxCUgjKp4/R0KhSbhs4TtQ2x8kzd"
			"7dDZde7PTq7AW6l4L+g4yfb05p4XP1YhLD2B6JJZdQ19YrMIOCe4b+4vA3jLwBI0bbM+Mt3cg4Hy"
			"yMxZJY1RcH+8P5l/5cllVmcyme7qhw6tn7/XikGylpuXGpJ/KI+OUYzd6rK8Ek1bjAnewgPHCx+3"
			"lgFwlExxFsfE/sVfwid2sysEkBnZJygFcZ3d8fGhb8S352Uk6PGEZN3KHEuW3FJkeYGblkXNyS//"
			"6+TqnmK17aFRjyeIMxyTimRdp2fIkCSGAGCKtziCGqPDtj+9wgCrOWkzUhHB4VpKZ39jgO3RM4Qc"
			"DC4IQPsqEnW7RJw1JAOYl7EGFheFRVKlAUD0rtkaYVg687epoCSTGgoJKOIlZbU1tKxTCAXtbPoN"
			"UCIRGQDHE+lcZYozzhva1pldosR3ZumqTT260La9qlxVtMCuOjGcSApYsfPYXSkzymvUe7lje4VK"
			"Va5tu+CeFa9HRysqjl671lalUpVvv+BLH7xCpVKVa5szEgsqE3eP7a0qVxWpyqv2HnM+UdLHbdte"
			"oSoqUlVsb7vwqLCEgoockXGC/EaMQyVRAopOCx9G0RRIogRPLmxXFWlPJ7PuRofbyouqjqVCqCle"
			"i8VNmy36OUOvoBgEDa0BUKJLMqNtWJSJ4Z5mbbmqSFWxve2yN93mieHTzdoKlWquad13WqtqvvYo"
			"8Zxnmp7z5stUnjiP7a0qV6lUFTs7rnkzruvUg9Nt2gpVkao8+Y75eqp0tqDsMWmKtifmGaLea0d3"
			"Jg86+05AztdtlujdZtIgyBEHU6TqeJCoyN1je7XlKlWhb1LUlz75zqOZNVee3D22M6kCzuHT21V7"
			"r03BPHtoqoKq8qq9x+4+WanZicLz1v/ud7/7wQ9+UFBRgSOAtkoLN0RcHAEakycej4tmCnBOkAs8"
			"u2SlcVzDmmwOh92sp3DA9XwkHo/HZY9JA6BhTTablaMJHAfQ2YLxeDwecrAEELTBarcZGRLHcSAM"
			"7ng8HncbSJwgSJozGjmzEInLHhOVOLjdbuVoAjQGIRJP1BEnaIPV4XBYORpP1jzC6wlcw5rtDofd"
			"xJCAs47Qgvp6TJpk8UTDgy4jjRN6fmHJLPzkJz/52c9+VuCVeQmRXXo8lT8iHo/H4xGexXHOJcdl"
			"t1EDicsge9L/jcfj8XjIwRCUySOH7AxOGt2pPR0sjtN6lsIBAAiKc0iFPjIvKT/60Y8+++yzXFsj"
			"goFMPM52m1FHApF4uCKCQQNAMkarzWpkNAAk50o9ooATJG10CG7BYUw/pHGZ1+M4TmhYq8vtdlnZ"
			"jOc0xLMEEDRntTtsJoYEgrEl3lXZY6JwIHVGq91u+v/bO3vYuJHz/z8ODtjZBLgdVRpVooMAoovE"
			"dCUKCCC60rgSXZkHBDAFBDBdma5MJwiw+AGB6epoIIHpylR1NFIcVYWqjqpMAQeYAgKESvPnIsWN"
			"Om4R3GzFf0FyX/Rmec/vNx+oEMnhcGbI+XI4z7PzUAmQ4uZlnng6AdkM4rTgVZV7KgKiWp7ve5aK"
			"gbR38MzuNgXLIksBpLlRkpVVxUIdA6r7rqliQLKdnri7ZaAhbMZVVVVV7mkIkGI4nucYCgakNipT"
			"xiYBJOuO59lUQhgjpPmsbh/USFHuqaiudq0g0ikXa/jb3/7217/+9SJ3s6qq96qhZWJJgBqFS0wC"
			"kpWePPlUGklq65y7SitoAUVIbZ6BqowM0mpoaktAGjGsqtxVpzUUkBZMOi9FeKKDZWSQupDMV5Hs"
			"ZO01PaoYYVFViYknAlFGpqI6J6uR2tLx1xW5oIJ++hpahhQhPZo8oVOiykIdg2ynmacipPlFmyKx"
			"JExDVlWzGpo5MgCSdMcPA8/SCEzd00+TczW08FRAWtC0ShkZGBSvaHaPG6sIKAbZyaumfZouVVU8"
			"sUjT83ioIyBmO0hhvgbIiHhVP5ryTF9CdboypAgpbvOS4uNhQGpLba/lsYHRpGvz1Jag7iJnd7cZ"
			"yoCidn9qT79Eee6qrfLNntFqKI9NDJKVlOOLy4D1qKyqwlOnujALKQY4pqE8rgWHj2sN+Mwh3Btp"
			"6Hv0Dx1sG4bPVDdoLAvovNhTx1n9OmeZ2373jzigJnZrGqdcMdsVFHvUos3H8iBNC0LN1ha8Yhgz"
			"02wSVZtp2FEaJ1zRNTSsAZWqkMXpEDAhkIf9J7uHQwBYuffPV9/cWgYghPDUs7f3ByOA3ubzVy8f"
			"rcJpIJmaDQZVSBlZ+uP9n5N702ks3nIdpfB12s8k22uX8B34ToAs99aJxXewZtpulH776M6t2/ee"
			"xrEjs9ANLzZ78ukxTOMMaZbetEpv00vz2FoeJnGGNGscC3jZsCjOk6RpBklVmyMdSZZQycZBjY/F"
			"yyxLDnCYJIWkUYk3zzvRNKlMk3zSl+pTOqv9JE/6s492FiWlTClpzuUS1UiRJIPXdbfTGKRJQfTx"
			"gkudFdNSIY3PjqaXxUkpG1YbS6mzaplKmUYZDJM4A81qYzUv6jY9MWWWJwmTJlOHK1aUZ772NqbZ"
			"35eGHu1uUSsGI4jauKgYYyhZeWFJ6aAienz35vW1K0tdpDhNtJghYyWSyMQqRWSpnk1jOQMiTyyA"
			"y+0BAKhdHpp/S1ZwSCwJtxAz4rxkJXRo39XKyKYyXrhyfevJbj2DsmK7Jsl8U5Xw0rWb97f3z+rR"
			"hPafN3zzz1d5bOG0b/vvcVWwDwVCCIBPvx95MwsOALBiewZmDHTXaRbqHe44bjHZnGZ548HXD8ZW"
			"x85V01R4lmYnE34WlIwBlqSJNWBxZWWxA4wxTuSp3R1JIsAa++TMJPtMw58aL5PlBRQ+JePnXfVy"
			"zhiDIWMcSVPRjnrLK8uzholRwUrIXGXSV2jAOCvK13S3U2E5A6JMWQsXJfnUsJ/jExhDkixNdtRv"
			"DDYq8oITeRIKpCNJ5PjVWVEiST5WubdiqXwva46M9h9SPWCKlwSTgYasyojnaQ6bsz3n4PF1MzXC"
			"b+/MrKQ93NlS9KCUNarphk0V1tf69RE021hovI2OR/qbTTne4hwAUzd01OnjWCIAnav3vivobhgE"
			"YRgHNg1DL3t5b2Vx83lWWFEQhGEUe2YUJXH2/LXOj711y5B9L8lG95Y/cytzhxAMGWMAzfiIsRKI"
			"2gbJLdKsBOBpnI021zsAg9CNSqKn7sMUAMo052XpP3zIjP6tE8FzMMbA+YcJgvtxgeZ0euQAIFuh"
			"b8x4GBEFILrY2aoTu3T64kiSgb2mu12UNz8JNX8f7Jl4D+PQox1Td3PZjmbDSXU0XUN5FBz7uD0I"
			"gyQv4dhQfBC4AdP87N/fffP00Z1b6wTKeh6gRwjiRTEZ27G8qP8hEuFFXoxzP2LF6a1MCEElx8r6"
			"GAmVgHAHRkcH+4d8ZePOo2+++38s9ylKg+gQhoODA4ZXbz14+u2rH1hiyUUYnBOJ9ueIpMiQZ0W7"
			"OWrs9AAAcPTCcXPZtLUysL1DAABecs6z0K3xEwY8C103yDgMtr+6tvZwKrpakRdAiPRea/P+wIRA"
			"WRQTa/P+k62t7QNCCGLTu0dFwficATIJIVACmTzuCuYcIdT2pckw8HD77taTaaN9/XIsQZqcLCPO"
			"EXqD7jZVEJkAy4opu36Rl3BOrQghvGj7N0D98wtMSIfIBFgxyWlUnBzMEolwlk92H+3c3zr+o8n5"
			"eOcaOtyxrZBTP/r6eEjonuEYJPctZ298l4b7Dy0vx3Q8s9FSshKwLLfzQYdRmDfvHZVqOAvCxnlh"
			"tBfErD6wrGlyGQdxk/kgCtLTb2pHoypK/WDsuPTCprrp5wBZX1d1t3HE6UiyhBAgdBSZqmq1sQp7"
			"skIu9vIc7QdRDrL6c3B1XNSozGN/t278YRzEXNG1HgCM9vpOhHTXcz1Lylz7xRHAyoNXU1P0Y5vS"
			"P2/3gBAo0jBo3Z+Gu35YSFT/QNHH3jk9lSqQBnHzcI32fDfIGOrVzRm2Q4Wj0I9L+ZzoxuchU42w"
			"yN9pOsbowDWp3k9KAJWqKJssQX8QuH6cQ6+ZBgAAAEVXcR56Y3e0vb5BDTd7g+6GoJ1tWFY1icVe"
			"25PgMPBTUOnZYZEUquE89Fu9GO37QYZVqkBP02VIgjanYRzE5fGry5pK8ihsf3Q8iFw/Kvhb8TS8"
			"oO2pmtMuX/gqmratmKZpWm7cGNBqjw3ACjUty6QKAQCih8WJDHlsEkCK6YVR6NsaQQCA9JBXVcUz"
			"R0FANMvzXVPBGKOxb1OoE0Cy4fqeTSWM8bRvkxZMjLtlYkkAWDXdxrcJNybQzJERNA5VNpUaB4Ay"
			"1FvXEN81VXyqpTi1pZl666qEAIgRXcQ0/6nb5avGQwKrlhfUHjBNE+WuglobbxnqGCQrOWYbnbXL"
			"V5mroObeOLqM4KL+YR8tr/NtMpqHtm64prpj3ybP92wqofGTNOW7U1V1fyNWWjW+TUY0zjgxceuL"
			"Uvgarh2BfM/WCIxvQuPkpzu101Pr8FJ4CoBELTdmFa/vh2K4jW8TUtzac+XM7jZLbGDAimEH2bRv"
			"k1/7XJx8Go77Nqm1b5Nf9zykuBmfajbd8TxHlzFCJ+zyrVeWZnu1dySSnU/Ct4lH+iljtNoro6ZM"
			"fVOTCQJAWFINNzmjg5SJS2WMECKyarhx4ipo7H7JEofKGCGsGH7kKGji6pEHpkoQQpLmxL6BztDQ"
			"qqpY7OgKQQCIqIaXjo8VkU1ljAAQUfRx4crUN9SmzJp1qsficd8mRGRqhxf0bfwMNLSqeNY0PlEM"
			"v37S2THVzF0F0HEnuGMaWlUscXWFoKaxs0/cPfQ1GlpVPA8tTcIIEFFNf1LdInKoTBAgPP0kzaOh"
			"VVVmvllfA8vUjqYGLSx2qIxR87w3/aAITRmjtsOVidc8/dN9ojqzux2rXupqBLXOqlOVVXQnPq3z"
			"T2torRdqc8J0R51cnKhW4Bu46eEz7VMmnqE0TXj6xRreSEMvVVV1wRFrWZa///3v//Wvf/2EUa/g"
			"QvzlL3/59a9/vbW19aELInj7/OEPf/jjH/+oadqHLshnxGg4hN7Eyj7auYkNCMtvN+ecN/v73/8+"
			"HA7/9Kc/XSSxWD9UIBB84mR9BU8ttplGKX9/hgcRT0kgEHziKDolXt/4CiyKyzTwAq75xsrrz3sr"
			"CA0VCASfOJ11Lw7A6rt2yJGk6n48/gXcu0doqEAg+OTprNx++t3tpx/i0mI+VCAQCOZHaKhAIBDM"
			"j9BQgUBwKkfP1rqX7++fcmRva6l7ffv8JbEvkuazQGioQCB4QxDG+MTKSD9XhE1JIBC8Iatf//uH"
			"D12GjwYxDhUIBIL5ERoqEAjOhhc7D2/UQeAmgSBn5jqH+8/qUHSXr9/feXH3cvfmzngVujJ91kbL"
			"29p+a0HgPi6EhgoEgrPgLDDNCOlO31IhcQ1757gOHm0b1IpB67sOhdCwwqmVO3nqGP1CMft9QyoC"
			"0/AO4TNEzIcKBIIz4VgP0282ewAPNLishnEGm9Mhlg7cfozMOHm+0QO4p8trij0VqIXLTvLywQoA"
			"WIQRM06PHqzMtejpx4wYhwoEgjNBmkGbxdMVVUFlyWYGoodxUhB9EorOtLRpc71i6G20SEWZiZb3"
			"GSE0VCAQnAXCmIyXP5paz76FFQymw8T1JGlqafjpaHkIAPjnKKFCQwUCwdm8PrLc+Ql+Bk6kQkMF"
			"AsG8NKHoxttDVnyWY83zEBoqEAjmZUXTJBYHu20outBPfnZxq4VdXiAQzM2q06eBaWjcMVUWe376"
			"oQv0/hHjUIFAMD+Lt8PYo5D0HSfieuhqCBD8DMJ/TxDjUIFAcCqLd17+eGey2dn89scf63/Xn//Q"
			"/DcaDtHqvW9e3as3j55dB4zxbBoAAFh59O8fH72HQr9/xDhUIBDMTWJJ+Pp28xNQGCZxBrIif9Ai"
			"vW/EOFQgEMyNalCk2/pWaWqojH03QnpkfHY/RToXMQ4VCARz09v0Y49C7Fim7WXEDJNgs/ehC/V+"
			"EeNQgUDwE+it3vvm5b0PXYoPiBiHCgQCwfy8wTj0v//97//+978///nPv/3tb99dgQQAsLu7++WX"
			"X3a73Q9dEMHb5/vvv//FL37BGHt9UsEH4h//+Ach5IKJ30BDv/zyy1/96lf/+c9/RqPPcy3Vj4df"
			"/vKXX3zxxffff/+hCyJ4+/zmN78ZjUbi5n7MfPHFF7/73e8umPhSVVXvtDQCgUDwGSPmQwUCgWB+"
			"hIYKBALB/AgNFQgEgvkRGioQCATzIzRUIBAI5kdoqEAgEMyP0FCBQCCYH6GhAoFAMD9CQwUCgWB+"
			"hIYKBALB/AgNFQgEgvkRGioQCATzIzRUIBAI5kdoqEAgEMyP0FCBQCCYH6GhAoFAMD9zaujRs+uX"
			"Tmfp7t5rz+ve3DllJfyj7euXLl3q3ngxfLOi7D68eWWpe6m7cHnt7ovDU5fYH27fuHTpxnab8XD/"
			"yVfXlrrdS92la1892Z+93vDwxcOba5eXut3uwuW1rSd7RyfzO8nh42vdKw8P3qjkNaMXN7vdr3bm"
			"OHM+htvXuwtbp92k/btL3bUng/dWEoHgc+BTH4cePqa6G+WMAy+L1Deovfe6QCWHT6hmJ0h3Pd/W"
			"ILKpsT3WjaPdu6piuAmXqWmZlBShralbu2+m6m8Iwphg9C6vIBAI3hlzxkZe1L1EYhwAisC0Qgaq"
			"E/U1BICQpLzVAp7Pvu9nHLDmxoHOXF3388CL3PVb50S43vPcVLLT5OvVDsAdQ0Mydf2D24+uAgxf"
			"WIbPFCeNH63WObj79zXNMx2zeLreeTdV6Gw+/2Hz3WQtEAjeOfOOQxevrm9sbGxsbKgSBgBEFLqx"
			"sbGxsb6+co5+vW1GrGAASLPt1eWVTcdSAHieFeedcpimjGjGaqOIPU1XUZHlQwA49N2IK07QCigA"
			"9FZd1yAs9BMRhk8gEJzCu/qWHx4821q7vNC9dKm7cPnkpCNLn9y8stDtLly58fCsCcfh3uOb1+qJ"
			"zutb2weniViHSCcCmKLzv4tXHqQscydjZV6WHBAggEEcZaBa5srsJTbcJMuDjVNGoUe7D29cWeh2"
			"l6599SybiXR7VBe92124cuP+Tj1TcPj42uxk8V49/Tg7Hzo62K7brbu0tvVsXOnTMjzB6HD77vUr"
			"S3Wbr003WTsBvHDl5uNkpqSDnfvXLy90u0trd1/kfFz+Z2vdtYfbD9cWut3LX70YtplfXuh2u0tr"
			"Xz2b3M7h/pOb15a6ly51l67dfNzey9Hgxd3rlxfqm3d3e2qWerBz/8aVpW53Jvl0vc+roUDwEVL9"
			"RDJHBgCkh3xqZxkZePYy2Ih5VVXM1wAAEJrSOaS4eVVVFQs0AEA0LKuqqnJPndFCrIfslMvnnooB"
			"a25a5JElA4DsZCdTlQEFoEF58gjzNQSKV1RVlZgYJDu9aMVzV0FANMvzXVPFCKH20jy1ZYQkanu+"
			"7xoKBsmMy6alJHtcusyWkOLmFQ91hIyoLk1AMSBZdzzfNRUMxIjKszM8VsfYIIAV0/UD37M0MmkK"
			"FlBcH/EsjSCEAJtJU1IJQKK257mGghECUL2iqirmqwhjLGmmbZp+XlUspBiwYrh+4NkaAax5eVVV"
			"VRnqGEnU8YPAtzUCiAasrirCiukGQeAaCho3axmbEiBZd/zAd3QJIcVJeVVVPLEIEM3ygnZ/nb1A"
			"8PHzTjS0jEyCAGlexiteBDoGaNSj0VAg1M9KXsSWjACAmDGf1dBGhCUzKjjPQ0M6Sx0rnjrKWGyx"
			"6qb8lERnaSgLddKqMw91BI2cvx4emxhku7kaT225LSALKMK1lNRtYRBUK1NqS5ML5K6CZCerpjU0"
			"s6VGNquqqligIUSD8uwMj1URoUkqHukYaUHZXJaMVTd31VZDy4AipLZqVUYGmdJQAMkat2VqS5PK"
			"1mWv71liYkTbW19GpqI6aS3Bk7uVe1QxwqI9b1y/poJhWWvuuEo8cVTVOuUtIRB8jLyTb/ne5vMf"
			"fixZdO9qBwAwxgDAeTlJoNjenau9zvKG26cIgKVJPptDFsUlgGI5m8udzsotx5AB8iQ58Yl3tGPq"
			"bjb+Bi3zMEwuakQfHTzWrYhTz7u1CADwRqbxLE5KWTebadXOqqnLTa5pnHBF19CwBlSqQhanQwBF"
			"pySP6koM4ignVL86necgSQtMTdrMxi4aYZYFBjo7w2l6tyNWhMZi2xKAEPCyBBikaUGoudHkumIY"
			"7URGGqdcMY1m7qJHLTr98YAUqjQTGIdJUkgalXhTBKJpUpkmOQAhhKeevb0/GAH0Np+/evloFQAT"
			"AnnYf7J7OASAlXv/fPXNrWWAozTOkaqr0GSDVF3haZwCEIlA5vef7R0OATrrj16+fLrxHqfVBYKf"
			"wLuaDx0dJoFzc+3KApb0oDh2EEmyVP/Xk2UCAIyVMwmGRVECQObItdOp4uYAUOTHMxqEbsjq4WpZ"
			"5oFOyswzndd6NwEADF4Y1EmJFYW3lwEAoIMJBlaw15zXwBgD0tYCACRZqjW4ZAWHxJJwCzEjzktW"
			"AnRUnaIsSoYAR3GUYarPujCwgiFJlsYzr53FlZXFzjkZztJBPA3ub924fu3yQpfoIatfLSxnQOTJ"
			"tPFyW9IhYyWSyOL4fNIeAQBAmOC2JCwvoPApGRdB9XLOGANYsV2TZL6pSnjp2s372/tHAAAd2ne1"
			"MrKpjBeuXN96slvPh7Kc8TIyJtnIdgolK4ewaPRtuQgsTcYLV27cfbY3ECY8wafCnL5N5zM6eKyq"
			"TsYBy5puKzzyomImAeeT/08b/jWHiWpQeXwcYe24AanIcmiGqz2A247Rj7wiiXNYvwrnMdzdomYE"
			"NIifro/HO7Iig5/lR7C+OJN47/6aU9rh81vLUzvR8YK3W5wDYOqGzsx0LpYIAHQ0nSIzSoY6j1Kk"
			"OepF3KXOy3CawyeaYmdYpVSzTFfDoWHkTcmONfF4Mhodq8LM9tQWBwDZCn1j5ppEAYDFzedZYUVB"
			"EIZR7JlRlMTZ843e1XvfFXQ3DIIwjAObhqGXvbwHAEAMP7Tk6Wyw3AOA9UevmLETBEEYxb4Vh3GY"
			"f3tr9j4IBB8l70RDU8/NOEhWkj1d78Hh49iLYFpzeJ5mcGsVAIZ5XgDMjJMAADAhGKDEmvP80VUA"
			"ODrcZ0i+unz8+67u57xsNJdzDmMBPpvBM90ImOIl0e1pWVykugpOEA7u3JvaPdoLwzRX0TEbGZEk"
			"nuUFQCPW4wEsIQSVJVbWx0o82N8pUD2m62i6xu0oiXmKtEDrHM+T8CJnAM3X9XDvsRVJ/6eek+Gk"
			"mLtuPyVWkjd+rKPdoGmVOtdiBCv1GUes4CABQI8QxPNiANBUl50Y57cFIwRKIOvr682O4cFuyhEC"
			"GA4OCpBXbz1YvfXg6XDvrqoFQeprSp6VZHXjzqONO49Gh8901Qqiw3umRKDkRF1vXW1Hh3sJQwhg"
			"NDjIuLS6ee/rzXtfjw4eaqrnx8Nbt8X3vODj5118y4+WltTMAAADa0lEQVTKkgMAlkgPAAZJXADA"
			"jLYVgf1wb3B0uGP3Iw5ANFWayaGj6ioCyIP+9mAERzsOVRWJ3DzxK1BZq5M5z/YHg70nbsgAsHIs"
			"s2McbZt2gs0wrmdrp1g2bB2lfePxxCnoaNe2AiYZNj3WnWWqkjz09+uUo4MgbGZlOxpVUeoHrTvP"
			"8IVNddNv5nt7VNfKxPUSrhrHJRSWNVUq42C3PTP23Cgrvzw3wzEl4yApcpPnMAmTsn6nLGuaXMZB"
			"3LTdIArS5k6oVMNZEB7WW6O9IGanv39kqhEW+TtNFqMD16R6PynhKDJV1YoaD6WerBBAAJD1dVV3"
			"mx++diRZQggQgkVVlXnsBe2s9iCwKLUjBqPY0TSz3d+RVXJi7CwQfLT8VKPUaXb5wtcQACBJ06nS"
			"jDCREfHWLo8laWpYhzW/qKpjvk08deTZbjRlF55wIhk6NdmUXT5zZACs6OYUlpc2VuAi1AkAIqpu"
			"WpZB5do54FQbceFrGLDaeAxhjFvHgTKxJKiP1K5IbQWrqmqcqQBpEwv6lG9TEVAMWDW9YNqJ6fwM"
			"G3JPQUCoE0RR4BoKRjD2ZGChTgDJhut7NpUwxmPfpsyZ+GcpGGM05ds04+ZV+FrrdOXZGgGQrIRX"
			"tW9T4/Pku6aKGweAzJERSNT2gsC3qTS2/rNIJwBEsz3fd3QZATEiVlUVT6zW5ynwLI1A44fAY1Mi"
			"mvBzEnzMvBv/0KqILJUgQFjW7DByFIDaR7DWUNlJUt9QCEJY1t104ssz0dCqqljs6gpBAIjIuhOf"
			"5h1aVVXFEs9QCAKEiaK7pyebaGjrXDWL5k9OY7FrqBJGAAjLmumnZzrZlKnXVsKLPW3KnYfFTlt0"
			"1fBmcyg8FUCdiOC0hlZVmfmmKiEALGlWmPMLZNjmk4dm3eaSQu0wDQ2MWncungemShBCkubEvoEa"
			"Da2qiiUOlTFCWDH8yFHQGRpaF0yTMAKEZWpH4+KXqW+oBAEgLGlW0Ja4iGwqYwSAiKK7ybh5eR42"
			"B2aSVzwPLE2q909qyCMdneHTJhB8JFyqquonjmQFAoHgZ8unvm6TQCAQfEiEhgoEAsH8CA0VCASC"
			"+REaKhAIBPMjNFQgEAjmR2ioQCAQzI/QUIFAIJgfoaECgUAwP0JDBQKBYH6EhgoEAsH8CA0VCASC"
			"+fn/CzHbZE1eTvUAAAAASUVORK5CYII="
		)
	)
	(text "Humidity Sensors"
		(exclude_from_sim no)
		(at 42.164 81.788 0)
		(effects
			(font
				(size 4 4)
				(thickness 0.508)
				(bold yes)
			)
		)
		(uuid "f6f6ad56-eee9-4a20-acab-689153f8c7c7")
	)
	(hierarchical_label "I2C_2_SDA"
		(shape input)
		(at 80.01 64.77 180)
		(fields_autoplaced yes)
		(effects
			(font
				(size 1.27 1.27)
			)
			(justify right)
		)
		(uuid "06023fd5-cea5-45cc-9323-fa079cbdf4e7")
	)
	(hierarchical_label "I2C_2_SCL"
		(shape input)
		(at 80.01 72.39 180)
		(fields_autoplaced yes)
		(effects
			(font
				(size 1.27 1.27)
			)
			(justify right)
		)
		(uuid "4e30f0d6-2496-4067-abdf-9fc25b31b7d0")
	)
	(hierarchical_label "HUMIDITY1_nRST"
		(shape input)
		(at 144.78 40.64 0)
		(fields_autoplaced yes)
		(effects
			(font
				(size 1.27 1.27)
			)
			(justify left)
		)
		(uuid "6eaaf8ec-9c40-44ad-b8a6-a2559308d905")
	)
	(hierarchical_label "HUMIDITY2_nRST"
		(shape input)
		(at 144.78 72.39 0)
		(fields_autoplaced yes)
		(effects
			(font
				(size 1.27 1.27)
			)
			(justify left)
		)
		(uuid "7e20d2d7-b43d-4c0e-8ddd-014169d3726b")
	)
	(hierarchical_label "I2C_1_SCL"
		(shape input)
		(at 80.01 40.64 180)
		(fields_autoplaced yes)
		(effects
			(font
				(size 1.27 1.27)
			)
			(justify right)
		)
		(uuid "d778813b-fe4b-4a69-92d7-b37fb7ec1e8a")
	)
	(hierarchical_label "I2C_1_SDA"
		(shape input)
		(at 80.01 33.02 180)
		(fields_autoplaced yes)
		(effects
			(font
				(size 1.27 1.27)
			)
			(justify right)
		)
		(uuid "dc32cfb5-37d8-4ae3-a331-9aeeea99af3a")
	)
	(symbol
		(lib_id "power:+3V3")
		(at 140.97 62.23 0)
		(unit 1)
		(exclude_from_sim no)
		(in_bom yes)
		(on_board yes)
		(dnp no)
		(fields_autoplaced yes)
		(uuid "2cf57933-1000-4eb0-8d4c-f0ab5085ba50")
		(property "Reference" "#PWR077"
			(at 140.97 66.04 0)
			(effects
				(font
					(size 1.27 1.27)
				)
				(hide yes)
			)
		)
		(property "Value" "+3V3"
			(at 140.97 57.15 0)
			(effects
				(font
					(size 1.27 1.27)
				)
			)
		)
		(property "Footprint" ""
			(at 140.97 62.23 0)
			(effects
				(font
					(size 1.27 1.27)
				)
				(hide yes)
			)
		)
		(property "Datasheet" ""
			(at 140.97 62.23 0)
			(effects
				(font
					(size 1.27 1.27)
				)
				(hide yes)
			)
		)
		(property "Description" "Power symbol creates a global label with name \"+3V3\""
			(at 140.97 62.23 0)
			(effects
				(font
					(size 1.27 1.27)
				)
				(hide yes)
			)
		)
		(pin "1"
			(uuid "1404e60e-fa43-4937-b732-230ef19f742d")
		)
		(instances
			(project "Draft-SU-PCB"
				(path "/ab60d743-7d21-44ca-af12-9d3ffcf1b44a/7ece7641-c949-474d-a8a5-24e5b298bf42"
					(reference "#PWR077")
					(unit 1)
				)
			)
		)
	)
	(symbol
		(lib_id "power:GND")
		(at 125.73 38.1 90)
		(unit 1)
		(exclude_from_sim no)
		(in_bom yes)
		(on_board yes)
		(dnp no)
		(fields_autoplaced yes)
		(uuid "2d5a40e5-32a0-4d99-9072-45463199f4e5")
		(property "Reference" "#PWR068"
			(at 132.08 38.1 0)
			(effects
				(font
					(size 1.27 1.27)
				)
				(hide yes)
			)
		)
		(property "Value" "GND"
			(at 129.54 38.0999 90)
			(effects
				(font
					(size 1.27 1.27)
				)
				(justify right)
			)
		)
		(property "Footprint" ""
			(at 125.73 38.1 0)
			(effects
				(font
					(size 1.27 1.27)
				)
				(hide yes)
			)
		)
		(property "Datasheet" ""
			(at 125.73 38.1 0)
			(effects
				(font
					(size 1.27 1.27)
				)
				(hide yes)
			)
		)
		(property "Description" "Power symbol creates a global label with name \"GND\" , ground"
			(at 125.73 38.1 0)
			(effects
				(font
					(size 1.27 1.27)
				)
				(hide yes)
			)
		)
		(pin "1"
			(uuid "7e5af99e-744f-448d-9ffe-e4b09ea2fe39")
		)
		(instances
			(project "Draft-SU-PCB"
				(path "/ab60d743-7d21-44ca-af12-9d3ffcf1b44a/7ece7641-c949-474d-a8a5-24e5b298bf42"
					(reference "#PWR068")
					(unit 1)
				)
			)
		)
	)
	(symbol
		(lib_id "power:+3V3")
		(at 125.73 43.18 270)
		(unit 1)
		(exclude_from_sim no)
		(in_bom yes)
		(on_board yes)
		(dnp no)
		(fields_autoplaced yes)
		(uuid "38048aed-d4c0-405e-a91a-14c75d2b853c")
		(property "Reference" "#PWR069"
			(at 121.92 43.18 0)
			(effects
				(font
					(size 1.27 1.27)
				)
				(hide yes)
			)
		)
		(property "Value" "+3V3"
			(at 129.54 43.1799 90)
			(effects
				(font
					(size 1.27 1.27)
				)
				(justify left)
			)
		)
		(property "Footprint" ""
			(at 125.73 43.18 0)
			(effects
				(font
					(size 1.27 1.27)
				)
				(hide yes)
			)
		)
		(property "Datasheet" ""
			(at 125.73 43.18 0)
			(effects
				(font
					(size 1.27 1.27)
				)
				(hide yes)
			)
		)
		(property "Description" "Power symbol creates a global label with name \"+3V3\""
			(at 125.73 43.18 0)
			(effects
				(font
					(size 1.27 1.27)
				)
				(hide yes)
			)
		)
		(pin "1"
			(uuid "547d806f-6ee3-4879-a148-ed04fe067b58")
		)
		(instances
			(project ""
				(path "/ab60d743-7d21-44ca-af12-9d3ffcf1b44a/7ece7641-c949-474d-a8a5-24e5b298bf42"
					(reference "#PWR069")
					(unit 1)
				)
			)
		)
	)
	(symbol
		(lib_id "power:GND")
		(at 125.73 67.31 90)
		(unit 1)
		(exclude_from_sim no)
		(in_bom yes)
		(on_board yes)
		(dnp no)
		(fields_autoplaced yes)
		(uuid "49d506d3-f601-40e6-93d3-a7c6d96b1c58")
		(property "Reference" "#PWR074"
			(at 132.08 67.31 0)
			(effects
				(font
					(size 1.27 1.27)
				)
				(hide yes)
			)
		)
		(property "Value" "GND"
			(at 129.54 67.3099 90)
			(effects
				(font
					(size 1.27 1.27)
				)
				(justify right)
			)
		)
		(property "Footprint" ""
			(at 125.73 67.31 0)
			(effects
				(font
					(size 1.27 1.27)
				)
				(hide yes)
			)
		)
		(property "Datasheet" ""
			(at 125.73 67.31 0)
			(effects
				(font
					(size 1.27 1.27)
				)
				(hide yes)
			)
		)
		(property "Description" "Power symbol creates a global label with name \"GND\" , ground"
			(at 125.73 67.31 0)
			(effects
				(font
					(size 1.27 1.27)
				)
				(hide yes)
			)
		)
		(pin "1"
			(uuid "c55445e1-bbd2-4d46-aed6-bb3f472c8163")
		)
		(instances
			(project "Draft-SU-PCB"
				(path "/ab60d743-7d21-44ca-af12-9d3ffcf1b44a/7ece7641-c949-474d-a8a5-24e5b298bf42"
					(reference "#PWR074")
					(unit 1)
				)
			)
		)
	)
	(symbol
		(lib_id "SU-PCB-IC:SHT30-DIS-F2.5KS")
		(at 80.01 64.77 0)
		(unit 1)
		(exclude_from_sim no)
		(in_bom yes)
		(on_board yes)
		(dnp no)
		(fields_autoplaced yes)
		(uuid "54f21405-75bb-4467-ac88-39239ca9f38e")
		(property "Reference" "U2"
			(at 102.87 54.61 0)
			(effects
				(font
					(size 1.524 1.524)
				)
			)
		)
		(property "Value" "SHT30-DIS-F2.5KS"
			(at 102.87 57.15 0)
			(effects
				(font
					(size 1.524 1.524)
				)
			)
		)
		(property "Footprint" "SU-PCB-IC:Humidity-Sensor"
			(at 80.01 64.77 0)
			(effects
				(font
					(size 1.27 1.27)
					(italic yes)
				)
				(hide yes)
			)
		)
		(property "Datasheet" "SHT30-DIS-F2.5KS"
			(at 80.01 64.77 0)
			(effects
				(font
					(size 1.27 1.27)
					(italic yes)
				)
				(hide yes)
			)
		)
		(property "Description" ""
			(at 80.01 64.77 0)
			(effects
				(font
					(size 1.27 1.27)
				)
				(hide yes)
			)
		)
		(pin "8"
			(uuid "d38b45cd-7851-468e-bb99-a2214108e162")
		)
		(pin "9"
			(uuid "f03bb5c7-186e-4e9c-8c19-317f91d74b06")
		)
		(pin "1"
			(uuid "a4b07382-cd9f-4d3f-b6f9-5b607c70e68a")
		)
		(pin "4"
			(uuid "bd795325-8680-4358-b713-3aa88c5a725d")
		)
		(pin "5"
			(uuid "fc18a36e-0f43-4f2c-b6a3-2e11ace569ee")
		)
		(pin "6"
			(uuid "2a010c3a-069d-4cdd-87ae-f9317d19f2f2")
		)
		(pin "7"
			(uuid "efc4de5d-0750-4304-8c1d-e6c3b2160c9f")
		)
		(pin "2"
			(uuid "c3aca305-2586-4f7e-90b9-30733831356f")
		)
		(pin "3"
			(uuid "ecbf98c0-2610-4ab0-b825-2f053dc5b4ef")
		)
		(instances
			(project "Draft-SU-PCB"
				(path "/ab60d743-7d21-44ca-af12-9d3ffcf1b44a/7ece7641-c949-474d-a8a5-24e5b298bf42"
					(reference "U2")
					(unit 1)
				)
			)
		)
	)
	(symbol
		(lib_id "power:+3V3")
		(at 125.73 74.93 270)
		(unit 1)
		(exclude_from_sim no)
		(in_bom yes)
		(on_board yes)
		(dnp no)
		(fields_autoplaced yes)
		(uuid "5c02e2ae-8a8d-460a-b094-69c9443ff27a")
		(property "Reference" "#PWR076"
			(at 121.92 74.93 0)
			(effects
				(font
					(size 1.27 1.27)
				)
				(hide yes)
			)
		)
		(property "Value" "+3V3"
			(at 129.54 74.9299 90)
			(effects
				(font
					(size 1.27 1.27)
				)
				(justify left)
			)
		)
		(property "Footprint" ""
			(at 125.73 74.93 0)
			(effects
				(font
					(size 1.27 1.27)
				)
				(hide yes)
			)
		)
		(property "Datasheet" ""
			(at 125.73 74.93 0)
			(effects
				(font
					(size 1.27 1.27)
				)
				(hide yes)
			)
		)
		(property "Description" "Power symbol creates a global label with name \"+3V3\""
			(at 125.73 74.93 0)
			(effects
				(font
					(size 1.27 1.27)
				)
				(hide yes)
			)
		)
		(pin "1"
			(uuid "b728155b-c509-49b9-b62c-447f398e124e")
		)
		(instances
			(project "Draft-SU-PCB"
				(path "/ab60d743-7d21-44ca-af12-9d3ffcf1b44a/7ece7641-c949-474d-a8a5-24e5b298bf42"
					(reference "#PWR076")
					(unit 1)
				)
			)
		)
	)
	(symbol
		(lib_id "power:GND")
		(at 125.73 69.85 90)
		(unit 1)
		(exclude_from_sim no)
		(in_bom yes)
		(on_board yes)
		(dnp no)
		(fields_autoplaced yes)
		(uuid "60b57ee9-7609-44c1-bd24-0c9c7c803e80")
		(property "Reference" "#PWR075"
			(at 132.08 69.85 0)
			(effects
				(font
					(size 1.27 1.27)
				)
				(hide yes)
			)
		)
		(property "Value" "GND"
			(at 129.54 69.8499 90)
			(effects
				(font
					(size 1.27 1.27)
				)
				(justify right)
			)
		)
		(property "Footprint" ""
			(at 125.73 69.85 0)
			(effects
				(font
					(size 1.27 1.27)
				)
				(hide yes)
			)
		)
		(property "Datasheet" ""
			(at 125.73 69.85 0)
			(effects
				(font
					(size 1.27 1.27)
				)
				(hide yes)
			)
		)
		(property "Description" "Power symbol creates a global label with name \"GND\" , ground"
			(at 125.73 69.85 0)
			(effects
				(font
					(size 1.27 1.27)
				)
				(hide yes)
			)
		)
		(pin "1"
			(uuid "98c85f2d-95ba-4e30-aedb-67e4758978d1")
		)
		(instances
			(project "Draft-SU-PCB"
				(path "/ab60d743-7d21-44ca-af12-9d3ffcf1b44a/7ece7641-c949-474d-a8a5-24e5b298bf42"
					(reference "#PWR075")
					(unit 1)
				)
			)
		)
	)
	(symbol
		(lib_id "SU-PCB-IC:SHT30-DIS-F2.5KS")
		(at 80.01 33.02 0)
		(unit 1)
		(exclude_from_sim no)
		(in_bom yes)
		(on_board yes)
		(dnp no)
		(fields_autoplaced yes)
		(uuid "7e8328b7-dab5-46cc-9cf5-2a589a6e1f36")
		(property "Reference" "U1"
			(at 102.87 22.86 0)
			(effects
				(font
					(size 1.524 1.524)
				)
			)
		)
		(property "Value" "SHT30-DIS-F2.5KS"
			(at 102.87 25.4 0)
			(effects
				(font
					(size 1.524 1.524)
				)
			)
		)
		(property "Footprint" "SU-PCB-IC:Humidity-Sensor"
			(at 80.01 33.02 0)
			(effects
				(font
					(size 1.27 1.27)
					(italic yes)
				)
				(hide yes)
			)
		)
		(property "Datasheet" "SHT30-DIS-F2.5KS"
			(at 80.01 33.02 0)
			(effects
				(font
					(size 1.27 1.27)
					(italic yes)
				)
				(hide yes)
			)
		)
		(property "Description" ""
			(at 80.01 33.02 0)
			(effects
				(font
					(size 1.27 1.27)
				)
				(hide yes)
			)
		)
		(pin "8"
			(uuid "7289a627-83ac-4a4c-9c3c-8fc698dc348e")
		)
		(pin "9"
			(uuid "801043e7-aa15-47be-93e6-dd2c954e8907")
		)
		(pin "1"
			(uuid "9754d8cb-8677-4493-8328-d654c50af7c4")
		)
		(pin "4"
			(uuid "a52aca12-b9a1-4b97-89c1-3dbe5c87542a")
		)
		(pin "5"
			(uuid "a06d0306-51fc-4441-bd99-789245127ac3")
		)
		(pin "6"
			(uuid "233e9b2d-1ee2-472e-bdeb-2ec8f8fc7c73")
		)
		(pin "7"
			(uuid "2e5bc6ad-ba72-4a4e-acc9-0872840e64bc")
		)
		(pin "2"
			(uuid "7ca16703-4ecf-409a-8846-db0c1e372db3")
		)
		(pin "3"
			(uuid "2d79b540-1458-43ba-8c5c-66dee4e4237b")
		)
		(instances
			(project ""
				(path "/ab60d743-7d21-44ca-af12-9d3ffcf1b44a/7ece7641-c949-474d-a8a5-24e5b298bf42"
					(reference "U1")
					(unit 1)
				)
			)
		)
	)
	(symbol
		(lib_id "power:GND")
		(at 125.73 33.02 90)
		(unit 1)
		(exclude_from_sim no)
		(in_bom yes)
		(on_board yes)
		(dnp no)
		(fields_autoplaced yes)
		(uuid "7f6cce32-1ccc-4137-8468-51c9a4f32dd3")
		(property "Reference" "#PWR066"
			(at 132.08 33.02 0)
			(effects
				(font
					(size 1.27 1.27)
				)
				(hide yes)
			)
		)
		(property "Value" "GND"
			(at 129.54 33.0199 90)
			(effects
				(font
					(size 1.27 1.27)
				)
				(justify right)
			)
		)
		(property "Footprint" ""
			(at 125.73 33.02 0)
			(effects
				(font
					(size 1.27 1.27)
				)
				(hide yes)
			)
		)
		(property "Datasheet" ""
			(at 125.73 33.02 0)
			(effects
				(font
					(size 1.27 1.27)
				)
				(hide yes)
			)
		)
		(property "Description" "Power symbol creates a global label with name \"GND\" , ground"
			(at 125.73 33.02 0)
			(effects
				(font
					(size 1.27 1.27)
				)
				(hide yes)
			)
		)
		(pin "1"
			(uuid "b32c6b22-7548-49e6-bc01-88f0a42d6977")
		)
		(instances
			(project ""
				(path "/ab60d743-7d21-44ca-af12-9d3ffcf1b44a/7ece7641-c949-474d-a8a5-24e5b298bf42"
					(reference "#PWR066")
					(unit 1)
				)
			)
		)
	)
	(symbol
		(lib_id "Device:R")
		(at 140.97 35.56 180)
		(unit 1)
		(exclude_from_sim no)
		(in_bom yes)
		(on_board yes)
		(dnp no)
		(uuid "83c66c20-2e63-4308-aa58-0fc56161905f")
		(property "Reference" "R13"
			(at 138.43 35.56 90)
			(effects
				(font
					(size 1.27 1.27)
				)
			)
		)
		(property "Value" "10k"
			(at 140.97 35.56 90)
			(effects
				(font
					(size 1.27 1.27)
				)
			)
		)
		(property "Footprint" "Resistor_SMD:R_0402_1005Metric"
			(at 142.748 35.56 90)
			(effects
				(font
					(size 1.27 1.27)
				)
				(hide yes)
			)
		)
		(property "Datasheet" "~"
			(at 140.97 35.56 0)
			(effects
				(font
					(size 1.27 1.27)
				)
				(hide yes)
			)
		)
		(property "Description" "Resistor"
			(at 140.97 35.56 0)
			(effects
				(font
					(size 1.27 1.27)
				)
				(hide yes)
			)
		)
		(pin "1"
			(uuid "83fd2862-9813-4a82-b4b8-9ceb7b0e64aa")
		)
		(pin "2"
			(uuid "14ad19dd-fd1b-48d1-8199-5d3aa364ebb0")
		)
		(instances
			(project "Draft-SU-PCB"
				(path "/ab60d743-7d21-44ca-af12-9d3ffcf1b44a/7ece7641-c949-474d-a8a5-24e5b298bf42"
					(reference "R13")
					(unit 1)
				)
			)
		)
	)
	(symbol
		(lib_id "power:GND")
		(at 80.01 67.31 270)
		(unit 1)
		(exclude_from_sim no)
		(in_bom yes)
		(on_board yes)
		(dnp no)
		(fields_autoplaced yes)
		(uuid "87648118-6a5e-4009-b60c-73a7e4e91cb6")
		(property "Reference" "#PWR072"
			(at 73.66 67.31 0)
			(effects
				(font
					(size 1.27 1.27)
				)
				(hide yes)
			)
		)
		(property "Value" "GND"
			(at 76.2 67.3099 90)
			(effects
				(font
					(size 1.27 1.27)
				)
				(justify right)
			)
		)
		(property "Footprint" ""
			(at 80.01 67.31 0)
			(effects
				(font
					(size 1.27 1.27)
				)
				(hide yes)
			)
		)
		(property "Datasheet" ""
			(at 80.01 67.31 0)
			(effects
				(font
					(size 1.27 1.27)
				)
				(hide yes)
			)
		)
		(property "Description" "Power symbol creates a global label with name \"GND\" , ground"
			(at 80.01 67.31 0)
			(effects
				(font
					(size 1.27 1.27)
				)
				(hide yes)
			)
		)
		(pin "1"
			(uuid "7da3ecf4-8305-4656-b845-a91b756ade5d")
		)
		(instances
			(project "Draft-SU-PCB"
				(path "/ab60d743-7d21-44ca-af12-9d3ffcf1b44a/7ece7641-c949-474d-a8a5-24e5b298bf42"
					(reference "#PWR072")
					(unit 1)
				)
			)
		)
	)
	(symbol
		(lib_id "power:+3V3")
		(at 140.97 30.48 0)
		(unit 1)
		(exclude_from_sim no)
		(in_bom yes)
		(on_board yes)
		(dnp no)
		(fields_autoplaced yes)
		(uuid "a2c45292-80fd-463d-a582-e1c96483f951")
		(property "Reference" "#PWR070"
			(at 140.97 34.29 0)
			(effects
				(font
					(size 1.27 1.27)
				)
				(hide yes)
			)
		)
		(property "Value" "+3V3"
			(at 140.97 25.4 0)
			(effects
				(font
					(size 1.27 1.27)
				)
			)
		)
		(property "Footprint" ""
			(at 140.97 30.48 0)
			(effects
				(font
					(size 1.27 1.27)
				)
				(hide yes)
			)
		)
		(property "Datasheet" ""
			(at 140.97 30.48 0)
			(effects
				(font
					(size 1.27 1.27)
				)
				(hide yes)
			)
		)
		(property "Description" "Power symbol creates a global label with name \"+3V3\""
			(at 140.97 30.48 0)
			(effects
				(font
					(size 1.27 1.27)
				)
				(hide yes)
			)
		)
		(pin "1"
			(uuid "7f8a347b-d531-4363-bafe-0ffc17a4626e")
		)
		(instances
			(project ""
				(path "/ab60d743-7d21-44ca-af12-9d3ffcf1b44a/7ece7641-c949-474d-a8a5-24e5b298bf42"
					(reference "#PWR070")
					(unit 1)
				)
			)
		)
	)
	(symbol
		(lib_id "power:GND")
		(at 80.01 35.56 270)
		(unit 1)
		(exclude_from_sim no)
		(in_bom yes)
		(on_board yes)
		(dnp no)
		(fields_autoplaced yes)
		(uuid "abf043ba-9a16-4d89-8ef4-7a48eed046f5")
		(property "Reference" "#PWR071"
			(at 73.66 35.56 0)
			(effects
				(font
					(size 1.27 1.27)
				)
				(hide yes)
			)
		)
		(property "Value" "GND"
			(at 76.2 35.5599 90)
			(effects
				(font
					(size 1.27 1.27)
				)
				(justify right)
			)
		)
		(property "Footprint" ""
			(at 80.01 35.56 0)
			(effects
				(font
					(size 1.27 1.27)
				)
				(hide yes)
			)
		)
		(property "Datasheet" ""
			(at 80.01 35.56 0)
			(effects
				(font
					(size 1.27 1.27)
				)
				(hide yes)
			)
		)
		(property "Description" "Power symbol creates a global label with name \"GND\" , ground"
			(at 80.01 35.56 0)
			(effects
				(font
					(size 1.27 1.27)
				)
				(hide yes)
			)
		)
		(pin "1"
			(uuid "15fbd58a-4f39-4945-8ae2-e360e701f5d2")
		)
		(instances
			(project "Draft-SU-PCB"
				(path "/ab60d743-7d21-44ca-af12-9d3ffcf1b44a/7ece7641-c949-474d-a8a5-24e5b298bf42"
					(reference "#PWR071")
					(unit 1)
				)
			)
		)
	)
	(symbol
		(lib_id "power:GND")
		(at 125.73 35.56 90)
		(unit 1)
		(exclude_from_sim no)
		(in_bom yes)
		(on_board yes)
		(dnp no)
		(fields_autoplaced yes)
		(uuid "ae8ceaf1-f7bc-4ef4-ac04-d3b36bc193ed")
		(property "Reference" "#PWR067"
			(at 132.08 35.56 0)
			(effects
				(font
					(size 1.27 1.27)
				)
				(hide yes)
			)
		)
		(property "Value" "GND"
			(at 129.54 35.5599 90)
			(effects
				(font
					(size 1.27 1.27)
				)
				(justify right)
			)
		)
		(property "Footprint" ""
			(at 125.73 35.56 0)
			(effects
				(font
					(size 1.27 1.27)
				)
				(hide yes)
			)
		)
		(property "Datasheet" ""
			(at 125.73 35.56 0)
			(effects
				(font
					(size 1.27 1.27)
				)
				(hide yes)
			)
		)
		(property "Description" "Power symbol creates a global label with name \"GND\" , ground"
			(at 125.73 35.56 0)
			(effects
				(font
					(size 1.27 1.27)
				)
				(hide yes)
			)
		)
		(pin "1"
			(uuid "92e2859c-84c8-4aa5-b499-19752249a97f")
		)
		(instances
			(project "Draft-SU-PCB"
				(path "/ab60d743-7d21-44ca-af12-9d3ffcf1b44a/7ece7641-c949-474d-a8a5-24e5b298bf42"
					(reference "#PWR067")
					(unit 1)
				)
			)
		)
	)
	(symbol
		(lib_id "power:GND")
		(at 125.73 64.77 90)
		(unit 1)
		(exclude_from_sim no)
		(in_bom yes)
		(on_board yes)
		(dnp no)
		(fields_autoplaced yes)
		(uuid "dd132069-fd5c-4b19-9edd-c9bbd927e554")
		(property "Reference" "#PWR073"
			(at 132.08 64.77 0)
			(effects
				(font
					(size 1.27 1.27)
				)
				(hide yes)
			)
		)
		(property "Value" "GND"
			(at 129.54 64.7699 90)
			(effects
				(font
					(size 1.27 1.27)
				)
				(justify right)
			)
		)
		(property "Footprint" ""
			(at 125.73 64.77 0)
			(effects
				(font
					(size 1.27 1.27)
				)
				(hide yes)
			)
		)
		(property "Datasheet" ""
			(at 125.73 64.77 0)
			(effects
				(font
					(size 1.27 1.27)
				)
				(hide yes)
			)
		)
		(property "Description" "Power symbol creates a global label with name \"GND\" , ground"
			(at 125.73 64.77 0)
			(effects
				(font
					(size 1.27 1.27)
				)
				(hide yes)
			)
		)
		(pin "1"
			(uuid "183d063e-ef8b-4c37-84d0-ece4b294c9e7")
		)
		(instances
			(project "Draft-SU-PCB"
				(path "/ab60d743-7d21-44ca-af12-9d3ffcf1b44a/7ece7641-c949-474d-a8a5-24e5b298bf42"
					(reference "#PWR073")
					(unit 1)
				)
			)
		)
	)
	(symbol
		(lib_id "Device:R")
		(at 140.97 67.31 180)
		(unit 1)
		(exclude_from_sim no)
		(in_bom yes)
		(on_board yes)
		(dnp no)
		(uuid "e1fc079e-dc20-4c85-a2ea-018ad182e599")
		(property "Reference" "R14"
			(at 138.43 67.31 90)
			(effects
				(font
					(size 1.27 1.27)
				)
			)
		)
		(property "Value" "10k"
			(at 140.97 67.31 90)
			(effects
				(font
					(size 1.27 1.27)
				)
			)
		)
		(property "Footprint" "Resistor_SMD:R_0402_1005Metric"
			(at 142.748 67.31 90)
			(effects
				(font
					(size 1.27 1.27)
				)
				(hide yes)
			)
		)
		(property "Datasheet" "~"
			(at 140.97 67.31 0)
			(effects
				(font
					(size 1.27 1.27)
				)
				(hide yes)
			)
		)
		(property "Description" "Resistor"
			(at 140.97 67.31 0)
			(effects
				(font
					(size 1.27 1.27)
				)
				(hide yes)
			)
		)
		(pin "1"
			(uuid "72685c0e-4240-41d2-86b6-54af9a378bfe")
		)
		(pin "2"
			(uuid "35a2cfdc-0bc4-45bd-95c7-254bd39ac31b")
		)
		(instances
			(project "Draft-SU-PCB"
				(path "/ab60d743-7d21-44ca-af12-9d3ffcf1b44a/7ece7641-c949-474d-a8a5-24e5b298bf42"
					(reference "R14")
					(unit 1)
				)
			)
		)
	)
)
