(footprint "NAND-Flash"
	(version 20240108)
	(generator "pcbnew")
	(generator_version "8.0")
	(layer "F.Cu")
	(descr "48 PIN TSOP TYPE 1 CPL (PACKAGE WP)_2")
	(tags "Integrated Circuit")
	(property "Reference" "IC**"
		(at 0 0 0)
		(layer "F.SilkS")
		(uuid "dc361ba7-1a41-4c74-8f8f-92c4ea45c9c6")
		(effects
			(font
				(size 1.27 1.27)
				(thickness 0.254)
			)
		)
	)
	(property "Value" "NAND-Flash"
		(at 0 0 0)
		(layer "F.SilkS")
		(hide yes)
		(uuid "21100b15-b35e-49dc-ad09-737686f8d2ec")
		(effects
			(font
				(size 1.27 1.27)
				(thickness 0.254)
			)
		)
	)
	(property "Footprint" ""
		(at 0 0 0)
		(layer "F.Fab")
		(hide yes)
		(uuid "9f6fc70d-5945-4a7b-80a8-94773c2dc49e")
		(effects
			(font
				(size 1.27 1.27)
				(thickness 0.15)
			)
		)
	)
	(property "Datasheet" ""
		(at 0 0 0)
		(layer "F.Fab")
		(hide yes)
		(uuid "819da2a7-c4a7-43d3-b978-7eacbbd003bc")
		(effects
			(font
				(size 1.27 1.27)
				(thickness 0.15)
			)
		)
	)
	(property "Description" ""
		(at 0 0 0)
		(layer "F.Fab")
		(hide yes)
		(uuid "f9634e31-2c28-4d02-bd2c-d5c69951d7a6")
		(effects
			(font
				(size 1.27 1.27)
				(thickness 0.15)
			)
		)
	)
	(attr smd)
	(fp_line
		(start -10.5 -6.25)
		(end -9.2 -6.25)
		(stroke
			(width 0.2)
			(type solid)
		)
		(layer "F.SilkS")
		(uuid "b24d386d-baae-4652-9542-71cf41df05b0")
	)
	(fp_line
		(start -8.85 -6)
		(end 8.85 -6)
		(stroke
			(width 0.2)
			(type solid)
		)
		(layer "F.SilkS")
		(uuid "0d8f6d27-7ed3-4daf-8142-16cbc91d2bca")
	)
	(fp_line
		(start -8.85 6)
		(end -8.85 -6)
		(stroke
			(width 0.2)
			(type solid)
		)
		(layer "F.SilkS")
		(uuid "98a7e127-1595-443a-bbf2-a56f9124169f")
	)
	(fp_line
		(start 8.85 -6)
		(end 8.85 6)
		(stroke
			(width 0.2)
			(type solid)
		)
		(layer "F.SilkS")
		(uuid "584a9802-2ae5-4311-8db7-6df590940d88")
	)
	(fp_line
		(start 8.85 6)
		(end -8.85 6)
		(stroke
			(width 0.2)
			(type solid)
		)
		(layer "F.SilkS")
		(uuid "315388f9-0e49-48da-be6c-a77b569d5d29")
	)
	(fp_line
		(start -10.75 -6.29)
		(end 10.75 -6.29)
		(stroke
			(width 0.05)
			(type solid)
		)
		(layer "F.CrtYd")
		(uuid "47c3a7c7-4ad6-4cc6-87c2-e01dc864c794")
	)
	(fp_line
		(start -10.75 6.29)
		(end -10.75 -6.29)
		(stroke
			(width 0.05)
			(type solid)
		)
		(layer "F.CrtYd")
		(uuid "26b3f824-8403-4fc0-99df-ca0a756a5365")
	)
	(fp_line
		(start 10.75 -6.29)
		(end 10.75 6.29)
		(stroke
			(width 0.05)
			(type solid)
		)
		(layer "F.CrtYd")
		(uuid "deb8ceec-db16-4977-94a2-8453a7665d2b")
	)
	(fp_line
		(start 10.75 6.29)
		(end -10.75 6.29)
		(stroke
			(width 0.05)
			(type solid)
		)
		(layer "F.CrtYd")
		(uuid "e7da9761-1102-46e8-996f-9b441f7fcdf9")
	)
	(fp_line
		(start -9.2 -6)
		(end 9.2 -6)
		(stroke
			(width 0.1)
			(type solid)
		)
		(layer "F.Fab")
		(uuid "ba4298b0-38d1-4ffd-a051-c1889f0a0f9e")
	)
	(fp_line
		(start -9.2 -5.5)
		(end -8.7 -6)
		(stroke
			(width 0.1)
			(type solid)
		)
		(layer "F.Fab")
		(uuid "6f99f00b-5b77-41bd-ab01-b8d42de36d95")
	)
	(fp_line
		(start -9.2 6)
		(end -9.2 -6)
		(stroke
			(width 0.1)
			(type solid)
		)
		(layer "F.Fab")
		(uuid "d2549c84-f194-43a0-93db-dd82b0893eb2")
	)
	(fp_line
		(start 9.2 -6)
		(end 9.2 6)
		(stroke
			(width 0.1)
			(type solid)
		)
		(layer "F.Fab")
		(uuid "2cabb5f4-63ce-4f55-b439-b058110d179e")
	)
	(fp_line
		(start 9.2 6)
		(end -9.2 6)
		(stroke
			(width 0.1)
			(type solid)
		)
		(layer "F.Fab")
		(uuid "694581e8-28c4-47ea-b1bf-f0b7f5bddd75")
	)
	(fp_text user "${REFERENCE}"
		(at 0 0 0)
		(layer "F.Fab")
		(uuid "c599878f-4dd1-4e28-a0e7-6ba96b2598fe")
		(effects
			(font
				(size 1.27 1.27)
				(thickness 0.254)
			)
		)
	)
	(pad "1" smd rect
		(at -9.85 -5.75 90)
		(size 0.3 1.3)
		(layers "F.Cu" "F.Paste" "F.Mask")
		(uuid "2d800b97-b3bd-436f-8031-6a13f12d1bac")
	)
	(pad "2" smd rect
		(at -9.85 -5.25 90)
		(size 0.3 1.3)
		(layers "F.Cu" "F.Paste" "F.Mask")
		(uuid "846086c0-124e-440b-babe-65568a9aa34c")
	)
	(pad "3" smd rect
		(at -9.85 -4.75 90)
		(size 0.3 1.3)
		(layers "F.Cu" "F.Paste" "F.Mask")
		(uuid "4227d89b-eb9a-4fd9-af39-18287cca0310")
	)
	(pad "4" smd rect
		(at -9.85 -4.25 90)
		(size 0.3 1.3)
		(layers "F.Cu" "F.Paste" "F.Mask")
		(uuid "db0d5744-ed41-4380-8ccf-490da8b22ae0")
	)
	(pad "5" smd rect
		(at -9.85 -3.75 90)
		(size 0.3 1.3)
		(layers "F.Cu" "F.Paste" "F.Mask")
		(uuid "15311835-264b-4b4b-bf37-b320997cd227")
	)
	(pad "6" smd rect
		(at -9.85 -3.25 90)
		(size 0.3 1.3)
		(layers "F.Cu" "F.Paste" "F.Mask")
		(uuid "daab54a9-4800-41e0-b60e-ee58f8a45996")
	)
	(pad "7" smd rect
		(at -9.85 -2.75 90)
		(size 0.3 1.3)
		(layers "F.Cu" "F.Paste" "F.Mask")
		(uuid "a66f5d93-5c84-4cf3-bd87-909da7ec57cb")
	)
	(pad "8" smd rect
		(at -9.85 -2.25 90)
		(size 0.3 1.3)
		(layers "F.Cu" "F.Paste" "F.Mask")
		(uuid "276be085-a6aa-4766-8100-c691e5f2ace7")
	)
	(pad "9" smd rect
		(at -9.85 -1.75 90)
		(size 0.3 1.3)
		(layers "F.Cu" "F.Paste" "F.Mask")
		(uuid "2fffceae-3583-462d-b308-9ed69e42732b")
	)
	(pad "10" smd rect
		(at -9.85 -1.25 90)
		(size 0.3 1.3)
		(layers "F.Cu" "F.Paste" "F.Mask")
		(uuid "70ff5b72-f558-4249-b0c3-b54b3d534273")
	)
	(pad "11" smd rect
		(at -9.85 -0.75 90)
		(size 0.3 1.3)
		(layers "F.Cu" "F.Paste" "F.Mask")
		(uuid "c36f3cc1-af41-4a8b-ae72-76cb17afe5c6")
	)
	(pad "12" smd rect
		(at -9.85 -0.25 90)
		(size 0.3 1.3)
		(layers "F.Cu" "F.Paste" "F.Mask")
		(uuid "fb19d498-11e1-4f0a-8648-5b7b445a3737")
	)
	(pad "13" smd rect
		(at -9.85 0.25 90)
		(size 0.3 1.3)
		(layers "F.Cu" "F.Paste" "F.Mask")
		(uuid "61a6dedd-6b6b-4022-a56a-ad6df1e2e407")
	)
	(pad "14" smd rect
		(at -9.85 0.75 90)
		(size 0.3 1.3)
		(layers "F.Cu" "F.Paste" "F.Mask")
		(uuid "3a6157b6-ce08-42a7-b959-79e18abc2360")
	)
	(pad "15" smd rect
		(at -9.85 1.25 90)
		(size 0.3 1.3)
		(layers "F.Cu" "F.Paste" "F.Mask")
		(uuid "8789749c-a08d-4173-8e55-ee7be7ccdd56")
	)
	(pad "16" smd rect
		(at -9.85 1.75 90)
		(size 0.3 1.3)
		(layers "F.Cu" "F.Paste" "F.Mask")
		(uuid "f99b8354-61a5-4a48-b3d6-e6f01d7251f1")
	)
	(pad "17" smd rect
		(at -9.85 2.25 90)
		(size 0.3 1.3)
		(layers "F.Cu" "F.Paste" "F.Mask")
		(uuid "dbf663f6-2c87-4e0e-900f-5d04972c560d")
	)
	(pad "18" smd rect
		(at -9.85 2.75 90)
		(size 0.3 1.3)
		(layers "F.Cu" "F.Paste" "F.Mask")
		(uuid "78a01c27-eb4f-4534-9d53-b810473edb89")
	)
	(pad "19" smd rect
		(at -9.85 3.25 90)
		(size 0.3 1.3)
		(layers "F.Cu" "F.Paste" "F.Mask")
		(uuid "d7eab49c-a5a9-4399-b94d-afac83fab03a")
	)
	(pad "20" smd rect
		(at -9.85 3.75 90)
		(size 0.3 1.3)
		(layers "F.Cu" "F.Paste" "F.Mask")
		(uuid "ea56462f-9026-4023-a321-1c3c2f40dfd9")
	)
	(pad "21" smd rect
		(at -9.85 4.25 90)
		(size 0.3 1.3)
		(layers "F.Cu" "F.Paste" "F.Mask")
		(uuid "1e76da7c-9e5f-479f-9cd9-d0292e9bf9e1")
	)
	(pad "22" smd rect
		(at -9.85 4.75 90)
		(size 0.3 1.3)
		(layers "F.Cu" "F.Paste" "F.Mask")
		(uuid "a04924e1-a8d8-46b1-a722-44909d424d21")
	)
	(pad "23" smd rect
		(at -9.85 5.25 90)
		(size 0.3 1.3)
		(layers "F.Cu" "F.Paste" "F.Mask")
		(uuid "49b45725-d121-4239-b40b-1ef3736c18e0")
	)
	(pad "24" smd rect
		(at -9.85 5.75 90)
		(size 0.3 1.3)
		(layers "F.Cu" "F.Paste" "F.Mask")
		(uuid "8435d779-8b5b-489b-875c-5b9c28948cd5")
	)
	(pad "25" smd rect
		(at 9.85 5.75 90)
		(size 0.3 1.3)
		(layers "F.Cu" "F.Paste" "F.Mask")
		(uuid "8660c709-3fa5-4028-96f7-bb5a37bf5b59")
	)
	(pad "26" smd rect
		(at 9.85 5.25 90)
		(size 0.3 1.3)
		(layers "F.Cu" "F.Paste" "F.Mask")
		(uuid "b10b3775-d846-4138-b18c-d8c88ecb5fff")
	)
	(pad "27" smd rect
		(at 9.85 4.75 90)
		(size 0.3 1.3)
		(layers "F.Cu" "F.Paste" "F.Mask")
		(uuid "9c688984-a84a-4c5b-baeb-605086b1dc62")
	)
	(pad "28" smd rect
		(at 9.85 4.25 90)
		(size 0.3 1.3)
		(layers "F.Cu" "F.Paste" "F.Mask")
		(uuid "6e9a0bc2-a9a3-40c9-ba21-9693d1497975")
	)
	(pad "29" smd rect
		(at 9.85 3.75 90)
		(size 0.3 1.3)
		(layers "F.Cu" "F.Paste" "F.Mask")
		(uuid "07a624ba-c279-4df3-8e4b-f0a737ddf3ad")
	)
	(pad "30" smd rect
		(at 9.85 3.25 90)
		(size 0.3 1.3)
		(layers "F.Cu" "F.Paste" "F.Mask")
		(uuid "18a13d69-439c-42e8-b5e0-b2a58181502d")
	)
	(pad "31" smd rect
		(at 9.85 2.75 90)
		(size 0.3 1.3)
		(layers "F.Cu" "F.Paste" "F.Mask")
		(uuid "217bb085-f4df-4d3c-b52b-d64e0bcc58d9")
	)
	(pad "32" smd rect
		(at 9.85 2.25 90)
		(size 0.3 1.3)
		(layers "F.Cu" "F.Paste" "F.Mask")
		(uuid "e94ee54a-0423-4d0c-a9b4-875e25ccd41e")
	)
	(pad "33" smd rect
		(at 9.85 1.75 90)
		(size 0.3 1.3)
		(layers "F.Cu" "F.Paste" "F.Mask")
		(uuid "09b5108e-fbd7-4004-b1ee-283ff179d7d7")
	)
	(pad "34" smd rect
		(at 9.85 1.25 90)
		(size 0.3 1.3)
		(layers "F.Cu" "F.Paste" "F.Mask")
		(uuid "13bae00f-0c77-4e21-bc30-1055e917e679")
	)
	(pad "35" smd rect
		(at 9.85 0.75 90)
		(size 0.3 1.3)
		(layers "F.Cu" "F.Paste" "F.Mask")
		(uuid "98575f4b-5fbe-4320-8e7e-4a86610517ad")
	)
	(pad "36" smd rect
		(at 9.85 0.25 90)
		(size 0.3 1.3)
		(layers "F.Cu" "F.Paste" "F.Mask")
		(uuid "582a0b66-6b46-4d48-af4f-5faf6ab51ed1")
	)
	(pad "37" smd rect
		(at 9.85 -0.25 90)
		(size 0.3 1.3)
		(layers "F.Cu" "F.Paste" "F.Mask")
		(uuid "7c3417f5-8fdb-4295-b62c-0da9144e6efb")
	)
	(pad "38" smd rect
		(at 9.85 -0.75 90)
		(size 0.3 1.3)
		(layers "F.Cu" "F.Paste" "F.Mask")
		(uuid "5405cff6-2a0b-4f0b-b1c1-cbfa0d3bfcc5")
	)
	(pad "39" smd rect
		(at 9.85 -1.25 90)
		(size 0.3 1.3)
		(layers "F.Cu" "F.Paste" "F.Mask")
		(uuid "07500a05-02e3-4ca1-9d0f-39a2889e9348")
	)
	(pad "40" smd rect
		(at 9.85 -1.75 90)
		(size 0.3 1.3)
		(layers "F.Cu" "F.Paste" "F.Mask")
		(uuid "c5133454-ad93-4f02-bfff-a6e223b769da")
	)
	(pad "41" smd rect
		(at 9.85 -2.25 90)
		(size 0.3 1.3)
		(layers "F.Cu" "F.Paste" "F.Mask")
		(uuid "d9d0b35a-1aef-41da-9d79-16effaf5f04d")
	)
	(pad "42" smd rect
		(at 9.85 -2.75 90)
		(size 0.3 1.3)
		(layers "F.Cu" "F.Paste" "F.Mask")
		(uuid "9306d8a0-57be-4687-a18f-f08c4f65e9be")
	)
	(pad "43" smd rect
		(at 9.85 -3.25 90)
		(size 0.3 1.3)
		(layers "F.Cu" "F.Paste" "F.Mask")
		(uuid "a837ddfd-668e-4518-a5ca-a99d28ccd3ea")
	)
	(pad "44" smd rect
		(at 9.85 -3.75 90)
		(size 0.3 1.3)
		(layers "F.Cu" "F.Paste" "F.Mask")
		(uuid "a601404f-7791-4b1a-920c-b89a1af9131f")
	)
	(pad "45" smd rect
		(at 9.85 -4.25 90)
		(size 0.3 1.3)
		(layers "F.Cu" "F.Paste" "F.Mask")
		(uuid "d54f5338-f653-4c3e-94b3-13cceb606257")
	)
	(pad "46" smd rect
		(at 9.85 -4.75 90)
		(size 0.3 1.3)
		(layers "F.Cu" "F.Paste" "F.Mask")
		(uuid "f8368743-fc5b-4c68-80f5-d5b9149a49a1")
	)
	(pad "47" smd rect
		(at 9.85 -5.25 90)
		(size 0.3 1.3)
		(layers "F.Cu" "F.Paste" "F.Mask")
		(uuid "58d4efd6-40d7-4b0c-be07-952c007ae4b0")
	)
	(pad "48" smd rect
		(at 9.85 -5.75 90)
		(size 0.3 1.3)
		(layers "F.Cu" "F.Paste" "F.Mask")
		(uuid "ad17da2b-80a9-4b91-9bd1-63016c46216b")
	)
	(model "${KIPRJMOD}/3D/MT29F64G08AFAAAWP-ITZ_A_TR.stp"
		(offset
			(xyz 0 0 0)
		)
		(scale
			(xyz 1 1 1)
		)
		(rotate
			(xyz 0 0 0)
		)
	)
)
