(footprint "SOT65P210X110-5N" (version 20221018) (generator pcbnew)
  (layer "F.Cu")
  (descr "DCK")
  (tags "Integrated Circuit")
  (attr smd)
  (fp_text reference "IC**" (at 0 0) (layer "F.SilkS")
      (effects (font (size 1.27 1.27) (thickness 0.254)))
    (tstamp d2ebc332-918b-427c-8329-7d034d9136c5)
  )
  (fp_text value "SOT65P210X110-5N" (at 0 0) (layer "F.SilkS") hide
      (effects (font (size 1.27 1.27) (thickness 0.254)))
    (tstamp 6b497d4e-a670-41ae-9589-f4188a63779c)
  )
  (fp_text user "${REFERENCE}" (at 0 0) (layer "F.Fab")
      (effects (font (size 1.27 1.27) (thickness 0.254)))
    (tstamp 205bf5c1-e58e-4a23-a9dd-4980e4e4e1aa)
  )
  (fp_line (start -1.55 -1.1) (end -0.35 -1.1)
    (stroke (width 0.2) (type solid)) (layer "F.SilkS") (tstamp 6bbbddbe-f648-4bb5-b054-1f9cbb5323be))
  (fp_line (start -1.8 -1.325) (end 1.8 -1.325)
    (stroke (width 0.05) (type solid)) (layer "F.CrtYd") (tstamp aa0e498f-f296-4340-8643-9f9604096362))
  (fp_line (start -1.8 1.325) (end -1.8 -1.325)
    (stroke (width 0.05) (type solid)) (layer "F.CrtYd") (tstamp 7baf62cb-9b95-4042-890a-e739375199f9))
  (fp_line (start 1.8 -1.325) (end 1.8 1.325)
    (stroke (width 0.05) (type solid)) (layer "F.CrtYd") (tstamp e0235cbf-180f-4679-acc6-9e158bc9b35d))
  (fp_line (start 1.8 1.325) (end -1.8 1.325)
    (stroke (width 0.05) (type solid)) (layer "F.CrtYd") (tstamp 0595b645-3888-4e94-8fd1-e853c5e217fb))
  (fp_line (start -0.625 -1) (end 0.625 -1)
    (stroke (width 0.1) (type solid)) (layer "F.Fab") (tstamp 471baa74-643b-4ab7-9489-6558eb297f78))
  (fp_line (start -0.625 -0.35) (end 0.025 -1)
    (stroke (width 0.1) (type solid)) (layer "F.Fab") (tstamp 5abcdded-7d4d-407c-bfe0-bc614b428b39))
  (fp_line (start -0.625 1) (end -0.625 -1)
    (stroke (width 0.1) (type solid)) (layer "F.Fab") (tstamp 527eb44c-d6d5-44a1-94a5-d822d39d6961))
  (fp_line (start 0.625 -1) (end 0.625 1)
    (stroke (width 0.1) (type solid)) (layer "F.Fab") (tstamp 90737ad9-7401-41af-9f74-e724577c25b6))
  (fp_line (start 0.625 1) (end -0.625 1)
    (stroke (width 0.1) (type solid)) (layer "F.Fab") (tstamp 920a8ab6-8b74-446d-b2cc-20de839bad2c))
  (pad "1" smd rect (at -0.95 -0.65 90) (size 0.4 1.2) (layers "F.Cu" "F.Paste" "F.Mask") (tstamp 94fae1aa-a7d2-4a93-a093-9975bbc08676))
  (pad "2" smd rect (at -0.95 0 90) (size 0.4 1.2) (layers "F.Cu" "F.Paste" "F.Mask") (tstamp 7334ec0d-aed4-468e-bd3d-594a3090d97f))
  (pad "3" smd rect (at -0.95 0.65 90) (size 0.4 1.2) (layers "F.Cu" "F.Paste" "F.Mask") (tstamp 67c845d2-afd4-4a0e-9b3f-f9dc917f6286))
  (pad "4" smd rect (at 0.95 0.65 90) (size 0.4 1.2) (layers "F.Cu" "F.Paste" "F.Mask") (tstamp 0fa43e5f-2cc9-46b2-8e74-e8ad1ff4135b))
  (pad "5" smd rect (at 0.95 -0.65 90) (size 0.4 1.2) (layers "F.Cu" "F.Paste" "F.Mask") (tstamp a3ad70f8-c747-4b1e-9f0a-ab24404353a2))
  (model "${KIPRJMOD}/3D/SN74AHC1G32TDCKRQ1.stp"
    (offset (xyz 0 0 0))
    (scale (xyz 1 1 1))
    (rotate (xyz 0 0 0))
  )
)
