(footprint "SSM3J133TULF" (version 20221018) (generator pcbnew)
  (layer "F.Cu")
  (descr "2-2U1A")
  (tags "MOSFET (P-Channel)")
  (attr smd)
  (fp_text reference "Q**" (at 0 0) (layer "F.SilkS")
      (effects (font (size 1.27 1.27) (thickness 0.254)))
    (tstamp 82179869-a95f-4aa7-977e-4616f11d3954)
  )
  (fp_text value "SSM3J133TULF" (at 0 0) (layer "F.SilkS") hide
      (effects (font (size 1.27 1.27) (thickness 0.254)))
    (tstamp 706b297c-46b5-4719-a8e7-f96657f6a855)
  )
  (fp_text user "${REFERENCE}" (at 0 0) (layer "F.Fab")
      (effects (font (size 1.27 1.27) (thickness 0.254)))
    (tstamp f775540c-66a0-4225-b6f3-21337e115d6a)
  )
  (fp_line (start -1 -0.85) (end -1 0.2)
    (stroke (width 0.2) (type solid)) (layer "F.SilkS") (tstamp 57d1521e-5bcb-4b87-a9b4-467d8fbe7cfa))
  (fp_line (start -0.65 1.8) (end -0.65 1.8)
    (stroke (width 0.1) (type solid)) (layer "F.SilkS") (tstamp 99b148bf-da02-4125-a398-fa954aeb5ca0))
  (fp_line (start -0.65 1.9) (end -0.65 1.9)
    (stroke (width 0.1) (type solid)) (layer "F.SilkS") (tstamp a7a97cce-ae46-428a-81a6-942795978d44))
  (fp_line (start -0.6 -0.85) (end -1 -0.85)
    (stroke (width 0.2) (type solid)) (layer "F.SilkS") (tstamp b6a81877-a7bc-4e71-b005-70f7573ef42a))
  (fp_line (start 0.6 -0.85) (end 1 -0.85)
    (stroke (width 0.2) (type solid)) (layer "F.SilkS") (tstamp 6be39d9d-9db8-4f7e-90bb-4f7d672dd2d6))
  (fp_line (start 1 -0.85) (end 1 0.2)
    (stroke (width 0.2) (type solid)) (layer "F.SilkS") (tstamp d4e1d7e6-3c24-42ba-b0a5-cef627286b26))
  (fp_arc (start -0.65 1.8) (mid -0.6 1.85) (end -0.65 1.9)
    (stroke (width 0.1) (type solid)) (layer "F.SilkS") (tstamp 6de2cb37-923e-47bb-b78f-89c6511d8c56))
  (fp_arc (start -0.65 1.9) (mid -0.7 1.85) (end -0.65 1.8)
    (stroke (width 0.1) (type solid)) (layer "F.SilkS") (tstamp d619108c-d2b7-4477-aad7-a38a267fa611))
  (fp_line (start -2 -2.35) (end 2 -2.35)
    (stroke (width 0.1) (type solid)) (layer "F.CrtYd") (tstamp 2606aa21-71a5-4e1e-b084-8b3670fedc2b))
  (fp_line (start -2 2.35) (end -2 -2.35)
    (stroke (width 0.1) (type solid)) (layer "F.CrtYd") (tstamp a164811b-2cdf-4554-8bcf-15eebbea54ab))
  (fp_line (start 2 -2.35) (end 2 2.35)
    (stroke (width 0.1) (type solid)) (layer "F.CrtYd") (tstamp 78903427-d1bd-46c0-9c0e-c42db01b759f))
  (fp_line (start 2 2.35) (end -2 2.35)
    (stroke (width 0.1) (type solid)) (layer "F.CrtYd") (tstamp 67771f86-3f71-4904-bcf5-449963672178))
  (fp_line (start -1 -0.85) (end 1 -0.85)
    (stroke (width 0.1) (type solid)) (layer "F.Fab") (tstamp 1ceace36-1e7f-49c0-b21a-cc77ef0dddd6))
  (fp_line (start -1 0.85) (end -1 -0.85)
    (stroke (width 0.1) (type solid)) (layer "F.Fab") (tstamp 0ebe3c51-a105-4dea-bebf-0723436d228e))
  (fp_line (start 1 -0.85) (end 1 0.85)
    (stroke (width 0.1) (type solid)) (layer "F.Fab") (tstamp 8b05a1ec-a51e-4fb8-9551-e5f879dc449a))
  (fp_line (start 1 0.85) (end -1 0.85)
    (stroke (width 0.1) (type solid)) (layer "F.Fab") (tstamp dd6ccc97-eb2b-494c-a911-fc1b1beaf00d))
  (pad "1" smd rect (at -0.65 0.95) (size 0.5 0.8) (layers "F.Cu" "F.Paste" "F.Mask") (tstamp a820f800-b7bd-4b77-89c5-7bd50c3118b6))
  (pad "2" smd rect (at 0.65 0.95) (size 0.5 0.8) (layers "F.Cu" "F.Paste" "F.Mask") (tstamp 899da963-5ea6-4cf9-9ccb-6412686372b6))
  (pad "3" smd rect (at 0 -0.95) (size 0.5 0.8) (layers "F.Cu" "F.Paste" "F.Mask") (tstamp bd67b82f-1a24-41de-addf-b565bc0cac8c))
  (model "../3D/SSM3J133TU,LF.stp"
    (offset (xyz 0 0 0))
    (scale (xyz 1 1 1))
    (rotate (xyz 0 0 0))
  )
)
