(footprint "DF584P12V21" (version 20221018) (generator pcbnew)
  (layer "F.Cu")
  (descr "DF58-4P-1.2V(21)-1")
  (tags "Connector")
  (attr smd)
  (fp_text reference "J**" (at 0 0) (layer "F.SilkS")
      (effects (font (size 1.27 1.27) (thickness 0.254)))
    (tstamp 5b1a2b68-ed19-4e4f-81da-81605b1cfe58)
  )
  (fp_text value "DF584P12V21" (at 0 0) (layer "F.SilkS") hide
      (effects (font (size 1.27 1.27) (thickness 0.254)))
    (tstamp e76fd5b2-a7d4-4236-af8b-a29d6d83aba2)
  )
  (fp_text user "${REFERENCE}" (at 0 0) (layer "F.Fab")
      (effects (font (size 1.27 1.27) (thickness 0.254)))
    (tstamp 8887e71b-8a01-4d3a-a865-08bce908f21d)
  )
  (fp_line (start -3.45 -2.31) (end -2.5 -2.31)
    (stroke (width 0.1) (type solid)) (layer "F.SilkS") (tstamp 89c5cc03-eccc-4669-b7d3-96ef2d89ca76))
  (fp_line (start -3.45 0.69) (end -3.45 -2.31)
    (stroke (width 0.1) (type solid)) (layer "F.SilkS") (tstamp 5771db4f-b603-433a-9387-a403d0ffb9e9))
  (fp_line (start -3.45 2.46) (end 3.45 2.46)
    (stroke (width 0.1) (type solid)) (layer "F.SilkS") (tstamp dec971ba-9b31-425f-9b6f-d5aa4b57798c))
  (fp_line (start -1.9 -3) (end -1.9 -3)
    (stroke (width 0.2) (type solid)) (layer "F.SilkS") (tstamp 97d4c8f9-c5b8-4e70-a26a-f053ced4e6b3))
  (fp_line (start -1.7 -3) (end -1.7 -3)
    (stroke (width 0.2) (type solid)) (layer "F.SilkS") (tstamp 2614c3e2-8f5b-4fe1-b10f-da7f840387a2))
  (fp_line (start 2.5 -2.31) (end 3.45 -2.31)
    (stroke (width 0.1) (type solid)) (layer "F.SilkS") (tstamp c264fd69-245e-4f3c-a8ff-df5cae7bb2bc))
  (fp_line (start 3.45 -2.31) (end 3.45 0.69)
    (stroke (width 0.1) (type solid)) (layer "F.SilkS") (tstamp 016acf02-4798-4bd0-bdd7-665f5890cbff))
  (fp_line (start 3.45 2.46) (end 3.45 2.46)
    (stroke (width 0.1) (type solid)) (layer "F.SilkS") (tstamp 204dae47-07e0-4960-80b0-dcef2ebf5e23))
  (fp_arc (start -1.9 -3) (mid -1.8 -3.1) (end -1.7 -3)
    (stroke (width 0.2) (type solid)) (layer "F.SilkS") (tstamp ae90d02d-0735-4d37-919e-0a671d242c93))
  (fp_arc (start -1.7 -3) (mid -1.8 -2.9) (end -1.9 -3)
    (stroke (width 0.2) (type solid)) (layer "F.SilkS") (tstamp 286be2a4-ab8b-4a46-9e2e-e81ec1bd9056))
  (fp_line (start -4.65 -3.46) (end 4.65 -3.46)
    (stroke (width 0.1) (type solid)) (layer "F.CrtYd") (tstamp 56ed3f89-bcf8-41b8-8952-8e80e1a6d142))
  (fp_line (start -4.65 3.46) (end -4.65 -3.46)
    (stroke (width 0.1) (type solid)) (layer "F.CrtYd") (tstamp 371a3f8a-db55-4825-8bc8-ffba8f599427))
  (fp_line (start 4.65 -3.46) (end 4.65 3.46)
    (stroke (width 0.1) (type solid)) (layer "F.CrtYd") (tstamp deb4feda-e8a6-462a-afa2-75bf77ea444b))
  (fp_line (start 4.65 3.46) (end -4.65 3.46)
    (stroke (width 0.1) (type solid)) (layer "F.CrtYd") (tstamp 51daebde-6d53-44c2-ad1d-36706093fb86))
  (fp_line (start -3.45 -2.31) (end 3.45 -2.31)
    (stroke (width 0.2) (type solid)) (layer "F.Fab") (tstamp 45345cee-6cde-446e-88d2-ef4ca1beca1e))
  (fp_line (start -3.45 2.46) (end -3.45 -2.31)
    (stroke (width 0.2) (type solid)) (layer "F.Fab") (tstamp 7466decc-cf91-4d35-938a-4ac095bdf503))
  (fp_line (start 3.45 -2.31) (end 3.45 2.46)
    (stroke (width 0.2) (type solid)) (layer "F.Fab") (tstamp a8558c7d-3449-4304-9519-da5d5437b9fd))
  (fp_line (start 3.45 2.46) (end -3.45 2.46)
    (stroke (width 0.2) (type solid)) (layer "F.Fab") (tstamp d4c4c169-0321-4b2f-a709-c1835cdbd328))
  (pad "1" smd rect (at -1.8 -2.135 90) (size 0.65 0.66) (layers "F.Cu" "F.Paste" "F.Mask") (tstamp 1593e6f7-ac2c-4bd2-baab-1cd018dfe4df))
  (pad "2" smd rect (at -0.6 -2.135 90) (size 0.65 0.66) (layers "F.Cu" "F.Paste" "F.Mask") (tstamp 4503cfe7-449b-48cd-b486-305c40884cd0))
  (pad "3" smd rect (at 0.6 -2.135 90) (size 0.65 0.66) (layers "F.Cu" "F.Paste" "F.Mask") (tstamp de614862-20fc-4e09-b559-11bc91fb7a69))
  (pad "4" smd rect (at 1.8 -2.135 90) (size 0.65 0.66) (layers "F.Cu" "F.Paste" "F.Mask") (tstamp fa33924d-7ef2-4d73-9b4d-49a6ac4a4d0f))
  (pad "5" smd rect (at -3.225 1.57) (size 0.85 1.34) (layers "F.Cu" "F.Paste" "F.Mask") (tstamp b6bd9e7a-e6dd-4f58-a9a2-3b8fc86b3f5f))
  (pad "6" smd rect (at 3.225 1.57) (size 0.85 1.34) (layers "F.Cu" "F.Paste" "F.Mask") (tstamp bd3dc645-863f-44af-ab7c-771d17c9aed4))
  (model "${KIPRJMOD}/3D/DF58-4P-1.2V.stp"
    (offset (xyz 0 0 0))
    (scale (xyz 1 1 1))
    (rotate (xyz 0 0 0))
  )
)
