(footprint "BUK9"
	(version 20240108)
	(generator "pcbnew")
	(generator_version "8.0")
	(layer "F.Cu")
	(property "Reference" "REF**"
		(at -0.635 -3.81 0)
		(layer "F.SilkS")
		(uuid "67fee845-657f-48b6-b2bc-4f73d17f5ec0")
		(effects
			(font
				(size 1 1)
				(thickness 0.15)
			)
		)
	)
	(property "Value" "BUK9"
		(at 9.525 3.81 0)
		(layer "F.Fab")
		(hide yes)
		(uuid "54790e0c-a422-4315-86d3-d4f72aa31d17")
		(effects
			(font
				(size 1 1)
				(thickness 0.15)
			)
		)
	)
	(property "Footprint" ""
		(at 0 0 0)
		(layer "F.Fab")
		(hide yes)
		(uuid "62005cf0-00fc-44ab-bc89-e7d7be940577")
		(effects
			(font
				(size 1.27 1.27)
				(thickness 0.15)
			)
		)
	)
	(property "Datasheet" ""
		(at 0 0 0)
		(layer "F.Fab")
		(hide yes)
		(uuid "db0fbc3a-d365-46ad-9c98-a644c935c3a6")
		(effects
			(font
				(size 1.27 1.27)
				(thickness 0.15)
			)
		)
	)
	(property "Description" ""
		(at 0 0 0)
		(layer "F.Fab")
		(hide yes)
		(uuid "9b8cf67a-d26a-4d33-ae8e-2df5b19c681d")
		(effects
			(font
				(size 1.27 1.27)
				(thickness 0.15)
			)
		)
	)
	(attr smd)
	(fp_poly
		(pts
			(xy -3.825 -2.23) (xy -2.725 -2.23) (xy -2.725 -1.58) (xy -3.825 -1.58)
		)
		(stroke
			(width 0.01)
			(type solid)
		)
		(fill solid)
		(layer "F.Paste")
		(uuid "be09d140-9519-41fc-a9f6-cc0475f0d12c")
	)
	(fp_poly
		(pts
			(xy -3.825 -0.96) (xy -2.725 -0.96) (xy -2.725 -0.31) (xy -3.825 -0.31)
		)
		(stroke
			(width 0.01)
			(type solid)
		)
		(fill solid)
		(layer "F.Paste")
		(uuid "42f19158-9011-4909-923a-4b94069e242c")
	)
	(fp_poly
		(pts
			(xy -3.825 0.31) (xy -2.725 0.31) (xy -2.725 0.96) (xy -3.825 0.96)
		)
		(stroke
			(width 0.01)
			(type solid)
		)
		(fill solid)
		(layer "F.Paste")
		(uuid "f2e1da35-0f96-4350-823a-0194d79adcbf")
	)
	(fp_poly
		(pts
			(xy -3.825 1.58) (xy -2.725 1.58) (xy -2.725 2.23) (xy -3.825 2.23)
		)
		(stroke
			(width 0.01)
			(type solid)
		)
		(fill solid)
		(layer "F.Paste")
		(uuid "056d5351-ac70-4912-98ef-4bce65d1e115")
	)
	(fp_poly
		(pts
			(xy -1.875 -1.72) (xy -0.875 -1.72) (xy -0.875 -0.72) (xy -1.875 -0.72)
		)
		(stroke
			(width 0.01)
			(type solid)
		)
		(fill solid)
		(layer "F.Paste")
		(uuid "a044f6cc-c9e5-4524-a738-0d0a7fe663a6")
	)
	(fp_poly
		(pts
			(xy -1.875 0.72) (xy -0.875 0.72) (xy -0.875 1.72) (xy -1.875 1.72)
		)
		(stroke
			(width 0.01)
			(type solid)
		)
		(fill solid)
		(layer "F.Paste")
		(uuid "9f446b63-de0f-4b1a-8241-83ba8c621052")
	)
	(fp_poly
		(pts
			(xy -0.075 -1.72) (xy 0.925 -1.72) (xy 0.925 -0.72) (xy -0.075 -0.72)
		)
		(stroke
			(width 0.01)
			(type solid)
		)
		(fill solid)
		(layer "F.Paste")
		(uuid "cf0d6eac-e1a3-4195-8623-1df156b79319")
	)
	(fp_poly
		(pts
			(xy -0.075 0.72) (xy 0.925 0.72) (xy 0.925 1.72) (xy -0.075 1.72)
		)
		(stroke
			(width 0.01)
			(type solid)
		)
		(fill solid)
		(layer "F.Paste")
		(uuid "31695de0-373a-468a-b397-12350461f4c8")
	)
	(fp_poly
		(pts
			(xy 1.25 -2.23) (xy 3.15 -2.23) (xy 3.15 -1.58) (xy 1.25 -1.58)
		)
		(stroke
			(width 0.01)
			(type solid)
		)
		(fill solid)
		(layer "F.Paste")
		(uuid "bb706123-fca9-423d-a1a0-916dff2afeaa")
	)
	(fp_poly
		(pts
			(xy 1.25 -0.96) (xy 3.15 -0.96) (xy 3.15 -0.31) (xy 1.25 -0.31)
		)
		(stroke
			(width 0.01)
			(type solid)
		)
		(fill solid)
		(layer "F.Paste")
		(uuid "b273a2d9-9ae2-45d9-8ba9-c58b3ea1f9c7")
	)
	(fp_poly
		(pts
			(xy 1.25 0.31) (xy 3.15 0.31) (xy 3.15 0.96) (xy 1.25 0.96)
		)
		(stroke
			(width 0.01)
			(type solid)
		)
		(fill solid)
		(layer "F.Paste")
		(uuid "623b5710-d49f-4cad-8bba-89f1e2839648")
	)
	(fp_poly
		(pts
			(xy 1.25 1.58) (xy 3.15 1.58) (xy 3.15 2.23) (xy 1.25 2.23)
		)
		(stroke
			(width 0.01)
			(type solid)
		)
		(fill solid)
		(layer "F.Paste")
		(uuid "414ebe29-8766-4bba-8947-eb5db0378e92")
	)
	(fp_line
		(start -2.2875 -2.5685)
		(end 2.2875 -2.5685)
		(stroke
			(width 0.127)
			(type solid)
		)
		(layer "F.SilkS")
		(uuid "a74e927f-d620-4e08-ae38-faa10bae0dcf")
	)
	(fp_line
		(start 2.2875 2.5685)
		(end -2.2875 2.5685)
		(stroke
			(width 0.127)
			(type solid)
		)
		(layer "F.SilkS")
		(uuid "313ca28f-2f2b-4345-9cad-cc58e9f1dde3")
	)
	(fp_circle
		(center -4.5 -1.905)
		(end -4.4 -1.905)
		(stroke
			(width 0.2)
			(type solid)
		)
		(fill none)
		(layer "F.SilkS")
		(uuid "45d2745a-f5b1-4b74-b76e-e25e276ef70e")
	)
	(fp_poly
		(pts
			(xy -3.85 -2.255) (xy -2.7 -2.255) (xy -2.7 -1.555) (xy -3.85 -1.555)
		)
		(stroke
			(width 0.01)
			(type solid)
		)
		(fill solid)
		(layer "F.Mask")
		(uuid "ce166ed6-a2ee-44ac-b1f2-2e16230ded57")
	)
	(fp_poly
		(pts
			(xy -3.85 -0.985) (xy -2.7 -0.985) (xy -2.7 -0.285) (xy -3.85 -0.285)
		)
		(stroke
			(width 0.01)
			(type solid)
		)
		(fill solid)
		(layer "F.Mask")
		(uuid "ba269409-a09e-4387-9249-c1098f46bb46")
	)
	(fp_poly
		(pts
			(xy -3.85 0.285) (xy -2.7 0.285) (xy -2.7 0.985) (xy -3.85 0.985)
		)
		(stroke
			(width 0.01)
			(type solid)
		)
		(fill solid)
		(layer "F.Mask")
		(uuid "42549153-3b86-429d-8005-97d6c58ba5b3")
	)
	(fp_poly
		(pts
			(xy -3.85 1.555) (xy -2.7 1.555) (xy -2.7 2.255) (xy -3.85 2.255)
		)
		(stroke
			(width 0.01)
			(type solid)
		)
		(fill solid)
		(layer "F.Mask")
		(uuid "d36efec2-6a98-42ec-959a-74999cbd3ca5")
	)
	(fp_poly
		(pts
			(xy 3.175 -2.255) (xy -2.1 -2.255) (xy -2.1 -0.285) (xy 3.175 -0.285) (xy 3.175 -0.985) (xy 2 -0.985)
			(xy 2 -1.555) (xy 3.175 -1.555)
		)
		(stroke
			(width 0.01)
			(type solid)
		)
		(fill solid)
		(layer "F.Mask")
		(uuid "ecbf4d9c-6a9c-4b31-af28-7b2ca52cbf13")
	)
	(fp_poly
		(pts
			(xy 3.175 2.255) (xy -2.1 2.255) (xy -2.1 0.285) (xy 3.175 0.285) (xy 3.175 0.985) (xy 2 0.985) (xy 2 1.555)
			(xy 3.175 1.555)
		)
		(stroke
			(width 0.01)
			(type solid)
		)
		(fill solid)
		(layer "F.Mask")
		(uuid "313bec73-11e0-4973-8429-c6ba219b3e35")
	)
	(fp_line
		(start -4.1 -2.925)
		(end 3.425 -2.925)
		(stroke
			(width 0.05)
			(type solid)
		)
		(layer "F.CrtYd")
		(uuid "3f264cbf-1a1d-4449-97b2-701867808f91")
	)
	(fp_line
		(start -4.1 2.925)
		(end -4.1 -2.925)
		(stroke
			(width 0.05)
			(type solid)
		)
		(layer "F.CrtYd")
		(uuid "b71d5d75-d54b-4f44-822f-a1d04cd0c9cc")
	)
	(fp_line
		(start 3.425 -2.925)
		(end 3.425 2.925)
		(stroke
			(width 0.05)
			(type solid)
		)
		(layer "F.CrtYd")
		(uuid "453b9eed-c4a6-4c88-a0da-2c0de93147a7")
	)
	(fp_line
		(start 3.425 2.925)
		(end -4.1 2.925)
		(stroke
			(width 0.05)
			(type solid)
		)
		(layer "F.CrtYd")
		(uuid "6f5b0776-6289-44b7-bc73-ce161d290af3")
	)
	(fp_line
		(start -2.2875 -2.5625)
		(end 2.2875 -2.5625)
		(stroke
			(width 0.127)
			(type solid)
		)
		(layer "F.Fab")
		(uuid "588324e4-84be-479e-912f-c5b3e072888b")
	)
	(fp_line
		(start -2.2875 2.5625)
		(end -2.2875 -2.5625)
		(stroke
			(width 0.127)
			(type solid)
		)
		(layer "F.Fab")
		(uuid "1a35d0ac-5b3c-4956-a895-f72f6b21021a")
	)
	(fp_line
		(start 2.2875 -2.5625)
		(end 2.2875 2.5625)
		(stroke
			(width 0.127)
			(type solid)
		)
		(layer "F.Fab")
		(uuid "ea5a7fd5-d986-4c42-91e6-7eb1529a86af")
	)
	(fp_line
		(start 2.2875 2.5625)
		(end -2.2875 2.5625)
		(stroke
			(width 0.127)
			(type solid)
		)
		(layer "F.Fab")
		(uuid "bd1cded7-162e-43fb-858e-fa19b1820f8f")
	)
	(fp_circle
		(center -4.5 -1.905)
		(end -4.4 -1.905)
		(stroke
			(width 0.2)
			(type solid)
		)
		(fill none)
		(layer "F.Fab")
		(uuid "044e932d-406d-45d2-9be5-c0f1d59e67e2")
	)
	(pad "1" smd rect
		(at -3.275 -1.905)
		(size 1.15 0.7)
		(layers "F.Cu")
		(uuid "b5533b35-2c11-4fb9-b942-feb879da18a9")
	)
	(pad "2" smd rect
		(at -3.275 -0.635)
		(size 1.15 0.7)
		(layers "F.Cu")
		(uuid "fbc59e8e-17b2-44ef-85cc-054e4e5e28dc")
	)
	(pad "3" smd rect
		(at -3.275 0.635)
		(size 1.15 0.7)
		(layers "F.Cu")
		(uuid "bd13d903-f0e6-4e87-86cc-93148f7b4ad5")
	)
	(pad "4" smd rect
		(at -3.275 1.905)
		(size 1.15 0.7)
		(layers "F.Cu")
		(uuid "928ce60b-05ba-4d66-874f-e656b097d359")
	)
	(pad "5_6" smd custom
		(at 0 1.27)
		(size 1.5 1.5)
		(layers "F.Cu")
		(options
			(clearance outline)
			(anchor rect)
		)
		(primitives
			(gr_poly
				(pts
					(xy 3.175 0.985) (xy -2.1 0.985) (xy -2.1 -0.985) (xy 3.175 -0.985) (xy 3.175 -0.285) (xy 2 -0.285)
					(xy 2 0.285) (xy 3.175 0.285)
				)
				(width 0.01)
				(fill yes)
			)
		)
		(uuid "931e9f61-ac0a-4360-a6c5-faf09820311f")
	)
	(pad "7_8" smd custom
		(at 0 -1.27)
		(size 1.5 1.5)
		(layers "F.Cu")
		(options
			(clearance outline)
			(anchor rect)
		)
		(primitives
			(gr_poly
				(pts
					(xy 3.175 -0.985) (xy -2.1 -0.985) (xy -2.1 0.985) (xy 3.175 0.985) (xy 3.175 0.285) (xy 2 0.285)
					(xy 2 -0.285) (xy 3.175 -0.285)
				)
				(width 0.01)
				(fill yes)
			)
		)
		(uuid "5d75b5c5-11c7-4649-bb19-aacb73b19952")
	)
	(model "${KIPRJMOD}/3D/BUK9K18-40E_115.step"
		(offset
			(xyz 0 0 0)
		)
		(scale
			(xyz 1 1 1)
		)
		(rotate
			(xyz -90 0 0)
		)
	)
)
