(footprint "BTS6143D" (version 20221018) (generator pcbnew)
  (layer "F.Cu")
  (descr "PG-TO252-5-11_FFW")
  (tags "Switch")
  (attr smd)
  (fp_text reference "S**" (at 0 -0.5) (layer "F.SilkS")
      (effects (font (size 1.27 1.27) (thickness 0.254)))
    (tstamp fd835473-8f66-4006-b060-a61201fd6cbc)
  )
  (fp_text value "BTS6143D" (at 0 -0.5) (layer "F.SilkS") hide
      (effects (font (size 1.27 1.27) (thickness 0.254)))
    (tstamp 04f4b5e9-d076-41c8-b241-9b08f4a830dd)
  )
  (fp_text user "${REFERENCE}" (at 0 -0.5) (layer "F.Fab")
      (effects (font (size 1.27 1.27) (thickness 0.254)))
    (tstamp fd8c2c86-6aa1-426f-93e6-b166ca90b914)
  )
  (fp_line (start -3.25 -5.1) (end -3.25 1.12)
    (stroke (width 0.1) (type solid)) (layer "F.SilkS") (tstamp 4f08acb6-53b7-456c-8d4e-88d53d0c1726))
  (fp_line (start -3.25 1.12) (end 3.25 1.12)
    (stroke (width 0.1) (type solid)) (layer "F.SilkS") (tstamp 077fb526-bdc5-43cd-9c29-14ade34bcc23))
  (fp_line (start -2.4 5) (end -2.4 5)
    (stroke (width 0.2) (type solid)) (layer "F.SilkS") (tstamp fc69d909-d4a6-443e-9d49-1e9fe594aaa1))
  (fp_line (start -2.2 5) (end -2.2 5)
    (stroke (width 0.2) (type solid)) (layer "F.SilkS") (tstamp 0390014c-4ae0-47e3-868c-e8c76296b831))
  (fp_line (start 3.25 1.12) (end 3.25 -5.1)
    (stroke (width 0.1) (type solid)) (layer "F.SilkS") (tstamp 728501ab-f301-4a39-a7be-727dec1c9b4b))
  (fp_arc (start -2.4 5) (mid -2.3 4.9) (end -2.2 5)
    (stroke (width 0.2) (type solid)) (layer "F.SilkS") (tstamp 6276b93d-7b42-4645-9132-b1707b8aba1c))
  (fp_arc (start -2.2 5) (mid -2.3 5.1) (end -2.4 5)
    (stroke (width 0.2) (type solid)) (layer "F.SilkS") (tstamp b4be1230-33de-401e-b077-2028bae8c454))
  (fp_line (start -4.25 -7.1) (end 4.25 -7.1)
    (stroke (width 0.1) (type solid)) (layer "F.CrtYd") (tstamp bed4a682-a0ef-49a0-98a0-c3cd1907249e))
  (fp_line (start -4.25 6.1) (end -4.25 -7.1)
    (stroke (width 0.1) (type solid)) (layer "F.CrtYd") (tstamp a0ec1122-86c7-4012-9b06-e5b2862cdafe))
  (fp_line (start 4.25 -7.1) (end 4.25 6.1)
    (stroke (width 0.1) (type solid)) (layer "F.CrtYd") (tstamp 4ffde54d-ccfc-40d5-8311-8583de40c595))
  (fp_line (start 4.25 6.1) (end -4.25 6.1)
    (stroke (width 0.1) (type solid)) (layer "F.CrtYd") (tstamp 9a398171-cc1b-46c2-9c71-e43283b36ba2))
  (fp_line (start -3.25 -5.1) (end 3.25 -5.1)
    (stroke (width 0.2) (type solid)) (layer "F.Fab") (tstamp 5fd657f3-9443-446d-b69e-94524176e46d))
  (fp_line (start -3.25 1.12) (end -3.25 -5.1)
    (stroke (width 0.2) (type solid)) (layer "F.Fab") (tstamp 9f9bc0a9-cd52-494a-b6a3-b9214623f931))
  (fp_line (start 3.25 -5.1) (end 3.25 1.12)
    (stroke (width 0.2) (type solid)) (layer "F.Fab") (tstamp ccd0838f-762c-4842-aba5-6273f2cc4e8d))
  (fp_line (start 3.25 1.12) (end -3.25 1.12)
    (stroke (width 0.2) (type solid)) (layer "F.Fab") (tstamp 6f210439-4bb6-4555-94db-f7835b187b5f))
  (pad "1" smd rect (at -2.28 3.4) (size 0.8 2.2) (layers "F.Cu" "F.Paste" "F.Mask") (tstamp 186f2360-429b-417d-92b9-38b9c04a9d7e))
  (pad "2" smd rect (at -1.14 3.4) (size 0.8 2.2) (layers "F.Cu" "F.Paste" "F.Mask") (tstamp f09e743f-b23f-470b-877e-c2e7b9138e20))
  (pad "3" smd rect (at 0 -2.9) (size 5.8 6.4) (layers "F.Cu" "F.Paste" "F.Mask") (tstamp f4e0ae80-90d9-479e-8cbd-fdd64a476fd5))
  (pad "4" smd rect (at 1.14 3.4) (size 0.8 2.2) (layers "F.Cu" "F.Paste" "F.Mask") (tstamp ed55bb26-c6a3-4b58-9bfc-05e54683133e))
  (pad "5" smd rect (at 2.28 3.4) (size 0.8 2.2) (layers "F.Cu" "F.Paste" "F.Mask") (tstamp dadf02af-1b99-4a90-9ffe-64c77fa3f0bb))
  (model "${KIPRJMOD}/3D/BTS3256DAUMA1.stp"
    (offset (xyz -3.249999951 -1.729999993 0.1500000037))
    (scale (xyz 1 1 1))
    (rotate (xyz 0 0 0))
  )
)
