(footprint "ZXMHC3F81N8TC" (version 20221018) (generator pcbnew)
  (layer "F.Cu")
  (descr "SOP-8_3")
  (tags "MOSFET (N-Channel)")
  (attr smd)
  (fp_text reference "Q**" (at 0 0) (layer "F.SilkS")
      (effects (font (size 1.27 1.27) (thickness 0.254)))
    (tstamp 95e6d924-d681-48fb-9b39-98dc04a43a29)
  )
  (fp_text value "ZXMHC3F81N8TC" (at 0 0) (layer "F.SilkS") hide
      (effects (font (size 1.27 1.27) (thickness 0.254)))
    (tstamp 22fe3d6a-14fa-4754-9d9c-22b5484c8961)
  )
  (fp_text user "${REFERENCE}" (at 0 0) (layer "F.Fab")
      (effects (font (size 1.27 1.27) (thickness 0.254)))
    (tstamp 299f0885-8a26-4e94-9aeb-fc267491c332)
  )
  (fp_line (start -3.475 -2.605) (end -1.95 -2.605)
    (stroke (width 0.2) (type solid)) (layer "F.SilkS") (tstamp b89c314f-9ca6-47e6-a292-94849166c950))
  (fp_line (start -1.6 -2.45) (end 1.6 -2.45)
    (stroke (width 0.2) (type solid)) (layer "F.SilkS") (tstamp 52e4119c-5575-4cd3-8dac-f6940fd6d757))
  (fp_line (start -1.6 2.45) (end -1.6 -2.45)
    (stroke (width 0.2) (type solid)) (layer "F.SilkS") (tstamp c3128578-fae4-4a6b-8058-18721fc9d22b))
  (fp_line (start 1.6 -2.45) (end 1.6 2.45)
    (stroke (width 0.2) (type solid)) (layer "F.SilkS") (tstamp eef93666-ea00-41ce-b7d1-2b5fdcd620b3))
  (fp_line (start 1.6 2.45) (end -1.6 2.45)
    (stroke (width 0.2) (type solid)) (layer "F.SilkS") (tstamp 3b548c51-3bf8-4302-84ec-da970b6e8d70))
  (fp_line (start -3.725 -2.75) (end 3.725 -2.75)
    (stroke (width 0.05) (type solid)) (layer "F.CrtYd") (tstamp e293c2dd-aa43-4a80-bd23-7ef39dbd85f8))
  (fp_line (start -3.725 2.75) (end -3.725 -2.75)
    (stroke (width 0.05) (type solid)) (layer "F.CrtYd") (tstamp 4f73ec75-16ee-4fe1-897d-4cb8a4fda683))
  (fp_line (start 3.725 -2.75) (end 3.725 2.75)
    (stroke (width 0.05) (type solid)) (layer "F.CrtYd") (tstamp 8e8bf174-62a1-4781-9f64-06d9929946cb))
  (fp_line (start 3.725 2.75) (end -3.725 2.75)
    (stroke (width 0.05) (type solid)) (layer "F.CrtYd") (tstamp d58507df-0e07-4043-a06d-3ed00ae05b67))
  (fp_line (start -1.95 -2.45) (end 1.95 -2.45)
    (stroke (width 0.1) (type solid)) (layer "F.Fab") (tstamp b1b5abc4-37f7-40c8-a3c8-95c07fa6878e))
  (fp_line (start -1.95 -1.18) (end -0.68 -2.45)
    (stroke (width 0.1) (type solid)) (layer "F.Fab") (tstamp a484f200-58dc-40a7-bf5f-fefca5df9df9))
  (fp_line (start -1.95 2.45) (end -1.95 -2.45)
    (stroke (width 0.1) (type solid)) (layer "F.Fab") (tstamp e21d45a9-b397-404d-b7a2-e2caa4108c07))
  (fp_line (start 1.95 -2.45) (end 1.95 2.45)
    (stroke (width 0.1) (type solid)) (layer "F.Fab") (tstamp c904382b-795c-4db4-91ed-35f4b372e728))
  (fp_line (start 1.95 2.45) (end -1.95 2.45)
    (stroke (width 0.1) (type solid)) (layer "F.Fab") (tstamp 82430b5a-61bb-4b6d-b0ac-723a6a7500ce))
  (pad "1" smd rect (at -2.712 -1.905 90) (size 0.7 1.525) (layers "F.Cu" "F.Paste" "F.Mask") (tstamp 754be0a8-e17b-45d5-a4e1-e3f94ff7c26e))
  (pad "2" smd rect (at -2.712 -0.635 90) (size 0.7 1.525) (layers "F.Cu" "F.Paste" "F.Mask") (tstamp 3baf222a-dadb-4d70-b3c9-6ced666e3e49))
  (pad "3" smd rect (at -2.712 0.635 90) (size 0.7 1.525) (layers "F.Cu" "F.Paste" "F.Mask") (tstamp a645cfb2-59db-403a-ad1c-432ee22c38a6))
  (pad "4" smd rect (at -2.712 1.905 90) (size 0.7 1.525) (layers "F.Cu" "F.Paste" "F.Mask") (tstamp 4805768e-2956-4a27-a580-8c3f34d35cc8))
  (pad "5" smd rect (at 2.712 1.905 90) (size 0.7 1.525) (layers "F.Cu" "F.Paste" "F.Mask") (tstamp b212b361-e6cd-4b2e-aef7-6eaa3c5585fe))
  (pad "6" smd rect (at 2.712 0.635 90) (size 0.7 1.525) (layers "F.Cu" "F.Paste" "F.Mask") (tstamp 4af45f81-bbb7-4c39-ac9a-9c54cf09e83c))
  (pad "7" smd rect (at 2.712 -0.635 90) (size 0.7 1.525) (layers "F.Cu" "F.Paste" "F.Mask") (tstamp e60f159a-0830-4ce7-8400-a9adc9187cdd))
  (pad "8" smd rect (at 2.712 -1.905 90) (size 0.7 1.525) (layers "F.Cu" "F.Paste" "F.Mask") (tstamp d125defd-de93-4dca-996b-a42d4fa95977))
  (model "${KIPRJMOD}/3D/ZXMHC3F381N8TC.stp"
    (offset (xyz 0 0 0))
    (scale (xyz 1 1 1))
    (rotate (xyz 0 0 0))
  )
)
