(footprint "SpaceDotLogo"
	(version 20240108)
	(generator "pcbnew")
	(generator_version "8.0")
	(layer "F.Cu")
	(property "Reference" "G***"
		(at 0 0 0)
		(layer "F.SilkS")
		(uuid "190ff15e-9b6f-4d01-9523-b100a167569d")
		(effects
			(font
				(size 1.5 1.5)
				(thickness 0.3)
			)
		)
	)
	(property "Value" "LOGO"
		(at 0.75 0 0)
		(layer "F.SilkS")
		(hide yes)
		(uuid "7201dd40-c1ed-4703-afce-3848171d7437")
		(effects
			(font
				(size 1.5 1.5)
				(thickness 0.3)
			)
		)
	)
	(property "Footprint" ""
		(at 0 0 0)
		(layer "F.Fab")
		(hide yes)
		(uuid "dc863662-8029-4cb7-8202-2c4701c53713")
		(effects
			(font
				(size 1.27 1.27)
				(thickness 0.15)
			)
		)
	)
	(property "Datasheet" ""
		(at 0 0 0)
		(layer "F.Fab")
		(hide yes)
		(uuid "504a8bee-cd29-4ca7-bb82-f7cec86c1d4b")
		(effects
			(font
				(size 1.27 1.27)
				(thickness 0.15)
			)
		)
	)
	(property "Description" ""
		(at 0 0 0)
		(layer "F.Fab")
		(hide yes)
		(uuid "33b8f5be-4857-480b-b3a6-887b2ad21d53")
		(effects
			(font
				(size 1.27 1.27)
				(thickness 0.15)
			)
		)
	)
	(attr board_only exclude_from_pos_files exclude_from_bom)
	(fp_poly
		(pts
			(xy -2.495954 0.758574) (xy -2.520424 0.783044) (xy -2.544894 0.758574) (xy -2.520424 0.734104)
		)
		(stroke
			(width 0)
			(type solid)
		)
		(fill solid)
		(layer "F.SilkS")
		(uuid "1b5be19c-bedc-4521-ba37-91707f740bed")
	)
	(fp_poly
		(pts
			(xy -2.202312 1.296917) (xy -2.226783 1.321387) (xy -2.251253 1.296917) (xy -2.226783 1.272447)
		)
		(stroke
			(width 0)
			(type solid)
		)
		(fill solid)
		(layer "F.SilkS")
		(uuid "922ce209-564e-446f-a35b-8df5616a0a3f")
	)
	(fp_poly
		(pts
			(xy -2.365447 0.995119) (xy -2.372165 1.024213) (xy -2.398074 1.027745) (xy -2.438357 1.009839) (xy -2.4307 0.995119)
			(xy -2.37262 0.989261)
		)
		(stroke
			(width 0)
			(type solid)
		)
		(fill solid)
		(layer "F.SilkS")
		(uuid "d759bcab-62a7-4f4b-aa65-dae71272bb42")
	)
	(fp_poly
		(pts
			(xy -1.876044 1.778163) (xy -1.882762 1.807258) (xy -1.908671 1.81079) (xy -1.948954 1.792883) (xy -1.941298 1.778163)
			(xy -1.883217 1.772306)
		)
		(stroke
			(width 0)
			(type solid)
		)
		(fill solid)
		(layer "F.SilkS")
		(uuid "245c410b-0756-44ae-82f2-cc61036138db")
	)
	(fp_poly
		(pts
			(xy -2.799789 3.954124) (xy -2.789596 3.990168) (xy -2.820322 4.054767) (xy -2.882514 4.047648) (xy -2.908777 4.01823)
			(xy -2.895748 3.966399) (xy -2.862725 3.946356)
		)
		(stroke
			(width 0)
			(type solid)
		)
		(fill solid)
		(layer "F.SilkS")
		(uuid "55e24395-e5c8-49d7-ae0a-9620b6349bf0")
	)
	(fp_poly
		(pts
			(xy 2.543429 -4.236916) (xy 2.537757 -4.213491) (xy 2.489676 -4.189544) (xy 2.454023 -4.204314) (xy 2.415339 -4.25021)
			(xy 2.445044 -4.281057) (xy 2.519305 -4.293879)
		)
		(stroke
			(width 0)
			(type solid)
		)
		(fill solid)
		(layer "F.SilkS")
		(uuid "012cc833-98e9-4781-ae6a-f545721284d8")
	)
	(fp_poly
		(pts
			(xy -3.372654 3.417719) (xy -3.306821 3.471054) (xy -3.260193 3.54873) (xy -3.26927 3.591097) (xy -3.332164 3.580739)
			(xy -3.397996 3.527404) (xy -3.444625 3.449728) (xy -3.435548 3.407361)
		)
		(stroke
			(width 0)
			(type solid)
		)
		(fill solid)
		(layer "F.SilkS")
		(uuid "d461dd7e-2f4c-47d7-9c50-68d0bc11ef75")
	)
	(fp_poly
		(pts
			(xy -1.468769 2.240177) (xy -1.468208 2.251252) (xy -1.505831 2.298312) (xy -1.520037 2.300192) (xy -1.549266 2.27021)
			(xy -1.541619 2.251252) (xy -1.497641 2.204564) (xy -1.48979 2.202312)
		)
		(stroke
			(width 0)
			(type solid)
		)
		(fill solid)
		(layer "F.SilkS")
		(uuid "86366257-eb41-47a6-8deb-7c7430307563")
	)
	(fp_poly
		(pts
			(xy -0.275078 -4.828334) (xy -0.244702 -4.796147) (xy -0.286584 -4.759357) (xy -0.367052 -4.747206)
			(xy -0.459026 -4.763959) (xy -0.489403 -4.796147) (xy -0.447521 -4.832936) (xy -0.367052 -4.845087)
		)
		(stroke
			(width 0)
			(type solid)
		)
		(fill solid)
		(layer "F.SilkS")
		(uuid "473e9975-ad48-4ee7-8298-82d6869841c6")
	)
	(fp_poly
		(pts
			(xy -0.262497 -5.027185) (xy -0.244702 -4.991908) (xy -0.286912 -4.956632) (xy -0.379287 -4.943717)
			(xy -0.464729 -4.951025) (xy -0.462145 -4.976339) (xy -0.440463 -4.991908) (xy -0.337091 -5.035298)
		)
		(stroke
			(width 0)
			(type solid)
		)
		(fill solid)
		(layer "F.SilkS")
		(uuid "46e3a1fc-25c1-4c04-a3ba-873dd75b515a")
	)
	(fp_poly
		(pts
			(xy 2.24983 4.441866) (xy 2.251252 4.453564) (xy 2.21401 4.501082) (xy 2.202312 4.502505) (xy 2.154794 4.465262)
			(xy 2.153372 4.453564) (xy 2.190614 4.406046) (xy 2.202312 4.404624)
		)
		(stroke
			(width 0)
			(type solid)
		)
		(fill solid)
		(layer "F.SilkS")
		(uuid "6efda552-ae6a-4543-9bb4-e1ba20c09dd0")
	)
	(fp_poly
		(pts
			(xy 2.493962 1.846316) (xy 2.495953 1.85973) (xy 2.479256 1.907398) (xy 2.474372 1.90867) (xy 2.432588 1.874376)
			(xy 2.422543 1.85973) (xy 2.426423 1.814632) (xy 2.444125 1.81079)
		)
		(stroke
			(width 0)
			(type solid)
		)
		(fill solid)
		(layer "F.SilkS")
		(uuid "35f73d1d-2211-4db7-acde-5fdedcbee4ad")
	)
	(fp_poly
		(pts
			(xy -3.049782 -3.755529) (xy -3.077407 -3.702105) (xy -3.083237 -3.694991) (xy -3.141879 -3.634167)
			(xy -3.16264 -3.62158) (xy -3.179076 -3.661549) (xy -3.181118 -3.694991) (xy -3.14149 -3.75846) (xy -3.101715 -3.768401)
		)
		(stroke
			(width 0)
			(type solid)
		)
		(fill solid)
		(layer "F.SilkS")
		(uuid "985da4d8-24cd-4390-a461-c30dbdcd8aa5")
	)
	(fp_poly
		(pts
			(xy -1.876656 1.641505) (xy -1.93026 1.685739) (xy -2.000309 1.73005) (xy -2.071599 1.760966) (xy -2.113935 1.768145)
			(xy -2.100354 1.744008) (xy -2.045501 1.711896) (xy -1.957611 1.667898) (xy -1.876353 1.631059)
		)
		(stroke
			(width 0)
			(type solid)
		)
		(fill solid)
		(layer "F.SilkS")
		(uuid "1864790d-9cf8-494e-95f5-c55136480535")
	)
	(fp_poly
		(pts
			(xy 1.64208 -4.76541) (xy 1.730155 -4.728379) (xy 1.761849 -4.692961) (xy 1.743681 -4.65716) (xy 1.675515 -4.664621)
			(xy 1.571218 -4.70242) (xy 1.493248 -4.745373) (xy 1.479798 -4.77511) (xy 1.543161 -4.785492)
		)
		(stroke
			(width 0)
			(type solid)
		)
		(fill solid)
		(layer "F.SilkS")
		(uuid "a74e9222-18a8-4a22-99fc-45d897036999")
	)
	(fp_poly
		(pts
			(xy 0.287488 -2.155236) (xy 0.340195 -2.06537) (xy 0.357489 -2.030407) (xy 0.409835 -1.905133) (xy 0.413105 -1.86337)
			(xy 0.374095 -1.908262) (xy 0.31576 -2.011099) (xy 0.268588 -2.116779) (xy 0.255055 -2.178428) (xy 0.256791 -2.181776)
		)
		(stroke
			(width 0)
			(type solid)
		)
		(fill solid)
		(layer "F.SilkS")
		(uuid "bc698504-6750-43e7-a917-a8147ac9c31c")
	)
	(fp_poly
		(pts
			(xy -4.06223 2.849846) (xy -4.009201 2.90579) (xy -3.943176 2.998135) (xy -3.915228 3.053919) (xy -3.915222 3.054251)
			(xy -3.942827 3.085757) (xy -4.007205 3.056351) (xy -4.080695 2.978804) (xy -4.081697 2.97738) (xy -4.132759 2.874659)
			(xy -4.12107 2.827012)
		)
		(stroke
			(width 0)
			(type solid)
		)
		(fill solid)
		(layer "F.SilkS")
		(uuid "d86e02f1-c939-422b-9c3e-7e9d585912d7")
	)
	(fp_poly
		(pts
			(xy -0.61607 4.775887) (xy -0.56604 4.794919) (xy -0.464019 4.862816) (xy -0.449367 4.939801) (xy -0.51656 5.004103)
			(xy -0.626133 5.031843) (xy -0.733802 5.036058) (xy -0.768483 5.003983) (xy -0.754168 4.91256) (xy -0.753433 4.909493)
			(xy -0.72382 4.79691) (xy -0.688725 4.758912)
		)
		(stroke
			(width 0)
			(type solid)
		)
		(fill solid)
		(layer "F.SilkS")
		(uuid "9eed8330-2f0a-408f-b259-4ded5f7fe900")
	)
	(fp_poly
		(pts
			(xy 1.370327 -1.887473) (xy 1.332233 -1.845089) (xy 1.241117 -1.78076) (xy 1.131727 -1.715864) (xy 1.03881 -1.671781)
			(xy 1.007354 -1.664152) (xy 0.979388 -1.676254) (xy 0.982883 -1.679941) (xy 1.06698 -1.736741) (xy 1.177605 -1.801223)
			(xy 1.284231 -1.857038) (xy 1.356335 -1.887833)
		)
		(stroke
			(width 0)
			(type solid)
		)
		(fill solid)
		(layer "F.SilkS")
		(uuid "5257215c-c55b-4eb9-b789-14c22a15e18e")
	)
	(fp_poly
		(pts
			(xy -2.074368 1.499357) (xy -2.085102 1.525465) (xy -2.087474 1.562217) (xy -2.03905 1.551471) (xy -1.971139 1.544377)
			(xy -1.957611 1.562388) (xy -1.995429 1.608933) (xy -2.073615 1.652578) (xy -2.12249 1.663969) (xy -2.133772 1.622802)
			(xy -2.139916 1.566088) (xy -2.125654 1.486853) (xy -2.098502 1.468208)
		)
		(stroke
			(width 0)
			(type solid)
		)
		(fill solid)
		(layer "F.SilkS")
		(uuid "64527d27-30f5-4187-a3db-97ba185c884f")
	)
	(fp_poly
		(pts
			(xy 0.344091 4.809661) (xy 0.387371 4.869042) (xy 0.401568 4.94029) (xy 0.408527 5.041296) (xy 0.370842 5.082091)
			(xy 0.262381 5.089785) (xy 0.257444 5.089788) (xy 0.145922 5.081881) (xy 0.105046 5.042119) (xy 0.106865 4.955202)
			(xy 0.142628 4.849639) (xy 0.235327 4.807796) (xy 0.250989 4.805704)
		)
		(stroke
			(width 0)
			(type solid)
		)
		(fill solid)
		(layer "F.SilkS")
		(uuid "5ec5b8c0-64b4-4ede-b1a3-2b6a35e85874")
	)
	(fp_poly
		(pts
			(xy 0.57128 1.213616) (xy 0.604568 1.282972) (xy 0.601576 1.382687) (xy 0.55856 1.485775) (xy 0.469166 1.517039)
			(xy 0.460763 1.517148) (xy 0.377504 1.49881) (xy 0.373716 1.444019) (xy 0.423309 1.396689) (xy 0.453152 1.40264)
			(xy 0.481116 1.403184) (xy 0.469845 1.378277) (xy 0.458044 1.298766) (xy 0.4944 1.228493) (xy 0.554781 1.206633)
		)
		(stroke
			(width 0)
			(type solid)
		)
		(fill solid)
		(layer "F.SilkS")
		(uuid "77b43217-cb2c-4a9f-8b7b-0def4812e1ae")
	)
	(fp_poly
		(pts
			(xy 2.605486 2.997449) (xy 2.684887 3.050979) (xy 2.691715 3.058767) (xy 2.783148 3.113141) (xy 2.892989 3.132177)
			(xy 2.98833 3.137122) (xy 2.998814 3.166954) (xy 2.949531 3.230058) (xy 2.877993 3.303073) (xy 2.816216 3.318064)
			(xy 2.733849 3.272145) (xy 2.646529 3.201237) (xy 2.551131 3.110808) (xy 2.499157 3.041785) (xy 2.495953 3.029946)
			(xy 2.529727 2.988556)
		)
		(stroke
			(width 0)
			(type solid)
		)
		(fill solid)
		(layer "F.SilkS")
		(uuid "ec5a433d-8199-4bd8-b22f-2489de676c17")
	)
	(fp_poly
		(pts
			(xy 1.782486 3.264331) (xy 1.84089 3.316997) (xy 1.931495 3.417995) (xy 2.033453 3.541484) (xy 2.125917 3.661624)
			(xy 2.188038 3.752574) (xy 2.202312 3.784699) (xy 2.163954 3.818879) (xy 2.128901 3.835039) (xy 2.065873 3.836256)
			(xy 2.055491 3.816228) (xy 2.027789 3.7544) (xy 1.956219 3.643575) (xy 1.8842 3.544844) (xy 1.772331 3.386774)
			(xy 1.719478 3.28506) (xy 1.727787 3.245626)
		)
		(stroke
			(width 0)
			(type solid)
		)
		(fill solid)
		(layer "F.SilkS")
		(uuid "f4ab732c-5f68-41c0-b5ca-21d64582dc69")
	)
	(fp_poly
		(pts
			(xy -1.096406 1.255555) (xy -1.020306 1.371029) (xy -0.939062 1.518747) (xy -0.862818 1.679061) (xy -0.801714 1.832321)
			(xy -0.765893 1.958881) (xy -0.763169 2.031902) (xy -0.79843 2.132108) (xy -0.828093 2.175437) (xy -0.863667 2.144691)
			(xy -0.928787 2.044404) (xy -1.011513 1.893691) (xy -1.042903 1.831583) (xy -1.146032 1.61114) (xy -1.203274 1.451559)
			(xy -1.219972 1.330298) (xy -1.201468 1.224816) (xy -1.192609 1.199933) (xy -1.157221 1.191974)
		)
		(stroke
			(width 0)
			(type solid)
		)
		(fill solid)
		(layer "F.SilkS")
		(uuid "ae50c99b-ef44-482f-95fc-4482f1cefbf7")
	)
	(fp_poly
		(pts
			(xy -1.057226 0.791945) (xy -0.98995 0.889515) (xy -0.900671 1.041768) (xy -0.82561 1.181949) (xy -0.720754 1.389666)
			(xy -0.657651 1.531497) (xy -0.630303 1.626999) (xy -0.632714 1.695727) (xy -0.652688 1.745824) (xy -0.682802 1.793313)
			(xy -0.713206 1.800461) (xy -0.754205 1.755549) (xy -0.816105 1.646857) (xy -0.909209 1.462665) (xy -0.918978 1.44298)
			(xy -1.043979 1.169655) (xy -1.111315 0.968034) (xy -1.122571 0.831909) (xy -1.0919 0.765631)
		)
		(stroke
			(width 0)
			(type solid)
		)
		(fill solid)
		(layer "F.SilkS")
		(uuid "d55a5a90-a512-42e4-8651-c6164ca6575e")
	)
	(fp_poly
		(pts
			(xy -0.903442 0.312506) (xy -0.850876 0.396658) (xy -0.768571 0.541944) (xy -0.671161 0.722253) (xy -0.63243 0.796056)
			(xy -0.536318 0.984863) (xy -0.481198 1.110894) (xy -0.461183 1.197296) (xy -0.470385 1.267215) (xy -0.496501 1.33039)
			(xy -0.564197 1.473331) (xy -0.802958 0.988066) (xy -0.912561 0.757445) (xy -0.979766 0.592992) (xy -1.010691 0.475861)
			(xy -1.011452 0.387205) (xy -1.006274 0.361575) (xy -0.977717 0.267809) (xy -0.947609 0.259281)
		)
		(stroke
			(width 0)
			(type solid)
		)
		(fill solid)
		(layer "F.SilkS")
		(uuid "da6792cd-1f13-41ce-acd9-93a533fce6c6")
	)
	(fp_poly
		(pts
			(xy 0.616544 0.879616) (xy 0.534579 0.985636) (xy 0.501637 1.021125) (xy 0.410582 1.092275) (xy 0.269376 1.175274)
			(xy 0.098501 1.261339) (xy -0.081561 1.341689) (xy -0.250329 1.407542) (xy -0.38732 1.450117) (xy -0.472052 1.460631)
			(xy -0.489403 1.44604) (xy -0.443411 1.312142) (xy -0.316495 1.186324) (xy -0.12882 1.086504) (xy 0.07392 1.007427)
			(xy 0.294496 0.920542) (xy 0.379287 0.886872) (xy 0.540265 0.831734) (xy 0.618894 0.828816)
		)
		(stroke
			(width 0)
			(type solid)
		)
		(fill solid)
		(layer "F.SilkS")
		(uuid "ab23e8d7-aa6e-4f21-af65-bb0c6aae715e")
	)
	(fp_poly
		(pts
			(xy 0.173299 1.630033) (xy 0.155165 1.694871) (xy 0.124046 1.758571) (xy 0.081192 1.831062) (xy 0.026502 1.890286)
			(xy -0.057264 1.946489) (xy -0.187346 2.009915) (xy -0.380983 2.090809) (xy -0.544278 2.155711) (xy -0.790066 2.252591)
			(xy -0.756833 2.141806) (xy -0.720092 2.050236) (xy -0.660516 1.97863) (xy -0.558387 1.91268) (xy -0.39399 1.838075)
			(xy -0.269172 1.787889) (xy -0.093974 1.718911) (xy 0.050121 1.662154) (xy 0.13479 1.628772) (xy 0.139531 1.626899)
		)
		(stroke
			(width 0)
			(type solid)
		)
		(fill solid)
		(layer "F.SilkS")
		(uuid "33bb4804-d1aa-48db-864d-79e4f6dae8fa")
	)
	(fp_poly
		(pts
			(xy 0.36381 1.309152) (xy 0.328821 1.398058) (xy 0.32712 1.401329) (xy 0.256613 1.485385) (xy 0.125501 1.570891)
			(xy -0.08154 1.667303) (xy -0.148824 1.69497) (xy -0.364742 1.780773) (xy -0.505982 1.832252) (xy -0.588 1.853253)
			(xy -0.626251 1.84762) (xy -0.636189 1.819198) (xy -0.636224 1.816211) (xy -0.588881 1.717133) (xy -0.450885 1.60712)
			(xy -0.228288 1.490373) (xy -0.073411 1.425371) (xy 0.108372 1.355796) (xy 0.25509 1.302748) (xy 0.343242 1.274606)
			(xy 0.35638 1.272184)
		)
		(stroke
			(width 0)
			(type solid)
		)
		(fill solid)
		(layer "F.SilkS")
		(uuid "15c0e101-e6b3-4b3b-9bdf-da35a182b5a0")
	)
	(fp_poly
		(pts
			(xy 1.287105 2.0397) (xy 1.333974 2.07507) (xy 1.419432 2.11647) (xy 1.465281 2.10624) (xy 1.542728 2.10121)
			(xy 1.653106 2.133368) (xy 1.755605 2.185742) (xy 1.809419 2.241358) (xy 1.81079 2.249947) (xy 1.76755 2.275709)
			(xy 1.660335 2.28886) (xy 1.627264 2.289327) (xy 1.467754 2.297871) (xy 1.32863 2.3201) (xy 1.320789 2.322168)
			(xy 1.218563 2.337708) (xy 1.16874 2.326993) (xy 1.154539 2.25877) (xy 1.168957 2.151916) (xy 1.202191 2.057827)
			(xy 1.225404 2.029848)
		)
		(stroke
			(width 0)
			(type solid)
		)
		(fill solid)
		(layer "F.SilkS")
		(uuid "6c813a01-285f-46b1-b48e-e74dbcd4d04b")
	)
	(fp_poly
		(pts
			(xy 2.154458 1.873364) (xy 2.164148 1.940937) (xy 2.189024 2.009431) (xy 2.262608 2.087758) (xy 2.365381 2.188388)
			(xy 2.452904 2.303212) (xy 2.507188 2.404702) (xy 2.51024 2.465331) (xy 2.50972 2.465874) (xy 2.43768 2.492751)
			(xy 2.34515 2.435461) (xy 2.328158 2.419047) (xy 2.266314 2.337735) (xy 2.251252 2.294349) (xy 2.217438 2.23335)
			(xy 2.134294 2.14526) (xy 2.116666 2.129519) (xy 2.030295 2.040582) (xy 2.014807 1.971775) (xy 2.036355 1.923871)
			(xy 2.100485 1.865026)
		)
		(stroke
			(width 0)
			(type solid)
		)
		(fill solid)
		(layer "F.SilkS")
		(uuid "802a0b55-8ddf-45d0-a3f6-cea14395cc7e")
	)
	(fp_poly
		(pts
			(xy -1.634617 1.992462) (xy -1.592141 2.035782) (xy -1.598869 2.068936) (xy -1.595129 2.100323) (xy -1.549647 2.089814)
			(xy -1.478839 2.077726) (xy -1.481888 2.114709) (xy -1.553854 2.183125) (xy -1.64764 2.240263) (xy -1.691806 2.240643)
			(xy -1.671286 2.186362) (xy -1.657727 2.168679) (xy -1.617136 2.110009) (xy -1.650428 2.109218) (xy -1.683127 2.120859)
			(xy -1.745739 2.138148) (xy -1.732244 2.103161) (xy -1.707597 2.071918) (xy -1.666383 2.012567) (xy -1.700054 2.011557)
			(xy -1.73738 2.024757) (xy -1.800535 2.040682) (xy -1.782823 2.008406) (xy -1.782269 2.007846) (xy -1.711368 1.978695)
		)
		(stroke
			(width 0)
			(type solid)
		)
		(fill solid)
		(layer "F.SilkS")
		(uuid "26ce8924-e252-46da-aa6d-4e951e25258f")
	)
	(fp_poly
		(pts
			(xy -0.793853 -0.240189) (xy -0.726868 -0.141768) (xy -0.641042 0.005533) (xy -0.546839 0.181436)
			(xy -0.454717 0.365661) (xy -0.375139 0.537927) (xy -0.318567 0.677956) (xy -0.29546 0.765468) (xy -0.295376 0.76992)
			(xy -0.319844 0.877277) (xy -0.363469 0.976278) (xy -0.393662 1.02376) (xy -0.423003 1.036899) (xy -0.460822 1.00444)
			(xy -0.516448 0.915131) (xy -0.599212 0.757719) (xy -0.683932 0.589738) (xy -0.797849 0.355839) (xy -0.869769 0.187523)
			(xy -0.906193 0.065349) (xy -0.913624 -0.030121) (xy -0.907586 -0.078947) (xy -0.874338 -0.197667)
			(xy -0.834595 -0.26725) (xy -0.831536 -0.269449)
		)
		(stroke
			(width 0)
			(type solid)
		)
		(fill solid)
		(layer "F.SilkS")
		(uuid "fa6b3e4d-75b6-40ab-ae59-c966464a6bd5")
	)
	(fp_poly
		(pts
			(xy 0.875277 0.321209) (xy 0.871596 0.37381) (xy 0.837141 0.476844) (xy 0.833623 0.485447) (xy 0.76754 0.601672)
			(xy 0.664666 0.696044) (xy 0.503344 0.78476) (xy 0.342582 0.852752) (xy 0.153843 0.927475) (xy -0.051082 1.008654)
			(xy -0.110116 1.03205) (xy -0.240945 1.078233) (xy -0.325266 1.097099) (xy -0.342582 1.091681) (xy -0.327363 1.02774)
			(xy -0.290137 0.914294) (xy -0.284297 0.897981) (xy -0.251314 0.825611) (xy -0.200457 0.765815) (xy -0.11464 0.707819)
			(xy 0.023226 0.640845) (xy 0.230226 0.554117) (xy 0.315221 0.519886) (xy 0.526739 0.437147) (xy 0.702813 0.372114)
			(xy 0.825101 0.331293) (xy 0.875258 0.321191)
		)
		(stroke
			(width 0)
			(type solid)
		)
		(fill solid)
		(layer "F.SilkS")
		(uuid "590726fb-4982-4816-b21f-e247dcae4154")
	)
	(fp_poly
		(pts
			(xy 0.796837 -1.9228) (xy 0.801235 -1.898512) (xy 0.814134 -1.862268) (xy 0.831984 -1.859731) (xy 0.863899 -1.829918)
			(xy 0.856454 -1.81079) (xy 0.861958 -1.765765) (xy 0.880925 -1.76185) (xy 0.914185 -1.733258) (xy 0.907833 -1.716855)
			(xy 0.915069 -1.650597) (xy 0.951555 -1.600331) (xy 0.996728 -1.530492) (xy 0.992788 -1.498505) (xy 1.000595 -1.470878)
			(xy 1.022477 -1.468208) (xy 1.059321 -1.439499) (xy 1.052216 -1.419268) (xy 1.059879 -1.374732) (xy 1.081954 -1.370328)
			(xy 1.118753 -1.352427) (xy 1.111635 -1.340024) (xy 1.11761 -1.285131) (xy 1.160884 -1.167265) (xy 1.232619 -1.009774)
			(xy 1.249659 -0.975464) (xy 1.325143 -0.814372) (xy 1.372993 -0.689688) (xy 1.384815 -0.62398) (xy 1.381922 -0.619778)
			(xy 1.325023 -0.594713) (xy 1.195355 -0.541562) (xy 1.01135 -0.467774) (xy 0.791441 -0.380797) (xy 0.758574 -0.367888)
			(xy 0.533637 -0.279538) (xy 0.340474 -0.203513) (xy 0.198034 -0.147285) (xy 0.125268 -0.118321) (xy 0.121872 -0.11693)
			(xy 0.084128 -0.151145) (xy 0.012794 -0.259012) (xy -0.083473 -0.425893) (xy -0.196015 -0.637146)
			(xy -0.257415 -0.758312) (xy -0.372143 -0.989924) (xy -0.469523 -1.189202) (xy -0.541967 -1.340406)
			(xy -0.581889 -1.427795) (xy -0.587284 -1.442665) (xy -0.55044 -1.447992) (xy -0.513873 -1.436966)
			(xy -0.451091 -1.440456) (xy -0.440463 -1.465861) (xy -0.410789 -1.499951) (xy -0.391522 -1.492679)
			(xy -0.346386 -1.495687) (xy -0.342582 -1.512724) (xy -0.306825 -1.542128) (xy -0.269172 -1.534847)
			(xy -0.20639 -1.538336) (xy -0.195761 -1.563741) (xy -0.166087 -1.597832) (xy -0.146821 -1.590559)
			(xy -0.101685 -1.593568) (xy -0.097881 -1.610605) (xy -0.062124 -1.640009) (xy -0.02447 -1.632727)
			(xy 0.038311 -1.636217) (xy 0.04894 -1.661622) (xy 0.078614 -1.695712) (xy 0.09788 -1.68844) (xy 0.142846 -1.695249)
			(xy 0.146821 -1.715257) (xy 0.182302 -1.750444) (xy 0.220231 -1.744152) (xy 0.283286 -1.742408) (xy 0.293641 -1.76185)
			(xy 0.329064 -1.788657) (xy 0.360741 -1.78197) (xy 0.447379 -1.791108) (xy 0.495764 -1.824143) (xy 0.583245 -1.870747)
			(xy 0.631237 -1.869549) (xy 0.674193 -1.874761) (xy 0.666448 -1.89936) (xy 0.676699 -1.939039) (xy 0.729656 -1.94449)
		)
		(stroke
			(width 0)
			(type solid)
		)
		(fill solid)
		(layer "F.SilkS")
		(uuid "14af3a95-6913-48d7-a0d5-96ed3ec6c34b")
	)
	(fp_poly
		(pts
			(xy -0.64763 -1.357111) (xy -0.586268 -1.263781) (xy -0.562037 -1.223507) (xy -0.466112 -1.055368)
			(xy -0.355911 -0.85202) (xy -0.2827 -0.711118) (xy -0.205722 -0.554018) (xy -0.171168 -0.460369)
			(xy -0.174888 -0.407531) (xy -0.212732 -0.372866) (xy -0.219902 -0.368536) (xy -0.322839 -0.297391)
			(xy -0.40956 -0.227764) (xy -0.46039 -0.179874) (xy -0.44353 -0.179226) (xy -0.35132 -0.226962) (xy -0.32755 -0.239999)
			(xy -0.209665 -0.302587) (xy -0.133128 -0.338903) (xy -0.121117 -0.342582) (xy -0.086991 -0.30426)
			(xy -0.032463 -0.211751) (xy -0.030821 -0.208628) (xy 0.003477 -0.127765) (xy 0.009261 -0.0466) (xy -0.016659 0.064642)
			(xy -0.077477 0.235741) (xy -0.078836 0.239354) (xy -0.135188 0.398753) (xy -0.1706 0.518264) (xy -0.177642 0.572715)
			(xy -0.177327 0.573091) (xy -0.152599 0.540961) (xy -0.106065 0.437881) (xy -0.047451 0.285562) (xy -0.042984 0.273163)
			(xy 0.031145 0.088348) (xy 0.100295 -0.024688) (xy 0.180601 -0.089738) (xy 0.213678 -0.105302) (xy 0.317796 -0.130953)
			(xy 0.401221 -0.100126) (xy 0.480157 -0.000102) (xy 0.56606 0.171291) (xy 0.610157 0.252174) (xy 0.633381 0.2624)
			(xy 0.634308 0.254986) (xy 0.614487 0.175139) (xy 0.562414 0.049451) (xy 0.536856 -0.002915) (xy 0.478533 -0.12403)
			(xy 0.465399 -0.18644) (xy 0.495975 -0.217476) (xy 0.52462 -0.228856) (xy 0.610486 -0.261036) (xy 0.758247 -0.317771)
			(xy 0.938693 -0.387831) (xy 0.97277 -0.401138) (xy 1.144463 -0.464486) (xy 1.278299 -0.506808) (xy 1.350948 -0.520937)
			(xy 1.35691 -0.519134) (xy 1.351716 -0.462105) (xy 1.301505 -0.351164) (xy 1.220702 -0.210168) (xy 1.12373 -0.062968)
			(xy 1.025013 0.06658) (xy 0.961167 0.135334) (xy 0.854413 0.210447) (xy 0.684875 0.303083) (xy 0.478349 0.401976)
			(xy 0.26063 0.495859) (xy 0.057513 0.573465) (xy -0.105207 0.623528) (xy -0.18564 0.636223) (xy -0.242656 0.603973)
			(xy -0.320272 0.50211) (xy -0.423529 0.322965) (xy -0.534497 0.105676) (xy -0.644487 -0.119416) (xy -0.716917 -0.279621)
			(xy -0.757892 -0.397653) (xy -0.773517 -0.496226) (xy -0.769897 -0.598054) (xy -0.754828 -0.714073)
			(xy -0.73387 -0.885247) (xy -0.722911 -1.026115) (xy -0.723167 -1.088921) (xy -0.708585 -1.161081)
			(xy -0.683655 -1.174567) (xy -0.656414 -1.215598) (xy -0.663795 -1.309153) (xy -0.671394 -1.370486)
		)
		(stroke
			(width 0)
			(type solid)
		)
		(fill solid)
		(layer "F.SilkS")
		(uuid "8e1d17e7-5e06-480c-9ecf-b8ab8d887949")
	)
	(fp_poly
		(pts
			(xy 1.567281 -4.037993) (xy 1.94543 -3.882392) (xy 2.341029 -3.651494) (xy 2.734762 -3.36071) (xy 3.10731 -3.025457)
			(xy 3.439355 -2.661147) (xy 3.653216 -2.373603) (xy 3.786738 -2.149294) (xy 3.929592 -1.868819) (xy 4.06589 -1.567223)
			(xy 4.179741 -1.27955) (xy 4.252339 -1.052216) (xy 4.346387 -0.53077) (xy 4.372783 0.029878) (xy 4.3327 0.599338)
			(xy 4.227314 1.147216) (xy 4.158334 1.380319) (xy 4.080428 1.592665) (xy 3.987043 1.814897) (xy 3.888619 2.025524)
			(xy 3.795597 2.203054) (xy 3.718419 2.325998) (xy 3.677991 2.368985) (xy 3.637835 2.341132) (xy 3.562436 2.249157)
			(xy 3.467582 2.112468) (xy 3.460736 2.101905) (xy 3.082026 1.604073) (xy 2.640094 1.180272) (xy 3.899159 1.180272)
			(xy 3.949388 1.22381) (xy 4.015466 1.203551) (xy 4.034145 1.180111) (xy 4.025238 1.117066) (xy 3.993808 1.080982)
			(xy 3.93118 1.053068) (xy 3.899839 1.095122) (xy 3.899159 1.180272) (xy 2.640094 1.180272) (xy 2.631825 1.172342)
			(xy 2.113194 0.809394) (xy 1.779043 0.629908) (xy 1.545893 0.524989) (xy 1.382466 0.470978) (xy 1.277218 0.464232)
			(xy 1.264413 0.467482) (xy 1.190895 0.499014) (xy 1.204789 0.535703) (xy 1.237204 0.560988) (xy 1.279483 0.604589)
			(xy 1.268703 0.655505) (xy 1.195834 0.738249) (xy 1.158378 0.775017) (xy 1.038179 0.876693) (xy 0.948489 0.925147)
			(xy 0.903707 0.915417) (xy 0.910672 0.860349) (xy 0.895613 0.795878) (xy 0.842875 0.774703) (xy 0.811124 0.759735)
			(xy 0.804489 0.721045) (xy 0.828001 0.646123) (xy 0.886694 0.522459) (xy 0.985601 0.33754) (xy 1.105334 0.12235)
			(xy 1.231127 -0.105621) (xy 1.337902 -0.306262) (xy 1.417062 -0.462858) (xy 1.460015 -0.558698) (xy 1.465237 -0.577479)
			(xy 1.446098 -0.662485) (xy 1.395678 -0.78128) (xy 1.392466 -0.787552) (xy 1.354243 -0.870615) (xy 1.352137 -0.908044)
			(xy 1.933697 -0.908044) (xy 1.964922 -0.847645) (xy 2.027475 -0.815813) (xy 2.072686 -0.855509) (xy 2.076877 -0.940583)
			(xy 2.069718 -0.963382) (xy 2.031212 -1.004241) (xy 1.975762 -0.973561) (xy 1.933697 -0.908044) (xy 1.352137 -0.908044)
			(xy 1.350577 -0.935772) (xy 1.390937 -1.010648) (xy 1.484794 -1.122869) (xy 1.521651 -1.164409) (xy 1.783348 -1.524574)
			(xy 1.963262 -1.916073) (xy 2.060991 -2.325519) (xy 2.064175 -2.412578) (xy 2.81626 -2.412578) (xy 2.83806 -2.335753)
			(xy 2.887476 -2.300193) (xy 2.936457 -2.338937) (xy 2.953513 -2.372036) (xy 2.949098 -2.453085) (xy 2.887982 -2.487249)
			(xy 2.840673 -2.472805) (xy 2.81626 -2.412578) (xy 2.064175 -2.412578) (xy 2.076134 -2.739523) (xy 2.008289 -3.144696)
			(xy 1.857053 -3.527649) (xy 1.622025 -3.874994) (xy 1.603685 -3.896194) (xy 1.513116 -4.001839) (xy 1.484068 -4.049371)
			(xy 1.512748 -4.053577)
		)
		(stroke
			(width 0)
			(type solid)
		)
		(fill solid)
		(layer "F.SilkS")
		(uuid "3536dce4-db2b-4ca7-b624-1b8dd9d287a5")
	)
	(fp_poly
		(pts
			(xy 0.471531 2.211423) (xy 0.513873 2.234411) (xy 0.639266 2.315314) (xy 0.719029 2.38757) (xy 0.734104 2.417902)
			(xy 0.765351 2.484322) (xy 0.839293 2.567161) (xy 0.926231 2.639704) (xy 0.996466 2.675239) (xy 1.015668 2.671165)
			(xy 1.007683 2.61939) (xy 0.95553 2.546214) (xy 0.89677 2.473569) (xy 0.90601 2.437686) (xy 0.956973 2.414759)
			(xy 1.042494 2.41244) (xy 1.067633 2.444326) (xy 1.146269 2.570575) (xy 1.265738 2.654849) (xy 1.390428 2.672576)
			(xy 1.396449 2.671203) (xy 1.512823 2.676388) (xy 1.567194 2.728137) (xy 1.607684 2.787342) (xy 1.606467 2.76362)
			(xy 1.59579 2.72842) (xy 1.599889 2.6564) (xy 1.631207 2.642774) (xy 1.673452 2.685361) (xy 1.673936 2.808248)
			(xy 1.652561 2.914736) (xy 1.601289 2.968622) (xy 1.489819 2.996252) (xy 1.451297 3.001827) (xy 1.275339 3.005612)
			(xy 1.106 2.978522) (xy 1.082581 2.97105) (xy 0.967286 2.937929) (xy 0.900493 2.953469) (xy 0.844146 3.022173)
			(xy 0.79957 3.087022) (xy 0.757921 3.117247) (xy 0.692902 3.113982) (xy 0.578215 3.078359) (xy 0.464932 3.038514)
			(xy 0.326471 2.98029) (xy 0.234965 2.92368) (xy 0.214113 2.895486) (xy 0.207752 2.826835) (xy 1.048972 2.826835)
			(xy 1.097077 2.834672) (xy 1.160554 2.825674) (xy 1.161312 2.808967) (xy 1.09581 2.797284) (xy 1.067509 2.805104)
			(xy 1.048972 2.826835) (xy 0.207752 2.826835) (xy 0.204958 2.796687) (xy 0.201878 2.758456) (xy 0.187931 2.721724)
			(xy 0.141177 2.700392) (xy 0.04391 2.692408) (xy -0.12158 2.695719) (xy -0.275948 2.703051) (xy -0.488145 2.713076)
			(xy -0.613889 2.715103) (xy -0.664387 2.707726) (xy -0.650845 2.689538) (xy -0.59406 2.663142) (xy -0.490324 2.606146)
			(xy -0.441095 2.552777) (xy -0.440463 2.547913) (xy -0.399648 2.498137) (xy -0.34042 2.463327) (xy 0.065253 2.463327)
			(xy 0.071971 2.492422) (xy 0.09788 2.495953) (xy 0.138164 2.478047) (xy 0.130507 2.463327) (xy 0.072426 2.457469)
			(xy 0.065253 2.463327) (xy -0.34042 2.463327) (xy -0.298592 2.438743) (xy -0.269172 2.425697) (xy -0.173827 2.373603)
			(xy 0.04894 2.373603) (xy 0.07341 2.398073) (xy 0.09788 2.373603) (xy 0.07341 2.349133) (xy 0.04894 2.373603)
			(xy -0.173827 2.373603) (xy -0.158338 2.36514) (xy -0.100352 2.30565) (xy -0.097881 2.294533) (xy -0.078878 2.259209)
			(xy -0.065679 2.267141) (xy -0.006652 2.268905) (xy 0.029945 2.246708) (xy 0.091709 2.231392) (xy 0.186529 2.275601)
			(xy 0.294447 2.355665) (xy 0.40844 2.451512) (xy 0.45458 2.509738) (xy 0.443352 2.551409) (xy 0.407058 2.581948)
			(xy 0.349025 2.637747) (xy 0.372419 2.679208) (xy 0.389486 2.690456) (xy 0.452288 2.697021) (xy 0.513137 2.623046)
			(xy 0.532127 2.586141) (xy 0.573103 2.487414) (xy 0.563761 2.421957) (xy 0.4921 2.350975) (xy 0.448756 2.316613)
			(xy 0.331945 2.213768) (xy 0.299241 2.158879) (xy 0.346989 2.156559)
		)
		(stroke
			(width 0)
			(type solid)
		)
		(fill solid)
		(layer "F.SilkS")
		(uuid "eef9df0c-3091-4e4f-ab01-59c5dcee2ee4")
	)
	(fp_poly
		(pts
			(xy -1.437234 -4.041169) (xy -1.482951 -3.979013) (xy -1.554746 -3.896194) (xy -1.789873 -3.558454)
			(xy -1.950638 -3.17554) (xy -2.030838 -2.76954) (xy -2.024274 -2.36254) (xy -2.010278 -2.273479)
			(xy -1.888496 -1.846632) (xy -1.693318 -1.462536) (xy -1.43413 -1.135824) (xy -1.120318 -0.881133)
			(xy -1.115298 -0.87797) (xy -0.977965 -0.791694) (xy -0.878258 -0.728872) (xy -0.840712 -0.705002)
			(xy -0.844664 -0.65612) (xy -0.866697 -0.529989) (xy -0.903344 -0.344842) (xy -0.951137 -0.118907)
			(xy -0.959543 -0.080387) (xy -1.016459 0.173504) (xy -1.060743 0.348442) (xy -1.099288 0.461386)
			(xy -1.138989 0.529298) (xy -1.18674 0.569136) (xy -1.232448 0.590986) (xy -1.323314 0.646402) (xy -1.433218 0.736715)
			(xy -1.539953 0.83991) (xy -1.621316 0.933973) (xy -1.655099 0.99689) (xy -1.652081 1.007007) (xy -1.601928 0.9979)
			(xy -1.494757 0.954516) (xy -1.426797 0.922336) (xy -1.300826 0.86644) (xy -1.215303 0.840458) (xy -1.196977 0.842201)
			(xy -1.197957 0.896156) (xy -1.218078 1.024677) (xy -1.253727 1.20713) (xy -1.290175 1.374431) (xy -1.335116 1.588098)
			(xy -1.366258 1.767501) (xy -1.380177 1.890638) (xy -1.377082 1.93314) (xy -1.352377 1.923008) (xy -1.32558 1.838227)
			(xy -1.318006 1.798014) (xy -1.291326 1.671472) (xy -1.263841 1.592152) (xy -1.258735 1.585002) (xy -1.226332 1.611265)
			(xy -1.16624 1.703145) (xy -1.090784 1.836932) (xy -1.01229 1.988915) (xy -0.943082 2.135383) (xy -0.895487 2.252627)
			(xy -0.881227 2.311206) (xy -0.902803 2.396977) (xy -0.951305 2.50736) (xy -0.989001 2.607211) (xy -0.983863 2.664039)
			(xy -0.98274 2.664813) (xy -0.946486 2.638542) (xy -0.902345 2.544135) (xy -0.888591 2.502239) (xy -0.850938 2.401205)
			(xy -0.795565 2.330214) (xy -0.698749 2.269953) (xy -0.536768 2.201112) (xy -0.502037 2.187551) (xy -0.276221 2.099494)
			(xy -0.128811 2.043677) (xy -0.046299 2.018694) (xy -0.015175 2.023138) (xy -0.021932 2.055603) (xy -0.05306 2.114681)
			(xy -0.067695 2.14232) (xy -0.151808 2.239277) (xy -0.294778 2.348299) (xy -0.463102 2.449053) (xy -0.623274 2.521205)
			(xy -0.731074 2.544894) (xy -0.780999 2.582349) (xy -0.783045 2.596722) (xy -0.812518 2.62702) (xy -0.828461 2.620482)
			(xy -0.876493 2.636616) (xy -0.90517 2.691004) (xy -0.958823 2.770726) (xy -1.005038 2.789595) (xy -1.051278 2.756173)
			(xy -1.045444 2.716185) (xy -1.044685 2.653193) (xy -1.097379 2.652265) (xy -1.164779 2.701503) (xy -1.21308 2.734483)
			(xy -1.223507 2.696921) (xy -1.182457 2.635251) (xy -1.122859 2.607291) (xy -1.049802 2.558613) (xy -1.049448 2.509989)
			(xy -1.073964 2.430794) (xy -1.076686 2.41194) (xy -1.102557 2.42682) (xy -1.166039 2.498659) (xy -1.178119 2.513824)
			(xy -1.262017 2.602111) (xy -1.328923 2.64251) (xy -1.332525 2.642774) (xy -1.342863 2.612421) (xy -1.294489 2.539142)
			(xy -1.292268 2.536595) (xy -1.233314 2.464419) (xy -1.240056 2.447852) (xy -1.284682 2.461649) (xy -1.355451 2.464701)
			(xy -1.370328 2.439769) (xy -1.331745 2.407149) (xy -1.275608 2.411427) (xy -1.185084 2.402853) (xy -1.154793 2.368194)
			(xy -1.158047 2.308622) (xy -1.178991 2.300192) (xy -1.21016 2.273326) (xy -1.205154 2.26115) (xy -1.208913 2.193224)
			(xy -1.231353 2.151035) (xy -1.265991 2.110204) (xy -1.257272 2.155719) (xy -1.25413 2.165607) (xy -1.254559 2.236215)
			(xy -1.279689 2.251252) (xy -1.312329 2.210858) (xy -1.310533 2.13478) (xy -1.318754 2.032677) (xy -1.402621 1.951217)
			(xy -1.422495 1.939019) (xy -1.537991 1.882735) (xy -1.624695 1.85973) (xy -1.683084 1.817624) (xy -1.735117 1.714851)
			(xy -1.739494 1.70089) (xy -1.826046 1.547619) (xy -1.943491 1.443954) (xy -2.060869 1.330678) (xy -2.105526 1.198269)
			(xy -2.071971 1.073416) (xy -2.029392 1.026393) (xy -1.976086 0.951497) (xy -1.974065 0.910285) (xy -1.960726 0.835571)
			(xy -1.91452 0.763119) (xy -1.886865 0.721638) (xy -1.800093 0.721638) (xy -1.77204 0.730893) (xy -1.680503 0.696366)
			(xy -1.546989 0.626466) (xy -1.410519 0.544026) (xy -1.319264 0.481007) (xy -1.293368 0.452168) (xy -1.3475 0.458118)
			(xy -1.453507 0.501691) (xy -1.581357 0.566918) (xy -1.70102 0.637828) (xy -1.782465 0.698452) (xy -1.800093 0.721638)
			(xy -1.886865 0.721638) (xy -1.88488 0.718661) (xy -1.91738 0.722717) (xy -2.020939 0.777465) (xy -2.056102 0.797662)
			(xy -2.215207 0.876159) (xy -2.314328 0.885822) (xy -2.365938 0.823623) (xy -2.381467 0.718691) (xy -2.401704 0.588877)
			(xy -2.441667 0.543034) (xy -2.494793 0.587627) (xy -2.502057 0.599926) (xy -2.573752 0.671001) (xy -2.620737 0.685163)
			(xy -2.684889 0.711209) (xy -2.670957 0.776349) (xy -2.618305 0.831984) (xy -2.548132 0.943728) (xy -2.567706 1.081672)
			(xy -2.674991 1.238017) (xy -2.74152 1.303521) (xy -2.883989 1.442736) (xy -3.043951 1.614324) (xy -3.145278 1.731621)
			(xy -3.352409 1.982081) (xy -3.095472 1.769527) (xy -2.968545 1.671353) (xy -2.876717 1.613351) (xy -2.838699 1.607213)
			(xy -2.838536 1.608935) (xy -2.814752 1.648468) (xy -2.760857 1.626624) (xy -2.703037 1.562098) (xy -2.670729 1.489137)
			(xy -2.609687 1.390305) (xy -2.536377 1.370327) (xy -2.465078 1.376508) (xy -2.471569 1.411689) (xy -2.514952 1.462161)
			(xy -2.569805 1.532586) (xy -2.555554 1.567923) (xy -2.518008 1.584714) (xy -2.442981 1.577422) (xy -2.412307 1.51735)
			(xy -2.365124 1.437737) (xy -2.323537 1.419268) (xy -2.280841 1.456915) (xy -2.284704 1.512145) (xy -2.274823 1.653998)
			(xy -2.185848 1.797913) (xy -2.064603 1.899054) (xy -1.961394 2.001404) (xy -1.920491 2.104431) (xy -1.865795 2.239831)
			(xy -1.753857 2.34882) (xy -1.620294 2.397759) (xy -1.609607 2.398073) (xy -1.540577 2.424588) (xy -1.517524 2.518864)
			(xy -1.517149 2.541342) (xy -1.472745 2.684772) (xy -1.355762 2.815385) (xy -1.19054 2.906686) (xy -1.177524 2.911007)
			(xy -1.112247 2.97039) (xy -1.111675 3.065353) (xy -1.166975 3.166878) (xy -1.269312 3.245949) (xy -1.281089 3.251209)
			(xy -1.419366 3.348858) (xy -1.553844 3.507985) (xy -1.660056 3.694393) (xy -1.710246 3.85107) (xy -1.73738 4.00864)
			(xy -2.037475 3.847992) (xy -2.572533 3.507224) (xy -3.048902 3.093343) (xy -3.460023 2.616079) (xy -3.799336 2.085163)
			(xy -4.060283 1.510324) (xy -4.236305 0.901293) (xy -4.30249 0.487888) (xy -4.311381 0.326026) (xy -3.942065 0.326026)
			(xy -3.90524 0.380819) (xy -3.866282 0.391522) (xy -3.802466 0.356287) (xy -3.794961 0.345963) (xy -3.79814 0.287947)
			(xy -3.856976 0.256952) (xy -3.91602 0.269665) (xy -3.942065 0.326026) (xy -4.311381 0.326026) (xy -4.324635 0.084719)
			(xy -4.310602 -0.346249) (xy -4.291162 -0.516522) (xy -2.519868 -0.516522) (xy -2.488642 -0.456123)
			(xy -2.426089 -0.424291) (xy -2.380879 -0.463987) (xy -2.376688 -0.549061) (xy -2.383847 -0.571859)
			(xy -2.422353 -0.612719) (xy -2.477803 -0.582039) (xy -2.519868 -0.516522) (xy -4.291162 -0.516522)
			(xy -4.263185 -0.761576) (xy -4.203399 -1.052216) (xy -4.12534 -1.294558) (xy -4.009826 -1.583922)
			(xy -3.916615 -1.788831) (xy -3.026959 -1.788831) (xy -3.018557 -1.742183) (xy -2.939996 -1.699691)
			(xy -2.936416 -1.698729) (xy -2.855268 -1.639668) (xy -2.835434 -1.582906) (xy -2.827511 -1.530874)
			(xy -2.803426 -1.566055) (xy -2.788071 -1.602794) (xy -2.726245 -1.687964) (xy -2.668822 -1.71291)
			(xy -2.601173 -1.734869) (xy -2.609575 -1.781517) (xy -2.688135 -1.824009) (xy -2.691715 -1.824971)
			(xy -2.772863 -1.884032) (xy -2.792698 -1.940794) (xy -2.80062 -1.992826) (xy -2.824706 -1.957645)
			(xy -2.840061 -1.920906) (xy -2.901887 -1.835736) (xy -2.95931 -1.81079) (xy -3.026959 -1.788831)
			(xy -3.916615 -1.788831) (xy -3.872748 -1.885265) (xy -3.729995 -2.163541) (xy -3.604276 -2.373603)
			(xy -3.316056 -2.749706) (xy -2.972614 -3.108496) (xy -2.59327 -3.434559) (xy -2.197341 -3.712481)
			(xy -1.804144 -3.926849) (xy -1.518341 -4.037993) (xy -1.450296 -4.055901)
		)
		(stroke
			(width 0)
			(type solid)
		)
		(fill solid)
		(layer "F.SilkS")
		(uuid "9b1a873c-8ed1-428e-b120-27fd810925fc")
	)
	(fp_poly
		(pts
			(xy 0.611451 -5.28366) (xy 1.270871 -5.167877) (xy 1.91478 -4.968231) (xy 2.534928 -4.684722) (xy 3.123069 -4.317349)
			(xy 3.670955 -3.866113) (xy 3.794909 -3.745969) (xy 4.266169 -3.208915) (xy 4.653566 -2.629637) (xy 4.957099 -2.016381)
			(xy 5.176769 -1.377396) (xy 5.312576 -0.72093) (xy 5.36452 -0.055232) (xy 5.3326 0.611451) (xy 5.216817 1.270871)
			(xy 5.017171 1.91478) (xy 4.733661 2.534928) (xy 4.366288 3.123069) (xy 3.915052 3.670955) (xy 3.794909 3.794909)
			(xy 3.252006 4.270702) (xy 2.660132 4.664693) (xy 2.027225 4.974119) (xy 1.361222 5.196213) (xy 0.670059 5.328211)
			(xy -0.038326 5.367348) (xy -0.611754 5.329981) (xy -1.303932 5.198975) (xy -1.876184 5.007984) (xy -0.861629 5.007984)
			(xy -0.81759 5.096454) (xy -0.703395 5.133165) (xy -0.60124 5.137979) (xy -0.460854 5.110415) (xy -0.388209 5.034657)
			(xy -0.367174 4.93481) (xy 0 4.93481) (xy 0.007818 5.06414) (xy 0.027162 5.146928) (xy 0.032627 5.155041)
			(xy 0.114899 5.183869) (xy 0.245872 5.186624) (xy 0.380972 5.1669) (xy 0.475624 5.128295) (xy 0.485902 5.118475)
			(xy 0.513634 5.032711) (xy 0.50738 4.914955) (xy 0.475365 4.802923) (xy 0.425818 4.734334) (xy 0.400646 4.72763)
			(xy 0.314706 4.732954) (xy 0.183641 4.739329) (xy 0.171291 4.739865) (xy 0.059905 4.751487) (xy 0.011648 4.793321)
			(xy 0.000196 4.895323) (xy 0 4.93481) (xy -0.367174 4.93481) (xy -0.362492 4.912585) (xy -0.394474 4.79298)
			(xy -0.469371 4.712254) (xy -0.522517 4.698266) (xy 0.783044 4.698266) (xy 0.823935 4.738331) (xy 0.878707 4.747206)
			(xy 0.953424 4.777232) (xy 0.998426 4.880273) (xy 1.006504 4.918497) (xy 1.045589 5.049876) (xy 1.085203 5.088808)
			(xy 1.109601 5.039361) (xy 1.10304 4.905606) (xy 1.101156 4.894027) (xy 1.086558 4.766548) (xy 1.104037 4.709394)
			(xy 1.145794 4.698266) (xy 1.492678 4.698266) (xy 1.507263 4.737149) (xy 1.560312 4.747206) (xy 1.601927 4.737628)
			(xy 2.014729 4.737628) (xy 2.059704 4.729679) (xy 2.155879 4.646817) (xy 2.156468 4.646229) (xy 2.266216 4.574393)
			(xy 2.364464 4.553765) (xy 2.480318 4.557508) (xy 2.513495 4.536619) (xy 2.464399 4.480468) (xy 2.370086 4.405986)
			(xy 2.217043 4.300832) (xy 2.121137 4.266351) (xy 2.071079 4.303229) (xy 2.055577 4.412152) (xy 2.055491 4.425091)
			(xy 2.047046 4.56364) (xy 2.026642 4.667491) (xy 2.025785 4.669793) (xy 2.014729 4.737628) (xy 1.601927 4.737628)
			(xy 1.6552 4.725367) (xy 1.688439 4.698266) (xy 1.673854 4.659382) (xy 1.620805 4.649325) (xy 1.525917 4.671164)
			(xy 1.492678 4.698266) (xy 1.145794 4.698266) (xy 1.213586 4.670042) (xy 1.223506 4.643208) (xy 1.181009 4.609776)
			(xy 1.070568 4.618738) (xy 0.941245 4.640554) (xy 0.850337 4.649325) (xy 0.789236 4.677819) (xy 0.783044 4.698266)
			(xy -0.522517 4.698266) (xy -0.525059 4.697597) (xy -0.64571 4.684238) (xy -0.714989 4.669218) (xy -0.781994 4.664222)
			(xy -0.820867 4.710369) (xy -0.848242 4.829614) (xy -0.851462 4.849358) (xy -0.861629 5.007984) (xy -1.876184 5.007984)
			(xy -1.972528 4.975829) (xy -2.210995 4.859269) (xy -1.648748 4.859269) (xy -1.60148 4.901269) (xy -1.515356 4.937579)
			(xy -1.386569 4.976904) (xy -1.286424 4.986945) (xy -1.240859 4.96682) (xy -1.24565 4.946732) (xy -1.309385 4.904954)
			(xy -1.420256 4.869339) (xy -1.513262 4.834158) (xy -1.53924 4.792662) (xy -1.537927 4.790173) (xy -1.474022 4.764457)
			(xy -1.415149 4.772983) (xy -1.335684 4.781536) (xy -1.333077 4.741183) (xy -1.407033 4.66585) (xy -1.451066 4.62429)
			(xy -1.426624 4.613079) (xy -1.320533 4.627283) (xy -1.309153 4.629196) (xy -1.179433 4.641229) (xy -1.128956 4.625368)
			(xy -1.164586 4.588388) (xy -1.235742 4.556769) (xy -1.400752 4.497563) (xy -1.498544 4.478869) (xy -1.553612 4.506997)
			(xy -1.590449 4.58826) (xy -1.610445 4.653324) (xy -1.648149 4.787345) (xy -1.648748 4.859269) (xy -2.210995 4.859269)
			(xy -2.607837 4.665297) (xy -2.824536 4.521458) (xy -2.436545 4.521458) (xy -2.390463 4.575661) (xy -2.312428 4.621333)
			(xy -2.160159 4.683919) (xy -2.053343 4.687395) (xy -2.007281 4.631847) (xy -2.006551 4.619619) (xy -2.036643 4.56405)
			(xy -2.079962 4.569143) (xy -2.187009 4.578371) (xy -2.27377 4.538045) (xy -2.300193 4.482152) (xy -2.273313 4.398424)
			(xy -2.232958 4.331383) (xy -2.18408 4.276038) (xy -2.138009 4.279779) (xy -2.064153 4.349146) (xy -2.042839 4.372027)
			(xy -1.95842 4.452834) (xy -1.912139 4.462472) (xy -1.890864 4.428812) (xy -1.909339 4.346648) (xy -2.019808 4.256646)
			(xy -2.147611 4.18471) (xy -2.22637 4.172273) (xy -2.289171 4.225586) (xy -2.34967 4.318979) (xy -2.421699 4.446027)
			(xy -2.436545 4.521458) (xy -2.824536 4.521458) (xy -3.200159 4.272129) (xy -3.477976 4.029619) (xy -3.205588 4.029619)
			(xy -3.044598 4.072201) (xy -2.89137 4.154336) (xy -2.829126 4.247469) (xy -2.79602 4.32064) (xy -2.774114 4.328049)
			(xy -2.753378 4.258762) (xy -2.730803 4.140276) (xy -2.711552 3.975198) (xy -2.722354 3.871527) (xy -2.732456 3.854904)
			(xy -2.804753 3.847195) (xy -2.937243 3.893035) (xy -2.991769 3.919515) (xy -3.205588 4.029619) (xy -3.477976 4.029619)
			(xy -3.739791 3.801077) (xy -3.745969 3.794909) (xy -3.950642 3.561661) (xy -3.681853 3.561661) (xy -3.681375 3.607035)
			(xy -3.633822 3.598333) (xy -3.590085 3.566809) (xy -3.524108 3.537915) (xy -3.449734 3.578106) (xy -3.411935 3.613712)
			(xy -3.30771 3.693251) (xy -3.227373 3.685295) (xy -3.161517 3.608212) (xy -3.143379 3.537958) (xy -3.186784 3.453509)
			(xy -3.253183 3.378282) (xy -3.395913 3.229305) (xy -3.555782 3.384257) (xy -3.638806 3.481104) (xy -3.681853 3.561661)
			(xy -3.950642 3.561661) (xy -4.217229 3.257855) (xy -4.472688 2.875864) (xy -4.269319 2.875864) (xy -4.156477 3.028491)
			(xy -4.049066 3.14625) (xy -3.95979 3.175007) (xy -3.875441 3.118486) (xy -3.868026 3.109809) (xy -3.836212 3.03663)
			(xy -3.87357 2.946671) (xy -3.886504 2.927629) (xy -3.950217 2.819225) (xy -3.957787 2.765516) (xy -3.911114 2.777921)
			(xy -3.867436 2.813021) (xy -3.803919 2.890412) (xy -3.794824 2.939575) (xy -3.785462 2.996748) (xy -3.772581 3.007243)
			(xy -3.713077 3.018026) (xy -3.69771 2.965071) (xy -3.726179 2.87185) (xy -3.775364 2.790644) (xy -3.868252 2.683127)
			(xy -3.949305 2.653582) (xy -4.048933 2.699465) (xy -4.128976 2.761079) (xy -4.269319 2.875864) (xy -4.472688 2.875864)
			(xy -4.604626 2.678576) (xy -4.908159 2.06532) (xy -5.127829 1.426336) (xy -5.263636 0.76987) (xy -5.31558 0.104171)
			(xy -5.311893 0.027166) (xy -4.476231 0.027166) (xy -4.429939 0.66492) (xy -4.291835 1.2913) (xy -4.064243 1.890016)
			(xy -3.740304 2.481046) (xy -3.353943 2.997584) (xy -2.901001 3.44379) (xy -2.377316 3.823824) (xy -1.841076 4.113183)
			(xy -1.451048 4.274402) (xy -1.049582 4.394933) (xy -0.609477 4.481327) (xy -0.103529 4.540133) (xy -0.048941 4.544694)
			(xy 0.030476 4.542012) (xy 0.180386 4.529786) (xy 0.374121 4.510324) (xy 0.464932 4.500228) (xy 0.89104 4.438647)
			(xy 1.258527 4.354125) (xy 1.605851 4.236218) (xy 1.890016 4.113183) (xy 2.068999 4.015084) (xy 2.593834 4.015084)
			(xy 2.620243 4.083337) (xy 2.683119 4.184408) (xy 2.757938 4.283993) (xy 2.820172 4.347789) (xy 2.837353 4.355684)
			(xy 2.889419 4.326684) (xy 2.984755 4.253988) (xy 3.024116 4.221098) (xy 3.181529 4.086512) (xy 3.078637 3.927456)
			(xy 3.002181 3.825301) (xy 2.941365 3.77106) (xy 2.93161 3.7684) (xy 2.891692 3.786603) (xy 2.910847 3.850618)
			(xy 2.979835 3.956607) (xy 3.039157 4.048663) (xy 3.036985 4.103705) (xy 2.969071 4.164111) (xy 2.958213 4.172294)
			(xy 2.878775 4.224571) (xy 2.828072 4.215209) (xy 2.770638 4.133402) (xy 2.757421 4.111119) (xy 2.679647 4.002945)
			(xy 2.620939 3.964453) (xy 2.594272 4.00326) (xy 2.593834 4.015084) (xy 2.068999 4.015084) (xy 2.481046 3.789244)
			(xy 2.77147 3.572012) (xy 3.188181 3.572012) (xy 3.199059 3.598099) (xy 3.276316 3.56489) (xy 3.283137 3.560819)
			(xy 3.366607 3.527203) (xy 3.431103 3.563836) (xy 3.466663 3.607518) (xy 3.550739 3.688676) (xy 3.618501 3.717634)
			(xy 3.637384 3.68988) (xy 3.582495 3.60793) (xy 3.54509 3.566199) (xy 3.457799 3.455551) (xy 3.451967 3.396953)
			(xy 3.462524 3.390829) (xy 3.516582 3.3292) (xy 3.523699 3.289789) (xy 3.501793 3.261614) (xy 3.431467 3.304846)
			(xy 3.352408 3.376878) (xy 3.240394 3.495361) (xy 3.188181 3.572012) (xy 2.77147 3.572012) (xy 2.997584 3.402883)
			(xy 3.386972 3.007616) (xy 3.690167 3.007616) (xy 3.745344 3.063709) (xy 3.817341 3.127114) (xy 3.952514 3.235839)
			(xy 4.031056 3.274723) (xy 4.061123 3.247294) (xy 4.062042 3.232946) (xy 4.026468 3.166664) (xy 4.013102 3.156647)
			(xy 3.969479 3.104933) (xy 3.994478 3.027575) (xy 4.035117 2.969253) (xy 4.106022 2.908726) (xy 4.193324 2.928268)
			(xy 4.204852 2.934269) (xy 4.283224 2.964191) (xy 4.306075 2.931611) (xy 4.306138 2.925903) (xy 4.270339 2.861738)
			(xy 4.184596 2.787025) (xy 4.079878 2.721394) (xy 3.987154 2.684474) (xy 3.938843 2.693087) (xy 3.949651 2.748437)
			(xy 3.98369 2.770001) (xy 4.030649 2.800429) (xy 4.018798 2.855141) (xy 3.981433 2.916063) (xy 3.898258 3.000959)
			(xy 3.789894 3.008582) (xy 3.775277 3.005667) (xy 3.701716 2.992806) (xy 3.690167 3.007616) (xy 3.386972 3.007616)
			(xy 3.44379 2.94994) (xy 3.823824 2.426256) (xy 4.113183 1.890016) (xy 4.342323 1.286098) (xy 4.479652 0.659575)
			(xy 4.525171 0.021773) (xy 4.478878 -0.61598) (xy 4.340775 -1.24236) (xy 4.113183 -1.841076) (xy 3.789244 -2.432106)
			(xy 3.402883 -2.948645) (xy 2.94994 -3.394851) (xy 2.697443 -3.578086) (xy 3.034109 -3.578086) (xy 3.065555 -3.56308)
			(xy 3.148702 -3.616466) (xy 3.179348 -3.644355) (xy 3.279853 -3.72975) (xy 3.346667 -3.749477) (xy 3.399579 -3.720929)
			(xy 3.46474 -3.678011) (xy 3.476368 -3.695399) (xy 3.442161 -3.757036) (xy 3.369818 -3.846866) (xy 3.308985 -3.909875)
			(xy 3.20223 -3.998142) (xy 3.129109 -4.028964) (xy 3.112194 -4.020364) (xy 3.122699 -3.959962) (xy 3.167545 -3.921845)
			(xy 3.220578 -3.882425) (xy 3.212044 -3.835449) (xy 3.144104 -3.756627) (xy 3.05881 -3.647323) (xy 3.034109 -3.578086)
			(xy 2.697443 -3.578086) (xy 2.426256 -3.774884) (xy 1.890016 -4.064243) (xy 1.588769 -4.178543) (xy 2.153372 -4.178543)
			(xy 2.193222 -4.163733) (xy 2.239017 -4.166875) (xy 2.35425 -4.15334) (xy 2.466697 -4.096401) (xy 2.537202 -4.019095)
			(xy 2.544894 -3.98691) (xy 2.571871 -3.922895) (xy 2.593834 -3.915222) (xy 2.621893 -3.959207) (xy 2.639597 -4.071543)
			(xy 2.642774 -4.157035) (xy 2.635402 -4.301596) (xy 2.616616 -4.400505) (xy 2.603119 -4.423356) (xy 2.545141 -4.413287)
			(xy 2.438719 -4.366688) (xy 2.316543 -4.301357) (xy 2.211307 -4.235089) (xy 2.155703 -4.185679) (xy 2.153372 -4.178543)
			(xy 1.588769 -4.178543) (xy 1.286098 -4.293383) (xy 0.659575 -4.430713) (xy 0.021773 -4.476231) (xy -0.61598 -4.429939)
			(xy -1.24236 -4.291835) (xy -1.841076 -4.064243) (xy -2.432106 -3.740304) (xy -2.948645 -3.353943)
			(xy -3.394851 -2.901001) (xy -3.774884 -2.377316) (xy -4.064243 -1.841076) (xy -4.293383 -1.237158)
			(xy -4.430713 -0.610635) (xy -4.476231 0.027166) (xy -5.311893 0.027166) (xy -5.28366 -0.562512)
			(xy -5.167877 -1.221932) (xy -4.968231 -1.86584) (xy -4.684722 -2.485989) (xy -4.317349 -3.07413)
			(xy -3.866113 -3.622015) (xy -3.745969 -3.745969) (xy -3.646378 -3.833359) (xy -3.27761 -3.833359)
			(xy -3.268383 -3.717793) (xy -3.246272 -3.581567) (xy -3.217376 -3.459201) (xy -3.187794 -3.38522)
			(xy -3.176525 -3.376879) (xy -3.139231 -3.417452) (xy -3.132178 -3.464971) (xy -3.089909 -3.589646)
			(xy -2.977308 -3.660886) (xy -2.902158 -3.670521) (xy -2.814951 -3.686905) (xy -2.789596 -3.71486)
			(xy -2.831181 -3.752438) (xy -2.93309 -3.802342) (xy -3.06105 -3.851753) (xy -3.180788 -3.887852)
			(xy -3.258032 -3.89782) (xy -3.267851 -3.893742) (xy -3.27761 -3.833359) (xy -3.646378 -3.833359)
			(xy -3.208915 -4.217229) (xy -3.038472 -4.331214) (xy -2.595151 -4.331214) (xy -2.497332 -4.172158)
			(xy -2.423051 -4.062151) (xy -2.359435 -4.022854) (xy -2.273275 -4.048009) (xy -2.166629 -4.109825)
			(xy -2.054757 -4.201969) (xy -2.037279 -4.280933) (xy -2.087953 -4.347534) (xy -2.137628 -4.340267)
			(xy -2.153372 -4.283996) (xy -2.192144 -4.205069) (xy -2.24625 -4.162601) (xy -2.327027 -4.142644)
			(xy -2.394219 -4.198442) (xy -2.412868 -4.225435) (xy -2.45911 -4.311713) (xy -2.440585 -4.362899)
			(xy -2.395335 -4.394977) (xy -2.286041 -4.428157) (xy -2.222039 -4.420503) (xy -2.161898 -4.415856)
			(xy -2.162985 -4.458001) (xy -2.225871 -4.529951) (xy -2.332306 -4.521184) (xy -2.459907 -4.441835)
			(xy -2.595151 -4.331214) (xy -3.038472 -4.331214) (xy -2.629637 -4.604626) (xy -2.20495 -4.814826)
			(xy -1.644381 -4.814826) (xy -1.633662 -4.710501) (xy -1.585401 -4.544183) (xy -1.530429 -4.458801)
			(xy -1.451255 -4.438009) (xy -1.361486 -4.456101) (xy -1.23898 -4.500966) (xy -1.159101 -4.547365)
			(xy -1.157949 -4.548487) (xy -1.151052 -4.574338) (xy 1.321387 -4.574338) (xy 1.360096 -4.501981)
			(xy 1.454944 -4.446326) (xy 1.574014 -4.414256) (xy 1.685386 -4.412655) (xy 1.757143 -4.448405) (xy 1.767967 -4.478035)
			(xy 1.782041 -4.588212) (xy 1.809932 -4.658631) (xy 1.823235 -4.680486) (xy 1.822625 -4.753654) (xy 1.739712 -4.821601)
			(xy 1.589823 -4.872099) (xy 1.580702 -4.873975) (xy 1.466496 -4.881279) (xy 1.408469 -4.835103) (xy 1.399177 -4.814382)
			(xy 1.407267 -4.719168) (xy 1.481992 -4.637366) (xy 1.593794 -4.600485) (xy 1.599912 -4.600386) (xy 1.658795 -4.570661)
			(xy 1.663969 -4.551445) (xy 1.629431 -4.507144) (xy 1.549426 -4.513908) (xy 1.459363 -4.567673) (xy 1.450729 -4.575916)
			(xy 1.367161 -4.642017) (xy 1.327332 -4.624516) (xy 1.321387 -4.574338) (xy -1.151052 -4.574338)
			(xy -1.136986 -4.627064) (xy -1.153651 -4.745998) (xy -1.196299 -4.861074) (xy -1.203514 -4.869557)
			(xy -0.587284 -4.869557) (xy -0.587284 -4.649326) (xy -0.397515 -4.649326) (xy -0.261805 -4.664219)
			(xy -0.167321 -4.701027) (xy -0.15968 -4.708104) (xy 0.397873 -4.708104) (xy 0.428354 -4.661739)
			(xy 0.525795 -4.641109) (xy 0.569586 -4.636363) (xy 0.700409 -4.621792) (xy 0.78614 -4.61032) (xy 0.795279 -4.608613)
			(xy 0.831023 -4.636714) (xy 0.831984 -4.647108) (xy 0.789208 -4.685973) (xy 0.683978 -4.721178) (xy 0.661122 -4.725885)
			(xy 0.548494 -4.764013) (xy 0.522614 -4.808349) (xy 0.584886 -4.841357) (xy 0.651347 -4.848189) (xy 0.721089 -4.853638)
			(xy 0.707594 -4.873032) (xy 0.636223 -4.907267) (xy 0.562606 -4.944148) (xy 0.564397 -4.96333) (xy 0.651127 -4.976047)
			(xy 0.698423 -4.980591) (xy 0.819445 -5.004998) (xy 0.85185 -5.038935) (xy 0.802585 -5.07075) (xy 0.678595 -5.088791)
			(xy 0.633335 -5.089788) (xy 0.492768 -5.074941) (xy 0.440946 -5.029306) (xy 0.440462 -5.022495) (xy 0.431257 -4.928034)
			(xy 0.41053 -4.805544) (xy 0.397873 -4.708104) (xy -0.15968 -4.708104) (xy -0.156588 -4.710968) (xy -0.130815 -4.793458)
			(xy -0.135684 -4.910834) (xy -0.163823 -5.025386) (xy -0.20786 -5.099403) (xy -0.234473 -5.109364)
			(xy -0.324008 -5.103478) (xy -0.440463 -5.097129) (xy -0.530829 -5.085789) (xy -0.573598 -5.045458)
			(xy -0.586496 -4.948657) (xy -0.587284 -4.869557) (xy -1.203514 -4.869557) (xy -1.253288 -4.928074)
			(xy -1.25846 -4.930148) (xy -1.292005 -4.917943) (xy -1.282844 -4.835152) (xy -1.271381 -4.792429)
			(xy -1.243673 -4.657215) (xy -1.26789 -4.582855) (xy -1.354543 -4.541513) (xy -1.367463 -4.538014)
			(xy -1.44139 -4.541581) (xy -1.49428 -4.613228) (xy -1.518842 -4.678927) (xy -1.570874 -4.794632)
			(xy -1.618088 -4.841407) (xy -1.644381 -4.814826) (xy -2.20495 -4.814826) (xy -2.016381 -4.908159)
			(xy -1.377396 -5.127829) (xy -0.72093 -5.263636) (xy -0.055232 -5.31558)
		)
		(stroke
			(width 0)
			(type solid)
		)
		(fill solid)
		(layer "F.SilkS")
		(uuid "9e4afc67-a038-4484-a9ff-4818b56d94f1")
	)
)
