(footprint "Micro-Lock-Plus-18p-5054331831"
	(version 20240108)
	(generator "pcbnew")
	(generator_version "8.0")
	(layer "F.Cu")
	(tags "5054331831 ")
	(property "Reference" "REF**"
		(at -5 -7.62 0)
		(unlocked yes)
		(layer "F.SilkS")
		(hide yes)
		(uuid "8841a218-ca06-47c3-9a76-2b1bc160c83e")
		(effects
			(font
				(size 1 1)
				(thickness 0.15)
			)
		)
	)
	(property "Value" "CON_5054331831"
		(at -5 -6 0)
		(unlocked yes)
		(layer "F.Fab")
		(hide yes)
		(uuid "472b8b40-fec6-40bd-ab6c-30923887ab27")
		(effects
			(font
				(size 1 1)
				(thickness 0.15)
			)
		)
	)
	(property "Footprint" ""
		(at 0 0 0)
		(layer "F.Fab")
		(hide yes)
		(uuid "bc1e5b2a-758b-4e5e-af87-10297a97768b")
		(effects
			(font
				(size 1.27 1.27)
				(thickness 0.15)
			)
		)
	)
	(property "Datasheet" ""
		(at 0 0 0)
		(layer "F.Fab")
		(hide yes)
		(uuid "9dee60d9-c18f-4194-a1f4-76a3829ae08e")
		(effects
			(font
				(size 1.27 1.27)
				(thickness 0.15)
			)
		)
	)
	(property "Description" ""
		(at 0 0 0)
		(layer "F.Fab")
		(hide yes)
		(uuid "005e2ec3-f27f-4428-8a68-bc6cc97f3466")
		(effects
			(font
				(size 1.27 1.27)
				(thickness 0.15)
			)
		)
	)
	(attr smd)
	(fp_line
		(start -12.924983 -1.16)
		(end -12.924983 -0.287615)
		(stroke
			(width 0.1524)
			(type solid)
		)
		(layer "F.SilkS")
		(uuid "c19e64ff-a1e6-4e32-85f7-d77ca3436e16")
	)
	(fp_line
		(start -12.924983 4.967616)
		(end -12.924983 7.89)
		(stroke
			(width 0.1524)
			(type solid)
		)
		(layer "F.SilkS")
		(uuid "6cc7c787-6559-475b-b635-2921778a0399")
	)
	(fp_line
		(start -12.924983 7.89)
		(end -10.72004 7.89)
		(stroke
			(width 0.1524)
			(type solid)
		)
		(layer "F.SilkS")
		(uuid "e42db035-61bc-40bc-9fb1-9e2325e8eef6")
	)
	(fp_line
		(start -0.635 -2.938)
		(end 0 -1.414)
		(stroke
			(width 0.1524)
			(type solid)
		)
		(layer "F.SilkS")
		(uuid "d5495d26-5ed2-49c5-bfce-893668abfe75")
	)
	(fp_line
		(start 0 -1.414)
		(end 0.635 -2.938)
		(stroke
			(width 0.1524)
			(type solid)
		)
		(layer "F.SilkS")
		(uuid "9fa2e74b-b7a0-4896-ab72-c75c0208d46e")
	)
	(fp_line
		(start 0.635 -2.938)
		(end -0.635 -2.938)
		(stroke
			(width 0.1524)
			(type solid)
		)
		(layer "F.SilkS")
		(uuid "b7cc5a96-f249-42e8-b1e0-73d41224de9b")
	)
	(fp_line
		(start 0.72004 7.89)
		(end 2.924985 7.89)
		(stroke
			(width 0.1524)
			(type solid)
		)
		(layer "F.SilkS")
		(uuid "6b3ccafe-44ff-4081-8f39-94f9efd4a952")
	)
	(fp_line
		(start 2.924985 -1.16)
		(end -12.924983 -1.16)
		(stroke
			(width 0.1524)
			(type solid)
		)
		(layer "F.SilkS")
		(uuid "8c990005-648c-4016-b592-820c5e518dca")
	)
	(fp_line
		(start 2.924985 -0.292447)
		(end 2.924985 -1.16)
		(stroke
			(width 0.1524)
			(type solid)
		)
		(layer "F.SilkS")
		(uuid "8d957ed1-9372-4a89-a06c-f5bd41428bbe")
	)
	(fp_line
		(start 2.924985 7.89)
		(end 2.924985 4.972448)
		(stroke
			(width 0.1524)
			(type solid)
		)
		(layer "F.SilkS")
		(uuid "49acfae0-d32e-4c50-ad0a-e486adbef93a")
	)
	(fp_line
		(start -14.194983 -2.43)
		(end -14.194983 9.16)
		(stroke
			(width 0.127)
			(type solid)
		)
		(layer "F.CrtYd")
		(uuid "25fc8c85-2be2-4005-aa45-07784e4bb0b2")
	)
	(fp_line
		(start -14.194983 9.16)
		(end 4.194985 9.16)
		(stroke
			(width 0.127)
			(type solid)
		)
		(layer "F.CrtYd")
		(uuid "71c773c7-a6ac-4cb1-9e9b-1616d8310fc6")
	)
	(fp_line
		(start 4.194985 -2.43)
		(end -14.194983 -2.43)
		(stroke
			(width 0.127)
			(type solid)
		)
		(layer "F.CrtYd")
		(uuid "9b4ee71d-e9c1-49c2-a37c-0899d40a3c76")
	)
	(fp_line
		(start 4.194985 9.16)
		(end 4.194985 -2.43)
		(stroke
			(width 0.127)
			(type solid)
		)
		(layer "F.CrtYd")
		(uuid "f4a48c10-2aba-4d6f-91b0-d0606a171e77")
	)
	(fp_line
		(start -12.924983 -1.16)
		(end -12.924983 7.89)
		(stroke
			(width 0.127)
			(type solid)
		)
		(layer "F.Fab")
		(uuid "3e02f0d9-7463-4df9-a54c-3e1346150a6c")
	)
	(fp_line
		(start -12.924983 7.89)
		(end 2.924985 7.89)
		(stroke
			(width 0.127)
			(type solid)
		)
		(layer "F.Fab")
		(uuid "f8efca04-3b63-46a5-b7dd-6ad91b0a0976")
	)
	(fp_line
		(start -0.635 -2.938)
		(end 0 -1.414)
		(stroke
			(width 0.127)
			(type solid)
		)
		(layer "F.Fab")
		(uuid "525662c1-cf61-4516-af5a-ccb00a6b8dec")
	)
	(fp_line
		(start 0 -1.414)
		(end 0.635 -2.938)
		(stroke
			(width 0.127)
			(type solid)
		)
		(layer "F.Fab")
		(uuid "1cc9433d-8a21-4bb8-b6c3-a2df78dc390f")
	)
	(fp_line
		(start 0.635 -2.938)
		(end -0.635 -2.938)
		(stroke
			(width 0.127)
			(type solid)
		)
		(layer "F.Fab")
		(uuid "a415f746-32a6-4957-96af-687a57c8cfe5")
	)
	(fp_line
		(start 2.924985 -1.16)
		(end -12.924983 -1.16)
		(stroke
			(width 0.127)
			(type solid)
		)
		(layer "F.Fab")
		(uuid "d031fafc-7b6b-4cea-bab8-55d0222dae97")
	)
	(fp_line
		(start 2.924985 7.89)
		(end 2.924985 -1.16)
		(stroke
			(width 0.127)
			(type solid)
		)
		(layer "F.Fab")
		(uuid "000a83d3-d518-4d9a-a842-d372243ca5bf")
	)
	(pad "1" smd rect
		(at 0 0)
		(size 0.8 1.6)
		(layers "F.Cu" "F.Paste" "F.Mask")
		(uuid "eb09c125-9182-4f9c-bf56-8e3e6c2d39c7")
	)
	(pad "2" smd rect
		(at 0 7.390003)
		(size 0.8 1.6)
		(layers "F.Cu" "F.Paste" "F.Mask")
		(uuid "009acc83-1f11-4f8e-b735-cc2c7b8aea6d")
	)
	(pad "3" smd rect
		(at -1.25 0)
		(size 0.8 1.6)
		(layers "F.Cu" "F.Paste" "F.Mask")
		(uuid "98741eb1-6f6f-4b12-b820-a320f819febd")
	)
	(pad "4" smd rect
		(at -1.25 7.390003)
		(size 0.8 1.6)
		(layers "F.Cu" "F.Paste" "F.Mask")
		(uuid "04941c21-15ee-4295-8291-ba88b65e343f")
	)
	(pad "5" smd rect
		(at -2.5 0)
		(size 0.8 1.6)
		(layers "F.Cu" "F.Paste" "F.Mask")
		(uuid "1fdbec19-3d00-4e9e-91cf-dd5341f15c63")
	)
	(pad "6" smd rect
		(at -2.5 7.390003)
		(size 0.8 1.6)
		(layers "F.Cu" "F.Paste" "F.Mask")
		(uuid "b8420312-c3ac-441f-9d71-cabafa08a7a8")
	)
	(pad "7" smd rect
		(at -3.75 0)
		(size 0.8 1.6)
		(layers "F.Cu" "F.Paste" "F.Mask")
		(uuid "906ba731-7881-417d-8d43-469cb3cb1ed0")
	)
	(pad "8" smd rect
		(at -3.75 7.390003)
		(size 0.8 1.6)
		(layers "F.Cu" "F.Paste" "F.Mask")
		(uuid "20e08d41-e4a3-4570-b6b0-b2e2d8d74b68")
	)
	(pad "9" smd rect
		(at -5 0)
		(size 0.8 1.6)
		(layers "F.Cu" "F.Paste" "F.Mask")
		(uuid "acf3c000-2dba-4ed5-8020-1ce9c11f33c8")
	)
	(pad "10" smd rect
		(at -5 7.390003)
		(size 0.8 1.6)
		(layers "F.Cu" "F.Paste" "F.Mask")
		(uuid "a512a0f3-0fd9-4cbc-ac20-ac75438b5a96")
	)
	(pad "11" smd rect
		(at -6.25 0)
		(size 0.8 1.6)
		(layers "F.Cu" "F.Paste" "F.Mask")
		(uuid "659957a6-75df-4280-bc99-6679c98b648e")
	)
	(pad "12" smd rect
		(at -6.25 7.390003)
		(size 0.8 1.6)
		(layers "F.Cu" "F.Paste" "F.Mask")
		(uuid "c83af3ad-3417-4162-ba50-ac6c2bcd248d")
	)
	(pad "13" smd rect
		(at -7.5 0)
		(size 0.8 1.6)
		(layers "F.Cu" "F.Paste" "F.Mask")
		(uuid "6757f785-4c44-4318-acec-933245c87c3d")
	)
	(pad "14" smd rect
		(at -7.5 7.390003)
		(size 0.8 1.6)
		(layers "F.Cu" "F.Paste" "F.Mask")
		(uuid "fbb30448-7724-4b05-b94c-56cf94486d50")
	)
	(pad "15" smd rect
		(at -8.75 0)
		(size 0.8 1.6)
		(layers "F.Cu" "F.Paste" "F.Mask")
		(uuid "ddb7c3cb-567f-4223-b99a-a9f2ff3cc1be")
	)
	(pad "16" smd rect
		(at -8.75 7.390003)
		(size 0.8 1.6)
		(layers "F.Cu" "F.Paste" "F.Mask")
		(uuid "aed1c9aa-7a39-410a-bd99-090e4ce8940a")
	)
	(pad "17" smd rect
		(at -10 0)
		(size 0.8 1.6)
		(layers "F.Cu" "F.Paste" "F.Mask")
		(uuid "62333d70-37ed-417d-ba68-01abef305490")
	)
	(pad "18" smd rect
		(at -10 7.390003)
		(size 0.8 1.6)
		(layers "F.Cu" "F.Paste" "F.Mask")
		(uuid "a1631b6b-d055-4fda-b82a-04e953f4a7cf")
	)
	(pad "19" smd rect
		(at 2.204999 2.34)
		(size 1 4.8)
		(layers "F.Cu" "F.Paste" "F.Mask")
		(uuid "96c10b09-11d6-47e4-85f9-c83f5d258dd9")
	)
	(pad "20" smd rect
		(at -12.200001 2.34)
		(size 1 4.8)
		(layers "F.Cu" "F.Paste" "F.Mask")
		(uuid "a9e723e9-09d5-4937-996b-9d133dcdb4dc")
	)
	(model "${KIPRJMOD}/3D/Micro-Lock-Plus-18-Pos-5054331821.stp"
		(offset
			(xyz 0 -3 9)
		)
		(scale
			(xyz 1 1 1)
		)
		(rotate
			(xyz 90 0 0)
		)
	)
)
