(footprint "ATSAMV71Q21B"
	(version 20240108)
	(generator "pcbnew")
	(generator_version "8.0")
	(layer "F.Cu")
	(descr "144-Lead Plastic Low Profile Quad Flatpack (PL) 20x20x1.40 mm Body")
	(tags "Integrated Circuit")
	(property "Reference" "IC**"
		(at 0 0 0)
		(layer "F.SilkS")
		(uuid "0cbf1e58-2b40-47fe-8b87-6b631df307e4")
		(effects
			(font
				(size 1.27 1.27)
				(thickness 0.254)
			)
		)
	)
	(property "Value" "ATSAMV71Q21B"
		(at 0 0 0)
		(layer "F.SilkS")
		(hide yes)
		(uuid "df2513b3-9831-46f5-b93e-684d73d01801")
		(effects
			(font
				(size 1.27 1.27)
				(thickness 0.254)
			)
		)
	)
	(property "Footprint" ""
		(at 0 0 0)
		(layer "F.Fab")
		(hide yes)
		(uuid "d99e5bf4-3cf6-4ee7-9578-e8af441a0483")
		(effects
			(font
				(size 1.27 1.27)
				(thickness 0.15)
			)
		)
	)
	(property "Datasheet" ""
		(at 0 0 0)
		(layer "F.Fab")
		(hide yes)
		(uuid "93ea426d-662e-4b9f-93a5-2cc7e9dfe90f")
		(effects
			(font
				(size 1.27 1.27)
				(thickness 0.15)
			)
		)
	)
	(property "Description" ""
		(at 0 0 0)
		(layer "F.Fab")
		(hide yes)
		(uuid "b8ac784b-8cea-4b13-b63b-15adce81ede5")
		(effects
			(font
				(size 1.27 1.27)
				(thickness 0.15)
			)
		)
	)
	(attr smd)
	(fp_line
		(start -9.65 -9.65)
		(end 9.65 -9.65)
		(stroke
			(width 0.2)
			(type solid)
		)
		(layer "F.SilkS")
		(uuid "0de5e0e4-d81e-4d66-8404-50893d3d610f")
	)
	(fp_line
		(start -9.65 9.65)
		(end -9.65 -9.65)
		(stroke
			(width 0.2)
			(type solid)
		)
		(layer "F.SilkS")
		(uuid "3c44ff85-3c79-49f5-9faf-e5810d868761")
	)
	(fp_line
		(start 9.65 -9.65)
		(end 9.65 9.65)
		(stroke
			(width 0.2)
			(type solid)
		)
		(layer "F.SilkS")
		(uuid "e276bc61-4f2d-4a4c-aef0-d9938183d737")
	)
	(fp_line
		(start 9.65 9.65)
		(end -9.65 9.65)
		(stroke
			(width 0.2)
			(type solid)
		)
		(layer "F.SilkS")
		(uuid "7e9bece0-a5a2-4c44-935d-485f5c7b7f5e")
	)
	(fp_circle
		(center -11.225 -9.5)
		(end -11.225 -9.375)
		(stroke
			(width 0.25)
			(type solid)
		)
		(fill none)
		(layer "F.SilkS")
		(uuid "b28fefd8-fe3e-489d-9d38-72de66f22aac")
	)
	(fp_line
		(start -11.725 -11.725)
		(end 11.725 -11.725)
		(stroke
			(width 0.05)
			(type solid)
		)
		(layer "F.CrtYd")
		(uuid "5d2d431c-2017-43c9-af90-02021b78b158")
	)
	(fp_line
		(start -11.725 11.725)
		(end -11.725 -11.725)
		(stroke
			(width 0.05)
			(type solid)
		)
		(layer "F.CrtYd")
		(uuid "c45a8689-b6be-4d2d-951e-8f20b254e1c3")
	)
	(fp_line
		(start 11.725 -11.725)
		(end 11.725 11.725)
		(stroke
			(width 0.05)
			(type solid)
		)
		(layer "F.CrtYd")
		(uuid "79d5792c-a3b6-46d7-a9a9-5ad7a2797b32")
	)
	(fp_line
		(start 11.725 11.725)
		(end -11.725 11.725)
		(stroke
			(width 0.05)
			(type solid)
		)
		(layer "F.CrtYd")
		(uuid "d37db85e-1710-472a-afe3-a9dad5782fb6")
	)
	(fp_line
		(start -10 -10)
		(end 10 -10)
		(stroke
			(width 0.1)
			(type solid)
		)
		(layer "F.Fab")
		(uuid "2aa5c769-66bc-4ddf-b346-36664d6c5825")
	)
	(fp_line
		(start -10 -9.5)
		(end -9.5 -10)
		(stroke
			(width 0.1)
			(type solid)
		)
		(layer "F.Fab")
		(uuid "31534f4b-dcc8-4e3b-8019-71cd1067ad34")
	)
	(fp_line
		(start -10 10)
		(end -10 -10)
		(stroke
			(width 0.1)
			(type solid)
		)
		(layer "F.Fab")
		(uuid "df012695-ad58-46ff-90b8-d6ca51c52cb7")
	)
	(fp_line
		(start 10 -10)
		(end 10 10)
		(stroke
			(width 0.1)
			(type solid)
		)
		(layer "F.Fab")
		(uuid "81ea45cf-4cac-464a-9efb-b3519c552188")
	)
	(fp_line
		(start 10 10)
		(end -10 10)
		(stroke
			(width 0.1)
			(type solid)
		)
		(layer "F.Fab")
		(uuid "abd3e93c-e1da-4181-aa37-2d58fd3a80b3")
	)
	(fp_text user "${REFERENCE}"
		(at 0 0 0)
		(layer "F.Fab")
		(uuid "8af16259-0870-4af2-86cd-b6f0e7d3db99")
		(effects
			(font
				(size 1.27 1.27)
				(thickness 0.254)
			)
		)
	)
	(pad "1" smd rect
		(at -10.738 -8.75 90)
		(size 0.3 1.475)
		(layers "F.Cu" "F.Paste" "F.Mask")
		(uuid "0ce85eab-5d1b-428e-a994-e8267ecbb07c")
	)
	(pad "2" smd rect
		(at -10.738 -8.25 90)
		(size 0.3 1.475)
		(layers "F.Cu" "F.Paste" "F.Mask")
		(uuid "fd16016c-c896-4ea3-b703-67e54b6a47c3")
	)
	(pad "3" smd rect
		(at -10.738 -7.75 90)
		(size 0.3 1.475)
		(layers "F.Cu" "F.Paste" "F.Mask")
		(uuid "30a93acb-107a-487e-9a55-a0e7551533bd")
	)
	(pad "4" smd rect
		(at -10.738 -7.25 90)
		(size 0.3 1.475)
		(layers "F.Cu" "F.Paste" "F.Mask")
		(uuid "f4f95f30-2fc9-4d94-9a6e-a515e9a60e20")
	)
	(pad "5" smd rect
		(at -10.738 -6.75 90)
		(size 0.3 1.475)
		(layers "F.Cu" "F.Paste" "F.Mask")
		(uuid "b2d6d56a-073e-439c-8681-2ef0db8130b2")
	)
	(pad "6" smd rect
		(at -10.738 -6.25 90)
		(size 0.3 1.475)
		(layers "F.Cu" "F.Paste" "F.Mask")
		(uuid "99cfb372-f0da-4432-9350-03c22c8363ee")
	)
	(pad "7" smd rect
		(at -10.738 -5.75 90)
		(size 0.3 1.475)
		(layers "F.Cu" "F.Paste" "F.Mask")
		(uuid "2b67c061-749d-4d6d-85ab-2dd2980b0749")
	)
	(pad "8" smd rect
		(at -10.738 -5.25 90)
		(size 0.3 1.475)
		(layers "F.Cu" "F.Paste" "F.Mask")
		(uuid "1b185beb-fde8-41eb-8dfd-a38297a9cc7d")
	)
	(pad "9" smd rect
		(at -10.738 -4.75 90)
		(size 0.3 1.475)
		(layers "F.Cu" "F.Paste" "F.Mask")
		(uuid "c464ddea-e0ea-4f31-ad12-810213faec17")
	)
	(pad "10" smd rect
		(at -10.738 -4.25 90)
		(size 0.3 1.475)
		(layers "F.Cu" "F.Paste" "F.Mask")
		(uuid "77ade292-c52f-4bd7-b825-6f97fe1a8bb3")
	)
	(pad "11" smd rect
		(at -10.738 -3.75 90)
		(size 0.3 1.475)
		(layers "F.Cu" "F.Paste" "F.Mask")
		(uuid "942da7b5-2f7b-4801-b4ae-becfc756d109")
	)
	(pad "12" smd rect
		(at -10.738 -3.25 90)
		(size 0.3 1.475)
		(layers "F.Cu" "F.Paste" "F.Mask")
		(uuid "5591fcf9-1ae7-47df-b01f-77e701dff9b6")
	)
	(pad "13" smd rect
		(at -10.738 -2.75 90)
		(size 0.3 1.475)
		(layers "F.Cu" "F.Paste" "F.Mask")
		(uuid "b707b800-c673-4294-b339-8639f322cae6")
	)
	(pad "14" smd rect
		(at -10.738 -2.25 90)
		(size 0.3 1.475)
		(layers "F.Cu" "F.Paste" "F.Mask")
		(uuid "e94b38b4-211a-46b4-a226-772eec22a2f4")
	)
	(pad "15" smd rect
		(at -10.738 -1.75 90)
		(size 0.3 1.475)
		(layers "F.Cu" "F.Paste" "F.Mask")
		(uuid "6759d41d-2a4b-45ac-8d9c-00bb4f8ff4c0")
	)
	(pad "16" smd rect
		(at -10.738 -1.25 90)
		(size 0.3 1.475)
		(layers "F.Cu" "F.Paste" "F.Mask")
		(uuid "3b3632f0-fe1b-4965-8c74-25a15b8ba210")
	)
	(pad "17" smd rect
		(at -10.738 -0.75 90)
		(size 0.3 1.475)
		(layers "F.Cu" "F.Paste" "F.Mask")
		(uuid "d0b14843-78da-42de-a1ed-bd49228ac0ad")
	)
	(pad "18" smd rect
		(at -10.738 -0.25 90)
		(size 0.3 1.475)
		(layers "F.Cu" "F.Paste" "F.Mask")
		(uuid "ce5c11d4-c928-43f1-a6dc-8d9dbaa3c309")
	)
	(pad "19" smd rect
		(at -10.738 0.25 90)
		(size 0.3 1.475)
		(layers "F.Cu" "F.Paste" "F.Mask")
		(uuid "fb176964-0d6b-425d-a0ca-fcb0b94119b2")
	)
	(pad "20" smd rect
		(at -10.738 0.75 90)
		(size 0.3 1.475)
		(layers "F.Cu" "F.Paste" "F.Mask")
		(uuid "af073b92-1e8a-4321-92be-5ee53731111b")
	)
	(pad "21" smd rect
		(at -10.738 1.25 90)
		(size 0.3 1.475)
		(layers "F.Cu" "F.Paste" "F.Mask")
		(uuid "67183a03-ae46-484e-a3c7-c457cc902c53")
	)
	(pad "22" smd rect
		(at -10.738 1.75 90)
		(size 0.3 1.475)
		(layers "F.Cu" "F.Paste" "F.Mask")
		(uuid "e8c502cb-9d5d-4318-bf4c-8f715aa972af")
	)
	(pad "23" smd rect
		(at -10.738 2.25 90)
		(size 0.3 1.475)
		(layers "F.Cu" "F.Paste" "F.Mask")
		(uuid "c08268f7-7f3d-4691-ac31-6e9753375bff")
	)
	(pad "24" smd rect
		(at -10.738 2.75 90)
		(size 0.3 1.475)
		(layers "F.Cu" "F.Paste" "F.Mask")
		(uuid "f9699f84-917f-47d9-87a3-445fd42eefbe")
	)
	(pad "25" smd rect
		(at -10.738 3.25 90)
		(size 0.3 1.475)
		(layers "F.Cu" "F.Paste" "F.Mask")
		(uuid "9f9a707b-eed0-4607-9baa-2397beccbb7d")
	)
	(pad "26" smd rect
		(at -10.738 3.75 90)
		(size 0.3 1.475)
		(layers "F.Cu" "F.Paste" "F.Mask")
		(uuid "d955351b-a4b8-44f6-b052-0fe8a58037b0")
	)
	(pad "27" smd rect
		(at -10.738 4.25 90)
		(size 0.3 1.475)
		(layers "F.Cu" "F.Paste" "F.Mask")
		(uuid "ffeaada0-0591-4a87-b98a-d31f5de00759")
	)
	(pad "28" smd rect
		(at -10.738 4.75 90)
		(size 0.3 1.475)
		(layers "F.Cu" "F.Paste" "F.Mask")
		(uuid "148ef633-1ae5-4780-8a8a-4f7ec78d3944")
	)
	(pad "29" smd rect
		(at -10.738 5.25 90)
		(size 0.3 1.475)
		(layers "F.Cu" "F.Paste" "F.Mask")
		(uuid "7a9015b6-868c-4a82-9ccf-38a866b76467")
	)
	(pad "30" smd rect
		(at -10.738 5.75 90)
		(size 0.3 1.475)
		(layers "F.Cu" "F.Paste" "F.Mask")
		(uuid "e7561874-514e-48f2-b216-9b1d5c8657d9")
	)
	(pad "31" smd rect
		(at -10.738 6.25 90)
		(size 0.3 1.475)
		(layers "F.Cu" "F.Paste" "F.Mask")
		(uuid "7cd46efb-4a36-4936-9efc-9129e3d4c06c")
	)
	(pad "32" smd rect
		(at -10.738 6.75 90)
		(size 0.3 1.475)
		(layers "F.Cu" "F.Paste" "F.Mask")
		(uuid "6e73278c-6b1c-4341-9260-4aa681711c57")
	)
	(pad "33" smd rect
		(at -10.738 7.25 90)
		(size 0.3 1.475)
		(layers "F.Cu" "F.Paste" "F.Mask")
		(uuid "e7186978-f728-448f-84c1-14a8a7b92c44")
	)
	(pad "34" smd rect
		(at -10.738 7.75 90)
		(size 0.3 1.475)
		(layers "F.Cu" "F.Paste" "F.Mask")
		(uuid "a47690e3-b4c7-4dba-9311-4889a8d339aa")
	)
	(pad "35" smd rect
		(at -10.738 8.25 90)
		(size 0.3 1.475)
		(layers "F.Cu" "F.Paste" "F.Mask")
		(uuid "d7a776db-9000-4ec9-adb0-b1bd89fa7b30")
	)
	(pad "36" smd rect
		(at -10.738 8.75 90)
		(size 0.3 1.475)
		(layers "F.Cu" "F.Paste" "F.Mask")
		(uuid "4f78c5a3-efa0-4e76-bfae-e15910a2b814")
	)
	(pad "37" smd rect
		(at -8.75 10.738)
		(size 0.3 1.475)
		(layers "F.Cu" "F.Paste" "F.Mask")
		(uuid "bd6bcc6c-9dd0-47d4-adf1-f56ffca8698e")
	)
	(pad "38" smd rect
		(at -8.25 10.738)
		(size 0.3 1.475)
		(layers "F.Cu" "F.Paste" "F.Mask")
		(uuid "35233084-4710-40c6-a08f-415ec72c0034")
	)
	(pad "39" smd rect
		(at -7.75 10.738)
		(size 0.3 1.475)
		(layers "F.Cu" "F.Paste" "F.Mask")
		(uuid "bc933324-3ce2-49a2-af03-0dd830cf9448")
	)
	(pad "40" smd rect
		(at -7.25 10.738)
		(size 0.3 1.475)
		(layers "F.Cu" "F.Paste" "F.Mask")
		(uuid "08337d76-2913-43f1-ba8e-81a0ea110a76")
	)
	(pad "41" smd rect
		(at -6.75 10.738)
		(size 0.3 1.475)
		(layers "F.Cu" "F.Paste" "F.Mask")
		(uuid "d9679507-60bb-4815-8ed2-a0d9a9454e45")
	)
	(pad "42" smd rect
		(at -6.25 10.738)
		(size 0.3 1.475)
		(layers "F.Cu" "F.Paste" "F.Mask")
		(uuid "4256495e-620f-410e-b787-1899209e381f")
	)
	(pad "43" smd rect
		(at -5.75 10.738)
		(size 0.3 1.475)
		(layers "F.Cu" "F.Paste" "F.Mask")
		(uuid "fede5946-6d38-4772-8508-ae579443a50f")
	)
	(pad "44" smd rect
		(at -5.25 10.738)
		(size 0.3 1.475)
		(layers "F.Cu" "F.Paste" "F.Mask")
		(uuid "13243322-c474-4dd8-816f-f6963a397b41")
	)
	(pad "45" smd rect
		(at -4.75 10.738)
		(size 0.3 1.475)
		(layers "F.Cu" "F.Paste" "F.Mask")
		(uuid "03e0fa6d-4d6f-41b0-894b-11fc07a34c07")
	)
	(pad "46" smd rect
		(at -4.25 10.738)
		(size 0.3 1.475)
		(layers "F.Cu" "F.Paste" "F.Mask")
		(uuid "1f5d5828-be6c-4fac-84a7-ebfb09bdcddd")
	)
	(pad "47" smd rect
		(at -3.75 10.738)
		(size 0.3 1.475)
		(layers "F.Cu" "F.Paste" "F.Mask")
		(uuid "bc66f468-5fde-45e5-943f-46b050d3891c")
	)
	(pad "48" smd rect
		(at -3.25 10.738)
		(size 0.3 1.475)
		(layers "F.Cu" "F.Paste" "F.Mask")
		(uuid "c3c71e2f-246a-45c8-9786-26c6bdea62f8")
	)
	(pad "49" smd rect
		(at -2.75 10.738)
		(size 0.3 1.475)
		(layers "F.Cu" "F.Paste" "F.Mask")
		(uuid "8ea0e805-2670-40a1-aada-49b7bfc7975f")
	)
	(pad "50" smd rect
		(at -2.25 10.738)
		(size 0.3 1.475)
		(layers "F.Cu" "F.Paste" "F.Mask")
		(uuid "2146cb1d-ed2e-47dc-a53f-e48440f18b6b")
	)
	(pad "51" smd rect
		(at -1.75 10.738)
		(size 0.3 1.475)
		(layers "F.Cu" "F.Paste" "F.Mask")
		(uuid "b469bdf2-5d75-437e-a0e4-5eb18f1dba97")
	)
	(pad "52" smd rect
		(at -1.25 10.738)
		(size 0.3 1.475)
		(layers "F.Cu" "F.Paste" "F.Mask")
		(uuid "38a7d886-bb0a-4895-b60a-ddd35d9d734d")
	)
	(pad "53" smd rect
		(at -0.75 10.738)
		(size 0.3 1.475)
		(layers "F.Cu" "F.Paste" "F.Mask")
		(uuid "451412a8-ab42-4784-ba03-451597041a8b")
	)
	(pad "54" smd rect
		(at -0.25 10.738)
		(size 0.3 1.475)
		(layers "F.Cu" "F.Paste" "F.Mask")
		(uuid "8aa43f7e-b1e1-420e-83e4-f9af675a77df")
	)
	(pad "55" smd rect
		(at 0.25 10.738)
		(size 0.3 1.475)
		(layers "F.Cu" "F.Paste" "F.Mask")
		(uuid "cd56fb1f-399a-4f1f-ac93-fff6f30011af")
	)
	(pad "56" smd rect
		(at 0.75 10.738)
		(size 0.3 1.475)
		(layers "F.Cu" "F.Paste" "F.Mask")
		(uuid "0a9bef51-ec93-43c2-a619-f495dde0ea2b")
	)
	(pad "57" smd rect
		(at 1.25 10.738)
		(size 0.3 1.475)
		(layers "F.Cu" "F.Paste" "F.Mask")
		(uuid "c19a5b68-8b20-47e3-9586-bf74d8a599ca")
	)
	(pad "58" smd rect
		(at 1.75 10.738)
		(size 0.3 1.475)
		(layers "F.Cu" "F.Paste" "F.Mask")
		(uuid "9ebf4109-6ccf-41e8-acfc-12f7e2c936dc")
	)
	(pad "59" smd rect
		(at 2.25 10.738)
		(size 0.3 1.475)
		(layers "F.Cu" "F.Paste" "F.Mask")
		(uuid "ce761f7e-018a-4cc9-b6e7-4363dba6c962")
	)
	(pad "60" smd rect
		(at 2.75 10.738)
		(size 0.3 1.475)
		(layers "F.Cu" "F.Paste" "F.Mask")
		(uuid "4301a5a3-ff71-443c-bd89-b5797140941a")
	)
	(pad "61" smd rect
		(at 3.25 10.738)
		(size 0.3 1.475)
		(layers "F.Cu" "F.Paste" "F.Mask")
		(uuid "4a732dbb-d296-402e-90f5-44138f81a603")
	)
	(pad "62" smd rect
		(at 3.75 10.738)
		(size 0.3 1.475)
		(layers "F.Cu" "F.Paste" "F.Mask")
		(uuid "21beac88-6e04-412f-a378-77f4888f8770")
	)
	(pad "63" smd rect
		(at 4.25 10.738)
		(size 0.3 1.475)
		(layers "F.Cu" "F.Paste" "F.Mask")
		(uuid "9530fc47-a721-4bfb-a133-bbb8d89a825f")
	)
	(pad "64" smd rect
		(at 4.75 10.738)
		(size 0.3 1.475)
		(layers "F.Cu" "F.Paste" "F.Mask")
		(uuid "5feb1f86-58f3-405c-9b1f-f8845e1e4e30")
	)
	(pad "65" smd rect
		(at 5.25 10.738)
		(size 0.3 1.475)
		(layers "F.Cu" "F.Paste" "F.Mask")
		(uuid "1aff0b93-2f3e-4141-a207-3ab628131af3")
	)
	(pad "66" smd rect
		(at 5.75 10.738)
		(size 0.3 1.475)
		(layers "F.Cu" "F.Paste" "F.Mask")
		(uuid "48d1104b-fb55-457e-b13c-84ff9483c787")
	)
	(pad "67" smd rect
		(at 6.25 10.738)
		(size 0.3 1.475)
		(layers "F.Cu" "F.Paste" "F.Mask")
		(uuid "eea1c416-d462-4f07-b9eb-727a84bec7aa")
	)
	(pad "68" smd rect
		(at 6.75 10.738)
		(size 0.3 1.475)
		(layers "F.Cu" "F.Paste" "F.Mask")
		(uuid "e40e896b-d63f-47c4-a975-a345b68e093d")
	)
	(pad "69" smd rect
		(at 7.25 10.738)
		(size 0.3 1.475)
		(layers "F.Cu" "F.Paste" "F.Mask")
		(uuid "1c12a914-07ed-4b64-9465-58fbbf57af09")
	)
	(pad "70" smd rect
		(at 7.75 10.738)
		(size 0.3 1.475)
		(layers "F.Cu" "F.Paste" "F.Mask")
		(uuid "f7f04cc7-c33d-40b7-b0dd-bc79ad396acb")
	)
	(pad "71" smd rect
		(at 8.25 10.738)
		(size 0.3 1.475)
		(layers "F.Cu" "F.Paste" "F.Mask")
		(uuid "eaf58531-0a68-4f23-b94f-c1fefe7bc0c2")
	)
	(pad "72" smd rect
		(at 8.75 10.738)
		(size 0.3 1.475)
		(layers "F.Cu" "F.Paste" "F.Mask")
		(uuid "fe015d41-4473-462e-bcc4-b9d08f8c1c42")
	)
	(pad "73" smd rect
		(at 10.738 8.75 90)
		(size 0.3 1.475)
		(layers "F.Cu" "F.Paste" "F.Mask")
		(uuid "fe119bf2-a7d5-4221-992e-faf6b5ad07c8")
	)
	(pad "74" smd rect
		(at 10.738 8.25 90)
		(size 0.3 1.475)
		(layers "F.Cu" "F.Paste" "F.Mask")
		(uuid "d30d7f28-31e6-4dfb-9982-262e844d3e46")
	)
	(pad "75" smd rect
		(at 10.738 7.75 90)
		(size 0.3 1.475)
		(layers "F.Cu" "F.Paste" "F.Mask")
		(uuid "7a34877e-8e49-48cf-85f5-6d0bca035fe2")
	)
	(pad "76" smd rect
		(at 10.738 7.25 90)
		(size 0.3 1.475)
		(layers "F.Cu" "F.Paste" "F.Mask")
		(uuid "03493e5f-0be0-438c-97f3-8e4c486d4c51")
	)
	(pad "77" smd rect
		(at 10.738 6.75 90)
		(size 0.3 1.475)
		(layers "F.Cu" "F.Paste" "F.Mask")
		(uuid "0677e291-93e8-496d-b2a4-6ecbf9657d73")
	)
	(pad "78" smd rect
		(at 10.738 6.25 90)
		(size 0.3 1.475)
		(layers "F.Cu" "F.Paste" "F.Mask")
		(uuid "9a6aa7c8-9daf-43aa-b35b-837831ff8b02")
	)
	(pad "79" smd rect
		(at 10.738 5.75 90)
		(size 0.3 1.475)
		(layers "F.Cu" "F.Paste" "F.Mask")
		(uuid "5d7f5ce2-7e4a-4096-8cbd-3c395cb7ec83")
	)
	(pad "80" smd rect
		(at 10.738 5.25 90)
		(size 0.3 1.475)
		(layers "F.Cu" "F.Paste" "F.Mask")
		(uuid "d1efd024-81b6-4afb-809f-2491c78fd7b1")
	)
	(pad "81" smd rect
		(at 10.738 4.75 90)
		(size 0.3 1.475)
		(layers "F.Cu" "F.Paste" "F.Mask")
		(uuid "38685ed1-53a3-4cec-b5a8-bcd2ef4122f1")
	)
	(pad "82" smd rect
		(at 10.738 4.25 90)
		(size 0.3 1.475)
		(layers "F.Cu" "F.Paste" "F.Mask")
		(uuid "4e924011-e22a-41ac-9585-a0f299a29259")
	)
	(pad "83" smd rect
		(at 10.738 3.75 90)
		(size 0.3 1.475)
		(layers "F.Cu" "F.Paste" "F.Mask")
		(uuid "8a60ea80-70c8-404c-972f-98e477c654a9")
	)
	(pad "84" smd rect
		(at 10.738 3.25 90)
		(size 0.3 1.475)
		(layers "F.Cu" "F.Paste" "F.Mask")
		(uuid "45323065-36df-43a7-9b32-65e4c4d18c01")
	)
	(pad "85" smd rect
		(at 10.738 2.75 90)
		(size 0.3 1.475)
		(layers "F.Cu" "F.Paste" "F.Mask")
		(uuid "2b03fe64-08f0-4f13-8e6b-145d65eb5913")
	)
	(pad "86" smd rect
		(at 10.738 2.25 90)
		(size 0.3 1.475)
		(layers "F.Cu" "F.Paste" "F.Mask")
		(uuid "76b0f65d-504b-43cc-8826-02e53c21ccd2")
	)
	(pad "87" smd rect
		(at 10.738 1.75 90)
		(size 0.3 1.475)
		(layers "F.Cu" "F.Paste" "F.Mask")
		(uuid "6cc90748-a86e-40c4-8af6-1323316b7df9")
	)
	(pad "88" smd rect
		(at 10.738 1.25 90)
		(size 0.3 1.475)
		(layers "F.Cu" "F.Paste" "F.Mask")
		(uuid "ba97f05c-2726-44ba-960a-f528fc743ce0")
	)
	(pad "89" smd rect
		(at 10.738 0.75 90)
		(size 0.3 1.475)
		(layers "F.Cu" "F.Paste" "F.Mask")
		(uuid "a059accd-1b0b-46cc-a252-d2056ca5d194")
	)
	(pad "90" smd rect
		(at 10.738 0.25 90)
		(size 0.3 1.475)
		(layers "F.Cu" "F.Paste" "F.Mask")
		(uuid "7b7390fc-d343-4df5-9854-0a2587305d16")
	)
	(pad "91" smd rect
		(at 10.738 -0.25 90)
		(size 0.3 1.475)
		(layers "F.Cu" "F.Paste" "F.Mask")
		(uuid "46a2908d-f423-49fe-9a7b-784e52996bf7")
	)
	(pad "92" smd rect
		(at 10.738 -0.75 90)
		(size 0.3 1.475)
		(layers "F.Cu" "F.Paste" "F.Mask")
		(uuid "3e7f2a3d-fada-4a9e-a825-df795ac10fcb")
	)
	(pad "93" smd rect
		(at 10.738 -1.25 90)
		(size 0.3 1.475)
		(layers "F.Cu" "F.Paste" "F.Mask")
		(uuid "0ae7c9b8-847b-49bd-ace2-8c0ad06bd78a")
	)
	(pad "94" smd rect
		(at 10.738 -1.75 90)
		(size 0.3 1.475)
		(layers "F.Cu" "F.Paste" "F.Mask")
		(uuid "b655406d-1039-426d-b714-647d1c07cc9e")
	)
	(pad "95" smd rect
		(at 10.738 -2.25 90)
		(size 0.3 1.475)
		(layers "F.Cu" "F.Paste" "F.Mask")
		(uuid "b5fee242-eb0d-4bff-baa3-ce01f0597e01")
	)
	(pad "96" smd rect
		(at 10.738 -2.75 90)
		(size 0.3 1.475)
		(layers "F.Cu" "F.Paste" "F.Mask")
		(uuid "2ee74804-0b11-4bf8-bd0f-aee969ea2b09")
	)
	(pad "97" smd rect
		(at 10.738 -3.25 90)
		(size 0.3 1.475)
		(layers "F.Cu" "F.Paste" "F.Mask")
		(uuid "ca5ad80c-2938-4962-82ad-579416b9e816")
	)
	(pad "98" smd rect
		(at 10.738 -3.75 90)
		(size 0.3 1.475)
		(layers "F.Cu" "F.Paste" "F.Mask")
		(uuid "518c3340-d532-43b3-b62c-9caaa25e7cf0")
	)
	(pad "99" smd rect
		(at 10.738 -4.25 90)
		(size 0.3 1.475)
		(layers "F.Cu" "F.Paste" "F.Mask")
		(uuid "9ac596c5-09ef-444d-9d61-5776787e6041")
	)
	(pad "100" smd rect
		(at 10.738 -4.75 90)
		(size 0.3 1.475)
		(layers "F.Cu" "F.Paste" "F.Mask")
		(uuid "8be4b458-7dee-48ef-bb35-6fddb14071ac")
	)
	(pad "101" smd rect
		(at 10.738 -5.25 90)
		(size 0.3 1.475)
		(layers "F.Cu" "F.Paste" "F.Mask")
		(uuid "ec2ccd2c-4571-432d-ad1b-c273574b4d09")
	)
	(pad "102" smd rect
		(at 10.738 -5.75 90)
		(size 0.3 1.475)
		(layers "F.Cu" "F.Paste" "F.Mask")
		(uuid "e099ee2c-298a-4150-9090-83f9afce9c58")
	)
	(pad "103" smd rect
		(at 10.738 -6.25 90)
		(size 0.3 1.475)
		(layers "F.Cu" "F.Paste" "F.Mask")
		(uuid "69714122-5fbe-459c-b9cb-936a2e8d2a37")
	)
	(pad "104" smd rect
		(at 10.738 -6.75 90)
		(size 0.3 1.475)
		(layers "F.Cu" "F.Paste" "F.Mask")
		(uuid "684a84bb-6490-442c-8c4c-4fb6971aa243")
	)
	(pad "105" smd rect
		(at 10.738 -7.25 90)
		(size 0.3 1.475)
		(layers "F.Cu" "F.Paste" "F.Mask")
		(uuid "1761137d-8fc9-460a-959e-2c74bb234694")
	)
	(pad "106" smd rect
		(at 10.738 -7.75 90)
		(size 0.3 1.475)
		(layers "F.Cu" "F.Paste" "F.Mask")
		(uuid "a5297621-a273-4cc6-ba28-8e979d6d49d7")
	)
	(pad "107" smd rect
		(at 10.738 -8.25 90)
		(size 0.3 1.475)
		(layers "F.Cu" "F.Paste" "F.Mask")
		(uuid "0154f913-c340-42f8-baa2-790ab8742b9b")
	)
	(pad "108" smd rect
		(at 10.738 -8.75 90)
		(size 0.3 1.475)
		(layers "F.Cu" "F.Paste" "F.Mask")
		(uuid "0b0b66eb-6524-4420-a92a-7362654d7bc1")
	)
	(pad "109" smd rect
		(at 8.75 -10.738)
		(size 0.3 1.475)
		(layers "F.Cu" "F.Paste" "F.Mask")
		(uuid "8650beb8-07a5-4cb5-ad6d-7c473edf0b5e")
	)
	(pad "110" smd rect
		(at 8.25 -10.738)
		(size 0.3 1.475)
		(layers "F.Cu" "F.Paste" "F.Mask")
		(uuid "0eba1727-5e34-4263-aba4-df0ce58e7f5a")
	)
	(pad "111" smd rect
		(at 7.75 -10.738)
		(size 0.3 1.475)
		(layers "F.Cu" "F.Paste" "F.Mask")
		(uuid "fb3beb79-76fd-4e63-adaf-41272b2db658")
	)
	(pad "112" smd rect
		(at 7.25 -10.738)
		(size 0.3 1.475)
		(layers "F.Cu" "F.Paste" "F.Mask")
		(uuid "1284e98a-2f8a-402a-8124-391c1b6682d0")
	)
	(pad "113" smd rect
		(at 6.75 -10.738)
		(size 0.3 1.475)
		(layers "F.Cu" "F.Paste" "F.Mask")
		(uuid "3d3195da-08af-433a-a64c-76c8a6496c77")
	)
	(pad "114" smd rect
		(at 6.25 -10.738)
		(size 0.3 1.475)
		(layers "F.Cu" "F.Paste" "F.Mask")
		(uuid "56f20f6e-5a99-41d2-8da7-9e0fa379a43f")
	)
	(pad "115" smd rect
		(at 5.75 -10.738)
		(size 0.3 1.475)
		(layers "F.Cu" "F.Paste" "F.Mask")
		(uuid "afe8d6c1-8c83-4282-be0b-55ef9ee948b2")
	)
	(pad "116" smd rect
		(at 5.25 -10.738)
		(size 0.3 1.475)
		(layers "F.Cu" "F.Paste" "F.Mask")
		(uuid "06ed9757-9951-4010-a8f6-c68f179b4f73")
	)
	(pad "117" smd rect
		(at 4.75 -10.738)
		(size 0.3 1.475)
		(layers "F.Cu" "F.Paste" "F.Mask")
		(uuid "59102462-7714-4c73-998a-ae1fb56154ba")
	)
	(pad "118" smd rect
		(at 4.25 -10.738)
		(size 0.3 1.475)
		(layers "F.Cu" "F.Paste" "F.Mask")
		(uuid "7d8d5eec-a496-476c-9149-60d46ee9349d")
	)
	(pad "119" smd rect
		(at 3.75 -10.738)
		(size 0.3 1.475)
		(layers "F.Cu" "F.Paste" "F.Mask")
		(uuid "de0448d1-fd25-4f1e-8569-c31f3ad31954")
	)
	(pad "120" smd rect
		(at 3.25 -10.738)
		(size 0.3 1.475)
		(layers "F.Cu" "F.Paste" "F.Mask")
		(uuid "44aa91d8-a784-4bd9-b416-03d9d5156a8b")
	)
	(pad "121" smd rect
		(at 2.75 -10.738)
		(size 0.3 1.475)
		(layers "F.Cu" "F.Paste" "F.Mask")
		(uuid "ef79083f-5e2e-4fab-8cd3-0cd7f64d426b")
	)
	(pad "122" smd rect
		(at 2.25 -10.738)
		(size 0.3 1.475)
		(layers "F.Cu" "F.Paste" "F.Mask")
		(uuid "2c9689e2-91cf-4e2f-8d2b-cf2372503aef")
	)
	(pad "123" smd rect
		(at 1.75 -10.738)
		(size 0.3 1.475)
		(layers "F.Cu" "F.Paste" "F.Mask")
		(uuid "14d9b1d3-aa2f-4ce2-91a1-05cd9a3654dd")
	)
	(pad "124" smd rect
		(at 1.25 -10.738)
		(size 0.3 1.475)
		(layers "F.Cu" "F.Paste" "F.Mask")
		(uuid "95f35cb1-ac56-489b-adb3-8bb97e4edc07")
	)
	(pad "125" smd rect
		(at 0.75 -10.738)
		(size 0.3 1.475)
		(layers "F.Cu" "F.Paste" "F.Mask")
		(uuid "b74ab33b-0754-4f13-9ecf-547dfd20854f")
	)
	(pad "126" smd rect
		(at 0.25 -10.738)
		(size 0.3 1.475)
		(layers "F.Cu" "F.Paste" "F.Mask")
		(uuid "dcc2cb92-059e-4634-a165-a77169284ee5")
	)
	(pad "127" smd rect
		(at -0.25 -10.738)
		(size 0.3 1.475)
		(layers "F.Cu" "F.Paste" "F.Mask")
		(uuid "a107235d-3e84-42c6-9bab-10fde01faf89")
	)
	(pad "128" smd rect
		(at -0.75 -10.738)
		(size 0.3 1.475)
		(layers "F.Cu" "F.Paste" "F.Mask")
		(uuid "6e88bbc1-32b3-4731-a34e-e34cbca9fd1c")
	)
	(pad "129" smd rect
		(at -1.25 -10.738)
		(size 0.3 1.475)
		(layers "F.Cu" "F.Paste" "F.Mask")
		(uuid "c680b511-5ad0-4f07-ac3f-16f1b55cb234")
	)
	(pad "130" smd rect
		(at -1.75 -10.738)
		(size 0.3 1.475)
		(layers "F.Cu" "F.Paste" "F.Mask")
		(uuid "359e41b1-48db-4e5c-96f2-d26845069ae9")
	)
	(pad "131" smd rect
		(at -2.25 -10.738)
		(size 0.3 1.475)
		(layers "F.Cu" "F.Paste" "F.Mask")
		(uuid "27b10d0a-7aa1-4dc1-85eb-94dbb98bf82e")
	)
	(pad "132" smd rect
		(at -2.75 -10.738)
		(size 0.3 1.475)
		(layers "F.Cu" "F.Paste" "F.Mask")
		(uuid "ef8b16a2-2efd-4e25-8529-3d6343caaf6b")
	)
	(pad "133" smd rect
		(at -3.25 -10.738)
		(size 0.3 1.475)
		(layers "F.Cu" "F.Paste" "F.Mask")
		(uuid "3a8b47b3-3306-4553-b9b3-de23bbc70928")
	)
	(pad "134" smd rect
		(at -3.75 -10.738)
		(size 0.3 1.475)
		(layers "F.Cu" "F.Paste" "F.Mask")
		(uuid "0e957eed-5fe3-4f29-ae10-223cbbea5fe4")
	)
	(pad "135" smd rect
		(at -4.25 -10.738)
		(size 0.3 1.475)
		(layers "F.Cu" "F.Paste" "F.Mask")
		(uuid "a5521bbc-dcbc-4868-8d08-e19516758bc9")
	)
	(pad "136" smd rect
		(at -4.75 -10.738)
		(size 0.3 1.475)
		(layers "F.Cu" "F.Paste" "F.Mask")
		(uuid "dc6f58bb-a0c7-4d65-9e82-d7886192ab87")
	)
	(pad "137" smd rect
		(at -5.25 -10.738)
		(size 0.3 1.475)
		(layers "F.Cu" "F.Paste" "F.Mask")
		(uuid "ab92beb3-38c2-49e5-837f-e954eb8bb0ab")
	)
	(pad "138" smd rect
		(at -5.75 -10.738)
		(size 0.3 1.475)
		(layers "F.Cu" "F.Paste" "F.Mask")
		(uuid "cc581391-d5ee-4ef3-ae70-274b4af99fa7")
	)
	(pad "139" smd rect
		(at -6.25 -10.738)
		(size 0.3 1.475)
		(layers "F.Cu" "F.Paste" "F.Mask")
		(uuid "3620f848-f7dd-4915-bf5d-63e330741703")
	)
	(pad "140" smd rect
		(at -6.75 -10.738)
		(size 0.3 1.475)
		(layers "F.Cu" "F.Paste" "F.Mask")
		(uuid "dd3a11db-134c-4cd0-bad5-7f32b3224d3b")
	)
	(pad "141" smd rect
		(at -7.25 -10.738)
		(size 0.3 1.475)
		(layers "F.Cu" "F.Paste" "F.Mask")
		(uuid "88effc5e-8e35-4678-bc98-6a89b1fda11f")
	)
	(pad "142" smd rect
		(at -7.75 -10.738)
		(size 0.3 1.475)
		(layers "F.Cu" "F.Paste" "F.Mask")
		(uuid "6ee2b622-08c9-4d78-bb70-6f3d52e9dbfd")
	)
	(pad "143" smd rect
		(at -8.25 -10.738)
		(size 0.3 1.475)
		(layers "F.Cu" "F.Paste" "F.Mask")
		(uuid "a0b87b0d-6d8f-4dd3-a0a6-d3a724f3cfaf")
	)
	(pad "144" smd rect
		(at -8.75 -10.738)
		(size 0.3 1.475)
		(layers "F.Cu" "F.Paste" "F.Mask")
		(uuid "ae8d8869-4f62-4eea-a96a-42779280ab21")
	)
	(model "${KIPRJMOD}/3D/ATSAMV71Q21B-AAB.step"
		(offset
			(xyz 0 0 0)
		)
		(scale
			(xyz 1 1 1)
		)
		(rotate
			(xyz -90 0 0)
		)
	)
)
