(footprint "ATSAM Main TCXO"
	(version 20240108)
	(generator "pcbnew")
	(generator_version "8.0")
	(layer "F.Cu")
	(descr "2.5x2.0x0.9mm")
	(tags "Crystal or Oscillator")
	(property "Reference" "Y**"
		(at 0 0 0)
		(layer "F.SilkS")
		(uuid "dead6a21-eebc-4bff-8363-e6f1f0dd2427")
		(effects
			(font
				(size 1.27 1.27)
				(thickness 0.254)
			)
		)
	)
	(property "Value" "ATSAM Main TCXO"
		(at 0 0 0)
		(layer "F.SilkS")
		(hide yes)
		(uuid "58398a79-2aef-4876-831a-a26c8bec5e4f")
		(effects
			(font
				(size 1.27 1.27)
				(thickness 0.254)
			)
		)
	)
	(property "Footprint" ""
		(at 0 0 0)
		(layer "F.Fab")
		(hide yes)
		(uuid "97bcf8b7-f149-4798-bf0d-44545a104814")
		(effects
			(font
				(size 1.27 1.27)
				(thickness 0.15)
			)
		)
	)
	(property "Datasheet" ""
		(at 0 0 0)
		(layer "F.Fab")
		(hide yes)
		(uuid "8ec67d60-2fd7-453a-8b02-05bc55235695")
		(effects
			(font
				(size 1.27 1.27)
				(thickness 0.15)
			)
		)
	)
	(property "Description" ""
		(at 0 0 0)
		(layer "F.Fab")
		(hide yes)
		(uuid "6d17ea94-49a1-42c9-bf36-8f948af0f89e")
		(effects
			(font
				(size 1.27 1.27)
				(thickness 0.15)
			)
		)
	)
	(attr smd)
	(fp_line
		(start -1.8 0.7)
		(end -1.8 0.7)
		(stroke
			(width 0.1)
			(type solid)
		)
		(layer "F.SilkS")
		(uuid "73d18fa1-ba45-4557-90c5-64322baa22f4")
	)
	(fp_line
		(start -1.8 0.8)
		(end -1.8 0.8)
		(stroke
			(width 0.1)
			(type solid)
		)
		(layer "F.SilkS")
		(uuid "e48af772-13a6-46b5-812a-d126d5a98c6b")
	)
	(fp_line
		(start -0.2 -1)
		(end 0.2 -1)
		(stroke
			(width 0.2)
			(type solid)
		)
		(layer "F.SilkS")
		(uuid "c2144746-a112-4711-ad90-a1951ec1c213")
	)
	(fp_line
		(start -0.2 1)
		(end 0.2 1)
		(stroke
			(width 0.2)
			(type solid)
		)
		(layer "F.SilkS")
		(uuid "49ea770b-a510-4c2d-9860-bfbd934d5a9e")
	)
	(fp_arc
		(start -1.8 0.7)
		(mid -1.75 0.75)
		(end -1.8 0.8)
		(stroke
			(width 0.1)
			(type solid)
		)
		(layer "F.SilkS")
		(uuid "46a19ecd-0d0b-4606-a4f2-3398fd506cc9")
	)
	(fp_arc
		(start -1.8 0.8)
		(mid -1.85 0.75)
		(end -1.8 0.7)
		(stroke
			(width 0.1)
			(type solid)
		)
		(layer "F.SilkS")
		(uuid "eb1d3686-8f94-44ee-9925-3b469cd2012a")
	)
	(fp_line
		(start -2.375 -2.125)
		(end 2.375 -2.125)
		(stroke
			(width 0.1)
			(type solid)
		)
		(layer "F.CrtYd")
		(uuid "a6a6a8b7-9b5a-401b-b059-9dee6fa25d06")
	)
	(fp_line
		(start -2.375 2.125)
		(end -2.375 -2.125)
		(stroke
			(width 0.1)
			(type solid)
		)
		(layer "F.CrtYd")
		(uuid "2befd978-fa82-4cba-af3f-000b9bb12daa")
	)
	(fp_line
		(start 2.375 -2.125)
		(end 2.375 2.125)
		(stroke
			(width 0.1)
			(type solid)
		)
		(layer "F.CrtYd")
		(uuid "61c15f9d-3207-4f12-aafa-ef193349f8de")
	)
	(fp_line
		(start 2.375 2.125)
		(end -2.375 2.125)
		(stroke
			(width 0.1)
			(type solid)
		)
		(layer "F.CrtYd")
		(uuid "c47742d7-fab0-44e5-b32f-8771d07fc437")
	)
	(fp_line
		(start -1.25 -1)
		(end 1.25 -1)
		(stroke
			(width 0.1)
			(type solid)
		)
		(layer "F.Fab")
		(uuid "8902bd82-ec7e-40c2-9248-8e7c4add93df")
	)
	(fp_line
		(start -1.25 1)
		(end -1.25 -1)
		(stroke
			(width 0.1)
			(type solid)
		)
		(layer "F.Fab")
		(uuid "92365c91-54dd-4abe-851e-6fb3ad3a9e0d")
	)
	(fp_line
		(start 1.25 -1)
		(end 1.25 1)
		(stroke
			(width 0.1)
			(type solid)
		)
		(layer "F.Fab")
		(uuid "3022eae0-f475-4775-8a97-2fb854cd9e39")
	)
	(fp_line
		(start 1.25 1)
		(end -1.25 1)
		(stroke
			(width 0.1)
			(type solid)
		)
		(layer "F.Fab")
		(uuid "eaff2414-9039-41e5-b778-ab5ed09a8c5e")
	)
	(fp_text user "${REFERENCE}"
		(at 0 0 0)
		(layer "F.Fab")
		(uuid "4b08f3e1-1620-4745-b69a-8019ee32800a")
		(effects
			(font
				(size 1.27 1.27)
				(thickness 0.254)
			)
		)
	)
	(pad "1" smd rect
		(at -0.925 0.725 90)
		(size 0.8 0.9)
		(layers "F.Cu" "F.Paste" "F.Mask")
		(uuid "6388dcd0-1328-4825-b345-5d9a3ba4b822")
	)
	(pad "2" smd rect
		(at 0.925 0.725 90)
		(size 0.8 0.9)
		(layers "F.Cu" "F.Paste" "F.Mask")
		(uuid "1483a2f4-66f5-467c-b774-0495b08af09d")
	)
	(pad "3" smd rect
		(at 0.925 -0.725 90)
		(size 0.8 0.9)
		(layers "F.Cu" "F.Paste" "F.Mask")
		(uuid "5b754d34-ca3c-4480-a4db-4b7f92167718")
	)
	(pad "4" smd rect
		(at -0.925 -0.725 90)
		(size 0.8 0.9)
		(layers "F.Cu" "F.Paste" "F.Mask")
		(uuid "1cc81541-5638-459f-b30a-011ad06d9448")
	)
	(model "${KIPRJMOD}/3D/ECS-TXO-2520-33-160-AN-TR.step"
		(offset
			(xyz 0 0 0)
		)
		(scale
			(xyz 1 1 1)
		)
		(rotate
			(xyz -90 0 0)
		)
	)
)
