(footprint "DMHC3025LSD-Pump"
	(version 20240108)
	(generator "pcbnew")
	(generator_version "8.0")
	(layer "F.Cu")
	(tags "DMHC3025LSD-13 ")
	(property "Reference" "REF**"
		(at 0 0 0)
		(unlocked yes)
		(layer "F.SilkS")
		(uuid "93bc7b5f-927e-430e-af8d-30c1f3530083")
		(effects
			(font
				(size 1 1)
				(thickness 0.15)
			)
		)
	)
	(property "Value" "DMHC3025LSD-Pump"
		(at 0 0 0)
		(unlocked yes)
		(layer "F.Fab")
		(uuid "e950db03-41a4-41e3-8b1a-e0da0320fbe8")
		(effects
			(font
				(size 1 1)
				(thickness 0.15)
			)
		)
	)
	(property "Footprint" ""
		(at 0 0 0)
		(layer "F.Fab")
		(hide yes)
		(uuid "735d165e-f9c6-4e9a-856b-82c723af7eb6")
		(effects
			(font
				(size 1.27 1.27)
				(thickness 0.15)
			)
		)
	)
	(property "Datasheet" ""
		(at 0 0 0)
		(layer "F.Fab")
		(hide yes)
		(uuid "b16b79f0-f781-449d-9640-d2c15a0cad73")
		(effects
			(font
				(size 1.27 1.27)
				(thickness 0.15)
			)
		)
	)
	(property "Description" ""
		(at 0 0 0)
		(layer "F.Fab")
		(hide yes)
		(uuid "1b2c55d4-60fa-4a02-8fc2-fcbc01520c61")
		(effects
			(font
				(size 1.27 1.27)
				(thickness 0.15)
			)
		)
	)
	(attr smd)
	(fp_line
		(start -1.8 -1.95)
		(end -1.55 -2.2)
		(stroke
			(width 0.1)
			(type default)
		)
		(layer "F.SilkS")
		(uuid "37122dac-8c15-4de0-84ec-37cf1dda792e")
	)
	(fp_line
		(start -1.8 -1.95)
		(end -1.55 -1.7)
		(stroke
			(width 0.1)
			(type default)
		)
		(layer "F.SilkS")
		(uuid "c91bbedd-ac2f-41e0-8228-fc16ad8c82cc")
	)
	(fp_line
		(start -1.8 -1.95)
		(end -1.1 -1.95)
		(stroke
			(width 0.1)
			(type default)
		)
		(layer "F.SilkS")
		(uuid "6320dbb1-c38e-4a98-8e46-6f856208d19b")
	)
	(fp_line
		(start 2.1082 -2.6035)
		(end -2.1082 -2.6035)
		(stroke
			(width 0.1524)
			(type solid)
		)
		(layer "F.SilkS")
		(uuid "d3feaacb-7964-483d-8516-290b0c0aaec3")
	)
	(fp_line
		(start -3.6576 -2.4384)
		(end -2.2352 -2.4384)
		(stroke
			(width 0.1524)
			(type solid)
		)
		(layer "F.CrtYd")
		(uuid "0a468254-0749-4748-9cb1-9b81d4fad9db")
	)
	(fp_line
		(start -3.6576 2.4384)
		(end -3.6576 -2.4384)
		(stroke
			(width 0.1524)
			(type solid)
		)
		(layer "F.CrtYd")
		(uuid "53ce623c-10ac-4903-8f22-21df009a1376")
	)
	(fp_line
		(start -3.6576 2.4384)
		(end -2.2352 2.4384)
		(stroke
			(width 0.1524)
			(type solid)
		)
		(layer "F.CrtYd")
		(uuid "2a6124f3-3e1c-40cc-8d03-1a2f0c0b8cb7")
	)
	(fp_line
		(start -2.2352 -2.7305)
		(end 2.2352 -2.7305)
		(stroke
			(width 0.1524)
			(type solid)
		)
		(layer "F.CrtYd")
		(uuid "063adcec-2751-4d59-a002-8961ad6c45b8")
	)
	(fp_line
		(start -2.2352 -2.4384)
		(end -2.2352 -2.7305)
		(stroke
			(width 0.1524)
			(type solid)
		)
		(layer "F.CrtYd")
		(uuid "189e5163-ea76-4574-927a-8d8021ad5762")
	)
	(fp_line
		(start -2.2352 2.7305)
		(end -2.2352 2.4384)
		(stroke
			(width 0.1524)
			(type solid)
		)
		(layer "F.CrtYd")
		(uuid "a8e4c786-e20d-440b-83d3-c1eda580dc55")
	)
	(fp_line
		(start 2.2352 -2.7305)
		(end 2.2352 -2.4384)
		(stroke
			(width 0.1524)
			(type solid)
		)
		(layer "F.CrtYd")
		(uuid "75cf3adc-97e1-4084-a0b4-9eff51f87cc3")
	)
	(fp_line
		(start 2.2352 2.4384)
		(end 2.2352 2.7305)
		(stroke
			(width 0.1524)
			(type solid)
		)
		(layer "F.CrtYd")
		(uuid "0524ab21-4525-4846-90db-8e4a04c6ab48")
	)
	(fp_line
		(start 2.2352 2.7305)
		(end -2.2352 2.7305)
		(stroke
			(width 0.1524)
			(type solid)
		)
		(layer "F.CrtYd")
		(uuid "db483b80-9b14-41ad-b593-f838a6eab4ae")
	)
	(fp_line
		(start 3.6576 -2.4384)
		(end 2.2352 -2.4384)
		(stroke
			(width 0.1524)
			(type solid)
		)
		(layer "F.CrtYd")
		(uuid "50dcc5a1-6e54-4a63-bd17-8dd749a5b50e")
	)
	(fp_line
		(start 3.6576 -2.4384)
		(end 3.6576 2.4384)
		(stroke
			(width 0.1524)
			(type solid)
		)
		(layer "F.CrtYd")
		(uuid "1558969a-f250-4e9c-9271-95c85e7d2bcb")
	)
	(fp_line
		(start 3.6576 2.4384)
		(end 2.2352 2.4384)
		(stroke
			(width 0.1524)
			(type solid)
		)
		(layer "F.CrtYd")
		(uuid "1e87c340-6b44-4319-91b1-9830b2116126")
	)
	(fp_line
		(start -3.048 -2.159)
		(end -3.048 -1.651)
		(stroke
			(width 0.0254)
			(type solid)
		)
		(layer "F.Fab")
		(uuid "587d7a5f-70bd-47a9-9c63-bd29df0a2870")
	)
	(fp_line
		(start -3.048 -1.651)
		(end -1.9812 -1.651)
		(stroke
			(width 0.0254)
			(type solid)
		)
		(layer "F.Fab")
		(uuid "73cd0ea7-badf-41d9-af9d-febd0452312a")
	)
	(fp_line
		(start -3.048 -0.889)
		(end -3.048 -0.381)
		(stroke
			(width 0.0254)
			(type solid)
		)
		(layer "F.Fab")
		(uuid "b98ab0a0-3efc-4176-bc4b-b034187f7812")
	)
	(fp_line
		(start -3.048 -0.381)
		(end -1.9812 -0.381)
		(stroke
			(width 0.0254)
			(type solid)
		)
		(layer "F.Fab")
		(uuid "63d5c1cd-64a9-48dd-8fc4-47b26ec12e9a")
	)
	(fp_line
		(start -3.048 0.381)
		(end -3.048 0.889)
		(stroke
			(width 0.0254)
			(type solid)
		)
		(layer "F.Fab")
		(uuid "14b315c8-993a-431c-914e-fd178c1507ac")
	)
	(fp_line
		(start -3.048 0.889)
		(end -1.9812 0.889)
		(stroke
			(width 0.0254)
			(type solid)
		)
		(layer "F.Fab")
		(uuid "2c807753-0d58-4072-919d-f80e1d3cfe6f")
	)
	(fp_line
		(start -3.048 1.651)
		(end -3.048 2.159)
		(stroke
			(width 0.0254)
			(type solid)
		)
		(layer "F.Fab")
		(uuid "150449ec-f7cd-4395-89e2-3f59fe151e28")
	)
	(fp_line
		(start -3.048 2.159)
		(end -1.9812 2.159)
		(stroke
			(width 0.0254)
			(type solid)
		)
		(layer "F.Fab")
		(uuid "a0625baa-5f6b-4493-84f9-4cfdcf76a7e2")
	)
	(fp_line
		(start -1.9812 -2.4765)
		(end -1.9812 2.4765)
		(stroke
			(width 0.0254)
			(type solid)
		)
		(layer "F.Fab")
		(uuid "b61e60a9-a27c-42be-862d-7fe46795fe73")
	)
	(fp_line
		(start -1.9812 -2.159)
		(end -3.048 -2.159)
		(stroke
			(width 0.0254)
			(type solid)
		)
		(layer "F.Fab")
		(uuid "cfb2baf5-7323-4d3b-95f2-aba38979d14e")
	)
	(fp_line
		(start -1.9812 -1.651)
		(end -1.9812 -2.159)
		(stroke
			(width 0.0254)
			(type solid)
		)
		(layer "F.Fab")
		(uuid "14ab579c-d363-4034-8a05-ae32c55bd923")
	)
	(fp_line
		(start -1.9812 -0.889)
		(end -3.048 -0.889)
		(stroke
			(width 0.0254)
			(type solid)
		)
		(layer "F.Fab")
		(uuid "00a4ab91-1fed-4363-b643-5650b12cc5d9")
	)
	(fp_line
		(start -1.9812 -0.381)
		(end -1.9812 -0.889)
		(stroke
			(width 0.0254)
			(type solid)
		)
		(layer "F.Fab")
		(uuid "0d285dea-c2b4-413d-9e7a-2b79eb96dcb5")
	)
	(fp_line
		(start -1.9812 0.381)
		(end -3.048 0.381)
		(stroke
			(width 0.0254)
			(type solid)
		)
		(layer "F.Fab")
		(uuid "bdd25630-5842-4e8b-a9df-cbf3e2c3972c")
	)
	(fp_line
		(start -1.9812 0.889)
		(end -1.9812 0.381)
		(stroke
			(width 0.0254)
			(type solid)
		)
		(layer "F.Fab")
		(uuid "f9dd319b-dede-4108-9079-ef73b9ec1ccc")
	)
	(fp_line
		(start -1.9812 1.651)
		(end -3.048 1.651)
		(stroke
			(width 0.0254)
			(type solid)
		)
		(layer "F.Fab")
		(uuid "2f490837-5768-4557-ac98-3beb71cc7600")
	)
	(fp_line
		(start -1.9812 2.159)
		(end -1.9812 1.651)
		(stroke
			(width 0.0254)
			(type solid)
		)
		(layer "F.Fab")
		(uuid "dc48acb2-e973-4dab-9dbc-4380c001a09f")
	)
	(fp_line
		(start -1.9812 2.4765)
		(end 1.9812 2.4765)
		(stroke
			(width 0.0254)
			(type solid)
		)
		(layer "F.Fab")
		(uuid "82d43bae-9803-405d-9f92-ae27933f1bc2")
	)
	(fp_line
		(start 1.9812 -2.4765)
		(end -1.9812 -2.4765)
		(stroke
			(width 0.0254)
			(type solid)
		)
		(layer "F.Fab")
		(uuid "da068788-6b35-4601-8c66-471d7704fe58")
	)
	(fp_line
		(start 1.9812 -2.159)
		(end 1.9812 -1.651)
		(stroke
			(width 0.0254)
			(type solid)
		)
		(layer "F.Fab")
		(uuid "caa9fa49-cf26-4f41-8d00-03ff27e4c7e6")
	)
	(fp_line
		(start 1.9812 -1.651)
		(end 3.048 -1.651)
		(stroke
			(width 0.0254)
			(type solid)
		)
		(layer "F.Fab")
		(uuid "05142b1c-454f-4468-987d-bab530da6343")
	)
	(fp_line
		(start 1.9812 -0.889)
		(end 1.9812 -0.381)
		(stroke
			(width 0.0254)
			(type solid)
		)
		(layer "F.Fab")
		(uuid "58c8d352-2a30-4111-83ad-7e43445930a3")
	)
	(fp_line
		(start 1.9812 -0.381)
		(end 3.048 -0.381)
		(stroke
			(width 0.0254)
			(type solid)
		)
		(layer "F.Fab")
		(uuid "8a990864-5d5c-4365-973c-e0905fbeefa9")
	)
	(fp_line
		(start 1.9812 0.381)
		(end 1.9812 0.889)
		(stroke
			(width 0.0254)
			(type solid)
		)
		(layer "F.Fab")
		(uuid "97fa3b03-d4bf-466b-9917-7bfb337f4eb1")
	)
	(fp_line
		(start 1.9812 0.889)
		(end 3.048 0.889)
		(stroke
			(width 0.0254)
			(type solid)
		)
		(layer "F.Fab")
		(uuid "e3d755ad-5831-4224-b2dc-fe7dff297bb5")
	)
	(fp_line
		(start 1.9812 1.651)
		(end 1.9812 2.159)
		(stroke
			(width 0.0254)
			(type solid)
		)
		(layer "F.Fab")
		(uuid "550c1c92-e863-4e2e-b277-29f28fddab91")
	)
	(fp_line
		(start 1.9812 2.159)
		(end 3.048 2.159)
		(stroke
			(width 0.0254)
			(type solid)
		)
		(layer "F.Fab")
		(uuid "388462e3-73f0-4bcd-ade6-d3d261e035a7")
	)
	(fp_line
		(start 1.9812 2.4765)
		(end 1.9812 -2.4765)
		(stroke
			(width 0.0254)
			(type solid)
		)
		(layer "F.Fab")
		(uuid "f4cc315d-5ba7-499c-8d26-1842b3552c28")
	)
	(fp_line
		(start 3.048 -2.159)
		(end 1.9812 -2.159)
		(stroke
			(width 0.0254)
			(type solid)
		)
		(layer "F.Fab")
		(uuid "ef378cc3-26a6-4fd9-b019-2f79d184fc61")
	)
	(fp_line
		(start 3.048 -1.651)
		(end 3.048 -2.159)
		(stroke
			(width 0.0254)
			(type solid)
		)
		(layer "F.Fab")
		(uuid "55d73ebc-a0e3-457a-a487-421fb4bf66ac")
	)
	(fp_line
		(start 3.048 -0.889)
		(end 1.9812 -0.889)
		(stroke
			(width 0.0254)
			(type solid)
		)
		(layer "F.Fab")
		(uuid "0d035e4e-09d2-45dd-b5f5-1e629d286ee0")
	)
	(fp_line
		(start 3.048 -0.381)
		(end 3.048 -0.889)
		(stroke
			(width 0.0254)
			(type solid)
		)
		(layer "F.Fab")
		(uuid "e946250f-cfc1-4500-af1b-8cb61603d816")
	)
	(fp_line
		(start 3.048 0.381)
		(end 1.9812 0.381)
		(stroke
			(width 0.0254)
			(type solid)
		)
		(layer "F.Fab")
		(uuid "9d126964-5d50-4c6d-b7b6-ec57ce3a5e10")
	)
	(fp_line
		(start 3.048 0.889)
		(end 3.048 0.381)
		(stroke
			(width 0.0254)
			(type solid)
		)
		(layer "F.Fab")
		(uuid "e4e769d3-aefd-48e1-9cc8-a880e556c916")
	)
	(fp_line
		(start 3.048 1.651)
		(end 1.9812 1.651)
		(stroke
			(width 0.0254)
			(type solid)
		)
		(layer "F.Fab")
		(uuid "8823187d-e6ab-4af0-b8ae-c2a82b3824bb")
	)
	(fp_line
		(start 3.048 2.159)
		(end 3.048 1.651)
		(stroke
			(width 0.0254)
			(type solid)
		)
		(layer "F.Fab")
		(uuid "461381e8-7160-4458-b8ad-0dff102e3371")
	)
	(fp_arc
		(start 0.3048 -2.4765)
		(mid 0 -2.1717)
		(end -0.3048 -2.4765)
		(stroke
			(width 0.0254)
			(type solid)
		)
		(layer "F.Fab")
		(uuid "9635bc8e-9821-4d7c-a452-052d0b0a946c")
	)
	(fp_text user "*"
		(at -3.05 -2.55 0)
		(unlocked yes)
		(layer "F.SilkS")
		(uuid "77d5e50f-ef84-487d-90d5-a7cfda92ac68")
		(effects
			(font
				(size 1 1)
				(thickness 0.2)
				(bold yes)
			)
		)
	)
	(fp_text user "*"
		(at -1.6002 -2.4003 0)
		(layer "F.Fab")
		(uuid "6611bf1b-6c74-4f89-ab4e-38ba4665c395")
		(effects
			(font
				(size 1 1)
				(thickness 0.15)
			)
		)
	)
	(fp_text user "${REFERENCE}"
		(at 0 0 0)
		(unlocked yes)
		(layer "F.Fab")
		(uuid "b08a9cda-ee07-4ce4-a6cf-877034c2c03a")
		(effects
			(font
				(size 1 1)
				(thickness 0.15)
			)
		)
	)
	(fp_text user "*"
		(at -1.6002 -2.4003 0)
		(unlocked yes)
		(layer "F.Fab")
		(uuid "bf43e3e5-b539-4e9e-9b7e-19054cf9bccf")
		(effects
			(font
				(size 1 1)
				(thickness 0.15)
			)
		)
	)
	(pad "1" smd rect
		(at -2.6924 -1.905)
		(size 1.4224 0.5588)
		(layers "F.Cu" "F.Paste" "F.Mask")
		(uuid "e36bf941-0f4f-4357-a546-d5df741f956e")
	)
	(pad "2" smd rect
		(at -2.6924 -0.635)
		(size 1.4224 0.5588)
		(layers "F.Cu" "F.Paste" "F.Mask")
		(uuid "93af19a3-218c-4d54-9161-d4d81ad29ef8")
	)
	(pad "3" smd rect
		(at -2.6924 0.635)
		(size 1.4224 0.5588)
		(layers "F.Cu" "F.Paste" "F.Mask")
		(uuid "4fa0c3de-d868-45c7-ac6a-0b26e3712b93")
	)
	(pad "4" smd rect
		(at -2.6924 1.905)
		(size 1.4224 0.5588)
		(layers "F.Cu" "F.Paste" "F.Mask")
		(uuid "6059c4bd-6e57-4ebc-b1c4-b14b19c46179")
	)
	(pad "5" smd rect
		(at 2.6924 1.905)
		(size 1.4224 0.5588)
		(layers "F.Cu" "F.Paste" "F.Mask")
		(uuid "efef67a4-1b40-4fc9-8527-162d82c8f9e1")
	)
	(pad "6" smd rect
		(at 2.6924 0.635)
		(size 1.4224 0.5588)
		(layers "F.Cu" "F.Paste" "F.Mask")
		(uuid "7eaa2bed-b7b5-4945-a3e9-1f3b9e0345d8")
	)
	(pad "7" smd rect
		(at 2.6924 -0.635)
		(size 1.4224 0.5588)
		(layers "F.Cu" "F.Paste" "F.Mask")
		(uuid "7016edc2-87a5-4a33-8e5f-47cd9c6de367")
	)
	(pad "8" smd rect
		(at 2.6924 -1.905)
		(size 1.4224 0.5588)
		(layers "F.Cu" "F.Paste" "F.Mask")
		(uuid "ed76f69e-fcb0-4b8c-b10d-e52b0ea7f58e")
	)
	(model "${KIPRJMOD}/3D/DMHC3025LSD_Pump.step"
		(offset
			(xyz 0 0 0)
		)
		(scale
			(xyz 1 1 1)
		)
		(rotate
			(xyz 0 0 0)
		)
	)
)
