(footprint "spacedot_footprint" (version 20221018) (generator pcbnew)
  (layer "F.Cu")
  (attr through_hole)
  (fp_text reference "G***" (at 0 0) (layer "F.SilkS") hide
      (effects (font (size 1.524 1.524) (thickness 0.3)))
    (tstamp 07693baa-6545-4d75-989d-ebae9ad540bc)
  )
  (fp_text value "LOGO" (at 0.75 0) (layer "F.SilkS") hide
      (effects (font (size 1.524 1.524) (thickness 0.3)))
    (tstamp b9c66244-4601-47b2-9835-f16483e72282)
  )
  (fp_poly
    (pts
      (xy -5.871539 -0.907627)
      (xy -5.835301 -0.885851)
      (xy -5.805123 -0.852874)
      (xy -5.795003 -0.835943)
      (xy -5.779455 -0.791401)
      (xy -5.775492 -0.743053)
      (xy -5.782604 -0.694939)
      (xy -5.800284 -0.651099)
      (xy -5.822007 -0.621489)
      (xy -5.854433 -0.597474)
      (xy -5.894082 -0.58338)
      (xy -5.936711 -0.579875)
      (xy -5.978079 -0.587623)
      (xy -5.994194 -0.594462)
      (xy -6.028126 -0.620029)
      (xy -6.054944 -0.656481)
      (xy -6.072894 -0.70002)
      (xy -6.08022 -0.746846)
      (xy -6.078488 -0.777027)
      (xy -6.071753 -0.802469)
      (xy -6.059964 -0.831659)
      (xy -6.05301 -0.845232)
      (xy -6.025312 -0.880859)
      (xy -5.990727 -0.904818)
      (xy -5.951843 -0.917204)
      (xy -5.91125 -0.918109)
      (xy -5.871539 -0.907627)
    )

    (stroke (width 0.01) (type solid)) (fill solid) (layer "F.SilkS") (tstamp 7ff057ef-16e7-43cb-8be9-4c9ed4d25c3c))
  (fp_poly
    (pts
      (xy -6.559216 -0.322127)
      (xy -6.500095 -0.306904)
      (xy -6.472128 -0.294146)
      (xy -6.418763 -0.257824)
      (xy -6.37487 -0.211186)
      (xy -6.34109 -0.156298)
      (xy -6.318062 -0.095224)
      (xy -6.306428 -0.030031)
      (xy -6.306829 0.037215)
      (xy -6.319905 0.10445)
      (xy -6.335353 0.146821)
      (xy -6.367893 0.203944)
      (xy -6.410204 0.251305)
      (xy -6.46026 0.287853)
      (xy -6.516038 0.312542)
      (xy -6.575513 0.324322)
      (xy -6.636659 0.322144)
      (xy -6.663141 0.316608)
      (xy -6.714956 0.295302)
      (xy -6.764129 0.26067)
      (xy -6.807934 0.215258)
      (xy -6.843645 0.161616)
      (xy -6.855917 0.136463)
      (xy -6.864582 0.115325)
      (xy -6.870266 0.096533)
      (xy -6.873588 0.075796)
      (xy -6.875168 0.048824)
      (xy -6.875627 0.011328)
      (xy -6.875639 0)
      (xy -6.875361 -0.040743)
      (xy -6.874114 -0.069906)
      (xy -6.871278 -0.091779)
      (xy -6.866233 -0.110651)
      (xy -6.858358 -0.130814)
      (xy -6.855917 -0.136464)
      (xy -6.822409 -0.196671)
      (xy -6.780115 -0.246164)
      (xy -6.730842 -0.284198)
      (xy -6.676397 -0.310031)
      (xy -6.618585 -0.322921)
      (xy -6.559216 -0.322127)
    )

    (stroke (width 0.01) (type solid)) (fill solid) (layer "F.SilkS") (tstamp 4bdbb130-9950-4ff8-8498-6a4d930dbcaa))
  (fp_poly
    (pts
      (xy 2.486496 -1.01598)
      (xy 2.550145 -1.015881)
      (xy 2.602178 -1.015646)
      (xy 2.643844 -1.015215)
      (xy 2.676391 -1.014532)
      (xy 2.701066 -1.013538)
      (xy 2.719118 -1.012175)
      (xy 2.731794 -1.010385)
      (xy 2.740343 -1.008111)
      (xy 2.746012 -1.005294)
      (xy 2.750049 -1.001876)
      (xy 2.751667 -1.000125)
      (xy 2.760792 -0.984829)
      (xy 2.765051 -0.962479)
      (xy 2.765778 -0.940594)
      (xy 2.764152 -0.910534)
      (xy 2.758476 -0.890973)
      (xy 2.751667 -0.881063)
      (xy 2.747569 -0.877001)
      (xy 2.742288 -0.873697)
      (xy 2.734434 -0.871074)
      (xy 2.722613 -0.869054)
      (xy 2.705433 -0.867557)
      (xy 2.681502 -0.866505)
      (xy 2.649426 -0.865821)
      (xy 2.607814 -0.865426)
      (xy 2.555274 -0.865242)
      (xy 2.490412 -0.86519)
      (xy 2.469445 -0.865188)
      (xy 2.201333 -0.865188)
      (xy 2.201333 -0.095875)
      (xy 2.43127 -0.093578)
      (xy 2.661206 -0.091282)
      (xy 2.674686 -0.072543)
      (xy 2.685542 -0.045795)
      (xy 2.688167 -0.015875)
      (xy 2.684023 0.020428)
      (xy 2.674686 0.040792)
      (xy 2.661206 0.059531)
      (xy 2.43127 0.061827)
      (xy 2.201333 0.064124)
      (xy 2.201333 0.85671)
      (xy 2.472239 0.858964)
      (xy 2.545244 0.859542)
      (xy 2.605384 0.860163)
      (xy 2.653903 0.861151)
      (xy 2.692044 0.862831)
      (xy 2.721052 0.865525)
      (xy 2.742169 0.869559)
      (xy 2.756641 0.875256)
      (xy 2.76571 0.882941)
      (xy 2.770621 0.892937)
      (xy 2.772617 0.905569)
      (xy 2.772942 0.92116)
      (xy 2.772833 0.937279)
      (xy 2.771987 0.964656)
      (xy 2.768363 0.981657)
      (xy 2.760336 0.99373)
      (xy 2.754243 0.999548)
      (xy 2.749523 1.003409)
      (xy 2.744026 1.006613)
      (xy 2.73648 1.009221)
      (xy 2.725611 1.011296)
      (xy 2.710148 1.012897)
      (xy 2.688816 1.014087)
      (xy 2.660343 1.014926)
      (xy 2.623457 1.015475)
      (xy 2.576884 1.015796)
      (xy 2.519351 1.015949)
      (xy 2.449585 1.015997)
      (xy 2.411728 1.016)
      (xy 2.087803 1.016)
      (xy 2.053167 0.977034)
      (xy 2.053167 0.001431)
      (xy 2.053169 -0.143193)
      (xy 2.053184 -0.272785)
      (xy 2.053223 -0.388192)
      (xy 2.0533 -0.490257)
      (xy 2.053427 -0.579825)
      (xy 2.053616 -0.65774)
      (xy 2.053879 -0.724847)
      (xy 2.054229 -0.78199)
      (xy 2.054679 -0.830014)
      (xy 2.05524 -0.869763)
      (xy 2.055925 -0.902082)
      (xy 2.056747 -0.927814)
      (xy 2.057717 -0.947806)
      (xy 2.058849 -0.9629)
      (xy 2.060154 -0.973941)
      (xy 2.061646 -0.981775)
      (xy 2.063336 -0.987244)
      (xy 2.065237 -0.991195)
      (xy 2.06736 -0.994471)
      (xy 2.06779 -0.995086)
      (xy 2.082413 -1.016)
      (xy 2.409984 -1.016)
      (xy 2.486496 -1.01598)
    )

    (stroke (width 0.01) (type solid)) (fill solid) (layer "F.SilkS") (tstamp 175a0955-17b5-40e8-b02a-8ce2f3ccd637))
  (fp_poly
    (pts
      (xy 7.352921 -1.023886)
      (xy 7.403658 -1.023342)
      (xy 7.444518 -1.022219)
      (xy 7.47656 -1.020329)
      (xy 7.500841 -1.017483)
      (xy 7.518421 -1.013491)
      (xy 7.530356 -1.008166)
      (xy 7.537707 -1.001317)
      (xy 7.54153 -0.992756)
      (xy 7.542885 -0.982294)
      (xy 7.54283 -0.969742)
      (xy 7.542422 -0.954912)
      (xy 7.542389 -0.950467)
      (xy 7.541466 -0.923438)
      (xy 7.537559 -0.906625)
      (xy 7.528959 -0.894434)
      (xy 7.523799 -0.889577)
      (xy 7.516857 -0.884118)
      (xy 7.508723 -0.880019)
      (xy 7.497405 -0.877086)
      (xy 7.480912 -0.875125)
      (xy 7.45725 -0.873943)
      (xy 7.424429 -0.873346)
      (xy 7.380457 -0.873142)
      (xy 7.354465 -0.873125)
      (xy 7.203722 -0.873125)
      (xy 7.203722 0.050714)
      (xy 7.203758 0.194575)
      (xy 7.203829 0.32339)
      (xy 7.20388 0.437985)
      (xy 7.203856 0.539191)
      (xy 7.203702 0.627833)
      (xy 7.203362 0.704742)
      (xy 7.202781 0.770743)
      (xy 7.201905 0.826666)
      (xy 7.200678 0.873339)
      (xy 7.199045 0.911589)
      (xy 7.196951 0.942244)
      (xy 7.194341 0.966133)
      (xy 7.191159 0.984084)
      (xy 7.18735 0.996924)
      (xy 7.18286 1.005482)
      (xy 7.177633 1.010585)
      (xy 7.171614 1.013063)
      (xy 7.164748 1.013741)
      (xy 7.15698 1.01345)
      (xy 7.148255 1.013016)
      (xy 7.139631 1.013182)
      (xy 7.114953 1.013368)
      (xy 7.093983 1.010899)
      (xy 7.086003 1.008439)
      (xy 7.07032 0.995781)
      (xy 7.063072 0.985219)
      (xy 7.061777 0.975946)
      (xy 7.060611 0.953665)
      (xy 7.059572 0.918101)
      (xy 7.058658 0.86898)
      (xy 7.057866 0.806028)
      (xy 7.057195 0.728971)
      (xy 7.056642 0.637535)
      (xy 7.056205 0.531445)
      (xy 7.055881 0.410428)
      (xy 7.055669 0.27421)
      (xy 7.055567 0.122517)
      (xy 7.055556 0.048146)
      (xy 7.055556 -0.873125)
      (xy 6.904813 -0.873125)
      (xy 6.854702 -0.87321)
      (xy 6.816711 -0.873592)
      (xy 6.788847 -0.874465)
      (xy 6.769118 -0.876024)
      (xy 6.755534 -0.87846)
      (xy 6.746101 -0.881968)
      (xy 6.738829 -0.886742)
      (xy 6.735479 -0.889577)
      (xy 6.724675 -0.901224)
      (xy 6.719078 -0.915109)
      (xy 6.717062 -0.936677)
      (xy 6.716889 -0.951846)
      (xy 6.716592 -0.966992)
      (xy 6.716405 -0.979863)
      (xy 6.717384 -0.990646)
      (xy 6.720585 -0.999523)
      (xy 6.727065 -1.006678)
      (xy 6.737878 -1.012295)
      (xy 6.754081 -1.016559)
      (xy 6.776731 -1.019652)
      (xy 6.806882 -1.02176)
      (xy 6.845592 -1.023065)
      (xy 6.893915 -1.023752)
      (xy 6.952909 -1.024005)
      (xy 7.023629 -1.024007)
      (xy 7.10713 -1.023943)
      (xy 7.130865 -1.023938)
      (xy 7.217583 -1.023995)
      (xy 7.291249 -1.024041)
      (xy 7.352921 -1.023886)
    )

    (stroke (width 0.01) (type solid)) (fill solid) (layer "F.SilkS") (tstamp 3cab68a8-6fd4-4f3e-9bde-390ff5b84190))
  (fp_poly
    (pts
      (xy -6.590764 -1.060853)
      (xy -6.574672 -1.057312)
      (xy -6.572364 -1.055794)
      (xy -6.563548 -1.039426)
      (xy -6.562527 -1.019216)
      (xy -6.569582 -1.003159)
      (xy -6.570486 -1.002308)
      (xy -6.580655 -0.998585)
      (xy -6.601786 -0.994164)
      (xy -6.630777 -0.989603)
      (xy -6.663972 -0.985518)
      (xy -6.776549 -0.965859)
      (xy -6.883603 -0.931976)
      (xy -6.984395 -0.884434)
      (xy -7.078185 -0.823794)
      (xy -7.164236 -0.750619)
      (xy -7.241807 -0.665472)
      (xy -7.310161 -0.568916)
      (xy -7.368557 -0.461514)
      (xy -7.377499 -0.442088)
      (xy -7.420918 -0.328299)
      (xy -7.450948 -0.211397)
      (xy -7.467757 -0.092677)
      (xy -7.471512 0.026565)
      (xy -7.462382 0.145034)
      (xy -7.440534 0.261437)
      (xy -7.406135 0.374477)
      (xy -7.359353 0.48286)
      (xy -7.300356 0.58529)
      (xy -7.232722 0.676414)
      (xy -7.153389 0.759938)
      (xy -7.064881 0.832332)
      (xy -6.968954 0.892508)
      (xy -6.867365 0.939373)
      (xy -6.761871 0.971837)
      (xy -6.754106 0.973605)
      (xy -6.704394 0.981617)
      (xy -6.645905 0.986229)
      (xy -6.58347 0.987436)
      (xy -6.521921 0.985232)
      (xy -6.466091 0.979612)
      (xy -6.434362 0.973949)
      (xy -6.326452 0.942135)
      (xy -6.224221 0.896428)
      (xy -6.128583 0.837725)
      (xy -6.040452 0.766924)
      (xy -5.960743 0.68492)
      (xy -5.890369 0.592612)
      (xy -5.830245 0.490895)
      (xy -5.781285 0.380668)
      (xy -5.757271 0.309562)
      (xy -5.74463 0.261115)
      (xy -5.733211 0.205919)
      (xy -5.723888 0.149309)
      (xy -5.71753 0.096619)
      (xy -5.71501 0.053187)
      (xy -5.715 0.05079)
      (xy -5.712307 0.008038)
      (xy -5.704361 -0.020822)
      (xy -5.691365 -0.03546)
      (xy -5.673521 -0.035542)
      (xy -5.6651 -0.031443)
      (xy -5.65848 -0.025551)
      (xy -5.654408 -0.015349)
      (xy -5.652295 0.002566)
      (xy -5.651548 0.031597)
      (xy -5.6515 0.046864)
      (xy -5.657607 0.148415)
      (xy -5.675666 0.255139)
      (xy -5.697275 0.338614)
      (xy -5.739923 0.45772)
      (xy -5.794268 0.568751)
      (xy -5.859429 0.67083)
      (xy -5.934528 0.763079)
      (xy -6.018684 0.84462)
      (xy -6.111016 0.914578)
      (xy -6.210645 0.972073)
      (xy -6.316689 1.016229)
      (xy -6.401268 1.040381)
      (xy -6.438201 1.047218)
      (xy -6.483388 1.052998)
      (xy -6.532919 1.057472)
      (xy -6.582881 1.060391)
      (xy -6.629364 1.061508)
      (xy -6.668455 1.060572)
      (xy -6.688667 1.058659)
      (xy -6.806838 1.034349)
      (xy -6.918558 0.996441)
      (xy -7.023197 0.945569)
      (xy -7.120128 0.882368)
      (xy -7.208722 0.807474)
      (xy -7.288353 0.721521)
      (xy -7.358391 0.625144)
      (xy -7.418209 0.518978)
      (xy -7.467179 0.403659)
      (xy -7.504672 0.27982)
      (xy -7.517876 0.220251)
      (xy -7.524018 0.178793)
      (xy -7.528825 0.126033)
      (xy -7.532161 0.066484)
      (xy -7.533892 0.004661)
      (xy -7.533881 -0.054922)
      (xy -7.531993 -0.107749)
      (xy -7.528806 -0.144014)
      (xy -7.50949 -0.25481)
      (xy -7.480284 -0.363706)
      (xy -7.442584 -0.466035)
      (xy -7.414194 -0.526804)
      (xy -7.352305 -0.632107)
      (xy -7.279959 -0.728259)
      (xy -7.198433 -0.814226)
      (xy -7.109005 -0.888977)
      (xy -7.012951 -0.951483)
      (xy -6.91155 -1.00071)
      (xy -6.806078 -1.035628)
      (xy -6.774935 -1.042926)
      (xy -6.733145 -1.050699)
      (xy -6.691171 -1.056547)
      (xy -6.651675 -1.060301)
      (xy -6.617319 -1.061793)
      (xy -6.590764 -1.060853)
    )

    (stroke (width 0.01) (type solid)) (fill solid) (layer "F.SilkS") (tstamp 907ab84f-49c5-4632-831f-f5a37c5cae38))
  (fp_poly
    (pts
      (xy 3.819752 -1.014044)
      (xy 3.889519 -1.013074)
      (xy 3.946712 -1.012005)
      (xy 3.992866 -1.010751)
      (xy 4.029518 -1.009227)
      (xy 4.058204 -1.007347)
      (xy 4.080462 -1.005024)
      (xy 4.097826 -1.002173)
      (xy 4.111834 -0.998709)
      (xy 4.115703 -0.997507)
      (xy 4.184009 -0.969082)
      (xy 4.240988 -0.931573)
      (xy 4.287334 -0.884212)
      (xy 4.323739 -0.826231)
      (xy 4.350897 -0.75686)
      (xy 4.358743 -0.728144)
      (xy 4.360909 -0.718306)
      (xy 4.362804 -0.70684)
      (xy 4.364446 -0.692686)
      (xy 4.365853 -0.674781)
      (xy 4.367042 -0.652064)
      (xy 4.368032 -0.623472)
      (xy 4.368841 -0.587943)
      (xy 4.369485 -0.544415)
      (xy 4.369984 -0.491826)
      (xy 4.370355 -0.429114)
      (xy 4.370615 -0.355217)
      (xy 4.370783 -0.269073)
      (xy 4.370877 -0.16962)
      (xy 4.370914 -0.055795)
      (xy 4.370917 -0.003969)
      (xy 4.370918 0.118663)
      (xy 4.370886 0.226508)
      (xy 4.370767 0.320656)
      (xy 4.370507 0.402195)
      (xy 4.370052 0.472213)
      (xy 4.36935 0.5318)
      (xy 4.368346 0.582043)
      (xy 4.366986 0.624031)
      (xy 4.365218 0.658853)
      (xy 4.362987 0.687598)
      (xy 4.360239 0.711354)
      (xy 4.356921 0.73121)
      (xy 4.35298 0.748254)
      (xy 4.348361 0.763576)
      (xy 4.343011 0.778262)
      (xy 4.336876 0.793403)
      (xy 4.3309 0.807693)
      (xy 4.298486 0.86732)
      (xy 4.255102 0.917062)
      (xy 4.200692 0.956966)
      (xy 4.135203 0.987082)
      (xy 4.115679 0.993521)
      (xy 4.099621 0.998108)
      (xy 4.083391 1.00184)
      (xy 4.065257 1.004836)
      (xy 4.043489 1.007213)
      (xy 4.016355 1.009091)
      (xy 3.982124 1.010586)
      (xy 3.939066 1.011818)
      (xy 3.88545 1.012905)
      (xy 3.819545 1.013966)
      (xy 3.81571 1.014023)
      (xy 3.570948 1.017663)
      (xy 3.552891 0.997348)
      (xy 3.534833 0.977034)
      (xy 3.534833 0.85725)
      (xy 3.683 0.85725)
      (xy 3.850851 0.85725)
      (xy 3.911513 0.85695)
      (xy 3.959841 0.855983)
      (xy 3.997603 0.85425)
      (xy 4.026567 0.851649)
      (xy 4.048502 0.848081)
      (xy 4.058987 0.845445)
      (xy 4.109205 0.824937)
      (xy 4.14912 0.795028)
      (xy 4.180439 0.753966)
      (xy 4.204869 0.699997)
      (xy 4.20715 0.693376)
      (xy 4.210023 0.684611)
      (xy 4.212524 0.675859)
      (xy 4.214683 0.665998)
      (xy 4.216529 0.65391)
      (xy 4.218093 0.638472)
      (xy 4.219404 0.618566)
      (xy 4.220493 0.593072)
      (xy 4.221389 0.560867)
      (xy 4.222122 0.520834)
      (xy 4.222723 0.47185)
      (xy 4.223222 0.412796)
      (xy 4.223648 0.342552)
      (xy 4.224032 0.259998)
      (xy 4.224403 0.164012)
      (xy 4.224791 0.053476)
      (xy 4.224866 0.03175)
      (xy 4.22523 -0.099655)
      (xy 4.225362 -0.215624)
      (xy 4.225258 -0.316597)
      (xy 4.224915 -0.403011)
      (xy 4.224328 -0.475305)
      (xy 4.223493 -0.533918)
      (xy 4.222408 -0.579286)
      (xy 4.221067 -0.611849)
      (xy 4.219468 -0.632045)
      (xy 4.219094 -0.634785)
      (xy 4.204093 -0.701157)
      (xy 4.180968 -0.754861)
      (xy 4.14891 -0.796808)
      (xy 4.107113 -0.827904)
      (xy 4.054766 -0.849059)
      (xy 4.021624 -0.856705)
      (xy 4.000267 -0.859293)
      (xy 3.967833 -0.861561)
      (xy 3.927355 -0.863377)
      (xy 3.881867 -0.864608)
      (xy 3.834401 -0.865121)
      (xy 3.829403 -0.865128)
      (xy 3.683 -0.865188)
      (xy 3.683 0.85725)
      (xy 3.534833 0.85725)
      (xy 3.534833 -0.974172)
      (xy 3.549877 -0.995687)
      (xy 3.56492 -1.017203)
      (xy 3.819752 -1.014044)
    )

    (stroke (width 0.01) (type solid)) (fill solid) (layer "F.SilkS") (tstamp a3042917-0ca3-493f-8302-c9aae53a78cd))
  (fp_poly
    (pts
      (xy -2.550084 -1.015545)
      (xy -2.498973 -1.015046)
      (xy -2.435544 -1.014259)
      (xy -2.417692 -1.014028)
      (xy -2.345671 -1.012997)
      (xy -2.286055 -1.011806)
      (xy -2.237137 -1.010232)
      (xy -2.19721 -1.008049)
      (xy -2.164568 -1.005033)
      (xy -2.137504 -1.00096)
      (xy -2.114312 -0.995606)
      (xy -2.093286 -0.988745)
      (xy -2.072718 -0.980154)
      (xy -2.050902 -0.969608)
      (xy -2.040801 -0.964462)
      (xy -2.004048 -0.939891)
      (xy -1.966819 -0.905353)
      (xy -1.933715 -0.865695)
      (xy -1.909536 -0.826178)
      (xy -1.897005 -0.798413)
      (xy -1.886876 -0.770845)
      (xy -1.878905 -0.741414)
      (xy -1.87285 -0.708054)
      (xy -1.868468 -0.668705)
      (xy -1.865517 -0.621302)
      (xy -1.863751 -0.563783)
      (xy -1.86293 -0.494086)
      (xy -1.862789 -0.42934)
      (xy -1.863067 -0.349355)
      (xy -1.863956 -0.283169)
      (xy -1.865679 -0.228715)
      (xy -1.868458 -0.183924)
      (xy -1.872513 -0.146726)
      (xy -1.878067 -0.115053)
      (xy -1.885342 -0.086836)
      (xy -1.894559 -0.060006)
      (xy -1.905125 -0.034356)
      (xy -1.932617 0.013929)
      (xy -1.970183 0.059098)
      (xy -2.013826 0.096807)
      (xy -2.042079 0.114481)
      (xy -2.06748 0.127266)
      (xy -2.091847 0.137524)
      (xy -2.117213 0.145574)
      (xy -2.14561 0.151733)
      (xy -2.179069 0.156319)
      (xy -2.219624 0.15965)
      (xy -2.269307 0.162044)
      (xy -2.330149 0.163819)
      (xy -2.361847 0.164503)
      (xy -2.554111 0.168354)
      (xy -2.554111 0.564022)
      (xy -2.554246 0.667008)
      (xy -2.554655 0.754556)
      (xy -2.555348 0.827101)
      (xy -2.556332 0.885079)
      (xy -2.557615 0.928922)
      (xy -2.559206 0.959067)
      (xy -2.561113 0.975948)
      (xy -2.561945 0.979032)
      (xy -2.577168 0.999146)
      (xy -2.600913 1.012031)
      (xy -2.628873 1.017076)
      (xy -2.656743 1.013667)
      (xy -2.680218 1.001195)
      (xy -2.68496 0.996517)
      (xy -2.702278 0.977034)
      (xy -2.702278 0.015875)
      (xy -2.488847 0.015629)
      (xy -2.432404 0.015312)
      (xy -2.377956 0.014534)
      (xy -2.327826 0.013366)
      (xy -2.284338 0.011876)
      (xy -2.249815 0.010132)
      (xy -2.226581 0.008203)
      (xy -2.223289 0.007772)
      (xy -2.162147 -0.00732)
      (xy -2.111327 -0.033232)
      (xy -2.070823 -0.06997)
      (xy -2.040629 -0.117539)
      (xy -2.030603 -0.141917)
      (xy -2.025846 -0.156197)
      (xy -2.022107 -0.170527)
      (xy -2.019235 -0.187062)
      (xy -2.017079 -0.207954)
      (xy -2.015486 -0.235358)
      (xy -2.014306 -0.271426)
      (xy -2.013388 -0.318313)
      (xy -2.012579 -0.378172)
      (xy -2.012296 -0.402417)
      (xy -2.011656 -0.470393)
      (xy -2.011512 -0.524667)
      (xy -2.011935 -0.567401)
      (xy -2.012999 -0.60076)
      (xy -2.014774 -0.626909)
      (xy -2.017334 -0.648012)
      (xy -2.020751 -0.666234)
      (xy -2.021176 -0.668127)
      (xy -2.039609 -0.727649)
      (xy -2.065598 -0.774586)
      (xy -2.100522 -0.81063)
      (xy -2.145764 -0.83747)
      (xy -2.166254 -0.845718)
      (xy -2.181661 -0.850373)
      (xy -2.200465 -0.854074)
      (xy -2.224611 -0.856983)
      (xy -2.256047 -0.859258)
      (xy -2.29672 -0.861059)
      (xy -2.348579 -0.862546)
      (xy -2.379486 -0.863226)
      (xy -2.554111 -0.866794)
      (xy -2.554111 -0.677257)
      (xy -2.554121 -0.611701)
      (xy -2.55454 -0.5603)
      (xy -2.555954 -0.521334)
      (xy -2.55895 -0.493084)
      (xy -2.564112 -0.473832)
      (xy -2.572027 -0.461857)
      (xy -2.583281 -0.455441)
      (xy -2.598459 -0.452864)
      (xy -2.618146 -0.452408)
      (xy -2.630711 -0.452438)
      (xy -2.661497 -0.453703)
      (xy -2.683621 -0.457212)
      (xy -2.693811 -0.461963)
      (xy -2.696341 -0.469502)
      (xy -2.698372 -0.48658)
      (xy -2.699938 -0.514306)
      (xy -2.701075 -0.553791)
      (xy -2.701818 -0.606148)
      (xy -2.702203 -0.672488)
      (xy -2.702278 -0.727869)
      (xy -2.702249 -0.798459)
      (xy -2.702101 -0.854893)
      (xy -2.70174 -0.898892)
      (xy -2.701075 -0.932173)
      (xy -2.700013 -0.956458)
      (xy -2.69846 -0.973466)
      (xy -2.696324 -0.984915)
      (xy -2.693513 -0.992526)
      (xy -2.689934 -0.998018)
      (xy -2.687567 -1.0008)
      (xy -2.683382 -1.005122)
      (xy -2.678351 -1.008595)
      (xy -2.67104 -1.011289)
      (xy -2.660015 -1.013275)
      (xy -2.64384 -1.014624)
      (xy -2.621083 -1.015405)
      (xy -2.590309 -1.015689)
      (xy -2.550084 -1.015545)
    )

    (stroke (width 0.01) (type solid)) (fill solid) (layer "F.SilkS") (tstamp e2b78dd2-b164-4a1c-b122-e7673d058f30))
  (fp_poly
    (pts
      (xy -0.745666 -1.015064)
      (xy -0.724655 -1.011813)
      (xy -0.71097 -1.005589)
      (xy -0.706786 -1.00211)
      (xy -0.704153 -0.997789)
      (xy -0.700747 -0.988756)
      (xy -0.696411 -0.974269)
      (xy -0.690986 -0.953587)
      (xy -0.684313 -0.925968)
      (xy -0.676234 -0.890671)
      (xy -0.66659 -0.846954)
      (xy -0.655222 -0.794075)
      (xy -0.641973 -0.731294)
      (xy -0.626683 -0.657867)
      (xy -0.609195 -0.573054)
      (xy -0.589349 -0.476113)
      (xy -0.566987 -0.366303)
      (xy -0.541951 -0.242882)
      (xy -0.514081 -0.105108)
      (xy -0.497866 -0.024817)
      (xy -0.47342 0.096493)
      (xy -0.449861 0.213806)
      (xy -0.42738 0.326159)
      (xy -0.406164 0.432591)
      (xy -0.386403 0.532138)
      (xy -0.368287 0.623837)
      (xy -0.352004 0.706726)
      (xy -0.337743 0.779843)
      (xy -0.325694 0.842224)
      (xy -0.316046 0.892908)
      (xy -0.308988 0.930931)
      (xy -0.304709 0.95533)
      (xy -0.303389 0.964936)
      (xy -0.308009 0.989588)
      (xy -0.322592 1.005761)
      (xy -0.348224 1.014232)
      (xy -0.374733 1.016)
      (xy -0.392185 1.015921)
      (xy -0.406489 1.014684)
      (xy -0.418294 1.010786)
      (xy -0.428252 1.002724)
      (xy -0.437013 0.988996)
      (xy -0.445227 0.9681)
      (xy -0.453546 0.938533)
      (xy -0.462619 0.898791)
      (xy -0.473097 0.847374)
      (xy -0.485631 0.782779)
      (xy -0.493533 0.741629)
      (xy -0.540698 0.496093)
      (xy -0.668189 0.493933)
      (xy -0.795679 0.491773)
      (xy -0.782548 0.426465)
      (xy -0.776521 0.395921)
      (xy -0.771904 0.371457)
      (xy -0.769447 0.357084)
      (xy -0.769237 0.355203)
      (xy -0.762535 0.353063)
      (xy -0.744253 0.351264)
      (xy -0.716922 0.349959)
      (xy -0.683072 0.3493)
      (xy -0.670278 0.34925)
      (xy -0.634777 0.349063)
      (xy -0.604936 0.348551)
      (xy -0.583281 0.347785)
      (xy -0.572334 0.346835)
      (xy -0.5715 0.346475)
      (xy -0.572939 0.338057)
      (xy -0.57706 0.315705)
      (xy -0.583574 0.28094)
      (xy -0.592189 0.235284)
      (xy -0.602614 0.18026)
      (xy -0.614558 0.117388)
      (xy -0.627729 0.048191)
      (xy -0.641836 -0.025809)
      (xy -0.65659 -0.103091)
      (xy -0.671697 -0.182132)
      (xy -0.686867 -0.26141)
      (xy -0.70181 -0.339404)
      (xy -0.716233 -0.414592)
      (xy -0.729847 -0.485452)
      (xy -0.742359 -0.550461)
      (xy -0.753478 -0.608099)
      (xy -0.762914 -0.656843)
      (xy -0.770375 -0.69517)
      (xy -0.775571 -0.721561)
      (xy -0.778209 -0.734491)
      (xy -0.778477 -0.735557)
      (xy -0.780166 -0.728223)
      (xy -0.784646 -0.706356)
      (xy -0.791723 -0.67094)
      (xy -0.801207 -0.622962)
      (xy -0.812904 -0.563403)
      (xy -0.826623 -0.49325)
      (xy -0.842172 -0.413485)
      (xy -0.859359 -0.325094)
      (xy -0.877991 -0.22906)
      (xy -0.897876 -0.126368)
      (xy -0.918823 -0.018001)
      (xy -0.940639 0.095055)
      (xy -0.945717 0.121401)
      (xy -0.972069 0.25799)
      (xy -0.995647 0.379872)
      (xy -1.016619 0.487862)
      (xy -1.035156 0.582779)
      (xy -1.051425 0.66544)
      (xy -1.065595 0.736664)
      (xy -1.077836 0.797266)
      (xy -1.088316 0.848065)
      (xy -1.097204 0.889879)
      (xy -1.104669 0.923524)
      (xy -1.11088 0.949819)
      (xy -1.116005 0.969581)
      (xy -1.120214 0.983628)
      (xy -1.123675 0.992777)
      (xy -1.126558 0.997845)
      (xy -1.126804 0.99814)
      (xy -1.140314 1.009522)
      (xy -1.158222 1.014878)
      (xy -1.179915 1.016)
      (xy -1.208177 1.013317)
      (xy -1.229433 1.006111)
      (xy -1.233152 1.003643)
      (xy -1.245405 0.987049)
      (xy -1.248833 0.962988)
      (xy -1.247323 0.952864)
      (xy -1.242945 0.928402)
      (xy -1.235926 0.890755)
      (xy -1.226493 0.841072)
      (xy -1.214873 0.780505)
      (xy -1.201293 0.710205)
      (xy -1.185982 0.631323)
      (xy -1.169164 0.545011)
      (xy -1.151069 0.452419)
      (xy -1.131923 0.354698)
      (xy -1.111953 0.253)
      (xy -1.091387 0.148475)
      (xy -1.070451 0.042275)
      (xy -1.049373 -0.064449)
      (xy -1.02838 -0.170546)
      (xy -1.0077 -0.274866)
      (xy -0.987558 -0.376256)
      (xy -0.968183 -0.473567)
      (xy -0.949802 -0.565646)
      (xy -0.932642 -0.651343)
      (xy -0.916929 -0.729507)
      (xy -0.902892 -0.798987)
      (xy -0.890757 -0.858631)
      (xy -0.880752 -0.907288)
      (xy -0.873104 -0.943808)
      (xy -0.868039 -0.967039)
      (xy -0.867301 -0.970225)
      (xy -0.860537 -0.990612)
      (xy -0.849957 -1.004011)
      (xy -0.832871 -1.011791)
      (xy -0.80659 -1.015319)
      (xy -0.777357 -1.016)
      (xy -0.745666 -1.015064)
    )

    (stroke (width 0.01) (type solid)) (fill solid) (layer "F.SilkS") (tstamp ac5947d7-8cfd-4987-938e-ffcd24ed9c55))
  (fp_poly
    (pts
      (xy 0.899038 -1.036628)
      (xy 0.978123 -1.024976)
      (xy 1.048218 -1.002335)
      (xy 1.108896 -0.96892)
      (xy 1.159731 -0.924944)
      (xy 1.200295 -0.870621)
      (xy 1.219795 -0.832537)
      (xy 1.232592 -0.799933)
      (xy 1.242705 -0.765628)
      (xy 1.25041 -0.727323)
      (xy 1.255983 -0.682722)
      (xy 1.2597 -0.629526)
      (xy 1.261836 -0.565437)
      (xy 1.262669 -0.488159)
      (xy 1.262698 -0.475145)
      (xy 1.262707 -0.410876)
      (xy 1.262137 -0.360729)
      (xy 1.260395 -0.322953)
      (xy 1.256883 -0.295796)
      (xy 1.251007 -0.277506)
      (xy 1.24217 -0.26633)
      (xy 1.229778 -0.260516)
      (xy 1.213233 -0.258313)
      (xy 1.191941 -0.257969)
      (xy 1.188861 -0.257969)
      (xy 1.166217 -0.25829)
      (xy 1.148732 -0.260464)
      (xy 1.13574 -0.26631)
      (xy 1.126574 -0.277644)
      (xy 1.120566 -0.296284)
      (xy 1.11705 -0.324048)
      (xy 1.115357 -0.362753)
      (xy 1.114822 -0.414218)
      (xy 1.114778 -0.459797)
      (xy 1.114046 -0.539639)
      (xy 1.111594 -0.605659)
      (xy 1.107035 -0.659839)
      (xy 1.099986 -0.70416)
      (xy 1.09006 -0.740605)
      (xy 1.076873 -0.771155)
      (xy 1.060039 -0.797792)
      (xy 1.045642 -0.815437)
      (xy 1.010869 -0.84452)
      (xy 0.965901 -0.866597)
      (xy 0.913498 -0.880957)
      (xy 0.856417 -0.886893)
      (xy 0.797417 -0.883695)
      (xy 0.786448 -0.882035)
      (xy 0.72736 -0.867434)
      (xy 0.679673 -0.84472)
      (xy 0.642127 -0.812792)
      (xy 0.613464 -0.770552)
      (xy 0.592425 -0.7169)
      (xy 0.590752 -0.711081)
      (xy 0.575028 -0.654844)
      (xy 0.575028 -0.007938)
      (xy 0.575034 0.113534)
      (xy 0.575091 0.220211)
      (xy 0.575255 0.313173)
      (xy 0.575582 0.3935)
      (xy 0.57613 0.462272)
      (xy 0.576956 0.520569)
      (xy 0.578115 0.569471)
      (xy 0.579665 0.610059)
      (xy 0.581662 0.643411)
      (xy 0.584163 0.670609)
      (xy 0.587225 0.692732)
      (xy 0.590905 0.71086)
      (xy 0.595258 0.726073)
      (xy 0.600342 0.739452)
      (xy 0.606214 0.752075)
      (xy 0.61293 0.765025)
      (xy 0.615902 0.770605)
      (xy 0.643986 0.811686)
      (xy 0.679686 0.84271)
      (xy 0.724158 0.864229)
      (xy 0.778558 0.876797)
      (xy 0.844042 0.880967)
      (xy 0.846385 0.880968)
      (xy 0.912379 0.876763)
      (xy 0.967301 0.863877)
      (xy 1.012281 0.8416)
      (xy 1.048451 0.809221)
      (xy 1.076941 0.766031)
      (xy 1.094225 0.725335)
      (xy 1.099111 0.710686)
      (xy 1.102959 0.696318)
      (xy 1.105921 0.680086)
      (xy 1.108153 0.659847)
      (xy 1.109806 0.633457)
      (xy 1.111035 0.598771)
      (xy 1.111994 0.553644)
      (xy 1.112836 0.495933)
      (xy 1.113291 0.459193)
      (xy 1.114143 0.389244)
      (xy 1.115158 0.333545)
      (xy 1.116817 0.290474)
      (xy 1.119605 0.258409)
      (xy 1.124005 0.235731)
      (xy 1.130499 0.220816)
      (xy 1.139571 0.212045)
      (xy 1.151703 0.207794)
      (xy 1.16738 0.206445)
      (xy 1.187083 0.206373)
      (xy 1.188624 0.206375)
      (xy 1.214009 0.207066)
      (xy 1.229794 0.210222)
      (xy 1.240469 0.217467)
      (xy 1.248985 0.228203)
      (xy 1.253358 0.234854)
      (xy 1.256778 0.242109)
      (xy 1.259333 0.251815)
      (xy 1.261111 0.26582)
      (xy 1.2622 0.285971)
      (xy 1.262688 0.314116)
      (xy 1.262663 0.352103)
      (xy 1.262214 0.401779)
      (xy 1.261427 0.464992)
      (xy 1.261174 0.484187)
      (xy 1.260118 0.554783)
      (xy 1.258945 0.611472)
      (xy 1.257547 0.656225)
      (xy 1.255814 0.691011)
      (xy 1.253636 0.717798)
      (xy 1.250904 0.738557)
      (xy 1.247509 0.755255)
      (xy 1.245726 0.762)
      (xy 1.219503 0.835186)
      (xy 1.185447 0.895511)
      (xy 1.142629 0.943959)
      (xy 1.09012 0.981514)
      (xy 1.026993 1.009159)
      (xy 1.006504 1.01548)
      (xy 0.955667 1.026265)
      (xy 0.896442 1.032933)
      (xy 0.834151 1.035136)
      (xy 0.774112 1.032529)
      (xy 0.762774 1.031392)
      (xy 0.684761 1.016687)
      (xy 0.616865 0.99109)
      (xy 0.55917 0.954667)
      (xy 0.511759 0.907482)
      (xy 0.474716 0.8496)
      (xy 0.449666 0.786307)
      (xy 0.433917 0.734218)
      (xy 0.431971 0.021961)
      (xy 0.431655 -0.103167)
      (xy 0.431442 -0.213428)
      (xy 0.431341 -0.309829)
      (xy 0.431366 -0.393377)
      (xy 0.431527 -0.46508)
      (xy 0.431836 -0.525945)
      (xy 0.432305 -0.576979)
      (xy 0.432944 -0.619191)
      (xy 0.433767 -0.653587)
      (xy 0.434783 -0.681174)
      (xy 0.436005 -0.702961)
      (xy 0.437444 -0.719954)
      (xy 0.439112 -0.73316)
      (xy 0.440704 -0.742095)
      (xy 0.462566 -0.815913)
      (xy 0.495498 -0.880051)
      (xy 0.53906 -0.934015)
      (xy 0.592813 -0.977312)
      (xy 0.656318 -1.009446)
      (xy 0.687917 -1.02012)
      (xy 0.712973 -1.025684)
      (xy 0.747038 -1.030916)
      (xy 0.785017 -1.035116)
      (xy 0.811389 -1.037078)
      (xy 0.899038 -1.036628)
    )

    (stroke (width 0.01) (type solid)) (fill solid) (layer "F.SilkS") (tstamp 80381f96-0ef4-4e18-bbf2-e9fd7dd057c7))
  (fp_poly
    (pts
      (xy -3.872344 -1.036494)
      (xy -3.850874 -1.025305)
      (xy -3.838934 -1.004395)
      (xy -3.83476 -0.971913)
      (xy -3.834694 -0.965941)
      (xy -3.837345 -0.929951)
      (xy -3.846617 -0.906676)
      (xy -3.864491 -0.893838)
      (xy -3.89295 -0.889162)
      (xy -3.901639 -0.889)
      (xy -3.961995 -0.883718)
      (xy -4.015902 -0.868423)
      (xy -4.061654 -0.843938)
      (xy -4.097548 -0.81109)
      (xy -4.114694 -0.785813)
      (xy -4.128468 -0.757568)
      (xy -4.138954 -0.728189)
      (xy -4.146498 -0.695132)
      (xy -4.151447 -0.655853)
      (xy -4.154147 -0.607807)
      (xy -4.154945 -0.54845)
      (xy -4.154482 -0.4936)
      (xy -4.153802 -0.443306)
      (xy -4.152685 -0.400926)
      (xy -4.150116 -0.365099)
      (xy -4.145078 -0.334466)
      (xy -4.136557 -0.307667)
      (xy -4.123536 -0.283342)
      (xy -4.104999 -0.260131)
      (xy -4.07993 -0.236674)
      (xy -4.047313 -0.21161)
      (xy -4.006133 -0.183581)
      (xy -3.955374 -0.151226)
      (xy -3.894019 -0.113185)
      (xy -3.850026 -0.086032)
      (xy -3.783713 -0.044686)
      (xy -3.728616 -0.009396)
      (xy -3.683343 0.020908)
      (xy -3.646504 0.047298)
      (xy -3.616704 0.070847)
      (xy -3.592554 0.092625)
      (xy -3.57266 0.113704)
      (xy -3.555632 0.135156)
      (xy -3.547291 0.147045)
      (xy -3.530853 0.172267)
      (xy -3.517829 0.195326)
      (xy -3.507795 0.218524)
      (xy -3.500329 0.244164)
      (xy -3.49501 0.274548)
      (xy -3.491415 0.31198)
      (xy -3.489122 0.358761)
      (xy -3.487709 0.417195)
      (xy -3.486899 0.476465)
      (xy -3.486329 0.546118)
      (xy -3.486416 0.602116)
      (xy -3.487231 0.64667)
      (xy -3.488842 0.681987)
      (xy -3.491321 0.710275)
      (xy -3.494736 0.733742)
      (xy -3.49509 0.735683)
      (xy -3.515307 0.812056)
      (xy -3.545504 0.877267)
      (xy -3.585535 0.931151)
      (xy -3.635255 0.97354)
      (xy -3.694518 1.00427)
      (xy -3.742972 1.019071)
      (xy -3.793542 1.027954)
      (xy -3.850894 1.033569)
      (xy -3.908945 1.035582)
      (xy -3.961613 1.033657)
      (xy -3.977406 1.032021)
      (xy -4.054494 1.016563)
      (xy -4.121368 0.991015)
      (xy -4.177736 0.955574)
      (xy -4.223304 0.910437)
      (xy -4.25778 0.855802)
      (xy -4.266137 0.837047)
      (xy -4.277434 0.806597)
      (xy -4.286307 0.775558)
      (xy -4.293025 0.741527)
      (xy -4.297856 0.702099)
      (xy -4.301067 0.654871)
      (xy -4.302926 0.597438)
      (xy -4.303701 0.527397)
      (xy -4.303766 0.499461)
      (xy -4.303771 0.440269)
      (xy -4.303589 0.394889)
      (xy -4.303056 0.361254)
      (xy -4.302009 0.337303)
      (xy -4.300284 0.32097)
      (xy -4.297718 0.310191)
      (xy -4.294146 0.302903)
      (xy -4.289405 0.297041)
      (xy -4.287559 0.295071)
      (xy -4.267334 0.282809)
      (xy -4.239822 0.277232)
      (xy -4.210581 0.278443)
      (xy -4.185167 0.286548)
      (xy -4.175907 0.292966)
      (xy -4.170658 0.29815)
      (xy -4.1666 0.304298)
      (xy -4.163527 0.313439)
      (xy -4.161236 0.327604)
      (xy -4.159522 0.348821)
      (xy -4.158181 0.379119)
      (xy -4.15701 0.420529)
      (xy -4.155803 0.475078)
      (xy -4.15534 0.497357)
      (xy -4.153492 0.56888)
      (xy -4.150911 0.6267)
      (xy -4.147143 0.672986)
      (xy -4.141732 0.709907)
      (xy -4.134222 0.739631)
      (xy -4.124158 0.764327)
      (xy -4.111084 0.786165)
      (xy -4.094545 0.807313)
      (xy -4.08888 0.813802)
      (xy -4.056494 0.843807)
      (xy -4.019606 0.86472)
      (xy -3.975633 0.877505)
      (xy -3.921991 0.883126)
      (xy -3.901722 0.883572)
      (xy -3.834789 0.87971)
      (xy -3.778969 0.86685)
      (xy -3.733369 0.844338)
      (xy -3.697098 0.811519)
      (xy -3.669262 0.767738)
      (xy -3.648969 0.712339)
      (xy -3.644561 0.694847)
      (xy -3.640645 0.669123)
      (xy -3.637537 0.631449)
      (xy -3.635262 0.58521)
      (xy -3.63385 0.53379)
      (xy -3.633326 0.480574)
      (xy -3.633719 0.428947)
      (xy -3.635055 0.382291)
      (xy -3.637362 0.343993)
      (xy -3.640668 0.317435)
      (xy -3.641487 0.313684)
      (xy -3.649087 0.288117)
      (xy -3.659392 0.264538)
      (xy -3.673587 0.241865)
      (xy -3.692858 0.21902)
      (xy -3.718391 0.194921)
      (xy -3.751373 0.168488)
      (xy -3.792987 0.138641)
      (xy -3.844422 0.104299)
      (xy -3.906862 0.064382)
      (xy -3.933472 0.047684)
      (xy -3.995021 0.009151)
      (xy -4.045567 -0.02266)
      (xy -4.086473 -0.048672)
      (xy -4.119102 -0.069813)
      (xy -4.144816 -0.087008)
      (xy -4.164978 -0.101182)
      (xy -4.180951 -0.11326)
      (xy -4.194098 -0.124169)
      (xy -4.20578 -0.134833)
      (xy -4.214042 -0.142871)
      (xy -4.254456 -0.192847)
      (xy -4.282536 -0.250512)
      (xy -4.29429 -0.292518)
      (xy -4.29743 -0.316334)
      (xy -4.299971 -0.352866)
      (xy -4.301895 -0.39897)
      (xy -4.303183 -0.451499)
      (xy -4.303815 -0.507308)
      (xy -4.303773 -0.563252)
      (xy -4.303038 -0.616185)
      (xy -4.30159 -0.662963)
      (xy -4.299412 -0.700439)
      (xy -4.296877 -0.723214)
      (xy -4.285783 -0.768277)
      (xy -4.267738 -0.816819)
      (xy -4.245107 -0.863826)
      (xy -4.220253 -0.904285)
      (xy -4.19974 -0.929192)
      (xy -4.154017 -0.966097)
      (xy -4.098153 -0.996839)
      (xy -4.03542 -1.020189)
      (xy -3.969089 -1.03492)
      (xy -3.905107 -1.039813)
      (xy -3.872344 -1.036494)
    )

    (stroke (width 0.01) (type solid)) (fill solid) (layer "F.SilkS") (tstamp a450bbf9-88f5-42d4-9f43-38c4d60b8761))
  (fp_poly
    (pts
      (xy 5.71041 -1.033891)
      (xy 5.755433 -1.029862)
      (xy 5.791342 -1.023668)
      (xy 5.799667 -1.021421)
      (xy 5.868094 -0.995337)
      (xy 5.924782 -0.961506)
      (xy 5.970861 -0.918694)
      (xy 6.007459 -0.865668)
      (xy 6.035709 -0.801193)
      (xy 6.051722 -0.746125)
      (xy 6.053917 -0.736189)
      (xy 6.055841 -0.724921)
      (xy 6.057512 -0.711269)
      (xy 6.058948 -0.694183)
      (xy 6.060166 -0.672613)
      (xy 6.061183 -0.645507)
      (xy 6.062019 -0.611815)
      (xy 6.062689 -0.570487)
      (xy 6.063212 -0.52047)
      (xy 6.063606 -0.460715)
      (xy 6.063888 -0.390171)
      (xy 6.064076 -0.307786)
      (xy 6.064187 -0.212511)
      (xy 6.064239 -0.103295)
      (xy 6.06425 0)
      (xy 6.064234 0.121735)
      (xy 6.064174 0.228646)
      (xy 6.064052 0.321784)
      (xy 6.06385 0.402199)
      (xy 6.063552 0.470942)
      (xy 6.063139 0.529065)
      (xy 6.062594 0.577618)
      (xy 6.061898 0.617651)
      (xy 6.061035 0.650216)
      (xy 6.059987 0.676363)
      (xy 6.058736 0.697143)
      (xy 6.057264 0.713608)
      (xy 6.055554 0.726807)
      (xy 6.053588 0.737792)
      (xy 6.051714 0.746125)
      (xy 6.026946 0.821653)
      (xy 5.992195 0.886052)
      (xy 5.947754 0.939011)
      (xy 5.893914 0.98022)
      (xy 5.830968 1.009369)
      (xy 5.793722 1.019889)
      (xy 5.745196 1.02815)
      (xy 5.688667 1.03342)
      (xy 5.630035 1.035418)
      (xy 5.575202 1.033867)
      (xy 5.549195 1.031449)
      (xy 5.472488 1.015835)
      (xy 5.405105 0.989247)
      (xy 5.347474 0.952011)
      (xy 5.300024 0.904454)
      (xy 5.263182 0.846901)
      (xy 5.24301 0.798097)
      (xy 5.237936 0.782093)
      (xy 5.233473 0.765788)
      (xy 5.229586 0.748121)
      (xy 5.226241 0.728031)
      (xy 5.223402 0.704456)
      (xy 5.221036 0.676335)
      (xy 5.219107 0.642608)
      (xy 5.217581 0.602211)
      (xy 5.216424 0.554085)
      (xy 5.2156 0.497167)
      (xy 5.215076 0.430397)
      (xy 5.214816 0.352713)
      (xy 5.214787 0.263054)
      (xy 5.214952 0.160358)
      (xy 5.215279 0.043565)
      (xy 5.215573 -0.043657)
      (xy 5.216009 -0.163357)
      (xy 5.216229 -0.217421)
      (xy 5.363118 -0.217421)
      (xy 5.363306 -0.102323)
      (xy 5.363696 0.027781)
      (xy 5.364114 0.147981)
      (xy 5.364511 0.253384)
      (xy 5.364956 0.345065)
      (xy 5.365521 0.424102)
      (xy 5.366277 0.491571)
      (xy 5.367296 0.548548)
      (xy 5.368648 0.596112)
      (xy 5.370404 0.635337)
      (xy 5.372637 0.667301)
      (xy 5.375416 0.693081)
      (xy 5.378813 0.713753)
      (xy 5.382899 0.730394)
      (xy 5.387745 0.744081)
      (xy 5.393423 0.75589)
      (xy 5.400003 0.766898)
      (xy 5.407557 0.778182)
      (xy 5.413885 0.787446)
      (xy 5.441836 0.821341)
      (xy 5.474941 0.846754)
      (xy 5.515009 0.864366)
      (xy 5.563851 0.87486)
      (xy 5.623276 0.878919)
      (xy 5.656097 0.878781)
      (xy 5.694283 0.877751)
      (xy 5.721847 0.87619)
      (xy 5.742278 0.873363)
      (xy 5.759064 0.868534)
      (xy 5.775692 0.860969)
      (xy 5.795651 0.849933)
      (xy 5.797208 0.849043)
      (xy 5.827941 0.829308)
      (xy 5.849817 0.809198)
      (xy 5.867617 0.784272)
      (xy 5.868393 0.782977)
      (xy 5.876747 0.76907)
      (xy 5.884055 0.75653)
      (xy 5.890392 0.74425)
      (xy 5.895831 0.73112)
      (xy 5.900445 0.716033)
      (xy 5.904309 0.697882)
      (xy 5.907497 0.675558)
      (xy 5.910081 0.647954)
      (xy 5.912137 0.613961)
      (xy 5.913737 0.572472)
      (xy 5.914956 0.522379)
      (xy 5.915867 0.462574)
      (xy 5.916544 0.391949)
      (xy 5.917061 0.309397)
      (xy 5.917492 0.213809)
      (xy 5.917911 0.104077)
      (xy 5.918168 0.035718)
      (xy 5.918591 -0.096594)
      (xy 5.918783 -0.213541)
      (xy 5.918738 -0.315629)
      (xy 5.918454 -0.403367)
      (xy 5.917926 -0.477261)
      (xy 5.917149 -0.537819)
      (xy 5.91612 -0.585549)
      (xy 5.914834 -0.620957)
      (xy 5.913288 -0.644551)
      (xy 5.912585 -0.650875)
      (xy 5.898306 -0.718781)
      (xy 5.875184 -0.774531)
      (xy 5.842945 -0.818585)
      (xy 5.801313 -0.851402)
      (xy 5.78826 -0.858478)
      (xy 5.748879 -0.872792)
      (xy 5.70061 -0.882152)
      (xy 5.648118 -0.886015)
      (xy 5.596069 -0.883841)
      (xy 5.583287 -0.882235)
      (xy 5.52228 -0.868557)
      (xy 5.472666 -0.846291)
      (xy 5.433412 -0.814377)
      (xy 5.403486 -0.771758)
      (xy 5.381859 -0.717375)
      (xy 5.369512 -0.662782)
      (xy 5.367896 -0.647586)
      (xy 5.366524 -0.622058)
      (xy 5.36539 -0.585582)
      (xy 5.36449 -0.537541)
      (xy 5.363818 -0.477321)
      (xy 5.363368 -0.404304)
      (xy 5.363137 -0.317876)
      (xy 5.363118 -0.217421)
      (xy 5.216229 -0.217421)
      (xy 5.216436 -0.268239)
      (xy 5.216877 -0.359359)
      (xy 5.217354 -0.437774)
      (xy 5.217889 -0.504541)
      (xy 5.218506 -0.560716)
      (xy 5.219225 -0.607356)
      (xy 5.220071 -0.645517)
      (xy 5.221064 -0.676257)
      (xy 5.222228 -0.700632)
      (xy 5.223584 -0.719698)
      (xy 5.225156 -0.734512)
      (xy 5.226965 -0.746131)
      (xy 5.229033 -0.755611)
      (xy 5.230783 -0.762)
      (xy 5.257968 -0.836009)
      (xy 5.292641 -0.897009)
      (xy 5.335842 -0.946083)
      (xy 5.38861 -0.984313)
      (xy 5.451985 -1.012784)
      (xy 5.479967 -1.021523)
      (xy 5.514251 -1.028335)
      (xy 5.558192 -1.032977)
      (xy 5.608035 -1.03545)
      (xy 5.660026 -1.035754)
      (xy 5.71041 -1.033891)
    )

    (stroke (width 0.01) (type solid)) (fill solid) (layer "F.SilkS") (tstamp a5318f36-3644-4b68-b37a-353e9603f53d))
)
