(footprint "G125-MS12005L3P"
	(version 20240108)
	(generator "pcbnew")
	(generator_version "8.0")
	(layer "F.Cu")
	(descr "G125-MS12005L3P")
	(tags "Connector")
	(property "Reference" "J**"
		(at 0 0 0)
		(layer "F.SilkS")
		(uuid "d47eca0c-3688-4405-be6a-fb417fe77d25")
		(effects
			(font
				(size 1.27 1.27)
				(thickness 0.254)
			)
		)
	)
	(property "Value" "G125-MS12005L3P"
		(at 0 0 0)
		(layer "F.SilkS")
		(hide yes)
		(uuid "de877891-091d-4da6-9eea-ee711de2a044")
		(effects
			(font
				(size 1.27 1.27)
				(thickness 0.254)
			)
		)
	)
	(property "Footprint" ""
		(at 0 0 0)
		(layer "F.Fab")
		(hide yes)
		(uuid "fd318338-6925-4d63-b8ea-005f8bc5da93")
		(effects
			(font
				(size 1.27 1.27)
				(thickness 0.15)
			)
		)
	)
	(property "Datasheet" ""
		(at 0 0 0)
		(layer "F.Fab")
		(hide yes)
		(uuid "14d6ef04-1207-4e12-8eb5-e23903a2da80")
		(effects
			(font
				(size 1.27 1.27)
				(thickness 0.15)
			)
		)
	)
	(property "Description" ""
		(at 0 0 0)
		(layer "F.Fab")
		(hide yes)
		(uuid "a90f58a9-cae5-4d11-87c8-8903e3cdbc69")
		(effects
			(font
				(size 1.27 1.27)
				(thickness 0.15)
			)
		)
	)
	(attr smd)
	(fp_line
		(start -7.525 2.45)
		(end -7.525 -2.45)
		(stroke
			(width 0.1)
			(type solid)
		)
		(layer "F.SilkS")
		(uuid "bbf6eaf3-bac6-4a7f-84b2-87bbb89702bd")
	)
	(fp_line
		(start 7.525 -2.45)
		(end 7.525 2.45)
		(stroke
			(width 0.1)
			(type solid)
		)
		(layer "F.SilkS")
		(uuid "83e6b07b-c2c6-4b19-90c8-9e5b05c29154")
	)
	(fp_circle
		(center -6.225 3.35)
		(end -6.225 3.4)
		(stroke
			(width 0.2)
			(type solid)
		)
		(fill none)
		(layer "F.SilkS")
		(uuid "55c75f31-4c62-4d93-bec6-7e26a8b8774e")
	)
	(fp_line
		(start -9.525 -4.1)
		(end 9.525 -4.1)
		(stroke
			(width 0.05)
			(type solid)
		)
		(layer "F.CrtYd")
		(uuid "98fad0a4-9d9a-4239-9c58-f0cad8bea793")
	)
	(fp_line
		(start -9.525 4.45)
		(end -9.525 -4.1)
		(stroke
			(width 0.05)
			(type solid)
		)
		(layer "F.CrtYd")
		(uuid "a626a455-3f01-41fc-947a-0ee501f5c431")
	)
	(fp_line
		(start 9.525 -4.1)
		(end 9.525 4.45)
		(stroke
			(width 0.05)
			(type solid)
		)
		(layer "F.CrtYd")
		(uuid "cc016ac4-bfb4-4638-91a1-f3241fc1479d")
	)
	(fp_line
		(start 9.525 4.45)
		(end -9.525 4.45)
		(stroke
			(width 0.05)
			(type solid)
		)
		(layer "F.CrtYd")
		(uuid "398fd1b6-74b7-47d7-b761-95de7470a23c")
	)
	(fp_line
		(start -7.525 -2.45)
		(end 7.525 -2.45)
		(stroke
			(width 0.2)
			(type solid)
		)
		(layer "F.Fab")
		(uuid "5bbd9e81-0696-4881-bd56-21a9b5cddaaf")
	)
	(fp_line
		(start -7.525 2.45)
		(end -7.525 -2.45)
		(stroke
			(width 0.2)
			(type solid)
		)
		(layer "F.Fab")
		(uuid "4c15c6bd-c170-4689-b783-a2bc1b4497cd")
	)
	(fp_line
		(start 7.525 -2.45)
		(end 7.525 2.45)
		(stroke
			(width 0.2)
			(type solid)
		)
		(layer "F.Fab")
		(uuid "93095d5a-0cd5-4d10-839a-4182393a46c3")
	)
	(fp_line
		(start 7.525 2.45)
		(end -7.525 2.45)
		(stroke
			(width 0.2)
			(type solid)
		)
		(layer "F.Fab")
		(uuid "0e2c3830-0241-488d-820f-92eb00233b66")
	)
	(fp_text user "${REFERENCE}"
		(at 0 0 0)
		(layer "F.Fab")
		(uuid "b64e40b7-7e9f-46e5-bff9-cd6ae23044f4")
		(effects
			(font
				(size 1.27 1.27)
				(thickness 0.254)
			)
		)
	)
	(pad "1" smd rect
		(at -5.625 1.85)
		(size 0.7 2.5)
		(layers "F.Cu" "F.Paste" "F.Mask")
		(uuid "e44d5a39-33b8-4e45-8928-f14c1739bd07")
	)
	(pad "2" smd rect
		(at -4.375 1.85)
		(size 0.7 2.5)
		(layers "F.Cu" "F.Paste" "F.Mask")
		(uuid "a6a43989-6e5c-42da-bf54-a7fb33379134")
	)
	(pad "3" smd rect
		(at -3.125 1.85)
		(size 0.7 2.5)
		(layers "F.Cu" "F.Paste" "F.Mask")
		(uuid "20843342-ed4e-4efb-b4f1-98bfd6c938d3")
	)
	(pad "4" smd rect
		(at -1.875 1.85)
		(size 0.7 2.5)
		(layers "F.Cu" "F.Paste" "F.Mask")
		(uuid "41fb3cb7-7df5-4515-8951-e7f929bf6182")
	)
	(pad "5" smd rect
		(at -0.625 1.85)
		(size 0.7 2.5)
		(layers "F.Cu" "F.Paste" "F.Mask")
		(uuid "ff06352e-c6c1-4796-9555-3c8b1cf82a81")
	)
	(pad "6" smd rect
		(at 0.625 1.85)
		(size 0.7 2.5)
		(layers "F.Cu" "F.Paste" "F.Mask")
		(uuid "21579656-ee61-47eb-88eb-350ed446dc97")
	)
	(pad "7" smd rect
		(at 1.875 1.85)
		(size 0.7 2.5)
		(layers "F.Cu" "F.Paste" "F.Mask")
		(uuid "702d7686-cf9f-4097-aec3-411f46b44b30")
	)
	(pad "8" smd rect
		(at 3.125 1.85)
		(size 0.7 2.5)
		(layers "F.Cu" "F.Paste" "F.Mask")
		(uuid "b002cf56-40e3-4891-8565-7f1c5d6c5209")
	)
	(pad "9" smd rect
		(at 4.375 1.85)
		(size 0.7 2.5)
		(layers "F.Cu" "F.Paste" "F.Mask")
		(uuid "5e59b600-3d75-4b18-8f5c-9a2cb1ab38ab")
	)
	(pad "10" smd rect
		(at 5.625 1.85)
		(size 0.7 2.5)
		(layers "F.Cu" "F.Paste" "F.Mask")
		(uuid "3b669229-65e5-4ba1-995f-855af305e39d")
	)
	(pad "11" smd rect
		(at -5.625 -1.85)
		(size 0.7 2.5)
		(layers "F.Cu" "F.Paste" "F.Mask")
		(uuid "fd8a577b-8e9e-4398-b0bb-6ed2277351df")
	)
	(pad "12" smd rect
		(at -4.375 -1.85)
		(size 0.7 2.5)
		(layers "F.Cu" "F.Paste" "F.Mask")
		(uuid "3aaf6985-21d1-457d-98aa-890a503071ed")
	)
	(pad "13" smd rect
		(at -3.125 -1.85)
		(size 0.7 2.5)
		(layers "F.Cu" "F.Paste" "F.Mask")
		(uuid "85905d40-236c-4a80-83ff-5059dd09817a")
	)
	(pad "14" smd rect
		(at -1.875 -1.85)
		(size 0.7 2.5)
		(layers "F.Cu" "F.Paste" "F.Mask")
		(uuid "442227a6-fdf5-489d-bfcf-e78a8d71b5f3")
	)
	(pad "15" smd rect
		(at -0.625 -1.85)
		(size 0.7 2.5)
		(layers "F.Cu" "F.Paste" "F.Mask")
		(uuid "d9a45dc0-d0d9-4501-b91a-bcc95942cf02")
	)
	(pad "16" smd rect
		(at 0.625 -1.85)
		(size 0.7 2.5)
		(layers "F.Cu" "F.Paste" "F.Mask")
		(uuid "8f547d49-eea1-421a-b2fa-1d59e7c8bb32")
	)
	(pad "17" smd rect
		(at 1.875 -1.85)
		(size 0.7 2.5)
		(layers "F.Cu" "F.Paste" "F.Mask")
		(uuid "37b293f5-5ade-4d26-95ce-b13e93df38a4")
	)
	(pad "18" smd rect
		(at 3.125 -1.85)
		(size 0.7 2.5)
		(layers "F.Cu" "F.Paste" "F.Mask")
		(uuid "8b30b62e-e93a-405d-9ade-faa0b6439250")
	)
	(pad "19" smd rect
		(at 4.375 -1.85)
		(size 0.7 2.5)
		(layers "F.Cu" "F.Paste" "F.Mask")
		(uuid "2f45d256-cb58-4788-b535-d51bd678b3e7")
	)
	(pad "20" smd rect
		(at 5.625 -1.85)
		(size 0.7 2.5)
		(layers "F.Cu" "F.Paste" "F.Mask")
		(uuid "c2b1d87a-0502-4687-962b-0f1ed609ff83")
	)
	(pad "21" smd rect
		(at -7.775 0)
		(size 1.5 1.85)
		(layers "F.Cu" "F.Paste" "F.Mask")
		(uuid "b0cfe98e-80f0-4579-8652-c191fd79fa78")
	)
	(pad "22" smd rect
		(at 7.775 0)
		(size 1.5 1.85)
		(layers "F.Cu" "F.Paste" "F.Mask")
		(uuid "4d0758c9-aed6-43b9-8224-7f7712371e2f")
	)
	(model "${KIPRJMOD}/3D/G125-MS12005L3P.stp"
		(offset
			(xyz 0 0 1.99999997)
		)
		(scale
			(xyz 1 1 1)
		)
		(rotate
			(xyz -90 0 0)
		)
	)
)
