(footprint "MicroLockPlus-3P-5055680381"
	(version 20240108)
	(generator "pcbnew")
	(generator_version "8.0")
	(layer "F.Cu")
	(descr "505568-0381-1")
	(tags "Connector")
	(property "Reference" "J**"
		(at 0 0 0)
		(layer "F.SilkS")
		(uuid "56e78b76-9511-4dca-9176-524936117b89")
		(effects
			(font
				(size 1.27 1.27)
				(thickness 0.254)
			)
		)
	)
	(property "Value" "5055680381"
		(at 0 0 0)
		(layer "F.SilkS")
		(hide yes)
		(uuid "a68689e7-b11f-4eca-9490-1a4b392ee70a")
		(effects
			(font
				(size 1.27 1.27)
				(thickness 0.254)
			)
		)
	)
	(property "Footprint" ""
		(at 0 0 0)
		(layer "F.Fab")
		(hide yes)
		(uuid "684eb1c8-0653-4a9c-abbd-37084e1ef2bc")
		(effects
			(font
				(size 1.27 1.27)
				(thickness 0.15)
			)
		)
	)
	(property "Datasheet" ""
		(at 0 0 0)
		(layer "F.Fab")
		(hide yes)
		(uuid "7394545d-81c0-4eb7-afd1-9802333b92c7")
		(effects
			(font
				(size 1.27 1.27)
				(thickness 0.15)
			)
		)
	)
	(property "Description" ""
		(at 0 0 0)
		(layer "F.Fab")
		(hide yes)
		(uuid "6bf57723-91e9-4b5e-9971-72b96ab9ef5b")
		(effects
			(font
				(size 1.27 1.27)
				(thickness 0.15)
			)
		)
	)
	(attr smd)
	(fp_line
		(start -3.5 0.5)
		(end -3.5 1.55)
		(stroke
			(width 0.1)
			(type solid)
		)
		(layer "F.SilkS")
		(uuid "06e57c60-438c-4da9-8180-16713055312d")
	)
	(fp_line
		(start -3.5 1.55)
		(end -2.5 1.55)
		(stroke
			(width 0.1)
			(type solid)
		)
		(layer "F.SilkS")
		(uuid "5e671dd4-67da-47b3-919e-4be1b6927467")
	)
	(fp_line
		(start -2.1 2.1)
		(end -2.1 2.1)
		(stroke
			(width 0.2)
			(type solid)
		)
		(layer "F.SilkS")
		(uuid "8bf24ebe-24fa-4df6-b92d-2725c1235c6f")
	)
	(fp_line
		(start -2.1 2.3)
		(end -2.1 2.3)
		(stroke
			(width 0.2)
			(type solid)
		)
		(layer "F.SilkS")
		(uuid "be730a1e-ebf2-4ade-b06b-10efa1ec1cd6")
	)
	(fp_line
		(start -2 -2.3)
		(end 2 -2.3)
		(stroke
			(width 0.1)
			(type solid)
		)
		(layer "F.SilkS")
		(uuid "46069f8c-4dd5-469e-ab5d-dc70494df12d")
	)
	(fp_line
		(start 3.5 0.5)
		(end 3.5 1.55)
		(stroke
			(width 0.1)
			(type solid)
		)
		(layer "F.SilkS")
		(uuid "96f3ab86-bfb4-47af-a139-b0b716145dc4")
	)
	(fp_line
		(start 3.5 1.55)
		(end 2.5 1.55)
		(stroke
			(width 0.1)
			(type solid)
		)
		(layer "F.SilkS")
		(uuid "4f8cd4b7-c1c5-46da-9553-4ba80af02d26")
	)
	(fp_arc
		(start -2.1 2.1)
		(mid -2 2.2)
		(end -2.1 2.3)
		(stroke
			(width 0.2)
			(type solid)
		)
		(layer "F.SilkS")
		(uuid "f7bbf6ef-3bd4-4552-a2d2-e35f066aa5a9")
	)
	(fp_arc
		(start -2.1 2.3)
		(mid -2.2 2.2)
		(end -2.1 2.1)
		(stroke
			(width 0.2)
			(type solid)
		)
		(layer "F.SilkS")
		(uuid "b9abe7a9-ec4d-465e-86f1-7fbb9707909f")
	)
	(fp_line
		(start -4.3 -2.8)
		(end 4.3 -2.8)
		(stroke
			(width 0.1)
			(type solid)
		)
		(layer "F.CrtYd")
		(uuid "2f268475-c1ce-42b5-ada5-8a033f95a706")
	)
	(fp_line
		(start -4.3 2.8)
		(end -4.3 -2.8)
		(stroke
			(width 0.1)
			(type solid)
		)
		(layer "F.CrtYd")
		(uuid "7d533e5a-d897-4487-bb86-fa8d5c284814")
	)
	(fp_line
		(start 4.3 -2.8)
		(end 4.3 2.8)
		(stroke
			(width 0.1)
			(type solid)
		)
		(layer "F.CrtYd")
		(uuid "e55b24d3-2ff5-460b-bf7f-cbce6896101a")
	)
	(fp_line
		(start 4.3 2.8)
		(end -4.3 2.8)
		(stroke
			(width 0.1)
			(type solid)
		)
		(layer "F.CrtYd")
		(uuid "841e4fa4-fcab-4bba-bea6-c3e95541179d")
	)
	(fp_line
		(start -3.5 -2.3)
		(end 3.5 -2.3)
		(stroke
			(width 0.2)
			(type solid)
		)
		(layer "F.Fab")
		(uuid "937be8ec-721f-4fb5-b9e1-c149e0995771")
	)
	(fp_line
		(start -3.5 1.55)
		(end -3.5 -2.3)
		(stroke
			(width 0.2)
			(type solid)
		)
		(layer "F.Fab")
		(uuid "1236d98a-e1ca-4583-94ca-338d4653a8b8")
	)
	(fp_line
		(start 3.5 -2.3)
		(end 3.5 1.55)
		(stroke
			(width 0.2)
			(type solid)
		)
		(layer "F.Fab")
		(uuid "87f6a8dc-dcbf-4245-bc8c-afd90adb497b")
	)
	(fp_line
		(start 3.5 1.55)
		(end -3.5 1.55)
		(stroke
			(width 0.2)
			(type solid)
		)
		(layer "F.Fab")
		(uuid "fac5f918-cd03-4510-8ff8-ed3ef9ba5c5d")
	)
	(fp_text user "${REFERENCE}"
		(at 0 0 0)
		(layer "F.Fab")
		(uuid "7ef11050-f777-44ab-a628-11050ce40d4c")
		(effects
			(font
				(size 1.27 1.27)
				(thickness 0.254)
			)
		)
	)
	(pad "1" smd rect
		(at -1.25 1.35)
		(size 0.8 1.2)
		(layers "F.Cu" "F.Paste" "F.Mask")
		(uuid "68c88ae2-e59d-404d-9cfc-f6312195ed55")
	)
	(pad "2" smd rect
		(at 0 1.35)
		(size 0.8 1.2)
		(layers "F.Cu" "F.Paste" "F.Mask")
		(uuid "7dc0e9fa-f1db-4d2e-b0f9-9242200305f0")
	)
	(pad "3" smd rect
		(at 1.25 1.35)
		(size 0.8 1.2)
		(layers "F.Cu" "F.Paste" "F.Mask")
		(uuid "19288a01-4e80-4088-93ce-5619858117b0")
	)
	(pad "MP1" smd rect
		(at -3.15 -0.945)
		(size 1.3 2.15)
		(layers "F.Cu" "F.Paste" "F.Mask")
		(uuid "4aef8784-4016-47bc-8dd2-cd1b20472baf")
	)
	(pad "MP2" smd rect
		(at 3.15 -0.945)
		(size 1.3 2.15)
		(layers "F.Cu" "F.Paste" "F.Mask")
		(uuid "f8ea4010-bf1f-4422-92e2-d9c9f8361958")
	)
	(model "${KIPRJMOD}/3D/MicroLockPlus-3P-505568-0381.stp"
		(offset
			(xyz 4.769999909 5.769999894 -25.50999985)
		)
		(scale
			(xyz 1 1 1)
		)
		(rotate
			(xyz 0 0 0)
		)
	)
)
