(kicad_sch (version 20230121) (generator eeschema)

  (uuid 508595e0-6622-4c67-8c60-17bebdad7569)

  (paper "A5")

  (lib_symbols
    (symbol "Connector:Conn_01x02_Pin" (pin_names (offset 1.016) hide) (in_bom yes) (on_board yes)
      (property "Reference" "J" (at 0 2.54 0)
        (effects (font (size 1.27 1.27)))
      )
      (property "Value" "Conn_01x02_Pin" (at 0 -5.08 0)
        (effects (font (size 1.27 1.27)))
      )
      (property "Footprint" "" (at 0 0 0)
        (effects (font (size 1.27 1.27)) hide)
      )
      (property "Datasheet" "~" (at 0 0 0)
        (effects (font (size 1.27 1.27)) hide)
      )
      (property "ki_locked" "" (at 0 0 0)
        (effects (font (size 1.27 1.27)))
      )
      (property "ki_keywords" "connector" (at 0 0 0)
        (effects (font (size 1.27 1.27)) hide)
      )
      (property "ki_description" "Generic connector, single row, 01x02, script generated" (at 0 0 0)
        (effects (font (size 1.27 1.27)) hide)
      )
      (property "ki_fp_filters" "Connector*:*_1x??_*" (at 0 0 0)
        (effects (font (size 1.27 1.27)) hide)
      )
      (symbol "Conn_01x02_Pin_1_1"
        (polyline
          (pts
            (xy 1.27 -2.54)
            (xy 0.8636 -2.54)
          )
          (stroke (width 0.1524) (type default))
          (fill (type none))
        )
        (polyline
          (pts
            (xy 1.27 0)
            (xy 0.8636 0)
          )
          (stroke (width 0.1524) (type default))
          (fill (type none))
        )
        (rectangle (start 0.8636 -2.413) (end 0 -2.667)
          (stroke (width 0.1524) (type default))
          (fill (type outline))
        )
        (rectangle (start 0.8636 0.127) (end 0 -0.127)
          (stroke (width 0.1524) (type default))
          (fill (type outline))
        )
        (pin passive line (at 5.08 0 180) (length 3.81)
          (name "Pin_1" (effects (font (size 1.27 1.27))))
          (number "1" (effects (font (size 1.27 1.27))))
        )
        (pin passive line (at 5.08 -2.54 180) (length 3.81)
          (name "Pin_2" (effects (font (size 1.27 1.27))))
          (number "2" (effects (font (size 1.27 1.27))))
        )
      )
    )
    (symbol "Connector:Conn_01x03_Pin" (pin_names (offset 1.016) hide) (in_bom yes) (on_board yes)
      (property "Reference" "J" (at 0 5.08 0)
        (effects (font (size 1.27 1.27)))
      )
      (property "Value" "Conn_01x03_Pin" (at 0 -5.08 0)
        (effects (font (size 1.27 1.27)))
      )
      (property "Footprint" "" (at 0 0 0)
        (effects (font (size 1.27 1.27)) hide)
      )
      (property "Datasheet" "~" (at 0 0 0)
        (effects (font (size 1.27 1.27)) hide)
      )
      (property "ki_locked" "" (at 0 0 0)
        (effects (font (size 1.27 1.27)))
      )
      (property "ki_keywords" "connector" (at 0 0 0)
        (effects (font (size 1.27 1.27)) hide)
      )
      (property "ki_description" "Generic connector, single row, 01x03, script generated" (at 0 0 0)
        (effects (font (size 1.27 1.27)) hide)
      )
      (property "ki_fp_filters" "Connector*:*_1x??_*" (at 0 0 0)
        (effects (font (size 1.27 1.27)) hide)
      )
      (symbol "Conn_01x03_Pin_1_1"
        (polyline
          (pts
            (xy 1.27 -2.54)
            (xy 0.8636 -2.54)
          )
          (stroke (width 0.1524) (type default))
          (fill (type none))
        )
        (polyline
          (pts
            (xy 1.27 0)
            (xy 0.8636 0)
          )
          (stroke (width 0.1524) (type default))
          (fill (type none))
        )
        (polyline
          (pts
            (xy 1.27 2.54)
            (xy 0.8636 2.54)
          )
          (stroke (width 0.1524) (type default))
          (fill (type none))
        )
        (rectangle (start 0.8636 -2.413) (end 0 -2.667)
          (stroke (width 0.1524) (type default))
          (fill (type outline))
        )
        (rectangle (start 0.8636 0.127) (end 0 -0.127)
          (stroke (width 0.1524) (type default))
          (fill (type outline))
        )
        (rectangle (start 0.8636 2.667) (end 0 2.413)
          (stroke (width 0.1524) (type default))
          (fill (type outline))
        )
        (pin passive line (at 5.08 2.54 180) (length 3.81)
          (name "Pin_1" (effects (font (size 1.27 1.27))))
          (number "1" (effects (font (size 1.27 1.27))))
        )
        (pin passive line (at 5.08 0 180) (length 3.81)
          (name "Pin_2" (effects (font (size 1.27 1.27))))
          (number "2" (effects (font (size 1.27 1.27))))
        )
        (pin passive line (at 5.08 -2.54 180) (length 3.81)
          (name "Pin_3" (effects (font (size 1.27 1.27))))
          (number "3" (effects (font (size 1.27 1.27))))
        )
      )
    )
    (symbol "Device:C" (pin_numbers hide) (pin_names (offset 0.254)) (in_bom yes) (on_board yes)
      (property "Reference" "C" (at 0.635 2.54 0)
        (effects (font (size 1.27 1.27)) (justify left))
      )
      (property "Value" "C" (at 0.635 -2.54 0)
        (effects (font (size 1.27 1.27)) (justify left))
      )
      (property "Footprint" "" (at 0.9652 -3.81 0)
        (effects (font (size 1.27 1.27)) hide)
      )
      (property "Datasheet" "~" (at 0 0 0)
        (effects (font (size 1.27 1.27)) hide)
      )
      (property "ki_keywords" "cap capacitor" (at 0 0 0)
        (effects (font (size 1.27 1.27)) hide)
      )
      (property "ki_description" "Unpolarized capacitor" (at 0 0 0)
        (effects (font (size 1.27 1.27)) hide)
      )
      (property "ki_fp_filters" "C_*" (at 0 0 0)
        (effects (font (size 1.27 1.27)) hide)
      )
      (symbol "C_0_1"
        (polyline
          (pts
            (xy -2.032 -0.762)
            (xy 2.032 -0.762)
          )
          (stroke (width 0.508) (type default))
          (fill (type none))
        )
        (polyline
          (pts
            (xy -2.032 0.762)
            (xy 2.032 0.762)
          )
          (stroke (width 0.508) (type default))
          (fill (type none))
        )
      )
      (symbol "C_1_1"
        (pin passive line (at 0 3.81 270) (length 2.794)
          (name "~" (effects (font (size 1.27 1.27))))
          (number "1" (effects (font (size 1.27 1.27))))
        )
        (pin passive line (at 0 -3.81 90) (length 2.794)
          (name "~" (effects (font (size 1.27 1.27))))
          (number "2" (effects (font (size 1.27 1.27))))
        )
      )
    )
    (symbol "Device:R" (pin_numbers hide) (pin_names (offset 0)) (in_bom yes) (on_board yes)
      (property "Reference" "R" (at 2.032 0 90)
        (effects (font (size 1.27 1.27)))
      )
      (property "Value" "R" (at 0 0 90)
        (effects (font (size 1.27 1.27)))
      )
      (property "Footprint" "" (at -1.778 0 90)
        (effects (font (size 1.27 1.27)) hide)
      )
      (property "Datasheet" "~" (at 0 0 0)
        (effects (font (size 1.27 1.27)) hide)
      )
      (property "ki_keywords" "R res resistor" (at 0 0 0)
        (effects (font (size 1.27 1.27)) hide)
      )
      (property "ki_description" "Resistor" (at 0 0 0)
        (effects (font (size 1.27 1.27)) hide)
      )
      (property "ki_fp_filters" "R_*" (at 0 0 0)
        (effects (font (size 1.27 1.27)) hide)
      )
      (symbol "R_0_1"
        (rectangle (start -1.016 -2.54) (end 1.016 2.54)
          (stroke (width 0.254) (type default))
          (fill (type none))
        )
      )
      (symbol "R_1_1"
        (pin passive line (at 0 3.81 270) (length 1.27)
          (name "~" (effects (font (size 1.27 1.27))))
          (number "1" (effects (font (size 1.27 1.27))))
        )
        (pin passive line (at 0 -3.81 90) (length 1.27)
          (name "~" (effects (font (size 1.27 1.27))))
          (number "2" (effects (font (size 1.27 1.27))))
        )
      )
    )
    (symbol "Valves-BDC-DRV:DRV8231DDAR" (in_bom yes) (on_board yes)
      (property "Reference" "IC" (at 26.67 7.62 0)
        (effects (font (size 1.27 1.27)) (justify left top))
      )
      (property "Value" "DRV8231DDAR" (at 26.67 5.08 0)
        (effects (font (size 1.27 1.27)) (justify left top))
      )
      (property "Footprint" "SOIC127P600X170-9N" (at 26.67 -94.92 0)
        (effects (font (size 1.27 1.27)) (justify left top) hide)
      )
      (property "Datasheet" "https://www.ti.com/lit/ds/symlink/drv8231.pdf?HQS=dis-mous-null-mousermode-dsf-pf-null-wwe&ts=1677835700436&ref_url=https%253A%252F%252Fwww.mouser.ch%252F" (at 26.67 -194.92 0)
        (effects (font (size 1.27 1.27)) (justify left top) hide)
      )
      (property "Height" "1.7" (at 26.67 -394.92 0)
        (effects (font (size 1.27 1.27)) (justify left top) hide)
      )
      (property "Mouser Part Number" "595-DRV8231DDAR" (at 26.67 -494.92 0)
        (effects (font (size 1.27 1.27)) (justify left top) hide)
      )
      (property "Mouser Price/Stock" "https://www.mouser.co.uk/ProductDetail/Texas-Instruments/DRV8231DDAR?qs=Li%252BoUPsLEntrWPqBKwBOfA%3D%3D" (at 26.67 -594.92 0)
        (effects (font (size 1.27 1.27)) (justify left top) hide)
      )
      (property "Manufacturer_Name" "Texas Instruments" (at 26.67 -694.92 0)
        (effects (font (size 1.27 1.27)) (justify left top) hide)
      )
      (property "Manufacturer_Part_Number" "DRV8231DDAR" (at 26.67 -794.92 0)
        (effects (font (size 1.27 1.27)) (justify left top) hide)
      )
      (property "ki_description" "Motor Drives 33V H bridge motor driver with current regulation" (at 0 0 0)
        (effects (font (size 1.27 1.27)) hide)
      )
      (symbol "DRV8231DDAR_1_1"
        (rectangle (start 5.08 2.54) (end 25.4 -15.24)
          (stroke (width 0.254) (type default))
          (fill (type background))
        )
        (pin passive line (at 0 0 0) (length 5.08)
          (name "GND" (effects (font (size 1.27 1.27))))
          (number "1" (effects (font (size 1.27 1.27))))
        )
        (pin passive line (at 0 -2.54 0) (length 5.08)
          (name "IN2" (effects (font (size 1.27 1.27))))
          (number "2" (effects (font (size 1.27 1.27))))
        )
        (pin passive line (at 0 -5.08 0) (length 5.08)
          (name "IN1" (effects (font (size 1.27 1.27))))
          (number "3" (effects (font (size 1.27 1.27))))
        )
        (pin passive line (at 0 -7.62 0) (length 5.08)
          (name "VREF" (effects (font (size 1.27 1.27))))
          (number "4" (effects (font (size 1.27 1.27))))
        )
        (pin passive line (at 30.48 -7.62 180) (length 5.08)
          (name "VM" (effects (font (size 1.27 1.27))))
          (number "5" (effects (font (size 1.27 1.27))))
        )
        (pin passive line (at 30.48 -5.08 180) (length 5.08)
          (name "OUT1" (effects (font (size 1.27 1.27))))
          (number "6" (effects (font (size 1.27 1.27))))
        )
        (pin passive line (at 30.48 -2.54 180) (length 5.08)
          (name "ISEN" (effects (font (size 1.27 1.27))))
          (number "7" (effects (font (size 1.27 1.27))))
        )
        (pin passive line (at 30.48 0 180) (length 5.08)
          (name "OUT2" (effects (font (size 1.27 1.27))))
          (number "8" (effects (font (size 1.27 1.27))))
        )
        (pin passive line (at 15.24 -20.32 90) (length 5.08)
          (name "EP" (effects (font (size 1.27 1.27))))
          (number "9" (effects (font (size 1.27 1.27))))
        )
      )
    )
    (symbol "power:+5V" (power) (pin_names (offset 0)) (in_bom yes) (on_board yes)
      (property "Reference" "#PWR" (at 0 -3.81 0)
        (effects (font (size 1.27 1.27)) hide)
      )
      (property "Value" "+5V" (at 0 3.556 0)
        (effects (font (size 1.27 1.27)))
      )
      (property "Footprint" "" (at 0 0 0)
        (effects (font (size 1.27 1.27)) hide)
      )
      (property "Datasheet" "" (at 0 0 0)
        (effects (font (size 1.27 1.27)) hide)
      )
      (property "ki_keywords" "global power" (at 0 0 0)
        (effects (font (size 1.27 1.27)) hide)
      )
      (property "ki_description" "Power symbol creates a global label with name \"+5V\"" (at 0 0 0)
        (effects (font (size 1.27 1.27)) hide)
      )
      (symbol "+5V_0_1"
        (polyline
          (pts
            (xy -0.762 1.27)
            (xy 0 2.54)
          )
          (stroke (width 0) (type default))
          (fill (type none))
        )
        (polyline
          (pts
            (xy 0 0)
            (xy 0 2.54)
          )
          (stroke (width 0) (type default))
          (fill (type none))
        )
        (polyline
          (pts
            (xy 0 2.54)
            (xy 0.762 1.27)
          )
          (stroke (width 0) (type default))
          (fill (type none))
        )
      )
      (symbol "+5V_1_1"
        (pin power_in line (at 0 0 90) (length 0) hide
          (name "+5V" (effects (font (size 1.27 1.27))))
          (number "1" (effects (font (size 1.27 1.27))))
        )
      )
    )
    (symbol "power:GND" (power) (pin_names (offset 0)) (in_bom yes) (on_board yes)
      (property "Reference" "#PWR" (at 0 -6.35 0)
        (effects (font (size 1.27 1.27)) hide)
      )
      (property "Value" "GND" (at 0 -3.81 0)
        (effects (font (size 1.27 1.27)))
      )
      (property "Footprint" "" (at 0 0 0)
        (effects (font (size 1.27 1.27)) hide)
      )
      (property "Datasheet" "" (at 0 0 0)
        (effects (font (size 1.27 1.27)) hide)
      )
      (property "ki_keywords" "global power" (at 0 0 0)
        (effects (font (size 1.27 1.27)) hide)
      )
      (property "ki_description" "Power symbol creates a global label with name \"GND\" , ground" (at 0 0 0)
        (effects (font (size 1.27 1.27)) hide)
      )
      (symbol "GND_0_1"
        (polyline
          (pts
            (xy 0 0)
            (xy 0 -1.27)
            (xy 1.27 -1.27)
            (xy 0 -2.54)
            (xy -1.27 -1.27)
            (xy 0 -1.27)
          )
          (stroke (width 0) (type default))
          (fill (type none))
        )
      )
      (symbol "GND_1_1"
        (pin power_in line (at 0 0 270) (length 0) hide
          (name "GND" (effects (font (size 1.27 1.27))))
          (number "1" (effects (font (size 1.27 1.27))))
        )
      )
    )
  )

  (junction (at 101.6 50.8) (diameter 0) (color 0 0 0 0)
    (uuid c7082e39-802c-41ac-be90-56060db1a346)
  )

  (wire (pts (xy 101.6 50.8) (xy 110.49 50.8))
    (stroke (width 0) (type default))
    (uuid 15a2934e-8903-4fb7-aba9-30e1eaa12007)
  )
  (wire (pts (xy 31.75 69.85) (xy 34.29 69.85))
    (stroke (width 0) (type default))
    (uuid 2b92bf2f-4c3a-4fc7-ba2f-39f77dba8688)
  )
  (wire (pts (xy 41.91 69.85) (xy 44.45 69.85))
    (stroke (width 0) (type default))
    (uuid 464b1b55-3246-478e-b7ce-e726d262a190)
  )
  (wire (pts (xy 101.6 50.8) (xy 101.6 53.34))
    (stroke (width 0) (type default))
    (uuid 61cc456c-7990-4561-bb58-f7910da9b8dd)
  )
  (wire (pts (xy 92.71 45.72) (xy 107.95 45.72))
    (stroke (width 0) (type default))
    (uuid 96cd41a3-3883-4c64-b174-2ca6d22d939c)
  )
  (wire (pts (xy 101.6 60.96) (xy 101.6 63.5))
    (stroke (width 0) (type default))
    (uuid a68c2b35-0311-4bb1-af0a-3d5a3a6ab5bf)
  )
  (wire (pts (xy 92.71 50.8) (xy 101.6 50.8))
    (stroke (width 0) (type default))
    (uuid c4b7f1d7-5c9b-470d-97f7-e4c3fd5d8c3f)
  )
  (wire (pts (xy 115.57 45.72) (xy 119.38 45.72))
    (stroke (width 0) (type default))
    (uuid e0128061-7009-477a-ae88-84dafaebbf12)
  )
  (wire (pts (xy 52.07 69.85) (xy 54.61 69.85))
    (stroke (width 0) (type default))
    (uuid ec71ba60-e314-44d5-8360-9b280e70d5e8)
  )

  (text "DRV8231DDAR" (at 124.46 63.5 0)
    (effects (font (size 3 3)) (justify left bottom))
    (uuid 86ac1fd3-28e3-49f0-b423-828bbdb03459)
  )

  (hierarchical_label "OUT2" (shape input) (at 93.98 88.9 0) (fields_autoplaced)
    (effects (font (size 1.27 1.27)) (justify left))
    (uuid 008107ac-c619-4a54-ab7e-8ba40636e0c8)
  )
  (hierarchical_label "OUT2" (shape input) (at 54.61 69.85 0) (fields_autoplaced)
    (effects (font (size 1.27 1.27)) (justify left))
    (uuid 16364649-d190-4bd0-a96c-e1d246f5687c)
  )
  (hierarchical_label "IN1" (shape input) (at 71.12 85.09 0) (fields_autoplaced)
    (effects (font (size 1.27 1.27)) (justify left))
    (uuid 491167c3-97d9-4eba-9270-3979cd3ccbc7)
  )
  (hierarchical_label "IN2" (shape input) (at 71.12 90.17 0) (fields_autoplaced)
    (effects (font (size 1.27 1.27)) (justify left))
    (uuid 60e709ed-8b68-4703-9011-3956be66cdaa)
  )
  (hierarchical_label "OUT2" (shape input) (at 92.71 43.18 0) (fields_autoplaced)
    (effects (font (size 1.27 1.27)) (justify left))
    (uuid 6b759378-b911-4e76-9046-4ee9037a81cc)
  )
  (hierarchical_label "IN2" (shape input) (at 62.23 45.72 180) (fields_autoplaced)
    (effects (font (size 1.27 1.27)) (justify right))
    (uuid 6d5d27a6-22ba-4b91-904e-1960d142e995)
  )
  (hierarchical_label "OUT1" (shape input) (at 92.71 48.26 0) (fields_autoplaced)
    (effects (font (size 1.27 1.27)) (justify left))
    (uuid 9117e70d-ee7f-4bd7-a440-7e98954a7cf2)
  )
  (hierarchical_label "OUT1" (shape input) (at 31.75 69.85 180) (fields_autoplaced)
    (effects (font (size 1.27 1.27)) (justify right))
    (uuid 9ba0f778-e16a-406f-aeda-42c062e49609)
  )
  (hierarchical_label "IN1" (shape input) (at 62.23 48.26 180) (fields_autoplaced)
    (effects (font (size 1.27 1.27)) (justify right))
    (uuid a18881f9-9a31-4c43-a1c6-fd6b6667ef20)
  )
  (hierarchical_label "OUT1" (shape input) (at 93.98 86.36 0) (fields_autoplaced)
    (effects (font (size 1.27 1.27)) (justify left))
    (uuid c3f62531-ab99-462c-8d77-2232a79f8af5)
  )

  (symbol (lib_id "power:GND") (at 71.12 87.63 90) (unit 1)
    (in_bom yes) (on_board yes) (dnp no)
    (uuid 132fb1f0-36a5-4cfc-aa35-ff0bea307276)
    (property "Reference" "#PWR048" (at 77.47 87.63 0)
      (effects (font (size 1.27 1.27)) hide)
    )
    (property "Value" "GND" (at 73.66 87.63 90)
      (effects (font (size 1.27 1.27)) (justify right))
    )
    (property "Footprint" "" (at 71.12 87.63 0)
      (effects (font (size 1.27 1.27)) hide)
    )
    (property "Datasheet" "" (at 71.12 87.63 0)
      (effects (font (size 1.27 1.27)) hide)
    )
    (pin "1" (uuid df94c2df-2bd6-4e08-af92-002d14a278b6))
    (instances
      (project "Valves-BDC-IC"
        (path "/e7e61ffa-4e25-4fc5-9449-1d6f0a2e2f78/16d7e54c-9261-4072-a026-eac6acb003f7"
          (reference "#PWR048") (unit 1)
        )
      )
    )
  )

  (symbol (lib_id "Valves-BDC-DRV:DRV8231DDAR") (at 62.23 43.18 0) (unit 1)
    (in_bom yes) (on_board yes) (dnp no) (fields_autoplaced)
    (uuid 2188dd10-d7dc-4ab1-962d-9130941c985b)
    (property "Reference" "IC3" (at 77.47 35.56 0)
      (effects (font (size 1.27 1.27)))
    )
    (property "Value" "DRV8231DDAR" (at 77.47 38.1 0)
      (effects (font (size 1.27 1.27)))
    )
    (property "Footprint" "Valves-BDC-DRV:DRV8231DDAR" (at 88.9 138.1 0)
      (effects (font (size 1.27 1.27)) (justify left top) hide)
    )
    (property "Datasheet" "https://www.ti.com/lit/ds/symlink/drv8231.pdf?HQS=dis-mous-null-mousermode-dsf-pf-null-wwe&ts=1677835700436&ref_url=https%253A%252F%252Fwww.mouser.ch%252F" (at 88.9 238.1 0)
      (effects (font (size 1.27 1.27)) (justify left top) hide)
    )
    (property "Height" "1.7" (at 88.9 438.1 0)
      (effects (font (size 1.27 1.27)) (justify left top) hide)
    )
    (property "Mouser Part Number" "595-DRV8231DDAR" (at 88.9 538.1 0)
      (effects (font (size 1.27 1.27)) (justify left top) hide)
    )
    (property "Mouser Price/Stock" "https://www.mouser.co.uk/ProductDetail/Texas-Instruments/DRV8231DDAR?qs=Li%252BoUPsLEntrWPqBKwBOfA%3D%3D" (at 88.9 638.1 0)
      (effects (font (size 1.27 1.27)) (justify left top) hide)
    )
    (property "Manufacturer_Name" "Texas Instruments" (at 88.9 738.1 0)
      (effects (font (size 1.27 1.27)) (justify left top) hide)
    )
    (property "Manufacturer_Part_Number" "DRV8231DDAR" (at 88.9 838.1 0)
      (effects (font (size 1.27 1.27)) (justify left top) hide)
    )
    (pin "8" (uuid 537482bd-0079-465b-bae0-127da634d432))
    (pin "3" (uuid c15d02b7-21c9-4eb6-8a05-254b614fbb88))
    (pin "7" (uuid 48fd8edc-7ab0-4459-90be-21a1eb8c3311))
    (pin "2" (uuid ce60196c-800f-4891-8c81-a6f6332fbb90))
    (pin "6" (uuid a12fcb87-7d6f-4dce-993e-8fbde381d3ea))
    (pin "5" (uuid 3fc8d57c-ab31-4644-ba45-18fa64de5c03))
    (pin "4" (uuid 0e89c27f-b854-403a-8408-7a5ad51b6d81))
    (pin "1" (uuid 57ce2380-c482-4fda-bd4a-d9e60393d00a))
    (pin "9" (uuid 8bff3f7b-5040-42cc-b01d-6d4a616fd248))
    (instances
      (project "Valves-BDC-IC"
        (path "/e7e61ffa-4e25-4fc5-9449-1d6f0a2e2f78/16d7e54c-9261-4072-a026-eac6acb003f7"
          (reference "IC3") (unit 1)
        )
      )
    )
  )

  (symbol (lib_id "Device:R") (at 111.76 45.72 90) (unit 1)
    (in_bom yes) (on_board yes) (dnp no)
    (uuid 220189bb-3c79-4636-b8b1-674a8d406d0e)
    (property "Reference" "R13" (at 111.76 43.18 90)
      (effects (font (size 1.27 1.27)))
    )
    (property "Value" "TBD" (at 111.76 45.72 90)
      (effects (font (size 1.27 1.27)))
    )
    (property "Footprint" "Resistor_SMD:R_0603_1608Metric_Pad0.98x0.95mm_HandSolder" (at 111.76 47.498 90)
      (effects (font (size 1.27 1.27)) hide)
    )
    (property "Datasheet" "~" (at 111.76 45.72 0)
      (effects (font (size 1.27 1.27)) hide)
    )
    (pin "2" (uuid 68acba57-ec19-40f4-9d66-5d322e15a4fa))
    (pin "1" (uuid cb26d73b-46a0-44b4-a051-0f6c53b5504b))
    (instances
      (project "Valves-BDC-IC"
        (path "/e7e61ffa-4e25-4fc5-9449-1d6f0a2e2f78/16d7e54c-9261-4072-a026-eac6acb003f7"
          (reference "R13") (unit 1)
        )
      )
    )
  )

  (symbol (lib_id "Device:C") (at 48.26 69.85 90) (unit 1)
    (in_bom yes) (on_board yes) (dnp no)
    (uuid 36c713b6-ef16-457a-9101-9136c2ff086b)
    (property "Reference" "C15" (at 48.26 66.04 90)
      (effects (font (size 1.27 1.27)))
    )
    (property "Value" "TBD" (at 48.26 73.66 90)
      (effects (font (size 1.27 1.27)))
    )
    (property "Footprint" "Capacitor_SMD:C_0603_1608Metric_Pad1.08x0.95mm_HandSolder" (at 52.07 68.8848 0)
      (effects (font (size 1.27 1.27)) hide)
    )
    (property "Datasheet" "~" (at 48.26 69.85 0)
      (effects (font (size 1.27 1.27)) hide)
    )
    (pin "2" (uuid 4a1337ee-2c2f-4fb6-9c2f-2d0b4629c86b))
    (pin "1" (uuid e2bf5f9b-ff75-4dcd-a771-d8a1ec77d4ce))
    (instances
      (project "Valves-BDC-IC"
        (path "/e7e61ffa-4e25-4fc5-9449-1d6f0a2e2f78/16d7e54c-9261-4072-a026-eac6acb003f7"
          (reference "C15") (unit 1)
        )
      )
    )
  )

  (symbol (lib_id "power:GND") (at 77.47 63.5 0) (unit 1)
    (in_bom yes) (on_board yes) (dnp no)
    (uuid 3e63f923-df2b-4163-8315-0e5c3ab7d977)
    (property "Reference" "#PWR042" (at 77.47 69.85 0)
      (effects (font (size 1.27 1.27)) hide)
    )
    (property "Value" "GND" (at 77.47 67.31 0)
      (effects (font (size 1.27 1.27)))
    )
    (property "Footprint" "" (at 77.47 63.5 0)
      (effects (font (size 1.27 1.27)) hide)
    )
    (property "Datasheet" "" (at 77.47 63.5 0)
      (effects (font (size 1.27 1.27)) hide)
    )
    (pin "1" (uuid 662c6fe5-4c1b-4b0e-ac06-06ab62e2ffb9))
    (instances
      (project "Valves-BDC-IC"
        (path "/e7e61ffa-4e25-4fc5-9449-1d6f0a2e2f78/16d7e54c-9261-4072-a026-eac6acb003f7"
          (reference "#PWR042") (unit 1)
        )
      )
    )
  )

  (symbol (lib_id "Connector:Conn_01x03_Pin") (at 66.04 87.63 0) (unit 1)
    (in_bom yes) (on_board yes) (dnp no) (fields_autoplaced)
    (uuid 444bab4f-94ef-4c5b-ba03-afdacc6cbaaa)
    (property "Reference" "J11" (at 66.675 80.01 0)
      (effects (font (size 1.27 1.27)))
    )
    (property "Value" "Conn_01x03_Pin" (at 66.675 82.55 0)
      (effects (font (size 1.27 1.27)))
    )
    (property "Footprint" "Connector_PinHeader_2.54mm:PinHeader_1x03_P2.54mm_Horizontal" (at 66.04 87.63 0)
      (effects (font (size 1.27 1.27)) hide)
    )
    (property "Datasheet" "~" (at 66.04 87.63 0)
      (effects (font (size 1.27 1.27)) hide)
    )
    (pin "1" (uuid 11d11285-0ab5-4eb3-b923-ff0b69c46d17))
    (pin "2" (uuid 1aacc9f7-03d1-4a48-8e0e-e89a9eda34cf))
    (pin "3" (uuid 48c1cabe-447d-4ed7-949c-749bffd8bcab))
    (instances
      (project "Valves-BDC-IC"
        (path "/e7e61ffa-4e25-4fc5-9449-1d6f0a2e2f78/16d7e54c-9261-4072-a026-eac6acb003f7"
          (reference "J11") (unit 1)
        )
      )
    )
  )

  (symbol (lib_id "power:+5V") (at 110.49 50.8 270) (unit 1)
    (in_bom yes) (on_board yes) (dnp no)
    (uuid 87851f65-e4f5-4d48-94a2-79799f528b30)
    (property "Reference" "#PWR049" (at 106.68 50.8 0)
      (effects (font (size 1.27 1.27)) hide)
    )
    (property "Value" "+5V" (at 113.03 50.8 90)
      (effects (font (size 1.27 1.27)) (justify left))
    )
    (property "Footprint" "" (at 110.49 50.8 0)
      (effects (font (size 1.27 1.27)) hide)
    )
    (property "Datasheet" "" (at 110.49 50.8 0)
      (effects (font (size 1.27 1.27)) hide)
    )
    (pin "1" (uuid 2001bfa4-2fa4-4b9d-946f-2a61a47f2b92))
    (instances
      (project "Valves-BDC-IC"
        (path "/e7e61ffa-4e25-4fc5-9449-1d6f0a2e2f78/16d7e54c-9261-4072-a026-eac6acb003f7"
          (reference "#PWR049") (unit 1)
        )
      )
    )
  )

  (symbol (lib_id "power:GND") (at 119.38 45.72 90) (unit 1)
    (in_bom yes) (on_board yes) (dnp no)
    (uuid 879fcf28-6430-4ca6-9d55-2e6c9b25c298)
    (property "Reference" "#PWR046" (at 125.73 45.72 0)
      (effects (font (size 1.27 1.27)) hide)
    )
    (property "Value" "GND" (at 121.92 45.72 90)
      (effects (font (size 1.27 1.27)) (justify right))
    )
    (property "Footprint" "" (at 119.38 45.72 0)
      (effects (font (size 1.27 1.27)) hide)
    )
    (property "Datasheet" "" (at 119.38 45.72 0)
      (effects (font (size 1.27 1.27)) hide)
    )
    (pin "1" (uuid 72ca0a12-e5e0-42fe-aa52-d281f1d41408))
    (instances
      (project "Valves-BDC-IC"
        (path "/e7e61ffa-4e25-4fc5-9449-1d6f0a2e2f78/16d7e54c-9261-4072-a026-eac6acb003f7"
          (reference "#PWR046") (unit 1)
        )
      )
    )
  )

  (symbol (lib_id "power:GND") (at 101.6 63.5 0) (unit 1)
    (in_bom yes) (on_board yes) (dnp no)
    (uuid b7a1c73d-c185-47b1-9d1c-c6625dbc5d73)
    (property "Reference" "#PWR050" (at 101.6 69.85 0)
      (effects (font (size 1.27 1.27)) hide)
    )
    (property "Value" "GND" (at 101.6 67.31 0)
      (effects (font (size 1.27 1.27)))
    )
    (property "Footprint" "" (at 101.6 63.5 0)
      (effects (font (size 1.27 1.27)) hide)
    )
    (property "Datasheet" "" (at 101.6 63.5 0)
      (effects (font (size 1.27 1.27)) hide)
    )
    (pin "1" (uuid 6006394d-6301-4c90-9cfc-acc8aec0ce4f))
    (instances
      (project "Valves-BDC-IC"
        (path "/e7e61ffa-4e25-4fc5-9449-1d6f0a2e2f78/16d7e54c-9261-4072-a026-eac6acb003f7"
          (reference "#PWR050") (unit 1)
        )
      )
    )
  )

  (symbol (lib_id "Connector:Conn_01x02_Pin") (at 88.9 86.36 0) (unit 1)
    (in_bom yes) (on_board yes) (dnp no) (fields_autoplaced)
    (uuid b84f287f-d6c3-4377-8630-a0555de5b7f1)
    (property "Reference" "J12" (at 89.535 81.28 0)
      (effects (font (size 1.27 1.27)))
    )
    (property "Value" "Conn_01x02_Pin" (at 89.535 83.82 0)
      (effects (font (size 1.27 1.27)))
    )
    (property "Footprint" "Valves-BDC-DRV:valves_mounting_holes" (at 88.9 86.36 0)
      (effects (font (size 1.27 1.27)) hide)
    )
    (property "Datasheet" "~" (at 88.9 86.36 0)
      (effects (font (size 1.27 1.27)) hide)
    )
    (pin "1" (uuid 16a25e75-e4eb-4ceb-907b-6ce3ef048a7d))
    (pin "2" (uuid 37eef4b7-7ec7-4ee6-b864-7432529c9d27))
    (instances
      (project "Valves-BDC-IC"
        (path "/e7e61ffa-4e25-4fc5-9449-1d6f0a2e2f78/16d7e54c-9261-4072-a026-eac6acb003f7"
          (reference "J12") (unit 1)
        )
      )
    )
  )

  (symbol (lib_id "power:GND") (at 62.23 43.18 270) (unit 1)
    (in_bom yes) (on_board yes) (dnp no)
    (uuid c4b713c9-169a-4c1f-a87d-1035808bd9e6)
    (property "Reference" "#PWR043" (at 55.88 43.18 0)
      (effects (font (size 1.27 1.27)) hide)
    )
    (property "Value" "GND" (at 59.69 43.18 90)
      (effects (font (size 1.27 1.27)) (justify right))
    )
    (property "Footprint" "" (at 62.23 43.18 0)
      (effects (font (size 1.27 1.27)) hide)
    )
    (property "Datasheet" "" (at 62.23 43.18 0)
      (effects (font (size 1.27 1.27)) hide)
    )
    (pin "1" (uuid b03a26f3-5403-4ecc-82d0-f35c74d56931))
    (instances
      (project "Valves-BDC-IC"
        (path "/e7e61ffa-4e25-4fc5-9449-1d6f0a2e2f78/16d7e54c-9261-4072-a026-eac6acb003f7"
          (reference "#PWR043") (unit 1)
        )
      )
    )
  )

  (symbol (lib_id "Device:C") (at 101.6 57.15 0) (unit 1)
    (in_bom yes) (on_board yes) (dnp no)
    (uuid cc6d0dc4-50b9-4f4b-bee2-6bcdd68658b3)
    (property "Reference" "C10" (at 104.14 55.88 0)
      (effects (font (size 1.27 1.27)) (justify left))
    )
    (property "Value" "0.1u" (at 104.14 58.42 0)
      (effects (font (size 1.27 1.27)) (justify left))
    )
    (property "Footprint" "Capacitor_SMD:C_0603_1608Metric_Pad1.08x0.95mm_HandSolder" (at 102.5652 60.96 0)
      (effects (font (size 1.27 1.27)) hide)
    )
    (property "Datasheet" "~" (at 101.6 57.15 0)
      (effects (font (size 1.27 1.27)) hide)
    )
    (pin "2" (uuid d42927f2-80db-40c7-a2bb-c1422789a627))
    (pin "1" (uuid e485f110-9811-4bbc-a96c-1423b3008739))
    (instances
      (project "Valves-BDC-IC"
        (path "/e7e61ffa-4e25-4fc5-9449-1d6f0a2e2f78/16d7e54c-9261-4072-a026-eac6acb003f7"
          (reference "C10") (unit 1)
        )
      )
    )
  )

  (symbol (lib_id "Device:R") (at 38.1 69.85 90) (unit 1)
    (in_bom yes) (on_board yes) (dnp no)
    (uuid e2e85bb3-ec53-4a35-be6f-0c7c1f657444)
    (property "Reference" "R18" (at 38.1 67.31 90)
      (effects (font (size 1.27 1.27)))
    )
    (property "Value" "TBD" (at 38.1 69.85 90)
      (effects (font (size 1.27 1.27)))
    )
    (property "Footprint" "Resistor_SMD:R_0603_1608Metric_Pad0.98x0.95mm_HandSolder" (at 38.1 71.628 90)
      (effects (font (size 1.27 1.27)) hide)
    )
    (property "Datasheet" "~" (at 38.1 69.85 0)
      (effects (font (size 1.27 1.27)) hide)
    )
    (pin "2" (uuid d4ec06ce-0925-4ddc-b712-2238aa02dd7d))
    (pin "1" (uuid 88ca516f-5429-409d-b12f-164976f188c0))
    (instances
      (project "Valves-BDC-IC"
        (path "/e7e61ffa-4e25-4fc5-9449-1d6f0a2e2f78/16d7e54c-9261-4072-a026-eac6acb003f7"
          (reference "R18") (unit 1)
        )
      )
    )
  )

  (symbol (lib_id "power:+5V") (at 62.23 50.8 90) (unit 1)
    (in_bom yes) (on_board yes) (dnp no)
    (uuid ee0e914e-4c26-4a07-92b3-7f74557ca957)
    (property "Reference" "#PWR047" (at 66.04 50.8 0)
      (effects (font (size 1.27 1.27)) hide)
    )
    (property "Value" "+5V" (at 59.69 50.8 90)
      (effects (font (size 1.27 1.27)) (justify left))
    )
    (property "Footprint" "" (at 62.23 50.8 0)
      (effects (font (size 1.27 1.27)) hide)
    )
    (property "Datasheet" "" (at 62.23 50.8 0)
      (effects (font (size 1.27 1.27)) hide)
    )
    (pin "1" (uuid f00f9b07-edea-44a3-870d-734184d94334))
    (instances
      (project "Valves-BDC-IC"
        (path "/e7e61ffa-4e25-4fc5-9449-1d6f0a2e2f78/16d7e54c-9261-4072-a026-eac6acb003f7"
          (reference "#PWR047") (unit 1)
        )
      )
    )
  )
)
