(kicad_sch (version 20230121) (generator eeschema)

  (uuid f692c6e2-325d-4edb-9bc0-1bba91cb5194)

  (paper "A5")

  (lib_symbols
    (symbol "Connector:Conn_01x02_Pin" (pin_names (offset 1.016) hide) (in_bom yes) (on_board yes)
      (property "Reference" "J" (at 0 2.54 0)
        (effects (font (size 1.27 1.27)))
      )
      (property "Value" "Conn_01x02_Pin" (at 0 -5.08 0)
        (effects (font (size 1.27 1.27)))
      )
      (property "Footprint" "" (at 0 0 0)
        (effects (font (size 1.27 1.27)) hide)
      )
      (property "Datasheet" "~" (at 0 0 0)
        (effects (font (size 1.27 1.27)) hide)
      )
      (property "ki_locked" "" (at 0 0 0)
        (effects (font (size 1.27 1.27)))
      )
      (property "ki_keywords" "connector" (at 0 0 0)
        (effects (font (size 1.27 1.27)) hide)
      )
      (property "ki_description" "Generic connector, single row, 01x02, script generated" (at 0 0 0)
        (effects (font (size 1.27 1.27)) hide)
      )
      (property "ki_fp_filters" "Connector*:*_1x??_*" (at 0 0 0)
        (effects (font (size 1.27 1.27)) hide)
      )
      (symbol "Conn_01x02_Pin_1_1"
        (polyline
          (pts
            (xy 1.27 -2.54)
            (xy 0.8636 -2.54)
          )
          (stroke (width 0.1524) (type default))
          (fill (type none))
        )
        (polyline
          (pts
            (xy 1.27 0)
            (xy 0.8636 0)
          )
          (stroke (width 0.1524) (type default))
          (fill (type none))
        )
        (rectangle (start 0.8636 -2.413) (end 0 -2.667)
          (stroke (width 0.1524) (type default))
          (fill (type outline))
        )
        (rectangle (start 0.8636 0.127) (end 0 -0.127)
          (stroke (width 0.1524) (type default))
          (fill (type outline))
        )
        (pin passive line (at 5.08 0 180) (length 3.81)
          (name "Pin_1" (effects (font (size 1.27 1.27))))
          (number "1" (effects (font (size 1.27 1.27))))
        )
        (pin passive line (at 5.08 -2.54 180) (length 3.81)
          (name "Pin_2" (effects (font (size 1.27 1.27))))
          (number "2" (effects (font (size 1.27 1.27))))
        )
      )
    )
    (symbol "Connector:Conn_01x04_Pin" (pin_names (offset 1.016) hide) (in_bom yes) (on_board yes)
      (property "Reference" "J" (at 0 5.08 0)
        (effects (font (size 1.27 1.27)))
      )
      (property "Value" "Conn_01x04_Pin" (at 0 -7.62 0)
        (effects (font (size 1.27 1.27)))
      )
      (property "Footprint" "" (at 0 0 0)
        (effects (font (size 1.27 1.27)) hide)
      )
      (property "Datasheet" "~" (at 0 0 0)
        (effects (font (size 1.27 1.27)) hide)
      )
      (property "ki_locked" "" (at 0 0 0)
        (effects (font (size 1.27 1.27)))
      )
      (property "ki_keywords" "connector" (at 0 0 0)
        (effects (font (size 1.27 1.27)) hide)
      )
      (property "ki_description" "Generic connector, single row, 01x04, script generated" (at 0 0 0)
        (effects (font (size 1.27 1.27)) hide)
      )
      (property "ki_fp_filters" "Connector*:*_1x??_*" (at 0 0 0)
        (effects (font (size 1.27 1.27)) hide)
      )
      (symbol "Conn_01x04_Pin_1_1"
        (polyline
          (pts
            (xy 1.27 -5.08)
            (xy 0.8636 -5.08)
          )
          (stroke (width 0.1524) (type default))
          (fill (type none))
        )
        (polyline
          (pts
            (xy 1.27 -2.54)
            (xy 0.8636 -2.54)
          )
          (stroke (width 0.1524) (type default))
          (fill (type none))
        )
        (polyline
          (pts
            (xy 1.27 0)
            (xy 0.8636 0)
          )
          (stroke (width 0.1524) (type default))
          (fill (type none))
        )
        (polyline
          (pts
            (xy 1.27 2.54)
            (xy 0.8636 2.54)
          )
          (stroke (width 0.1524) (type default))
          (fill (type none))
        )
        (rectangle (start 0.8636 -4.953) (end 0 -5.207)
          (stroke (width 0.1524) (type default))
          (fill (type outline))
        )
        (rectangle (start 0.8636 -2.413) (end 0 -2.667)
          (stroke (width 0.1524) (type default))
          (fill (type outline))
        )
        (rectangle (start 0.8636 0.127) (end 0 -0.127)
          (stroke (width 0.1524) (type default))
          (fill (type outline))
        )
        (rectangle (start 0.8636 2.667) (end 0 2.413)
          (stroke (width 0.1524) (type default))
          (fill (type outline))
        )
        (pin passive line (at 5.08 2.54 180) (length 3.81)
          (name "Pin_1" (effects (font (size 1.27 1.27))))
          (number "1" (effects (font (size 1.27 1.27))))
        )
        (pin passive line (at 5.08 0 180) (length 3.81)
          (name "Pin_2" (effects (font (size 1.27 1.27))))
          (number "2" (effects (font (size 1.27 1.27))))
        )
        (pin passive line (at 5.08 -2.54 180) (length 3.81)
          (name "Pin_3" (effects (font (size 1.27 1.27))))
          (number "3" (effects (font (size 1.27 1.27))))
        )
        (pin passive line (at 5.08 -5.08 180) (length 3.81)
          (name "Pin_4" (effects (font (size 1.27 1.27))))
          (number "4" (effects (font (size 1.27 1.27))))
        )
      )
    )
    (symbol "Device:C" (pin_numbers hide) (pin_names (offset 0.254)) (in_bom yes) (on_board yes)
      (property "Reference" "C" (at 0.635 2.54 0)
        (effects (font (size 1.27 1.27)) (justify left))
      )
      (property "Value" "C" (at 0.635 -2.54 0)
        (effects (font (size 1.27 1.27)) (justify left))
      )
      (property "Footprint" "" (at 0.9652 -3.81 0)
        (effects (font (size 1.27 1.27)) hide)
      )
      (property "Datasheet" "~" (at 0 0 0)
        (effects (font (size 1.27 1.27)) hide)
      )
      (property "ki_keywords" "cap capacitor" (at 0 0 0)
        (effects (font (size 1.27 1.27)) hide)
      )
      (property "ki_description" "Unpolarized capacitor" (at 0 0 0)
        (effects (font (size 1.27 1.27)) hide)
      )
      (property "ki_fp_filters" "C_*" (at 0 0 0)
        (effects (font (size 1.27 1.27)) hide)
      )
      (symbol "C_0_1"
        (polyline
          (pts
            (xy -2.032 -0.762)
            (xy 2.032 -0.762)
          )
          (stroke (width 0.508) (type default))
          (fill (type none))
        )
        (polyline
          (pts
            (xy -2.032 0.762)
            (xy 2.032 0.762)
          )
          (stroke (width 0.508) (type default))
          (fill (type none))
        )
      )
      (symbol "C_1_1"
        (pin passive line (at 0 3.81 270) (length 2.794)
          (name "~" (effects (font (size 1.27 1.27))))
          (number "1" (effects (font (size 1.27 1.27))))
        )
        (pin passive line (at 0 -3.81 90) (length 2.794)
          (name "~" (effects (font (size 1.27 1.27))))
          (number "2" (effects (font (size 1.27 1.27))))
        )
      )
    )
    (symbol "Device:R" (pin_numbers hide) (pin_names (offset 0)) (in_bom yes) (on_board yes)
      (property "Reference" "R" (at 2.032 0 90)
        (effects (font (size 1.27 1.27)))
      )
      (property "Value" "R" (at 0 0 90)
        (effects (font (size 1.27 1.27)))
      )
      (property "Footprint" "" (at -1.778 0 90)
        (effects (font (size 1.27 1.27)) hide)
      )
      (property "Datasheet" "~" (at 0 0 0)
        (effects (font (size 1.27 1.27)) hide)
      )
      (property "ki_keywords" "R res resistor" (at 0 0 0)
        (effects (font (size 1.27 1.27)) hide)
      )
      (property "ki_description" "Resistor" (at 0 0 0)
        (effects (font (size 1.27 1.27)) hide)
      )
      (property "ki_fp_filters" "R_*" (at 0 0 0)
        (effects (font (size 1.27 1.27)) hide)
      )
      (symbol "R_0_1"
        (rectangle (start -1.016 -2.54) (end 1.016 2.54)
          (stroke (width 0.254) (type default))
          (fill (type none))
        )
      )
      (symbol "R_1_1"
        (pin passive line (at 0 3.81 270) (length 1.27)
          (name "~" (effects (font (size 1.27 1.27))))
          (number "1" (effects (font (size 1.27 1.27))))
        )
        (pin passive line (at 0 -3.81 90) (length 1.27)
          (name "~" (effects (font (size 1.27 1.27))))
          (number "2" (effects (font (size 1.27 1.27))))
        )
      )
    )
    (symbol "Valves-BDC-DRV:DRV8837DSGR" (in_bom yes) (on_board yes)
      (property "Reference" "IC" (at 26.67 7.62 0)
        (effects (font (size 1.27 1.27)) (justify left top))
      )
      (property "Value" "DRV8837DSGR" (at 26.67 5.08 0)
        (effects (font (size 1.27 1.27)) (justify left top))
      )
      (property "Footprint" "SON50P200X200X80-9N" (at 26.67 -94.92 0)
        (effects (font (size 1.27 1.27)) (justify left top) hide)
      )
      (property "Datasheet" "http://www.ti.com/lit/gpn/drv8837" (at 26.67 -194.92 0)
        (effects (font (size 1.27 1.27)) (justify left top) hide)
      )
      (property "Height" "0.8" (at 26.67 -394.92 0)
        (effects (font (size 1.27 1.27)) (justify left top) hide)
      )
      (property "Mouser Part Number" "595-DRV8837DSGR" (at 26.67 -494.92 0)
        (effects (font (size 1.27 1.27)) (justify left top) hide)
      )
      (property "Mouser Price/Stock" "https://www.mouser.co.uk/ProductDetail/Texas-Instruments/DRV8837DSGR?qs=l6ZoeTYLMwO0pKIJ8222Ww%3D%3D" (at 26.67 -594.92 0)
        (effects (font (size 1.27 1.27)) (justify left top) hide)
      )
      (property "Manufacturer_Name" "Texas Instruments" (at 26.67 -694.92 0)
        (effects (font (size 1.27 1.27)) (justify left top) hide)
      )
      (property "Manufacturer_Part_Number" "DRV8837DSGR" (at 26.67 -794.92 0)
        (effects (font (size 1.27 1.27)) (justify left top) hide)
      )
      (property "ki_description" "1.8A Low Voltage Brushed DC Motor Driver (PWM Ctrl)" (at 0 0 0)
        (effects (font (size 1.27 1.27)) hide)
      )
      (symbol "DRV8837DSGR_1_1"
        (rectangle (start 5.08 2.54) (end 25.4 -15.24)
          (stroke (width 0.254) (type default))
          (fill (type background))
        )
        (pin passive line (at 0 0 0) (length 5.08)
          (name "VM" (effects (font (size 1.27 1.27))))
          (number "1" (effects (font (size 1.27 1.27))))
        )
        (pin passive line (at 0 -2.54 0) (length 5.08)
          (name "OUT1" (effects (font (size 1.27 1.27))))
          (number "2" (effects (font (size 1.27 1.27))))
        )
        (pin passive line (at 0 -5.08 0) (length 5.08)
          (name "OUT2" (effects (font (size 1.27 1.27))))
          (number "3" (effects (font (size 1.27 1.27))))
        )
        (pin passive line (at 0 -7.62 0) (length 5.08)
          (name "GND" (effects (font (size 1.27 1.27))))
          (number "4" (effects (font (size 1.27 1.27))))
        )
        (pin passive line (at 30.48 -7.62 180) (length 5.08)
          (name "IN2" (effects (font (size 1.27 1.27))))
          (number "5" (effects (font (size 1.27 1.27))))
        )
        (pin passive line (at 30.48 -5.08 180) (length 5.08)
          (name "IN1" (effects (font (size 1.27 1.27))))
          (number "6" (effects (font (size 1.27 1.27))))
        )
        (pin passive line (at 30.48 -2.54 180) (length 5.08)
          (name "NSLEEP" (effects (font (size 1.27 1.27))))
          (number "7" (effects (font (size 1.27 1.27))))
        )
        (pin passive line (at 30.48 0 180) (length 5.08)
          (name "VCC" (effects (font (size 1.27 1.27))))
          (number "8" (effects (font (size 1.27 1.27))))
        )
        (pin passive line (at 15.24 -20.32 90) (length 5.08)
          (name "EP" (effects (font (size 1.27 1.27))))
          (number "9" (effects (font (size 1.27 1.27))))
        )
      )
    )
    (symbol "power:+3.3V" (power) (pin_names (offset 0)) (in_bom yes) (on_board yes)
      (property "Reference" "#PWR" (at 0 -3.81 0)
        (effects (font (size 1.27 1.27)) hide)
      )
      (property "Value" "+3.3V" (at 0 3.556 0)
        (effects (font (size 1.27 1.27)))
      )
      (property "Footprint" "" (at 0 0 0)
        (effects (font (size 1.27 1.27)) hide)
      )
      (property "Datasheet" "" (at 0 0 0)
        (effects (font (size 1.27 1.27)) hide)
      )
      (property "ki_keywords" "global power" (at 0 0 0)
        (effects (font (size 1.27 1.27)) hide)
      )
      (property "ki_description" "Power symbol creates a global label with name \"+3.3V\"" (at 0 0 0)
        (effects (font (size 1.27 1.27)) hide)
      )
      (symbol "+3.3V_0_1"
        (polyline
          (pts
            (xy -0.762 1.27)
            (xy 0 2.54)
          )
          (stroke (width 0) (type default))
          (fill (type none))
        )
        (polyline
          (pts
            (xy 0 0)
            (xy 0 2.54)
          )
          (stroke (width 0) (type default))
          (fill (type none))
        )
        (polyline
          (pts
            (xy 0 2.54)
            (xy 0.762 1.27)
          )
          (stroke (width 0) (type default))
          (fill (type none))
        )
      )
      (symbol "+3.3V_1_1"
        (pin power_in line (at 0 0 90) (length 0) hide
          (name "+3.3V" (effects (font (size 1.27 1.27))))
          (number "1" (effects (font (size 1.27 1.27))))
        )
      )
    )
    (symbol "power:+5V" (power) (pin_names (offset 0)) (in_bom yes) (on_board yes)
      (property "Reference" "#PWR" (at 0 -3.81 0)
        (effects (font (size 1.27 1.27)) hide)
      )
      (property "Value" "+5V" (at 0 3.556 0)
        (effects (font (size 1.27 1.27)))
      )
      (property "Footprint" "" (at 0 0 0)
        (effects (font (size 1.27 1.27)) hide)
      )
      (property "Datasheet" "" (at 0 0 0)
        (effects (font (size 1.27 1.27)) hide)
      )
      (property "ki_keywords" "global power" (at 0 0 0)
        (effects (font (size 1.27 1.27)) hide)
      )
      (property "ki_description" "Power symbol creates a global label with name \"+5V\"" (at 0 0 0)
        (effects (font (size 1.27 1.27)) hide)
      )
      (symbol "+5V_0_1"
        (polyline
          (pts
            (xy -0.762 1.27)
            (xy 0 2.54)
          )
          (stroke (width 0) (type default))
          (fill (type none))
        )
        (polyline
          (pts
            (xy 0 0)
            (xy 0 2.54)
          )
          (stroke (width 0) (type default))
          (fill (type none))
        )
        (polyline
          (pts
            (xy 0 2.54)
            (xy 0.762 1.27)
          )
          (stroke (width 0) (type default))
          (fill (type none))
        )
      )
      (symbol "+5V_1_1"
        (pin power_in line (at 0 0 90) (length 0) hide
          (name "+5V" (effects (font (size 1.27 1.27))))
          (number "1" (effects (font (size 1.27 1.27))))
        )
      )
    )
    (symbol "power:GND" (power) (pin_names (offset 0)) (in_bom yes) (on_board yes)
      (property "Reference" "#PWR" (at 0 -6.35 0)
        (effects (font (size 1.27 1.27)) hide)
      )
      (property "Value" "GND" (at 0 -3.81 0)
        (effects (font (size 1.27 1.27)))
      )
      (property "Footprint" "" (at 0 0 0)
        (effects (font (size 1.27 1.27)) hide)
      )
      (property "Datasheet" "" (at 0 0 0)
        (effects (font (size 1.27 1.27)) hide)
      )
      (property "ki_keywords" "global power" (at 0 0 0)
        (effects (font (size 1.27 1.27)) hide)
      )
      (property "ki_description" "Power symbol creates a global label with name \"GND\" , ground" (at 0 0 0)
        (effects (font (size 1.27 1.27)) hide)
      )
      (symbol "GND_0_1"
        (polyline
          (pts
            (xy 0 0)
            (xy 0 -1.27)
            (xy 1.27 -1.27)
            (xy 0 -2.54)
            (xy -1.27 -1.27)
            (xy 0 -1.27)
          )
          (stroke (width 0) (type default))
          (fill (type none))
        )
      )
      (symbol "GND_1_1"
        (pin power_in line (at 0 0 270) (length 0) hide
          (name "GND" (effects (font (size 1.27 1.27))))
          (number "1" (effects (font (size 1.27 1.27))))
        )
      )
    )
  )

  (junction (at 71.12 44.45) (diameter 0) (color 0 0 0 0)
    (uuid 0c162c16-b092-4cad-a10c-a50e08c0ce5e)
  )
  (junction (at 109.22 44.45) (diameter 0) (color 0 0 0 0)
    (uuid 929c0624-d19a-418d-815f-ea67ee043931)
  )

  (wire (pts (xy 109.22 43.18) (xy 109.22 44.45))
    (stroke (width 0) (type default))
    (uuid 0f1e9162-f41d-41f6-b751-5881835f8048)
  )
  (wire (pts (xy 38.1 68.58) (xy 40.64 68.58))
    (stroke (width 0) (type default))
    (uuid 13b932d5-76d0-4339-a6e1-1c7c07513fc5)
  )
  (wire (pts (xy 58.42 68.58) (xy 60.96 68.58))
    (stroke (width 0) (type default))
    (uuid 13e41188-d7f7-4cff-8c7e-e1b8b2bcf79a)
  )
  (wire (pts (xy 109.22 44.45) (xy 105.41 44.45))
    (stroke (width 0) (type default))
    (uuid 1cfdde14-0cb2-4c60-9fbf-b30d2d19de6a)
  )
  (wire (pts (xy 67.31 44.45) (xy 71.12 44.45))
    (stroke (width 0) (type default))
    (uuid 423d211f-1dfe-4a41-9040-2f4cf240a8af)
  )
  (wire (pts (xy 71.12 44.45) (xy 74.93 44.45))
    (stroke (width 0) (type default))
    (uuid 47f30152-5d09-42e6-a725-b38d7a55e1f8)
  )
  (wire (pts (xy 71.12 43.18) (xy 71.12 44.45))
    (stroke (width 0) (type default))
    (uuid 64e927eb-a394-4fec-bcb4-de50e073229f)
  )
  (wire (pts (xy 113.03 44.45) (xy 109.22 44.45))
    (stroke (width 0) (type default))
    (uuid b4f61f2a-e093-48c5-a1c3-3a9c828c0b8d)
  )
  (wire (pts (xy 48.26 68.58) (xy 50.8 68.58))
    (stroke (width 0) (type default))
    (uuid f48948fc-91df-45bc-b5c3-81a29e8f49b0)
  )

  (text "DRV8837DSGR" (at 144.78 73.66 0)
    (effects (font (size 3 3)) (justify left bottom))
    (uuid b9fc1b78-680a-4d25-8f0a-23623449d803)
  )

  (hierarchical_label "IN1" (shape input) (at 77.47 83.82 0) (fields_autoplaced)
    (effects (font (size 1.27 1.27)) (justify left))
    (uuid 3d240b5f-6866-4810-93bd-eb25e3438e17)
  )
  (hierarchical_label "nSLEEP" (shape input) (at 105.41 46.99 0) (fields_autoplaced)
    (effects (font (size 1.27 1.27)) (justify left))
    (uuid 6011cd7f-605a-449c-b043-cca49ad7e4cf)
  )
  (hierarchical_label "OUT1" (shape input) (at 101.6 83.82 0) (fields_autoplaced)
    (effects (font (size 1.27 1.27)) (justify left))
    (uuid 724c7342-bd19-49df-a0cf-03b389f7f50d)
  )
  (hierarchical_label "OUT2" (shape input) (at 60.96 68.58 0) (fields_autoplaced)
    (effects (font (size 1.27 1.27)) (justify left))
    (uuid 97dbe759-d441-4c9b-bbfe-7f2066f6f8c6)
  )
  (hierarchical_label "OUT1" (shape input) (at 74.93 46.99 180) (fields_autoplaced)
    (effects (font (size 1.27 1.27)) (justify right))
    (uuid a5ed75fb-13b6-44ec-8cfe-07ba2d1cda04)
  )
  (hierarchical_label "OUT1" (shape input) (at 38.1 68.58 180) (fields_autoplaced)
    (effects (font (size 1.27 1.27)) (justify right))
    (uuid accca037-a2e0-4ae0-be8b-61d91937da4b)
  )
  (hierarchical_label "IN2" (shape input) (at 77.47 88.9 0) (fields_autoplaced)
    (effects (font (size 1.27 1.27)) (justify left))
    (uuid b1ab6cbd-21c8-465d-91b6-1128299be3aa)
  )
  (hierarchical_label "IN2" (shape input) (at 105.41 52.07 0) (fields_autoplaced)
    (effects (font (size 1.27 1.27)) (justify left))
    (uuid c8524d17-280a-4a6e-ba10-7c32a9dd43ae)
  )
  (hierarchical_label "IN1" (shape input) (at 105.41 49.53 0) (fields_autoplaced)
    (effects (font (size 1.27 1.27)) (justify left))
    (uuid cad2c59c-2e3d-4c40-a1f5-232e62818e8d)
  )
  (hierarchical_label "OUT2" (shape input) (at 101.6 86.36 0) (fields_autoplaced)
    (effects (font (size 1.27 1.27)) (justify left))
    (uuid cf43caa6-a900-4c37-8aff-ac9e178d6f79)
  )
  (hierarchical_label "nSLEEP" (shape input) (at 77.47 81.28 0) (fields_autoplaced)
    (effects (font (size 1.27 1.27)) (justify left))
    (uuid eec8396e-e49d-4025-abd0-9616d05381d8)
  )
  (hierarchical_label "OUT2" (shape input) (at 74.93 49.53 180) (fields_autoplaced)
    (effects (font (size 1.27 1.27)) (justify right))
    (uuid f8034fe8-4948-443a-86f1-b7fcfc6250ff)
  )

  (symbol (lib_id "power:GND") (at 74.93 52.07 270) (unit 1)
    (in_bom yes) (on_board yes) (dnp no)
    (uuid 3479ebce-675b-4157-956c-5e5ead51178b)
    (property "Reference" "#PWR017" (at 68.58 52.07 0)
      (effects (font (size 1.27 1.27)) hide)
    )
    (property "Value" "GND" (at 72.39 52.07 90)
      (effects (font (size 1.27 1.27)) (justify right))
    )
    (property "Footprint" "" (at 74.93 52.07 0)
      (effects (font (size 1.27 1.27)) hide)
    )
    (property "Datasheet" "" (at 74.93 52.07 0)
      (effects (font (size 1.27 1.27)) hide)
    )
    (pin "1" (uuid aa67ac28-29e1-4be7-a983-8048aa179199))
    (instances
      (project "Valves-BDC-IC"
        (path "/e7e61ffa-4e25-4fc5-9449-1d6f0a2e2f78/364b3751-8099-46b9-b309-21610ff38d80"
          (reference "#PWR017") (unit 1)
        )
      )
    )
  )

  (symbol (lib_id "Device:C") (at 109.22 39.37 0) (unit 1)
    (in_bom yes) (on_board yes) (dnp no)
    (uuid 60b1d29c-8408-42e4-9fdb-ff4ed66977d8)
    (property "Reference" "C5" (at 111.76 38.1 0)
      (effects (font (size 1.27 1.27)) (justify left))
    )
    (property "Value" "0.1u" (at 111.76 40.64 0)
      (effects (font (size 1.27 1.27)) (justify left))
    )
    (property "Footprint" "Capacitor_SMD:C_0402_1005Metric_Pad0.74x0.62mm_HandSolder" (at 110.1852 43.18 0)
      (effects (font (size 1.27 1.27)) hide)
    )
    (property "Datasheet" "~" (at 109.22 39.37 0)
      (effects (font (size 1.27 1.27)) hide)
    )
    (pin "2" (uuid 86f7d2fe-6748-4cde-a1cf-0e8509d8ec4e))
    (pin "1" (uuid 6cb823ba-8723-465d-96c8-c024e0a90adf))
    (instances
      (project "Valves-BDC-IC"
        (path "/e7e61ffa-4e25-4fc5-9449-1d6f0a2e2f78/364b3751-8099-46b9-b309-21610ff38d80"
          (reference "C5") (unit 1)
        )
      )
    )
  )

  (symbol (lib_id "Device:C") (at 54.61 68.58 90) (unit 1)
    (in_bom yes) (on_board yes) (dnp no)
    (uuid 6f0f0462-e825-42bb-8939-45ce5ce621e3)
    (property "Reference" "C14" (at 54.61 64.77 90)
      (effects (font (size 1.27 1.27)))
    )
    (property "Value" "TBD" (at 54.61 72.39 90)
      (effects (font (size 1.27 1.27)))
    )
    (property "Footprint" "Capacitor_SMD:C_0603_1608Metric_Pad1.08x0.95mm_HandSolder" (at 58.42 67.6148 0)
      (effects (font (size 1.27 1.27)) hide)
    )
    (property "Datasheet" "~" (at 54.61 68.58 0)
      (effects (font (size 1.27 1.27)) hide)
    )
    (pin "2" (uuid ad050e6f-2c53-4ccc-8e13-6c6a733f7654))
    (pin "1" (uuid 9796d25b-5bae-4d99-a0ef-e3378ce45ed7))
    (instances
      (project "Valves-BDC-IC"
        (path "/e7e61ffa-4e25-4fc5-9449-1d6f0a2e2f78/364b3751-8099-46b9-b309-21610ff38d80"
          (reference "C14") (unit 1)
        )
      )
    )
  )

  (symbol (lib_id "Device:R") (at 44.45 68.58 90) (unit 1)
    (in_bom yes) (on_board yes) (dnp no)
    (uuid 79ec313e-1e99-444b-96a5-cd437685a82a)
    (property "Reference" "R17" (at 44.45 66.04 90)
      (effects (font (size 1.27 1.27)))
    )
    (property "Value" "TBD" (at 44.45 68.58 90)
      (effects (font (size 1.27 1.27)))
    )
    (property "Footprint" "Resistor_SMD:R_0603_1608Metric_Pad0.98x0.95mm_HandSolder" (at 44.45 70.358 90)
      (effects (font (size 1.27 1.27)) hide)
    )
    (property "Datasheet" "~" (at 44.45 68.58 0)
      (effects (font (size 1.27 1.27)) hide)
    )
    (pin "2" (uuid ddbc2a86-5651-4cb1-99ae-d72258266fd2))
    (pin "1" (uuid 1b45d0c1-524f-4965-a311-bbb25d80c88d))
    (instances
      (project "Valves-BDC-IC"
        (path "/e7e61ffa-4e25-4fc5-9449-1d6f0a2e2f78/364b3751-8099-46b9-b309-21610ff38d80"
          (reference "R17") (unit 1)
        )
      )
    )
  )

  (symbol (lib_id "power:GND") (at 77.47 86.36 90) (unit 1)
    (in_bom yes) (on_board yes) (dnp no)
    (uuid 7e8ce724-843b-46a0-824e-71b77fa51053)
    (property "Reference" "#PWR015" (at 83.82 86.36 0)
      (effects (font (size 1.27 1.27)) hide)
    )
    (property "Value" "GND" (at 80.01 86.36 90)
      (effects (font (size 1.27 1.27)) (justify right))
    )
    (property "Footprint" "" (at 77.47 86.36 0)
      (effects (font (size 1.27 1.27)) hide)
    )
    (property "Datasheet" "" (at 77.47 86.36 0)
      (effects (font (size 1.27 1.27)) hide)
    )
    (pin "1" (uuid f85966b3-3ff6-45c1-8e08-989c97ceb9e1))
    (instances
      (project "Valves-BDC-IC"
        (path "/e7e61ffa-4e25-4fc5-9449-1d6f0a2e2f78/364b3751-8099-46b9-b309-21610ff38d80"
          (reference "#PWR015") (unit 1)
        )
      )
    )
  )

  (symbol (lib_id "Valves-BDC-DRV:DRV8837DSGR") (at 74.93 44.45 0) (unit 1)
    (in_bom yes) (on_board yes) (dnp no) (fields_autoplaced)
    (uuid 87b31ac9-d1c6-4d3a-a42f-314b5d97330d)
    (property "Reference" "IC5" (at 90.17 36.83 0)
      (effects (font (size 1.27 1.27)))
    )
    (property "Value" "DRV8837DSGR" (at 90.17 39.37 0)
      (effects (font (size 1.27 1.27)))
    )
    (property "Footprint" "Valves-BDC-DRV:DRV8837DSGR" (at 101.6 139.37 0)
      (effects (font (size 1.27 1.27)) (justify left top) hide)
    )
    (property "Datasheet" "http://www.ti.com/lit/gpn/drv8837" (at 101.6 239.37 0)
      (effects (font (size 1.27 1.27)) (justify left top) hide)
    )
    (property "Height" "0.8" (at 101.6 439.37 0)
      (effects (font (size 1.27 1.27)) (justify left top) hide)
    )
    (property "Mouser Part Number" "595-DRV8837DSGR" (at 101.6 539.37 0)
      (effects (font (size 1.27 1.27)) (justify left top) hide)
    )
    (property "Mouser Price/Stock" "https://www.mouser.co.uk/ProductDetail/Texas-Instruments/DRV8837DSGR?qs=l6ZoeTYLMwO0pKIJ8222Ww%3D%3D" (at 101.6 639.37 0)
      (effects (font (size 1.27 1.27)) (justify left top) hide)
    )
    (property "Manufacturer_Name" "Texas Instruments" (at 101.6 739.37 0)
      (effects (font (size 1.27 1.27)) (justify left top) hide)
    )
    (property "Manufacturer_Part_Number" "DRV8837DSGR" (at 101.6 839.37 0)
      (effects (font (size 1.27 1.27)) (justify left top) hide)
    )
    (pin "3" (uuid c4021993-c2a8-47eb-b688-78965a3bd545))
    (pin "2" (uuid a9212abc-a022-4584-bff7-1b506c475e0c))
    (pin "9" (uuid 50689cab-de5f-45a6-be99-c9a70489e8b7))
    (pin "1" (uuid fdda6d88-06db-448a-bc52-9b970cb11c0d))
    (pin "6" (uuid 8c0aa097-09e5-4ca1-96c1-0d2667c4a4f5))
    (pin "7" (uuid 3a9af752-b1be-42ad-bd89-dc2ce212db31))
    (pin "5" (uuid bef22fd2-a6b1-4a7d-b37e-6ddf33c57675))
    (pin "8" (uuid 9bbc9c4a-f80a-470e-bbbf-33a9ab2ab3f4))
    (pin "4" (uuid 19119dee-7969-49b9-b23e-7ed4f111218d))
    (instances
      (project "Valves-BDC-IC"
        (path "/e7e61ffa-4e25-4fc5-9449-1d6f0a2e2f78/364b3751-8099-46b9-b309-21610ff38d80"
          (reference "IC5") (unit 1)
        )
      )
    )
  )

  (symbol (lib_id "power:+5V") (at 67.31 44.45 90) (unit 1)
    (in_bom yes) (on_board yes) (dnp no)
    (uuid 8a5c10f3-7eee-42c0-9fca-8dbe1ab235f8)
    (property "Reference" "#PWR018" (at 71.12 44.45 0)
      (effects (font (size 1.27 1.27)) hide)
    )
    (property "Value" "+5V" (at 64.77 44.45 90)
      (effects (font (size 1.27 1.27)) (justify left))
    )
    (property "Footprint" "" (at 67.31 44.45 0)
      (effects (font (size 1.27 1.27)) hide)
    )
    (property "Datasheet" "" (at 67.31 44.45 0)
      (effects (font (size 1.27 1.27)) hide)
    )
    (pin "1" (uuid 518b931b-cb54-49e6-ad7c-bc6f7bc4c9ca))
    (instances
      (project "Valves-BDC-IC"
        (path "/e7e61ffa-4e25-4fc5-9449-1d6f0a2e2f78/364b3751-8099-46b9-b309-21610ff38d80"
          (reference "#PWR018") (unit 1)
        )
      )
    )
  )

  (symbol (lib_id "Connector:Conn_01x04_Pin") (at 72.39 83.82 0) (unit 1)
    (in_bom yes) (on_board yes) (dnp no) (fields_autoplaced)
    (uuid a3427f3c-fa53-4818-9991-99dd9e4287c6)
    (property "Reference" "J3" (at 73.025 76.2 0)
      (effects (font (size 1.27 1.27)))
    )
    (property "Value" "Conn_01x04_Pin" (at 73.025 78.74 0)
      (effects (font (size 1.27 1.27)))
    )
    (property "Footprint" "Connector_PinHeader_2.54mm:PinHeader_1x04_P2.54mm_Horizontal" (at 72.39 83.82 0)
      (effects (font (size 1.27 1.27)) hide)
    )
    (property "Datasheet" "~" (at 72.39 83.82 0)
      (effects (font (size 1.27 1.27)) hide)
    )
    (pin "1" (uuid 6d76c52e-3607-4003-a2fa-00596f25cfe0))
    (pin "2" (uuid a0db72e7-cec9-472f-ac0b-5370c46c108f))
    (pin "3" (uuid da42758b-a573-4dac-aea8-ce1194967b69))
    (pin "4" (uuid 71a4e064-a3f4-48ab-badd-189866640850))
    (instances
      (project "Valves-BDC-IC"
        (path "/e7e61ffa-4e25-4fc5-9449-1d6f0a2e2f78/364b3751-8099-46b9-b309-21610ff38d80"
          (reference "J3") (unit 1)
        )
      )
    )
  )

  (symbol (lib_id "Device:C") (at 71.12 39.37 0) (unit 1)
    (in_bom yes) (on_board yes) (dnp no)
    (uuid b0547448-41b5-4655-975e-a8d26f7e2ae4)
    (property "Reference" "C4" (at 73.66 38.1 0)
      (effects (font (size 1.27 1.27)) (justify left))
    )
    (property "Value" "0.1u" (at 73.66 40.64 0)
      (effects (font (size 1.27 1.27)) (justify left))
    )
    (property "Footprint" "Capacitor_SMD:C_0402_1005Metric_Pad0.74x0.62mm_HandSolder" (at 72.0852 43.18 0)
      (effects (font (size 1.27 1.27)) hide)
    )
    (property "Datasheet" "~" (at 71.12 39.37 0)
      (effects (font (size 1.27 1.27)) hide)
    )
    (pin "2" (uuid 11ddb49f-298b-41b4-a346-8fb5366f4e13))
    (pin "1" (uuid d9384b30-50f3-4e61-8fde-6eed32e0be2e))
    (instances
      (project "Valves-BDC-IC"
        (path "/e7e61ffa-4e25-4fc5-9449-1d6f0a2e2f78/364b3751-8099-46b9-b309-21610ff38d80"
          (reference "C4") (unit 1)
        )
      )
    )
  )

  (symbol (lib_id "power:+3.3V") (at 113.03 44.45 270) (unit 1)
    (in_bom yes) (on_board yes) (dnp no)
    (uuid b6194ccd-be6e-4d07-8ce6-4eb5e9ca0c23)
    (property "Reference" "#PWR021" (at 109.22 44.45 0)
      (effects (font (size 1.27 1.27)) hide)
    )
    (property "Value" "+3.3V" (at 115.57 44.45 90)
      (effects (font (size 1.27 1.27)) (justify left))
    )
    (property "Footprint" "" (at 113.03 44.45 0)
      (effects (font (size 1.27 1.27)) hide)
    )
    (property "Datasheet" "" (at 113.03 44.45 0)
      (effects (font (size 1.27 1.27)) hide)
    )
    (pin "1" (uuid 7bc04c3b-9c5d-48a0-9bc3-1435e48c73ea))
    (instances
      (project "Valves-BDC-IC"
        (path "/e7e61ffa-4e25-4fc5-9449-1d6f0a2e2f78/364b3751-8099-46b9-b309-21610ff38d80"
          (reference "#PWR021") (unit 1)
        )
      )
    )
  )

  (symbol (lib_id "Connector:Conn_01x02_Pin") (at 96.52 83.82 0) (unit 1)
    (in_bom yes) (on_board yes) (dnp no) (fields_autoplaced)
    (uuid c0632c39-882e-4530-ac22-e881fe2ed3b6)
    (property "Reference" "J6" (at 97.155 78.74 0)
      (effects (font (size 1.27 1.27)))
    )
    (property "Value" "Conn_01x02_Pin" (at 97.155 81.28 0)
      (effects (font (size 1.27 1.27)))
    )
    (property "Footprint" "Valves-BDC-DRV:valves_mounting_holes" (at 96.52 83.82 0)
      (effects (font (size 1.27 1.27)) hide)
    )
    (property "Datasheet" "~" (at 96.52 83.82 0)
      (effects (font (size 1.27 1.27)) hide)
    )
    (pin "1" (uuid 4b7440be-c8a9-40cb-ae83-e1a91d6caba6))
    (pin "2" (uuid 20d93d1e-b11e-416d-8ebf-141c6249c0a6))
    (instances
      (project "Valves-BDC-IC"
        (path "/e7e61ffa-4e25-4fc5-9449-1d6f0a2e2f78/364b3751-8099-46b9-b309-21610ff38d80"
          (reference "J6") (unit 1)
        )
      )
    )
  )

  (symbol (lib_id "power:GND") (at 71.12 35.56 180) (unit 1)
    (in_bom yes) (on_board yes) (dnp no)
    (uuid caa2b070-59f3-46b7-a405-35be4170c1f8)
    (property "Reference" "#PWR019" (at 71.12 29.21 0)
      (effects (font (size 1.27 1.27)) hide)
    )
    (property "Value" "GND" (at 71.12 31.75 0)
      (effects (font (size 1.27 1.27)))
    )
    (property "Footprint" "" (at 71.12 35.56 0)
      (effects (font (size 1.27 1.27)) hide)
    )
    (property "Datasheet" "" (at 71.12 35.56 0)
      (effects (font (size 1.27 1.27)) hide)
    )
    (pin "1" (uuid d8b2d029-a7d1-4aaa-a2a2-e26845cef472))
    (instances
      (project "Valves-BDC-IC"
        (path "/e7e61ffa-4e25-4fc5-9449-1d6f0a2e2f78/364b3751-8099-46b9-b309-21610ff38d80"
          (reference "#PWR019") (unit 1)
        )
      )
    )
  )

  (symbol (lib_id "power:GND") (at 90.17 64.77 0) (unit 1)
    (in_bom yes) (on_board yes) (dnp no)
    (uuid dcb5a1d4-c781-4f22-aa91-24885d309cff)
    (property "Reference" "#PWR016" (at 90.17 71.12 0)
      (effects (font (size 1.27 1.27)) hide)
    )
    (property "Value" "GND" (at 90.17 68.58 0)
      (effects (font (size 1.27 1.27)))
    )
    (property "Footprint" "" (at 90.17 64.77 0)
      (effects (font (size 1.27 1.27)) hide)
    )
    (property "Datasheet" "" (at 90.17 64.77 0)
      (effects (font (size 1.27 1.27)) hide)
    )
    (pin "1" (uuid 964e49e1-1ac3-43e6-875f-31dd5e63d076))
    (instances
      (project "Valves-BDC-IC"
        (path "/e7e61ffa-4e25-4fc5-9449-1d6f0a2e2f78/364b3751-8099-46b9-b309-21610ff38d80"
          (reference "#PWR016") (unit 1)
        )
      )
    )
  )

  (symbol (lib_id "power:GND") (at 109.22 35.56 180) (unit 1)
    (in_bom yes) (on_board yes) (dnp no)
    (uuid fce3615f-b16d-4382-a5ce-35ce0afc1ffb)
    (property "Reference" "#PWR020" (at 109.22 29.21 0)
      (effects (font (size 1.27 1.27)) hide)
    )
    (property "Value" "GND" (at 109.22 31.75 0)
      (effects (font (size 1.27 1.27)))
    )
    (property "Footprint" "" (at 109.22 35.56 0)
      (effects (font (size 1.27 1.27)) hide)
    )
    (property "Datasheet" "" (at 109.22 35.56 0)
      (effects (font (size 1.27 1.27)) hide)
    )
    (pin "1" (uuid 52a885d2-eb77-432d-81ef-a15a8a36f2be))
    (instances
      (project "Valves-BDC-IC"
        (path "/e7e61ffa-4e25-4fc5-9449-1d6f0a2e2f78/364b3751-8099-46b9-b309-21610ff38d80"
          (reference "#PWR020") (unit 1)
        )
      )
    )
  )
)
