(footprint "SOTFL65P210X105-3N" (version 20221018) (generator pcbnew)
  (layer "F.Cu")
  (descr "UMT3F")
  (tags "MOSFET (N-Channel)")
  (attr smd)
  (fp_text reference "Q**" (at 0 0) (layer "F.SilkS")
      (effects (font (size 1.27 1.27) (thickness 0.254)))
    (tstamp cf7a8482-6e0f-43ae-84fa-a3ab5d60941d)
  )
  (fp_text value "SOTFL65P210X105-3N" (at 0 0) (layer "F.SilkS") hide
      (effects (font (size 1.27 1.27) (thickness 0.254)))
    (tstamp 0d2053fa-b5f6-4e89-88bf-3017babd1edb)
  )
  (fp_text user "${REFERENCE}" (at 0 0) (layer "F.Fab")
      (effects (font (size 1.27 1.27) (thickness 0.254)))
    (tstamp 5cc59485-e3d4-4adf-ab3a-b655b091b5af)
  )
  (fp_line (start -1.32 -1.17) (end -0.625 -1.17)
    (stroke (width 0.2) (type solid)) (layer "F.SilkS") (tstamp 353fa68a-2b86-4f25-8808-28956849f3fb))
  (fp_line (start -0.275 -1) (end 0.275 -1)
    (stroke (width 0.2) (type solid)) (layer "F.SilkS") (tstamp 1bca486a-7087-4bb7-a119-26e5e251328a))
  (fp_line (start -0.275 1) (end -0.275 -1)
    (stroke (width 0.2) (type solid)) (layer "F.SilkS") (tstamp 71a97328-d2e5-421e-a928-43582c3e58b4))
  (fp_line (start 0.275 -1) (end 0.275 1)
    (stroke (width 0.2) (type solid)) (layer "F.SilkS") (tstamp fe42c77b-af6d-472a-94ac-b00ee9be720b))
  (fp_line (start 0.275 1) (end -0.275 1)
    (stroke (width 0.2) (type solid)) (layer "F.SilkS") (tstamp c173377c-95c2-4d35-8480-5a422151120b))
  (fp_line (start -1.47 -1.2) (end 1.47 -1.2)
    (stroke (width 0.05) (type solid)) (layer "F.CrtYd") (tstamp c5fb9c7a-5749-421e-a2b1-79ed9117ce61))
  (fp_line (start -1.47 1.2) (end -1.47 -1.2)
    (stroke (width 0.05) (type solid)) (layer "F.CrtYd") (tstamp 907469cf-ec47-464e-b72c-a07034d15711))
  (fp_line (start 1.47 -1.2) (end 1.47 1.2)
    (stroke (width 0.05) (type solid)) (layer "F.CrtYd") (tstamp d71e254c-4dc0-4df4-b759-bdc93c83a1e7))
  (fp_line (start 1.47 1.2) (end -1.47 1.2)
    (stroke (width 0.05) (type solid)) (layer "F.CrtYd") (tstamp 793eb3ec-9b72-493e-8255-66a3f5c14935))
  (fp_line (start -0.625 -1) (end 0.625 -1)
    (stroke (width 0.1) (type solid)) (layer "F.Fab") (tstamp 5a964a52-a850-4310-ad7f-0457686e909a))
  (fp_line (start -0.625 -0.35) (end 0.025 -1)
    (stroke (width 0.1) (type solid)) (layer "F.Fab") (tstamp fc77a62b-f9a8-4211-a7b1-a74a618bd39f))
  (fp_line (start -0.625 1) (end -0.625 -1)
    (stroke (width 0.1) (type solid)) (layer "F.Fab") (tstamp 4d640a85-dd11-4b31-91cb-5e390bddc0d1))
  (fp_line (start 0.625 -1) (end 0.625 1)
    (stroke (width 0.1) (type solid)) (layer "F.Fab") (tstamp bd2051a4-15c7-46ab-8ea7-2fde15aee0c9))
  (fp_line (start 0.625 1) (end -0.625 1)
    (stroke (width 0.1) (type solid)) (layer "F.Fab") (tstamp e768de16-acf6-45cf-9801-88c42d902a51))
  (pad "1" smd rect (at -0.972 -0.65 90) (size 0.54 0.695) (layers "F.Cu" "F.Paste" "F.Mask") (tstamp 75c033e2-0679-4da7-a72b-64d60e57cbe8))
  (pad "2" smd rect (at -0.972 0.65 90) (size 0.54 0.695) (layers "F.Cu" "F.Paste" "F.Mask") (tstamp 91a4e1a8-1495-4420-a74e-d6721a3c92ed))
  (pad "3" smd rect (at 0.972 0 90) (size 0.54 0.695) (layers "F.Cu" "F.Paste" "F.Mask") (tstamp 11cf54a3-4da3-4de5-a3c2-ea1907d1d226))
  (model "${KIPRJMOD}/3D/RU1J002YNTCL.stp"
    (offset (xyz 0 0 0))
    (scale (xyz 1 1 1))
    (rotate (xyz 0 0 0))
  )
)
