(kicad_sch (version 20230121) (generator eeschema)

  (uuid e7e61ffa-4e25-4fc5-9449-1d6f0a2e2f78)

  (paper "A5")

  (lib_symbols
    (symbol "Connector_Generic:Conn_02x03_Odd_Even" (pin_names (offset 1.016) hide) (in_bom yes) (on_board yes)
      (property "Reference" "J" (at 1.27 5.08 0)
        (effects (font (size 1.27 1.27)))
      )
      (property "Value" "Conn_02x03_Odd_Even" (at 1.27 -5.08 0)
        (effects (font (size 1.27 1.27)))
      )
      (property "Footprint" "" (at 0 0 0)
        (effects (font (size 1.27 1.27)) hide)
      )
      (property "Datasheet" "~" (at 0 0 0)
        (effects (font (size 1.27 1.27)) hide)
      )
      (property "ki_keywords" "connector" (at 0 0 0)
        (effects (font (size 1.27 1.27)) hide)
      )
      (property "ki_description" "Generic connector, double row, 02x03, odd/even pin numbering scheme (row 1 odd numbers, row 2 even numbers), script generated (kicad-library-utils/schlib/autogen/connector/)" (at 0 0 0)
        (effects (font (size 1.27 1.27)) hide)
      )
      (property "ki_fp_filters" "Connector*:*_2x??_*" (at 0 0 0)
        (effects (font (size 1.27 1.27)) hide)
      )
      (symbol "Conn_02x03_Odd_Even_1_1"
        (rectangle (start -1.27 -2.413) (end 0 -2.667)
          (stroke (width 0.1524) (type default))
          (fill (type none))
        )
        (rectangle (start -1.27 0.127) (end 0 -0.127)
          (stroke (width 0.1524) (type default))
          (fill (type none))
        )
        (rectangle (start -1.27 2.667) (end 0 2.413)
          (stroke (width 0.1524) (type default))
          (fill (type none))
        )
        (rectangle (start -1.27 3.81) (end 3.81 -3.81)
          (stroke (width 0.254) (type default))
          (fill (type background))
        )
        (rectangle (start 3.81 -2.413) (end 2.54 -2.667)
          (stroke (width 0.1524) (type default))
          (fill (type none))
        )
        (rectangle (start 3.81 0.127) (end 2.54 -0.127)
          (stroke (width 0.1524) (type default))
          (fill (type none))
        )
        (rectangle (start 3.81 2.667) (end 2.54 2.413)
          (stroke (width 0.1524) (type default))
          (fill (type none))
        )
        (pin passive line (at -5.08 2.54 0) (length 3.81)
          (name "Pin_1" (effects (font (size 1.27 1.27))))
          (number "1" (effects (font (size 1.27 1.27))))
        )
        (pin passive line (at 7.62 2.54 180) (length 3.81)
          (name "Pin_2" (effects (font (size 1.27 1.27))))
          (number "2" (effects (font (size 1.27 1.27))))
        )
        (pin passive line (at -5.08 0 0) (length 3.81)
          (name "Pin_3" (effects (font (size 1.27 1.27))))
          (number "3" (effects (font (size 1.27 1.27))))
        )
        (pin passive line (at 7.62 0 180) (length 3.81)
          (name "Pin_4" (effects (font (size 1.27 1.27))))
          (number "4" (effects (font (size 1.27 1.27))))
        )
        (pin passive line (at -5.08 -2.54 0) (length 3.81)
          (name "Pin_5" (effects (font (size 1.27 1.27))))
          (number "5" (effects (font (size 1.27 1.27))))
        )
        (pin passive line (at 7.62 -2.54 180) (length 3.81)
          (name "Pin_6" (effects (font (size 1.27 1.27))))
          (number "6" (effects (font (size 1.27 1.27))))
        )
      )
    )
    (symbol "power:+3.3V" (power) (pin_names (offset 0)) (in_bom yes) (on_board yes)
      (property "Reference" "#PWR" (at 0 -3.81 0)
        (effects (font (size 1.27 1.27)) hide)
      )
      (property "Value" "+3.3V" (at 0 3.556 0)
        (effects (font (size 1.27 1.27)))
      )
      (property "Footprint" "" (at 0 0 0)
        (effects (font (size 1.27 1.27)) hide)
      )
      (property "Datasheet" "" (at 0 0 0)
        (effects (font (size 1.27 1.27)) hide)
      )
      (property "ki_keywords" "global power" (at 0 0 0)
        (effects (font (size 1.27 1.27)) hide)
      )
      (property "ki_description" "Power symbol creates a global label with name \"+3.3V\"" (at 0 0 0)
        (effects (font (size 1.27 1.27)) hide)
      )
      (symbol "+3.3V_0_1"
        (polyline
          (pts
            (xy -0.762 1.27)
            (xy 0 2.54)
          )
          (stroke (width 0) (type default))
          (fill (type none))
        )
        (polyline
          (pts
            (xy 0 0)
            (xy 0 2.54)
          )
          (stroke (width 0) (type default))
          (fill (type none))
        )
        (polyline
          (pts
            (xy 0 2.54)
            (xy 0.762 1.27)
          )
          (stroke (width 0) (type default))
          (fill (type none))
        )
      )
      (symbol "+3.3V_1_1"
        (pin power_in line (at 0 0 90) (length 0) hide
          (name "+3.3V" (effects (font (size 1.27 1.27))))
          (number "1" (effects (font (size 1.27 1.27))))
        )
      )
    )
    (symbol "power:+5V" (power) (pin_names (offset 0)) (in_bom yes) (on_board yes)
      (property "Reference" "#PWR" (at 0 -3.81 0)
        (effects (font (size 1.27 1.27)) hide)
      )
      (property "Value" "+5V" (at 0 3.556 0)
        (effects (font (size 1.27 1.27)))
      )
      (property "Footprint" "" (at 0 0 0)
        (effects (font (size 1.27 1.27)) hide)
      )
      (property "Datasheet" "" (at 0 0 0)
        (effects (font (size 1.27 1.27)) hide)
      )
      (property "ki_keywords" "global power" (at 0 0 0)
        (effects (font (size 1.27 1.27)) hide)
      )
      (property "ki_description" "Power symbol creates a global label with name \"+5V\"" (at 0 0 0)
        (effects (font (size 1.27 1.27)) hide)
      )
      (symbol "+5V_0_1"
        (polyline
          (pts
            (xy -0.762 1.27)
            (xy 0 2.54)
          )
          (stroke (width 0) (type default))
          (fill (type none))
        )
        (polyline
          (pts
            (xy 0 0)
            (xy 0 2.54)
          )
          (stroke (width 0) (type default))
          (fill (type none))
        )
        (polyline
          (pts
            (xy 0 2.54)
            (xy 0.762 1.27)
          )
          (stroke (width 0) (type default))
          (fill (type none))
        )
      )
      (symbol "+5V_1_1"
        (pin power_in line (at 0 0 90) (length 0) hide
          (name "+5V" (effects (font (size 1.27 1.27))))
          (number "1" (effects (font (size 1.27 1.27))))
        )
      )
    )
    (symbol "power:GND" (power) (pin_names (offset 0)) (in_bom yes) (on_board yes)
      (property "Reference" "#PWR" (at 0 -6.35 0)
        (effects (font (size 1.27 1.27)) hide)
      )
      (property "Value" "GND" (at 0 -3.81 0)
        (effects (font (size 1.27 1.27)))
      )
      (property "Footprint" "" (at 0 0 0)
        (effects (font (size 1.27 1.27)) hide)
      )
      (property "Datasheet" "" (at 0 0 0)
        (effects (font (size 1.27 1.27)) hide)
      )
      (property "ki_keywords" "global power" (at 0 0 0)
        (effects (font (size 1.27 1.27)) hide)
      )
      (property "ki_description" "Power symbol creates a global label with name \"GND\" , ground" (at 0 0 0)
        (effects (font (size 1.27 1.27)) hide)
      )
      (symbol "GND_0_1"
        (polyline
          (pts
            (xy 0 0)
            (xy 0 -1.27)
            (xy 1.27 -1.27)
            (xy 0 -2.54)
            (xy -1.27 -1.27)
            (xy 0 -1.27)
          )
          (stroke (width 0) (type default))
          (fill (type none))
        )
      )
      (symbol "GND_1_1"
        (pin power_in line (at 0 0 270) (length 0) hide
          (name "GND" (effects (font (size 1.27 1.27))))
          (number "1" (effects (font (size 1.27 1.27))))
        )
      )
    )
    (symbol "power:PWR_FLAG" (power) (pin_numbers hide) (pin_names (offset 0) hide) (in_bom yes) (on_board yes)
      (property "Reference" "#FLG" (at 0 1.905 0)
        (effects (font (size 1.27 1.27)) hide)
      )
      (property "Value" "PWR_FLAG" (at 0 3.81 0)
        (effects (font (size 1.27 1.27)))
      )
      (property "Footprint" "" (at 0 0 0)
        (effects (font (size 1.27 1.27)) hide)
      )
      (property "Datasheet" "~" (at 0 0 0)
        (effects (font (size 1.27 1.27)) hide)
      )
      (property "ki_keywords" "flag power" (at 0 0 0)
        (effects (font (size 1.27 1.27)) hide)
      )
      (property "ki_description" "Special symbol for telling ERC where power comes from" (at 0 0 0)
        (effects (font (size 1.27 1.27)) hide)
      )
      (symbol "PWR_FLAG_0_0"
        (pin power_out line (at 0 0 90) (length 0)
          (name "pwr" (effects (font (size 1.27 1.27))))
          (number "1" (effects (font (size 1.27 1.27))))
        )
      )
      (symbol "PWR_FLAG_0_1"
        (polyline
          (pts
            (xy 0 0)
            (xy 0 1.27)
            (xy -1.016 1.905)
            (xy 0 2.54)
            (xy 1.016 1.905)
            (xy 0 1.27)
          )
          (stroke (width 0) (type default))
          (fill (type none))
        )
      )
    )
  )


  (no_connect (at 193.04 30.48) (uuid 004d0ac3-0121-4fe4-8191-54902a044bea))
  (no_connect (at 193.04 22.86) (uuid 08752779-a013-426e-928e-4b0167847d58))
  (no_connect (at 49.53 109.22) (uuid 133c1b95-4e14-4989-94a3-a17fc032f539))
  (no_connect (at 107.95 36.83) (uuid 1595f752-6d46-4b15-bc93-ddeaf980390a))
  (no_connect (at 132.08 25.4) (uuid 187e2e78-4bf8-466b-94d2-af7bff02728a))
  (no_connect (at 132.08 30.48) (uuid 1de8ea16-46c4-4274-8bfb-85bb8765d777))
  (no_connect (at 49.53 66.04) (uuid 22a851c4-ceff-481a-81c9-f5b69583f4d7))
  (no_connect (at 107.95 39.37) (uuid 25b3a174-4d0a-4949-ad02-88873dda4fe3))
  (no_connect (at 49.53 33.02) (uuid 2ff21f38-5b87-4336-a673-6e37b05f7829))
  (no_connect (at 49.53 35.56) (uuid 3580d5cc-2524-442c-ad84-1ac413821e69))
  (no_connect (at 107.95 24.13) (uuid 3ae39acb-6802-4465-a377-c650bc41b97a))
  (no_connect (at 107.95 66.04) (uuid 3ef9afa6-5839-4d55-aa66-00ac079276eb))
  (no_connect (at 49.53 120.65) (uuid 4d0aad24-9487-4e4a-98ab-7656943077c0))
  (no_connect (at 49.53 81.28) (uuid 4d9e8718-c6fc-44bf-bbca-82816d032e3b))
  (no_connect (at 132.08 38.1) (uuid 6322609f-c687-4fe7-b828-1df95f33589e))
  (no_connect (at 193.04 27.94) (uuid 6a575f19-db61-4ed8-b1d3-47f35ed8443f))
  (no_connect (at 49.53 106.68) (uuid 723792d5-c152-4464-a7f9-522dcb03bb44))
  (no_connect (at 132.08 40.64) (uuid 77d6bc2d-f256-4cd5-a16f-fe57a8a81761))
  (no_connect (at 107.95 26.67) (uuid 82bc1f7a-470e-4c52-91f3-3d7232ead328))
  (no_connect (at 49.53 123.19) (uuid 9033dea7-f0dc-4e27-9c0e-2440ee5ce111))
  (no_connect (at 193.04 38.1) (uuid 91a0746a-03c2-46ac-bd2b-0fb0f8c779b2))
  (no_connect (at 49.53 27.94) (uuid 928f6040-1e4f-4dd3-9fcb-dcc8943fc096))
  (no_connect (at 132.08 27.94) (uuid 9be0446c-58f0-432b-b128-03153cbeb639))
  (no_connect (at 132.08 22.86) (uuid b87a7da6-dbb8-4770-a114-f3c589ad28fa))
  (no_connect (at 107.95 68.58) (uuid cb2e6315-d5c8-4165-b63b-e7ff9c17c9b7))
  (no_connect (at 49.53 25.4) (uuid dcd7e85a-f9ed-48e1-8690-2e7faa3eb44e))
  (no_connect (at 107.95 78.74) (uuid e04a8adb-e7f8-406e-93c3-0cd6eb034dc6))
  (no_connect (at 193.04 40.64) (uuid e90268b1-29f6-4f25-9aa0-30c65b370703))
  (no_connect (at 49.53 114.3) (uuid e9cd450e-b27b-4b03-ab51-c11162e51b8a))
  (no_connect (at 107.95 76.2) (uuid eb127d3e-37a0-4455-90f5-2eec4781befc))
  (no_connect (at 49.53 78.74) (uuid edc130cd-c07a-412f-a4c0-9e0beb455e38))
  (no_connect (at 193.04 25.4) (uuid fa89f2d7-0d81-419f-a050-be99b2921985))
  (no_connect (at 49.53 68.58) (uuid ff016e8c-f9a9-4d64-a9ba-53f7faf4afda))
  (no_connect (at 49.53 73.66) (uuid ff5a8859-9461-4086-b11d-d54910d72deb))

  (wire (pts (xy 163.83 72.39) (xy 163.83 74.93))
    (stroke (width 0) (type default))
    (uuid 19eb04ec-de9f-418f-90b2-0494c88bac12)
  )
  (wire (pts (xy 175.26 72.39) (xy 175.26 74.93))
    (stroke (width 0) (type default))
    (uuid 9b02d593-f538-4385-bb79-999b20529515)
  )
  (wire (pts (xy 152.4 72.39) (xy 152.4 74.93))
    (stroke (width 0) (type default))
    (uuid abd35893-83f5-4ac3-9a16-d7099582b87a)
  )

  (text "PWR Flags" (at 158.75 86.36 0)
    (effects (font (size 1.27 1.27)) (justify left bottom))
    (uuid 5a8f8ce7-8e31-4886-a34a-0598d1f2f7da)
  )

  (symbol (lib_id "power:+5V") (at 124.46 91.44 90) (unit 1)
    (in_bom yes) (on_board yes) (dnp no) (fields_autoplaced)
    (uuid 0b3dd8f0-d681-48da-a2b1-d1311d890327)
    (property "Reference" "#PWR057" (at 128.27 91.44 0)
      (effects (font (size 1.27 1.27)) hide)
    )
    (property "Value" "+5V" (at 120.65 91.44 90)
      (effects (font (size 1.27 1.27)) (justify left))
    )
    (property "Footprint" "" (at 124.46 91.44 0)
      (effects (font (size 1.27 1.27)) hide)
    )
    (property "Datasheet" "" (at 124.46 91.44 0)
      (effects (font (size 1.27 1.27)) hide)
    )
    (pin "1" (uuid 18f434a8-34b4-46dd-b587-3eaa2f60d66b))
    (instances
      (project "Valves-BDC-IC"
        (path "/e7e61ffa-4e25-4fc5-9449-1d6f0a2e2f78"
          (reference "#PWR057") (unit 1)
        )
      )
    )
  )

  (symbol (lib_id "power:GND") (at 137.16 91.44 90) (unit 1)
    (in_bom yes) (on_board yes) (dnp no) (fields_autoplaced)
    (uuid 1e67aea4-6c5e-44a5-8a45-57c416c102a4)
    (property "Reference" "#PWR061" (at 143.51 91.44 0)
      (effects (font (size 1.27 1.27)) hide)
    )
    (property "Value" "GND" (at 140.97 91.44 90)
      (effects (font (size 1.27 1.27)) (justify right))
    )
    (property "Footprint" "" (at 137.16 91.44 0)
      (effects (font (size 1.27 1.27)) hide)
    )
    (property "Datasheet" "" (at 137.16 91.44 0)
      (effects (font (size 1.27 1.27)) hide)
    )
    (pin "1" (uuid 824f538f-3f4d-4d82-ac59-7c5102bffdf2))
    (instances
      (project "Valves-BDC-IC"
        (path "/e7e61ffa-4e25-4fc5-9449-1d6f0a2e2f78"
          (reference "#PWR061") (unit 1)
        )
      )
    )
  )

  (symbol (lib_id "power:GND") (at 137.16 93.98 90) (unit 1)
    (in_bom yes) (on_board yes) (dnp no) (fields_autoplaced)
    (uuid 4f30496b-93fd-4d22-802a-8097a0029a18)
    (property "Reference" "#PWR062" (at 143.51 93.98 0)
      (effects (font (size 1.27 1.27)) hide)
    )
    (property "Value" "GND" (at 140.97 93.98 90)
      (effects (font (size 1.27 1.27)) (justify right))
    )
    (property "Footprint" "" (at 137.16 93.98 0)
      (effects (font (size 1.27 1.27)) hide)
    )
    (property "Datasheet" "" (at 137.16 93.98 0)
      (effects (font (size 1.27 1.27)) hide)
    )
    (pin "1" (uuid febb1451-02cf-4a23-bc7b-3f9aa8366cc9))
    (instances
      (project "Valves-BDC-IC"
        (path "/e7e61ffa-4e25-4fc5-9449-1d6f0a2e2f78"
          (reference "#PWR062") (unit 1)
        )
      )
    )
  )

  (symbol (lib_id "power:GND") (at 175.26 72.39 180) (unit 1)
    (in_bom yes) (on_board yes) (dnp no) (fields_autoplaced)
    (uuid 5c5e1d63-ae71-4cde-b714-bc1717bfc8e7)
    (property "Reference" "#PWR02" (at 175.26 66.04 0)
      (effects (font (size 1.27 1.27)) hide)
    )
    (property "Value" "GND" (at 175.26 67.31 0)
      (effects (font (size 1.27 1.27)))
    )
    (property "Footprint" "" (at 175.26 72.39 0)
      (effects (font (size 1.27 1.27)) hide)
    )
    (property "Datasheet" "" (at 175.26 72.39 0)
      (effects (font (size 1.27 1.27)) hide)
    )
    (pin "1" (uuid 66071c56-9217-4199-ac5f-c9d710ae1128))
    (instances
      (project "Valves-BDC-IC"
        (path "/e7e61ffa-4e25-4fc5-9449-1d6f0a2e2f78"
          (reference "#PWR02") (unit 1)
        )
      )
    )
  )

  (symbol (lib_id "power:PWR_FLAG") (at 163.83 74.93 180) (unit 1)
    (in_bom yes) (on_board yes) (dnp no) (fields_autoplaced)
    (uuid 5e1a1d0b-f4a2-4ecd-a933-372d4d3fbf0d)
    (property "Reference" "#FLG02" (at 163.83 76.835 0)
      (effects (font (size 1.27 1.27)) hide)
    )
    (property "Value" "PWR_FLAG" (at 163.83 80.01 0)
      (effects (font (size 1.27 1.27)))
    )
    (property "Footprint" "" (at 163.83 74.93 0)
      (effects (font (size 1.27 1.27)) hide)
    )
    (property "Datasheet" "~" (at 163.83 74.93 0)
      (effects (font (size 1.27 1.27)) hide)
    )
    (pin "1" (uuid ac3b2066-f1cb-418f-a134-87d21d4d0eea))
    (instances
      (project "Valves-BDC-IC"
        (path "/e7e61ffa-4e25-4fc5-9449-1d6f0a2e2f78"
          (reference "#FLG02") (unit 1)
        )
      )
    )
  )

  (symbol (lib_id "power:+5V") (at 163.83 72.39 0) (unit 1)
    (in_bom yes) (on_board yes) (dnp no) (fields_autoplaced)
    (uuid 5e5ca29a-c101-4067-a08e-9eb770bf0ae4)
    (property "Reference" "#PWR03" (at 163.83 76.2 0)
      (effects (font (size 1.27 1.27)) hide)
    )
    (property "Value" "+5V" (at 163.83 67.31 0)
      (effects (font (size 1.27 1.27)))
    )
    (property "Footprint" "" (at 163.83 72.39 0)
      (effects (font (size 1.27 1.27)) hide)
    )
    (property "Datasheet" "" (at 163.83 72.39 0)
      (effects (font (size 1.27 1.27)) hide)
    )
    (pin "1" (uuid bc75070f-1c32-43b0-abb9-5d9a5c03fe66))
    (instances
      (project "Valves-BDC-IC"
        (path "/e7e61ffa-4e25-4fc5-9449-1d6f0a2e2f78"
          (reference "#PWR03") (unit 1)
        )
      )
    )
  )

  (symbol (lib_id "power:+5V") (at 124.46 88.9 90) (unit 1)
    (in_bom yes) (on_board yes) (dnp no) (fields_autoplaced)
    (uuid 94df8f89-0a14-4e7f-ac73-b40a0e7c0a63)
    (property "Reference" "#PWR056" (at 128.27 88.9 0)
      (effects (font (size 1.27 1.27)) hide)
    )
    (property "Value" "+5V" (at 120.65 88.9 90)
      (effects (font (size 1.27 1.27)) (justify left))
    )
    (property "Footprint" "" (at 124.46 88.9 0)
      (effects (font (size 1.27 1.27)) hide)
    )
    (property "Datasheet" "" (at 124.46 88.9 0)
      (effects (font (size 1.27 1.27)) hide)
    )
    (pin "1" (uuid c18e7c5e-f3e8-471f-9279-04cb66d68afc))
    (instances
      (project "Valves-BDC-IC"
        (path "/e7e61ffa-4e25-4fc5-9449-1d6f0a2e2f78"
          (reference "#PWR056") (unit 1)
        )
      )
    )
  )

  (symbol (lib_id "Connector_Generic:Conn_02x03_Odd_Even") (at 129.54 91.44 0) (unit 1)
    (in_bom yes) (on_board yes) (dnp no) (fields_autoplaced)
    (uuid 96ab94d0-0a1b-4316-8cde-6a32181c67a0)
    (property "Reference" "J16" (at 130.81 82.55 0)
      (effects (font (size 1.27 1.27)))
    )
    (property "Value" "Conn_02x03_Odd_Even" (at 130.81 85.09 0)
      (effects (font (size 1.27 1.27)))
    )
    (property "Footprint" "Connector_PinHeader_2.54mm:PinHeader_2x03_P2.54mm_Horizontal" (at 129.54 91.44 0)
      (effects (font (size 1.27 1.27)) hide)
    )
    (property "Datasheet" "~" (at 129.54 91.44 0)
      (effects (font (size 1.27 1.27)) hide)
    )
    (pin "6" (uuid f684e52b-1d85-4095-9903-035a271e7878))
    (pin "4" (uuid 06a933e9-0304-4fb8-809b-197e27144590))
    (pin "3" (uuid c5a886a4-8582-4b7b-8a22-885e3b02adc6))
    (pin "2" (uuid 30b45b59-f479-4275-8950-2ecdaf7a5b39))
    (pin "1" (uuid 8724d91f-edd6-4fe8-a197-6ebef4b54a05))
    (pin "5" (uuid bf61876d-b8c5-4f68-9c88-a6f92714000d))
    (instances
      (project "Valves-BDC-IC"
        (path "/e7e61ffa-4e25-4fc5-9449-1d6f0a2e2f78"
          (reference "J16") (unit 1)
        )
      )
    )
  )

  (symbol (lib_id "power:GND") (at 137.16 88.9 90) (unit 1)
    (in_bom yes) (on_board yes) (dnp no) (fields_autoplaced)
    (uuid aa576db5-15ac-4f0f-8c0d-8470aff2f3b4)
    (property "Reference" "#PWR060" (at 143.51 88.9 0)
      (effects (font (size 1.27 1.27)) hide)
    )
    (property "Value" "GND" (at 140.97 88.9 90)
      (effects (font (size 1.27 1.27)) (justify right))
    )
    (property "Footprint" "" (at 137.16 88.9 0)
      (effects (font (size 1.27 1.27)) hide)
    )
    (property "Datasheet" "" (at 137.16 88.9 0)
      (effects (font (size 1.27 1.27)) hide)
    )
    (pin "1" (uuid 4ac59cd9-e101-428e-8dd1-96ab8492d754))
    (instances
      (project "Valves-BDC-IC"
        (path "/e7e61ffa-4e25-4fc5-9449-1d6f0a2e2f78"
          (reference "#PWR060") (unit 1)
        )
      )
    )
  )

  (symbol (lib_id "power:+3.3V") (at 124.46 93.98 90) (unit 1)
    (in_bom yes) (on_board yes) (dnp no) (fields_autoplaced)
    (uuid ad434ceb-eb5c-4ea1-8c02-dc06f929600a)
    (property "Reference" "#PWR058" (at 128.27 93.98 0)
      (effects (font (size 1.27 1.27)) hide)
    )
    (property "Value" "+3.3V" (at 120.65 93.98 90)
      (effects (font (size 1.27 1.27)) (justify left))
    )
    (property "Footprint" "" (at 124.46 93.98 0)
      (effects (font (size 1.27 1.27)) hide)
    )
    (property "Datasheet" "" (at 124.46 93.98 0)
      (effects (font (size 1.27 1.27)) hide)
    )
    (pin "1" (uuid e25c6e4c-1304-4616-8cb5-38128761e224))
    (instances
      (project "Valves-BDC-IC"
        (path "/e7e61ffa-4e25-4fc5-9449-1d6f0a2e2f78"
          (reference "#PWR058") (unit 1)
        )
      )
    )
  )

  (symbol (lib_id "power:PWR_FLAG") (at 175.26 74.93 180) (unit 1)
    (in_bom yes) (on_board yes) (dnp no) (fields_autoplaced)
    (uuid f2437658-2a8d-405b-b2ce-97f8dff3bd40)
    (property "Reference" "#FLG03" (at 175.26 76.835 0)
      (effects (font (size 1.27 1.27)) hide)
    )
    (property "Value" "PWR_FLAG" (at 175.26 80.01 0)
      (effects (font (size 1.27 1.27)))
    )
    (property "Footprint" "" (at 175.26 74.93 0)
      (effects (font (size 1.27 1.27)) hide)
    )
    (property "Datasheet" "~" (at 175.26 74.93 0)
      (effects (font (size 1.27 1.27)) hide)
    )
    (pin "1" (uuid b9507a74-a699-43dc-9682-6bb0f6475cb0))
    (instances
      (project "Valves-BDC-IC"
        (path "/e7e61ffa-4e25-4fc5-9449-1d6f0a2e2f78"
          (reference "#FLG03") (unit 1)
        )
      )
    )
  )

  (symbol (lib_id "power:PWR_FLAG") (at 152.4 74.93 180) (unit 1)
    (in_bom yes) (on_board yes) (dnp no) (fields_autoplaced)
    (uuid fa82e487-1fd2-4f05-b88e-1463aea7ddb9)
    (property "Reference" "#FLG01" (at 152.4 76.835 0)
      (effects (font (size 1.27 1.27)) hide)
    )
    (property "Value" "PWR_FLAG" (at 152.4 80.01 0)
      (effects (font (size 1.27 1.27)))
    )
    (property "Footprint" "" (at 152.4 74.93 0)
      (effects (font (size 1.27 1.27)) hide)
    )
    (property "Datasheet" "~" (at 152.4 74.93 0)
      (effects (font (size 1.27 1.27)) hide)
    )
    (pin "1" (uuid 522a94e9-3e8c-4fa7-abb5-ca2b516dbabd))
    (instances
      (project "Valves-BDC-IC"
        (path "/e7e61ffa-4e25-4fc5-9449-1d6f0a2e2f78"
          (reference "#FLG01") (unit 1)
        )
      )
    )
  )

  (symbol (lib_id "power:+3.3V") (at 152.4 72.39 0) (unit 1)
    (in_bom yes) (on_board yes) (dnp no) (fields_autoplaced)
    (uuid fac8ec85-ee90-442e-b428-793841162f47)
    (property "Reference" "#PWR04" (at 152.4 76.2 0)
      (effects (font (size 1.27 1.27)) hide)
    )
    (property "Value" "+3.3V" (at 152.4 67.31 0)
      (effects (font (size 1.27 1.27)))
    )
    (property "Footprint" "" (at 152.4 72.39 0)
      (effects (font (size 1.27 1.27)) hide)
    )
    (property "Datasheet" "" (at 152.4 72.39 0)
      (effects (font (size 1.27 1.27)) hide)
    )
    (pin "1" (uuid 05723ca1-fbcd-44b3-9572-c169ae1ed597))
    (instances
      (project "Valves-BDC-IC"
        (path "/e7e61ffa-4e25-4fc5-9449-1d6f0a2e2f78"
          (reference "#PWR04") (unit 1)
        )
      )
    )
  )

  (sheet (at 73.66 16.51) (size 34.29 31.75) (fields_autoplaced)
    (stroke (width 0.1524) (type solid))
    (fill (color 0 0 0 0.0000))
    (uuid 16d7e54c-9261-4072-a026-eac6acb003f7)
    (property "Sheetname" "DRV8231" (at 73.66 15.7984 0)
      (effects (font (size 1.27 1.27)) (justify left bottom))
    )
    (property "Sheetfile" "DRV8231.kicad_sch" (at 73.66 48.8446 0)
      (effects (font (size 1.27 1.27)) (justify left top))
    )
    (pin "IN1" input (at 107.95 24.13 0)
      (effects (font (size 1.27 1.27)) (justify right))
      (uuid 85b214be-7170-4b64-9ab1-e4a1a9735300)
    )
    (pin "IN2" input (at 107.95 26.67 0)
      (effects (font (size 1.27 1.27)) (justify right))
      (uuid 97aad26d-a527-4db7-838c-47f4159418a1)
    )
    (pin "OUT1" input (at 107.95 36.83 0)
      (effects (font (size 1.27 1.27)) (justify right))
      (uuid 653ad650-4d3c-4e17-9256-7c2405cc2997)
    )
    (pin "OUT2" input (at 107.95 39.37 0)
      (effects (font (size 1.27 1.27)) (justify right))
      (uuid 11786139-08c5-432e-ba40-dd3968d5e6ca)
    )
    (instances
      (project "Valves-BDC-IC"
        (path "/e7e61ffa-4e25-4fc5-9449-1d6f0a2e2f78" (page "4"))
      )
    )
  )

  (sheet (at 15.24 99.06) (size 34.29 31.75) (fields_autoplaced)
    (stroke (width 0.1524) (type solid))
    (fill (color 0 0 0 0.0000))
    (uuid 364b3751-8099-46b9-b309-21610ff38d80)
    (property "Sheetname" "DRV8837" (at 15.24 98.3484 0)
      (effects (font (size 1.27 1.27)) (justify left bottom))
    )
    (property "Sheetfile" "DRV8837.kicad_sch" (at 15.24 131.3946 0)
      (effects (font (size 1.27 1.27)) (justify left top))
    )
    (pin "IN1" input (at 49.53 106.68 0)
      (effects (font (size 1.27 1.27)) (justify right))
      (uuid 9549b18e-7c97-4e61-ae76-6015b3204b36)
    )
    (pin "OUT2" input (at 49.53 123.19 0)
      (effects (font (size 1.27 1.27)) (justify right))
      (uuid febd7787-f6fc-4a58-83a2-87b840268784)
    )
    (pin "OUT1" input (at 49.53 120.65 0)
      (effects (font (size 1.27 1.27)) (justify right))
      (uuid 58fc2744-0f5b-48d1-9b96-0868107f38fd)
    )
    (pin "IN2" input (at 49.53 109.22 0)
      (effects (font (size 1.27 1.27)) (justify right))
      (uuid c600dd4f-4171-4523-b3a7-4b48ba9c6cd0)
    )
    (pin "nSLEEP" input (at 49.53 114.3 0)
      (effects (font (size 1.27 1.27)) (justify right))
      (uuid 6d533dfb-a3ac-46ff-a0c2-7e79e607112d)
    )
    (instances
      (project "Valves-BDC-IC"
        (path "/e7e61ffa-4e25-4fc5-9449-1d6f0a2e2f78" (page "6"))
      )
    )
  )

  (sheet (at 132.08 16.51) (size 60.96 31.75) (fields_autoplaced)
    (stroke (width 0.1524) (type solid))
    (fill (color 0 0 0 0.0000))
    (uuid 952afcd2-4f0a-4bec-bda1-fd87fc12b5d8)
    (property "Sheetname" "Discrete H-Bridge" (at 132.08 15.7984 0)
      (effects (font (size 1.27 1.27)) (justify left bottom))
    )
    (property "Sheetfile" "Discrete-HBridge.kicad_sch" (at 132.08 48.8446 0)
      (effects (font (size 1.27 1.27)) (justify left top))
    )
    (pin "VAL1_OPEN_INVERTED" input (at 132.08 25.4 180)
      (effects (font (size 1.27 1.27)) (justify left))
      (uuid 373ab540-304f-4b5b-9018-85d38cef0426)
    )
    (pin "VAL1_CLOSE_INVERTED" input (at 132.08 30.48 180)
      (effects (font (size 1.27 1.27)) (justify left))
      (uuid 92cca696-ac5e-4075-a940-4004eb7358b3)
    )
    (pin "VAL1_OUT-" input (at 132.08 40.64 180)
      (effects (font (size 1.27 1.27)) (justify left))
      (uuid 29ce57e6-10d0-4faf-bea8-911757a49488)
    )
    (pin "VAL1_OPEN" input (at 132.08 22.86 180)
      (effects (font (size 1.27 1.27)) (justify left))
      (uuid 026f999e-39ab-404f-95dc-0553aadc89eb)
    )
    (pin "VAL1_CLOSE" input (at 132.08 27.94 180)
      (effects (font (size 1.27 1.27)) (justify left))
      (uuid 80c36e42-739d-4eaa-b02a-b0166a18a1b5)
    )
    (pin "VAL1_OUT+" input (at 132.08 38.1 180)
      (effects (font (size 1.27 1.27)) (justify left))
      (uuid 18b6626f-e3e1-4e95-9bd5-70098ba7018f)
    )
    (pin "VAL2_OPEN" input (at 193.04 22.86 0)
      (effects (font (size 1.27 1.27)) (justify right))
      (uuid 4a814ea0-a664-4897-a4da-99767d7f5485)
    )
    (pin "VAL2_OUT-" input (at 193.04 40.64 0)
      (effects (font (size 1.27 1.27)) (justify right))
      (uuid 6ed0eeb6-b86a-42e1-8114-dd22cc2e4d96)
    )
    (pin "VAL2_OPEN_INVERTED" input (at 193.04 25.4 0)
      (effects (font (size 1.27 1.27)) (justify right))
      (uuid 5237cccc-06fe-435a-9bf0-7760916598e3)
    )
    (pin "VAL2_OUT+" input (at 193.04 38.1 0)
      (effects (font (size 1.27 1.27)) (justify right))
      (uuid a4dc36ab-b737-4e70-92f9-5ce5e3c9aa9a)
    )
    (pin "VAL2_CLOSE" input (at 193.04 27.94 0)
      (effects (font (size 1.27 1.27)) (justify right))
      (uuid 75aaa486-bbe6-4e80-a6e8-35654a1d92a8)
    )
    (pin "VAL2_CLOSE_INVERTED" input (at 193.04 30.48 0)
      (effects (font (size 1.27 1.27)) (justify right))
      (uuid ff4c359b-d4b1-4459-9e53-9181b5815a83)
    )
    (instances
      (project "Valves-BDC-IC"
        (path "/e7e61ffa-4e25-4fc5-9449-1d6f0a2e2f78" (page "7"))
      )
    )
  )

  (sheet (at 15.24 16.51) (size 34.29 31.75) (fields_autoplaced)
    (stroke (width 0.1524) (type solid))
    (fill (color 0 0 0 0.0000))
    (uuid ab20349a-e2ae-4289-b2ad-17fde1a4ca45)
    (property "Sheetname" "DRV8212" (at 15.24 15.7984 0)
      (effects (font (size 1.27 1.27)) (justify left bottom))
    )
    (property "Sheetfile" "DRV8212.kicad_sch" (at 15.24 48.8446 0)
      (effects (font (size 1.27 1.27)) (justify left top))
    )
    (pin "OUT1" input (at 49.53 25.4 0)
      (effects (font (size 1.27 1.27)) (justify right))
      (uuid 701b248c-7af3-4f8b-8f59-07b321b109f6)
    )
    (pin "OUT2" input (at 49.53 27.94 0)
      (effects (font (size 1.27 1.27)) (justify right))
      (uuid ad4252c5-3cb7-40db-a3e9-bfce56ae5881)
    )
    (pin "IN1" input (at 49.53 33.02 0)
      (effects (font (size 1.27 1.27)) (justify right))
      (uuid 39497778-7bdb-45e5-8b99-a6db2811b432)
    )
    (pin "IN2" input (at 49.53 35.56 0)
      (effects (font (size 1.27 1.27)) (justify right))
      (uuid 1117de41-b82e-4a03-99f1-e1cb244338b0)
    )
    (instances
      (project "Valves-BDC-IC"
        (path "/e7e61ffa-4e25-4fc5-9449-1d6f0a2e2f78" (page "3"))
      )
    )
  )

  (sheet (at 15.24 58.42) (size 34.29 31.75) (fields_autoplaced)
    (stroke (width 0.1524) (type solid))
    (fill (color 0 0 0 0.0000))
    (uuid afcd4060-1698-49e0-97c4-358753a9e508)
    (property "Sheetname" "DRV8210P" (at 15.24 57.7084 0)
      (effects (font (size 1.27 1.27)) (justify left bottom))
    )
    (property "Sheetfile" "DRV8210P.kicad_sch" (at 15.24 90.7546 0)
      (effects (font (size 1.27 1.27)) (justify left top))
    )
    (pin "IN2" input (at 49.53 68.58 0)
      (effects (font (size 1.27 1.27)) (justify right))
      (uuid 8b816da3-f91f-4687-ad7b-6ea9fbf38756)
    )
    (pin "IN1" input (at 49.53 66.04 0)
      (effects (font (size 1.27 1.27)) (justify right))
      (uuid a51fc0cc-60a2-44bd-862d-07793e29f686)
    )
    (pin "nSLEEP" input (at 49.53 73.66 0)
      (effects (font (size 1.27 1.27)) (justify right))
      (uuid a841fd46-b329-483a-bae6-3c68e3e43bff)
    )
    (pin "OUT2" input (at 49.53 81.28 0)
      (effects (font (size 1.27 1.27)) (justify right))
      (uuid 9e567c14-fce7-4ea7-a3f3-64d25b62f1c0)
    )
    (pin "OUT1" input (at 49.53 78.74 0)
      (effects (font (size 1.27 1.27)) (justify right))
      (uuid ef957bdc-8ce5-448b-9dad-e4f0400d2048)
    )
    (instances
      (project "Valves-BDC-IC"
        (path "/e7e61ffa-4e25-4fc5-9449-1d6f0a2e2f78" (page "2"))
      )
    )
  )

  (sheet (at 73.66 58.42) (size 34.29 31.75) (fields_autoplaced)
    (stroke (width 0.1524) (type solid))
    (fill (color 0 0 0 0.0000))
    (uuid fa7fab38-65b6-4e21-985a-c370c4f27e75)
    (property "Sheetname" "DRV8251" (at 73.66 57.7084 0)
      (effects (font (size 1.27 1.27)) (justify left bottom))
    )
    (property "Sheetfile" "DRV8251.kicad_sch" (at 73.66 90.7546 0)
      (effects (font (size 1.27 1.27)) (justify left top))
    )
    (pin "IN1" input (at 107.95 66.04 0)
      (effects (font (size 1.27 1.27)) (justify right))
      (uuid 3a3f3bea-dd9f-4c31-a3d9-fdb7d4d2a360)
    )
    (pin "IN2" input (at 107.95 68.58 0)
      (effects (font (size 1.27 1.27)) (justify right))
      (uuid 6977a503-7f62-4ab1-abf9-73528ae25445)
    )
    (pin "OUT1" input (at 107.95 76.2 0)
      (effects (font (size 1.27 1.27)) (justify right))
      (uuid bca9a38a-0827-4c82-88a3-b350c8601ee3)
    )
    (pin "OUT2" input (at 107.95 78.74 0)
      (effects (font (size 1.27 1.27)) (justify right))
      (uuid 03513305-55f5-4d4c-87dc-7c7fd3055ed8)
    )
    (instances
      (project "Valves-BDC-IC"
        (path "/e7e61ffa-4e25-4fc5-9449-1d6f0a2e2f78" (page "5"))
      )
    )
  )

  (sheet_instances
    (path "/" (page "1"))
  )
)
