(kicad_sch
	(version 20231120)
	(generator "eeschema")
	(generator_version "8.0")
	(uuid "671da697-1563-4417-b04d-53defac7fa97")
	(paper "A4")
	(lib_symbols
		(symbol "Device:NetTie_2"
			(pin_numbers hide)
			(pin_names
				(offset 0) hide)
			(exclude_from_sim no)
			(in_bom no)
			(on_board yes)
			(property "Reference" "NT"
				(at 0 1.27 0)
				(effects
					(font
						(size 1.27 1.27)
					)
				)
			)
			(property "Value" "NetTie_2"
				(at 0 -1.27 0)
				(effects
					(font
						(size 1.27 1.27)
					)
				)
			)
			(property "Footprint" ""
				(at 0 0 0)
				(effects
					(font
						(size 1.27 1.27)
					)
					(hide yes)
				)
			)
			(property "Datasheet" "~"
				(at 0 0 0)
				(effects
					(font
						(size 1.27 1.27)
					)
					(hide yes)
				)
			)
			(property "Description" "Net tie, 2 pins"
				(at 0 0 0)
				(effects
					(font
						(size 1.27 1.27)
					)
					(hide yes)
				)
			)
			(property "ki_keywords" "net tie short"
				(at 0 0 0)
				(effects
					(font
						(size 1.27 1.27)
					)
					(hide yes)
				)
			)
			(property "ki_fp_filters" "Net*Tie*"
				(at 0 0 0)
				(effects
					(font
						(size 1.27 1.27)
					)
					(hide yes)
				)
			)
			(symbol "NetTie_2_0_1"
				(polyline
					(pts
						(xy -1.27 0) (xy 1.27 0)
					)
					(stroke
						(width 0.254)
						(type default)
					)
					(fill
						(type none)
					)
				)
			)
			(symbol "NetTie_2_1_1"
				(pin passive line
					(at -2.54 0 0)
					(length 2.54)
					(name "1"
						(effects
							(font
								(size 1.27 1.27)
							)
						)
					)
					(number "1"
						(effects
							(font
								(size 1.27 1.27)
							)
						)
					)
				)
				(pin passive line
					(at 2.54 0 180)
					(length 2.54)
					(name "2"
						(effects
							(font
								(size 1.27 1.27)
							)
						)
					)
					(number "2"
						(effects
							(font
								(size 1.27 1.27)
							)
						)
					)
				)
			)
		)
	)
	(wire
		(pts
			(xy 146.812 76.2) (xy 148.717 76.2)
		)
		(stroke
			(width 0)
			(type default)
		)
		(uuid "2cecf8c8-a108-4507-8cc7-e954fd9969b7")
	)
	(wire
		(pts
			(xy 139.7 76.2) (xy 141.732 76.2)
		)
		(stroke
			(width 0)
			(type default)
		)
		(uuid "c08dea62-a9d1-47d4-be0d-e3452a68e481")
	)
	(global_label "Vin+"
		(shape input)
		(at 139.7 76.2 180)
		(fields_autoplaced yes)
		(effects
			(font
				(size 1.27 1.27)
			)
			(justify right)
		)
		(uuid "5cd35504-8cba-45c5-a71a-0680eee79184")
		(property "Intersheetrefs" "${INTERSHEET_REFS}"
			(at 132.3794 76.2 0)
			(effects
				(font
					(size 1.27 1.27)
				)
				(justify right)
				(hide yes)
			)
		)
	)
	(global_label "Vin-"
		(shape input)
		(at 148.717 76.2 0)
		(fields_autoplaced yes)
		(effects
			(font
				(size 1.27 1.27)
			)
			(justify left)
		)
		(uuid "cd96a2ad-662a-4e0f-a9ed-759731d1d859")
		(property "Intersheetrefs" "${INTERSHEET_REFS}"
			(at 156.0376 76.2 0)
			(effects
				(font
					(size 1.27 1.27)
				)
				(justify left)
				(hide yes)
			)
		)
	)
	(symbol
		(lib_id "Device:NetTie_2")
		(at 144.272 76.2 0)
		(unit 1)
		(exclude_from_sim no)
		(in_bom no)
		(on_board yes)
		(dnp no)
		(fields_autoplaced yes)
		(uuid "8f637f9f-c27d-4e0b-a92a-b6ee8e702dc3")
		(property "Reference" "NT1"
			(at 144.272 71.374 0)
			(effects
				(font
					(size 1.27 1.27)
				)
			)
		)
		(property "Value" "NetTie_2"
			(at 144.272 73.914 0)
			(effects
				(font
					(size 1.27 1.27)
				)
			)
		)
		(property "Footprint" "NetTie:NetTie-2_SMD_Pad0.5mm"
			(at 144.272 76.2 0)
			(effects
				(font
					(size 1.27 1.27)
				)
				(hide yes)
			)
		)
		(property "Datasheet" "~"
			(at 144.272 76.2 0)
			(effects
				(font
					(size 1.27 1.27)
				)
				(hide yes)
			)
		)
		(property "Description" ""
			(at 144.272 76.2 0)
			(effects
				(font
					(size 1.27 1.27)
				)
				(hide yes)
			)
		)
		(pin "1"
			(uuid "a7edbcd9-bd2c-458b-8721-5ed30124a9bf")
		)
		(pin "2"
			(uuid "66e367af-873e-498e-a7e8-d7aee79d0385")
		)
		(instances
			(project "transparent_heater"
				(path "/671da697-1563-4417-b04d-53defac7fa97"
					(reference "NT1")
					(unit 1)
				)
			)
		)
	)
	(sheet_instances
		(path "/"
			(page "1")
		)
	)
)