(footprint "SOD2512X110N" (version 20221018) (generator pcbnew)
  (layer "F.Cu")
  (descr "SOD323")
  (tags "Zener Diode")
  (attr smd)
  (fp_text reference "Z**" (at 0 0) (layer "F.SilkS")
      (effects (font (size 1.27 1.27) (thickness 0.254)))
    (tstamp be38b456-baab-402f-82d9-13e3c8aad9e3)
  )
  (fp_text value "SOD2512X110N" (at 0 0) (layer "F.SilkS") hide
      (effects (font (size 1.27 1.27) (thickness 0.254)))
    (tstamp b31e1945-e698-40ba-8c0d-07672ecbd58f)
  )
  (fp_text user "${REFERENCE}" (at 0 0) (layer "F.Fab")
      (effects (font (size 1.27 1.27) (thickness 0.254)))
    (tstamp b8c2c6be-a750-46be-8455-878714e5c690)
  )
  (fp_line (start -1.7 -0.625) (end 0.85 -0.625)
    (stroke (width 0.2) (type solid)) (layer "F.SilkS") (tstamp 0bbe888e-c5e8-4739-a478-48f8be444eae))
  (fp_line (start -0.85 0.625) (end 0.85 0.625)
    (stroke (width 0.2) (type solid)) (layer "F.SilkS") (tstamp ca446392-1d56-4bb1-85b5-c11b42081c05))
  (fp_line (start -1.975 -1.15) (end 1.975 -1.15)
    (stroke (width 0.05) (type solid)) (layer "F.CrtYd") (tstamp 77abdee5-6809-4178-a381-6284a4f69cf0))
  (fp_line (start -1.975 1.15) (end -1.975 -1.15)
    (stroke (width 0.05) (type solid)) (layer "F.CrtYd") (tstamp ad430215-4c6d-4491-ba7d-c09e2506f630))
  (fp_line (start 1.975 -1.15) (end 1.975 1.15)
    (stroke (width 0.05) (type solid)) (layer "F.CrtYd") (tstamp e46eb881-0ca9-41cc-8313-0535f2dcb38a))
  (fp_line (start 1.975 1.15) (end -1.975 1.15)
    (stroke (width 0.05) (type solid)) (layer "F.CrtYd") (tstamp 70cfd182-6cf9-4826-ad00-d325da13effc))
  (fp_line (start -0.85 -0.625) (end 0.85 -0.625)
    (stroke (width 0.1) (type solid)) (layer "F.Fab") (tstamp 5701ada1-9f79-4ee1-8d9b-c08de1304588))
  (fp_line (start -0.85 -0.075) (end -0.3 -0.625)
    (stroke (width 0.1) (type solid)) (layer "F.Fab") (tstamp fef64b93-1d3c-49f7-b781-2aaa993d539a))
  (fp_line (start -0.85 0.625) (end -0.85 -0.625)
    (stroke (width 0.1) (type solid)) (layer "F.Fab") (tstamp 3898f719-d88c-4689-84a7-1b57a109cfdd))
  (fp_line (start 0.85 -0.625) (end 0.85 0.625)
    (stroke (width 0.1) (type solid)) (layer "F.Fab") (tstamp dbebff9f-5f75-43ca-9055-1f1005ebc848))
  (fp_line (start 0.85 0.625) (end -0.85 0.625)
    (stroke (width 0.1) (type solid)) (layer "F.Fab") (tstamp 31dee63f-fdf2-47ae-87e0-e229a8db2064))
  (pad "1" smd rect (at -1.15 0 90) (size 0.5 1.1) (layers "F.Cu" "F.Paste" "F.Mask") (tstamp 2350a101-d793-45dd-a652-8d6dec007fb8))
  (pad "2" smd rect (at 1.15 0 90) (size 0.5 1.1) (layers "F.Cu" "F.Paste" "F.Mask") (tstamp 2505867c-87cb-4987-bb36-29835973b35e))
  (model "../3D/PDZ5.6B,115.stp"
    (offset (xyz -0.84 1.35 -0.7))
    (scale (xyz 1 1 1))
    (rotate (xyz -90 0 0))
  )
)
