(kicad_sch (version 20230121) (generator eeschema)

  (uuid dd9623aa-b639-41f0-8e62-3e0e708a0bf3)

  (paper "A5")

  (lib_symbols
    (symbol "Connector:Conn_01x02_Pin" (pin_names (offset 1.016) hide) (in_bom yes) (on_board yes)
      (property "Reference" "J" (at 0 2.54 0)
        (effects (font (size 1.27 1.27)))
      )
      (property "Value" "Conn_01x02_Pin" (at 0 -5.08 0)
        (effects (font (size 1.27 1.27)))
      )
      (property "Footprint" "" (at 0 0 0)
        (effects (font (size 1.27 1.27)) hide)
      )
      (property "Datasheet" "~" (at 0 0 0)
        (effects (font (size 1.27 1.27)) hide)
      )
      (property "ki_locked" "" (at 0 0 0)
        (effects (font (size 1.27 1.27)))
      )
      (property "ki_keywords" "connector" (at 0 0 0)
        (effects (font (size 1.27 1.27)) hide)
      )
      (property "ki_description" "Generic connector, single row, 01x02, script generated" (at 0 0 0)
        (effects (font (size 1.27 1.27)) hide)
      )
      (property "ki_fp_filters" "Connector*:*_1x??_*" (at 0 0 0)
        (effects (font (size 1.27 1.27)) hide)
      )
      (symbol "Conn_01x02_Pin_1_1"
        (polyline
          (pts
            (xy 1.27 -2.54)
            (xy 0.8636 -2.54)
          )
          (stroke (width 0.1524) (type default))
          (fill (type none))
        )
        (polyline
          (pts
            (xy 1.27 0)
            (xy 0.8636 0)
          )
          (stroke (width 0.1524) (type default))
          (fill (type none))
        )
        (rectangle (start 0.8636 -2.413) (end 0 -2.667)
          (stroke (width 0.1524) (type default))
          (fill (type outline))
        )
        (rectangle (start 0.8636 0.127) (end 0 -0.127)
          (stroke (width 0.1524) (type default))
          (fill (type outline))
        )
        (pin passive line (at 5.08 0 180) (length 3.81)
          (name "Pin_1" (effects (font (size 1.27 1.27))))
          (number "1" (effects (font (size 1.27 1.27))))
        )
        (pin passive line (at 5.08 -2.54 180) (length 3.81)
          (name "Pin_2" (effects (font (size 1.27 1.27))))
          (number "2" (effects (font (size 1.27 1.27))))
        )
      )
    )
    (symbol "Connector:Conn_01x04_Pin" (pin_names (offset 1.016) hide) (in_bom yes) (on_board yes)
      (property "Reference" "J" (at 0 5.08 0)
        (effects (font (size 1.27 1.27)))
      )
      (property "Value" "Conn_01x04_Pin" (at 0 -7.62 0)
        (effects (font (size 1.27 1.27)))
      )
      (property "Footprint" "" (at 0 0 0)
        (effects (font (size 1.27 1.27)) hide)
      )
      (property "Datasheet" "~" (at 0 0 0)
        (effects (font (size 1.27 1.27)) hide)
      )
      (property "ki_locked" "" (at 0 0 0)
        (effects (font (size 1.27 1.27)))
      )
      (property "ki_keywords" "connector" (at 0 0 0)
        (effects (font (size 1.27 1.27)) hide)
      )
      (property "ki_description" "Generic connector, single row, 01x04, script generated" (at 0 0 0)
        (effects (font (size 1.27 1.27)) hide)
      )
      (property "ki_fp_filters" "Connector*:*_1x??_*" (at 0 0 0)
        (effects (font (size 1.27 1.27)) hide)
      )
      (symbol "Conn_01x04_Pin_1_1"
        (polyline
          (pts
            (xy 1.27 -5.08)
            (xy 0.8636 -5.08)
          )
          (stroke (width 0.1524) (type default))
          (fill (type none))
        )
        (polyline
          (pts
            (xy 1.27 -2.54)
            (xy 0.8636 -2.54)
          )
          (stroke (width 0.1524) (type default))
          (fill (type none))
        )
        (polyline
          (pts
            (xy 1.27 0)
            (xy 0.8636 0)
          )
          (stroke (width 0.1524) (type default))
          (fill (type none))
        )
        (polyline
          (pts
            (xy 1.27 2.54)
            (xy 0.8636 2.54)
          )
          (stroke (width 0.1524) (type default))
          (fill (type none))
        )
        (rectangle (start 0.8636 -4.953) (end 0 -5.207)
          (stroke (width 0.1524) (type default))
          (fill (type outline))
        )
        (rectangle (start 0.8636 -2.413) (end 0 -2.667)
          (stroke (width 0.1524) (type default))
          (fill (type outline))
        )
        (rectangle (start 0.8636 0.127) (end 0 -0.127)
          (stroke (width 0.1524) (type default))
          (fill (type outline))
        )
        (rectangle (start 0.8636 2.667) (end 0 2.413)
          (stroke (width 0.1524) (type default))
          (fill (type outline))
        )
        (pin passive line (at 5.08 2.54 180) (length 3.81)
          (name "Pin_1" (effects (font (size 1.27 1.27))))
          (number "1" (effects (font (size 1.27 1.27))))
        )
        (pin passive line (at 5.08 0 180) (length 3.81)
          (name "Pin_2" (effects (font (size 1.27 1.27))))
          (number "2" (effects (font (size 1.27 1.27))))
        )
        (pin passive line (at 5.08 -2.54 180) (length 3.81)
          (name "Pin_3" (effects (font (size 1.27 1.27))))
          (number "3" (effects (font (size 1.27 1.27))))
        )
        (pin passive line (at 5.08 -5.08 180) (length 3.81)
          (name "Pin_4" (effects (font (size 1.27 1.27))))
          (number "4" (effects (font (size 1.27 1.27))))
        )
      )
    )
    (symbol "Device:C" (pin_numbers hide) (pin_names (offset 0.254)) (in_bom yes) (on_board yes)
      (property "Reference" "C" (at 0.635 2.54 0)
        (effects (font (size 1.27 1.27)) (justify left))
      )
      (property "Value" "C" (at 0.635 -2.54 0)
        (effects (font (size 1.27 1.27)) (justify left))
      )
      (property "Footprint" "" (at 0.9652 -3.81 0)
        (effects (font (size 1.27 1.27)) hide)
      )
      (property "Datasheet" "~" (at 0 0 0)
        (effects (font (size 1.27 1.27)) hide)
      )
      (property "ki_keywords" "cap capacitor" (at 0 0 0)
        (effects (font (size 1.27 1.27)) hide)
      )
      (property "ki_description" "Unpolarized capacitor" (at 0 0 0)
        (effects (font (size 1.27 1.27)) hide)
      )
      (property "ki_fp_filters" "C_*" (at 0 0 0)
        (effects (font (size 1.27 1.27)) hide)
      )
      (symbol "C_0_1"
        (polyline
          (pts
            (xy -2.032 -0.762)
            (xy 2.032 -0.762)
          )
          (stroke (width 0.508) (type default))
          (fill (type none))
        )
        (polyline
          (pts
            (xy -2.032 0.762)
            (xy 2.032 0.762)
          )
          (stroke (width 0.508) (type default))
          (fill (type none))
        )
      )
      (symbol "C_1_1"
        (pin passive line (at 0 3.81 270) (length 2.794)
          (name "~" (effects (font (size 1.27 1.27))))
          (number "1" (effects (font (size 1.27 1.27))))
        )
        (pin passive line (at 0 -3.81 90) (length 2.794)
          (name "~" (effects (font (size 1.27 1.27))))
          (number "2" (effects (font (size 1.27 1.27))))
        )
      )
    )
    (symbol "Device:R" (pin_numbers hide) (pin_names (offset 0)) (in_bom yes) (on_board yes)
      (property "Reference" "R" (at 2.032 0 90)
        (effects (font (size 1.27 1.27)))
      )
      (property "Value" "R" (at 0 0 90)
        (effects (font (size 1.27 1.27)))
      )
      (property "Footprint" "" (at -1.778 0 90)
        (effects (font (size 1.27 1.27)) hide)
      )
      (property "Datasheet" "~" (at 0 0 0)
        (effects (font (size 1.27 1.27)) hide)
      )
      (property "ki_keywords" "R res resistor" (at 0 0 0)
        (effects (font (size 1.27 1.27)) hide)
      )
      (property "ki_description" "Resistor" (at 0 0 0)
        (effects (font (size 1.27 1.27)) hide)
      )
      (property "ki_fp_filters" "R_*" (at 0 0 0)
        (effects (font (size 1.27 1.27)) hide)
      )
      (symbol "R_0_1"
        (rectangle (start -1.016 -2.54) (end 1.016 2.54)
          (stroke (width 0.254) (type default))
          (fill (type none))
        )
      )
      (symbol "R_1_1"
        (pin passive line (at 0 3.81 270) (length 1.27)
          (name "~" (effects (font (size 1.27 1.27))))
          (number "1" (effects (font (size 1.27 1.27))))
        )
        (pin passive line (at 0 -3.81 90) (length 1.27)
          (name "~" (effects (font (size 1.27 1.27))))
          (number "2" (effects (font (size 1.27 1.27))))
        )
      )
    )
    (symbol "Valves-BDC-DRV:DRV8210PDSGR" (in_bom yes) (on_board yes)
      (property "Reference" "IC" (at 26.67 7.62 0)
        (effects (font (size 1.27 1.27)) (justify left top))
      )
      (property "Value" "DRV8210PDSGR" (at 26.67 5.08 0)
        (effects (font (size 1.27 1.27)) (justify left top))
      )
      (property "Footprint" "SON50P200X200X80-9N" (at 26.67 -94.92 0)
        (effects (font (size 1.27 1.27)) (justify left top) hide)
      )
      (property "Datasheet" "https://www.ti.com/lit/gpn/drv8210p" (at 26.67 -194.92 0)
        (effects (font (size 1.27 1.27)) (justify left top) hide)
      )
      (property "Height" "0.8" (at 26.67 -394.92 0)
        (effects (font (size 1.27 1.27)) (justify left top) hide)
      )
      (property "Mouser Part Number" "595-DRV8210PDSGR" (at 26.67 -494.92 0)
        (effects (font (size 1.27 1.27)) (justify left top) hide)
      )
      (property "Mouser Price/Stock" "https://www.mouser.co.uk/ProductDetail/Texas-Instruments/DRV8210PDSGR?qs=eP2BKZSCXI76Q1gdVPvR3A%3D%3D" (at 26.67 -594.92 0)
        (effects (font (size 1.27 1.27)) (justify left top) hide)
      )
      (property "Manufacturer_Name" "Texas Instruments" (at 26.67 -694.92 0)
        (effects (font (size 1.27 1.27)) (justify left top) hide)
      )
      (property "Manufacturer_Part_Number" "DRV8210PDSGR" (at 26.67 -794.92 0)
        (effects (font (size 1.27 1.27)) (justify left top) hide)
      )
      (property "ki_description" "Motor/Motion/Ignition Controllers & Drivers 11V, 1A H-bridge motor driver, PWM control, with low power sleep mode 8-WSON -40 to 125" (at 0 0 0)
        (effects (font (size 1.27 1.27)) hide)
      )
      (symbol "DRV8210PDSGR_1_1"
        (rectangle (start 5.08 2.54) (end 25.4 -20.32)
          (stroke (width 0.254) (type default))
          (fill (type background))
        )
        (pin passive line (at 0 0 0) (length 5.08)
          (name "VM" (effects (font (size 1.27 1.27))))
          (number "1" (effects (font (size 1.27 1.27))))
        )
        (pin passive line (at 0 -2.54 0) (length 5.08)
          (name "OUT1" (effects (font (size 1.27 1.27))))
          (number "2" (effects (font (size 1.27 1.27))))
        )
        (pin passive line (at 0 -5.08 0) (length 5.08)
          (name "OUT2" (effects (font (size 1.27 1.27))))
          (number "3" (effects (font (size 1.27 1.27))))
        )
        (pin passive line (at 0 -7.62 0) (length 5.08)
          (name "GND" (effects (font (size 1.27 1.27))))
          (number "4" (effects (font (size 1.27 1.27))))
        )
        (pin passive line (at 30.48 -7.62 180) (length 5.08)
          (name "IN2" (effects (font (size 1.27 1.27))))
          (number "5" (effects (font (size 1.27 1.27))))
        )
        (pin passive line (at 30.48 -5.08 180) (length 5.08)
          (name "IN1" (effects (font (size 1.27 1.27))))
          (number "6" (effects (font (size 1.27 1.27))))
        )
        (pin passive line (at 30.48 -2.54 180) (length 5.08)
          (name "NSLEEP" (effects (font (size 1.27 1.27))))
          (number "7" (effects (font (size 1.27 1.27))))
        )
        (pin passive line (at 30.48 0 180) (length 5.08)
          (name "VCC" (effects (font (size 1.27 1.27))))
          (number "8" (effects (font (size 1.27 1.27))))
        )
        (pin passive line (at 15.24 -25.4 90) (length 5.08)
          (name "GROUND" (effects (font (size 1.27 1.27))))
          (number "9" (effects (font (size 1.27 1.27))))
        )
      )
    )
    (symbol "power:+3.3V" (power) (pin_names (offset 0)) (in_bom yes) (on_board yes)
      (property "Reference" "#PWR" (at 0 -3.81 0)
        (effects (font (size 1.27 1.27)) hide)
      )
      (property "Value" "+3.3V" (at 0 3.556 0)
        (effects (font (size 1.27 1.27)))
      )
      (property "Footprint" "" (at 0 0 0)
        (effects (font (size 1.27 1.27)) hide)
      )
      (property "Datasheet" "" (at 0 0 0)
        (effects (font (size 1.27 1.27)) hide)
      )
      (property "ki_keywords" "global power" (at 0 0 0)
        (effects (font (size 1.27 1.27)) hide)
      )
      (property "ki_description" "Power symbol creates a global label with name \"+3.3V\"" (at 0 0 0)
        (effects (font (size 1.27 1.27)) hide)
      )
      (symbol "+3.3V_0_1"
        (polyline
          (pts
            (xy -0.762 1.27)
            (xy 0 2.54)
          )
          (stroke (width 0) (type default))
          (fill (type none))
        )
        (polyline
          (pts
            (xy 0 0)
            (xy 0 2.54)
          )
          (stroke (width 0) (type default))
          (fill (type none))
        )
        (polyline
          (pts
            (xy 0 2.54)
            (xy 0.762 1.27)
          )
          (stroke (width 0) (type default))
          (fill (type none))
        )
      )
      (symbol "+3.3V_1_1"
        (pin power_in line (at 0 0 90) (length 0) hide
          (name "+3.3V" (effects (font (size 1.27 1.27))))
          (number "1" (effects (font (size 1.27 1.27))))
        )
      )
    )
    (symbol "power:+5V" (power) (pin_names (offset 0)) (in_bom yes) (on_board yes)
      (property "Reference" "#PWR" (at 0 -3.81 0)
        (effects (font (size 1.27 1.27)) hide)
      )
      (property "Value" "+5V" (at 0 3.556 0)
        (effects (font (size 1.27 1.27)))
      )
      (property "Footprint" "" (at 0 0 0)
        (effects (font (size 1.27 1.27)) hide)
      )
      (property "Datasheet" "" (at 0 0 0)
        (effects (font (size 1.27 1.27)) hide)
      )
      (property "ki_keywords" "global power" (at 0 0 0)
        (effects (font (size 1.27 1.27)) hide)
      )
      (property "ki_description" "Power symbol creates a global label with name \"+5V\"" (at 0 0 0)
        (effects (font (size 1.27 1.27)) hide)
      )
      (symbol "+5V_0_1"
        (polyline
          (pts
            (xy -0.762 1.27)
            (xy 0 2.54)
          )
          (stroke (width 0) (type default))
          (fill (type none))
        )
        (polyline
          (pts
            (xy 0 0)
            (xy 0 2.54)
          )
          (stroke (width 0) (type default))
          (fill (type none))
        )
        (polyline
          (pts
            (xy 0 2.54)
            (xy 0.762 1.27)
          )
          (stroke (width 0) (type default))
          (fill (type none))
        )
      )
      (symbol "+5V_1_1"
        (pin power_in line (at 0 0 90) (length 0) hide
          (name "+5V" (effects (font (size 1.27 1.27))))
          (number "1" (effects (font (size 1.27 1.27))))
        )
      )
    )
    (symbol "power:GND" (power) (pin_names (offset 0)) (in_bom yes) (on_board yes)
      (property "Reference" "#PWR" (at 0 -6.35 0)
        (effects (font (size 1.27 1.27)) hide)
      )
      (property "Value" "GND" (at 0 -3.81 0)
        (effects (font (size 1.27 1.27)))
      )
      (property "Footprint" "" (at 0 0 0)
        (effects (font (size 1.27 1.27)) hide)
      )
      (property "Datasheet" "" (at 0 0 0)
        (effects (font (size 1.27 1.27)) hide)
      )
      (property "ki_keywords" "global power" (at 0 0 0)
        (effects (font (size 1.27 1.27)) hide)
      )
      (property "ki_description" "Power symbol creates a global label with name \"GND\" , ground" (at 0 0 0)
        (effects (font (size 1.27 1.27)) hide)
      )
      (symbol "GND_0_1"
        (polyline
          (pts
            (xy 0 0)
            (xy 0 -1.27)
            (xy 1.27 -1.27)
            (xy 0 -2.54)
            (xy -1.27 -1.27)
            (xy 0 -1.27)
          )
          (stroke (width 0) (type default))
          (fill (type none))
        )
      )
      (symbol "GND_1_1"
        (pin power_in line (at 0 0 270) (length 0) hide
          (name "GND" (effects (font (size 1.27 1.27))))
          (number "1" (effects (font (size 1.27 1.27))))
        )
      )
    )
  )

  (junction (at 69.85 39.37) (diameter 0) (color 0 0 0 0)
    (uuid 30ed6708-4668-4e13-93f0-ac4e46273484)
  )
  (junction (at 107.95 39.37) (diameter 0) (color 0 0 0 0)
    (uuid fca35cab-8f6a-4a00-90ba-647a15caa14a)
  )

  (wire (pts (xy 99.06 95.25) (xy 101.6 95.25))
    (stroke (width 0) (type default))
    (uuid 7c557fea-a74b-4abd-a752-9f53fdd85675)
  )
  (wire (pts (xy 107.95 38.1) (xy 107.95 39.37))
    (stroke (width 0) (type default))
    (uuid 8dff0ea8-bc9b-4aba-a611-88f0c3674d9a)
  )
  (wire (pts (xy 88.9 95.25) (xy 91.44 95.25))
    (stroke (width 0) (type default))
    (uuid 8fdb79fa-cc60-4664-bb55-d59bbafb5aac)
  )
  (wire (pts (xy 111.76 39.37) (xy 107.95 39.37))
    (stroke (width 0) (type default))
    (uuid 930e2f1d-5b4c-447e-a012-eedcb932f4ec)
  )
  (wire (pts (xy 69.85 39.37) (xy 73.66 39.37))
    (stroke (width 0) (type default))
    (uuid dbd6f588-1d9c-4a7e-b3e8-588c939745be)
  )
  (wire (pts (xy 78.74 95.25) (xy 81.28 95.25))
    (stroke (width 0) (type default))
    (uuid ee51c19b-cc0e-4691-b024-0697e1397ec6)
  )
  (wire (pts (xy 107.95 39.37) (xy 104.14 39.37))
    (stroke (width 0) (type default))
    (uuid fdde97c1-f525-4e64-8c51-fdab397f7e90)
  )
  (wire (pts (xy 66.04 39.37) (xy 69.85 39.37))
    (stroke (width 0) (type default))
    (uuid fe63840a-a3b4-4ebc-9b4b-a57876e6807d)
  )
  (wire (pts (xy 69.85 38.1) (xy 69.85 39.37))
    (stroke (width 0) (type default))
    (uuid ff44b985-1e1e-48d5-9749-f7da1268b90b)
  )

  (text "DRV8210PDSGR" (at 134.62 63.5 0)
    (effects (font (size 3 3)) (justify left bottom))
    (uuid 06e88e9a-be31-41b4-b473-40ae8ccf6301)
  )

  (hierarchical_label "IN2" (shape input) (at 78.74 83.82 0) (fields_autoplaced)
    (effects (font (size 1.27 1.27)) (justify left))
    (uuid 3d3d0615-8b26-4c72-9339-cf815b864f13)
  )
  (hierarchical_label "OUT1" (shape input) (at 102.87 78.74 0) (fields_autoplaced)
    (effects (font (size 1.27 1.27)) (justify left))
    (uuid 44b8c330-3d7b-41bc-82c5-ecbedf94984a)
  )
  (hierarchical_label "IN1" (shape input) (at 104.14 44.45 0) (fields_autoplaced)
    (effects (font (size 1.27 1.27)) (justify left))
    (uuid 76e68b94-7b4d-4d29-93a5-d937e7d7c239)
  )
  (hierarchical_label "OUT1" (shape input) (at 73.66 41.91 180) (fields_autoplaced)
    (effects (font (size 1.27 1.27)) (justify right))
    (uuid 8943d292-3db7-4a15-906a-a41e8f96e6da)
  )
  (hierarchical_label "IN1" (shape input) (at 78.74 78.74 0) (fields_autoplaced)
    (effects (font (size 1.27 1.27)) (justify left))
    (uuid aaae2f55-16e2-4675-9435-28356788cd5e)
  )
  (hierarchical_label "OUT1" (shape input) (at 78.74 95.25 180) (fields_autoplaced)
    (effects (font (size 1.27 1.27)) (justify right))
    (uuid c1605ca9-b861-4d15-b6c3-7a3e09720d0b)
  )
  (hierarchical_label "OUT2" (shape input) (at 102.87 81.28 0) (fields_autoplaced)
    (effects (font (size 1.27 1.27)) (justify left))
    (uuid d9661067-3d42-48de-9393-c6384d567080)
  )
  (hierarchical_label "nSLEEP" (shape input) (at 78.74 76.2 0) (fields_autoplaced)
    (effects (font (size 1.27 1.27)) (justify left))
    (uuid edf37472-14a5-4b5b-9e54-51297b66411a)
  )
  (hierarchical_label "nSLEEP" (shape input) (at 104.14 41.91 0) (fields_autoplaced)
    (effects (font (size 1.27 1.27)) (justify left))
    (uuid edfcd465-53d2-454d-9ee1-ea6e754ea121)
  )
  (hierarchical_label "IN2" (shape input) (at 104.14 46.99 0) (fields_autoplaced)
    (effects (font (size 1.27 1.27)) (justify left))
    (uuid f6e23b8e-6f8b-4c4c-99ae-d5d4b0ed4992)
  )
  (hierarchical_label "OUT2" (shape input) (at 101.6 95.25 0) (fields_autoplaced)
    (effects (font (size 1.27 1.27)) (justify left))
    (uuid fac8765e-69a1-4a13-9382-589c5205ecf0)
  )
  (hierarchical_label "OUT2" (shape input) (at 73.66 44.45 180) (fields_autoplaced)
    (effects (font (size 1.27 1.27)) (justify right))
    (uuid fdb510d3-bd16-47b5-9ed7-83b6f339012c)
  )

  (symbol (lib_id "Valves-BDC-DRV:DRV8210PDSGR") (at 73.66 39.37 0) (unit 1)
    (in_bom yes) (on_board yes) (dnp no) (fields_autoplaced)
    (uuid 15ee3db4-942a-4166-aee1-d1e2547f0142)
    (property "Reference" "IC1" (at 88.9 31.75 0)
      (effects (font (size 1.27 1.27)))
    )
    (property "Value" "DRV8210PDSGR" (at 88.9 34.29 0)
      (effects (font (size 1.27 1.27)))
    )
    (property "Footprint" "Valves-BDC-DRV:DRV8210PDSGR" (at 100.33 134.29 0)
      (effects (font (size 1.27 1.27)) (justify left top) hide)
    )
    (property "Datasheet" "https://www.ti.com/lit/gpn/drv8210p" (at 100.33 234.29 0)
      (effects (font (size 1.27 1.27)) (justify left top) hide)
    )
    (property "Height" "0.8" (at 100.33 434.29 0)
      (effects (font (size 1.27 1.27)) (justify left top) hide)
    )
    (property "Mouser Part Number" "595-DRV8210PDSGR" (at 100.33 534.29 0)
      (effects (font (size 1.27 1.27)) (justify left top) hide)
    )
    (property "Mouser Price/Stock" "https://www.mouser.co.uk/ProductDetail/Texas-Instruments/DRV8210PDSGR?qs=eP2BKZSCXI76Q1gdVPvR3A%3D%3D" (at 100.33 634.29 0)
      (effects (font (size 1.27 1.27)) (justify left top) hide)
    )
    (property "Manufacturer_Name" "Texas Instruments" (at 100.33 734.29 0)
      (effects (font (size 1.27 1.27)) (justify left top) hide)
    )
    (property "Manufacturer_Part_Number" "DRV8210PDSGR" (at 100.33 834.29 0)
      (effects (font (size 1.27 1.27)) (justify left top) hide)
    )
    (pin "1" (uuid 75e6faa0-7530-46c5-a420-2629d85cb476))
    (pin "8" (uuid fd658a18-e0d0-4b95-9fc8-efc21926cd8d))
    (pin "4" (uuid 1e87e38a-373b-4354-8883-40e79e70d356))
    (pin "7" (uuid dfed5ab8-8712-4209-900a-c3f4001f6131))
    (pin "6" (uuid c1fd3ada-13c0-4652-a921-0370eda39f31))
    (pin "3" (uuid 6185a6fc-4958-4c94-8b22-da31b44d3978))
    (pin "5" (uuid d959a0ac-e73d-4ead-9e7c-109a8acded0e))
    (pin "2" (uuid 31af12c3-a592-4526-b5b1-e07a732623b1))
    (pin "9" (uuid 76bedbee-94ac-458a-bb6d-dc4afbd5fa05))
    (instances
      (project "Valves-BDC-IC"
        (path "/e7e61ffa-4e25-4fc5-9449-1d6f0a2e2f78/afcd4060-1698-49e0-97c4-358753a9e508"
          (reference "IC1") (unit 1)
        )
      )
    )
  )

  (symbol (lib_id "power:GND") (at 69.85 30.48 180) (unit 1)
    (in_bom yes) (on_board yes) (dnp no)
    (uuid 2ee2128e-1c4c-45b9-9921-3bf350abeb51)
    (property "Reference" "#PWR05" (at 69.85 24.13 0)
      (effects (font (size 1.27 1.27)) hide)
    )
    (property "Value" "GND" (at 69.85 26.67 0)
      (effects (font (size 1.27 1.27)))
    )
    (property "Footprint" "" (at 69.85 30.48 0)
      (effects (font (size 1.27 1.27)) hide)
    )
    (property "Datasheet" "" (at 69.85 30.48 0)
      (effects (font (size 1.27 1.27)) hide)
    )
    (pin "1" (uuid 1258e8d1-1430-4e56-9245-dc70fefd9514))
    (instances
      (project "Valves-BDC-IC"
        (path "/e7e61ffa-4e25-4fc5-9449-1d6f0a2e2f78/afcd4060-1698-49e0-97c4-358753a9e508"
          (reference "#PWR05") (unit 1)
        )
      )
    )
  )

  (symbol (lib_id "power:GND") (at 88.9 64.77 0) (unit 1)
    (in_bom yes) (on_board yes) (dnp no)
    (uuid 41cf495d-9443-4313-bdbc-79fee454c9bb)
    (property "Reference" "#PWR08" (at 88.9 71.12 0)
      (effects (font (size 1.27 1.27)) hide)
    )
    (property "Value" "GND" (at 88.9 68.58 0)
      (effects (font (size 1.27 1.27)))
    )
    (property "Footprint" "" (at 88.9 64.77 0)
      (effects (font (size 1.27 1.27)) hide)
    )
    (property "Datasheet" "" (at 88.9 64.77 0)
      (effects (font (size 1.27 1.27)) hide)
    )
    (pin "1" (uuid 94736ffd-3237-45f9-bd68-4cfa836a1756))
    (instances
      (project "Valves-BDC-IC"
        (path "/e7e61ffa-4e25-4fc5-9449-1d6f0a2e2f78/afcd4060-1698-49e0-97c4-358753a9e508"
          (reference "#PWR08") (unit 1)
        )
      )
    )
  )

  (symbol (lib_id "power:+3.3V") (at 111.76 39.37 270) (unit 1)
    (in_bom yes) (on_board yes) (dnp no)
    (uuid 505ccf73-3fe1-454c-85bc-5e07255442a9)
    (property "Reference" "#PWR010" (at 107.95 39.37 0)
      (effects (font (size 1.27 1.27)) hide)
    )
    (property "Value" "+3.3V" (at 114.3 39.37 90)
      (effects (font (size 1.27 1.27)) (justify left))
    )
    (property "Footprint" "" (at 111.76 39.37 0)
      (effects (font (size 1.27 1.27)) hide)
    )
    (property "Datasheet" "" (at 111.76 39.37 0)
      (effects (font (size 1.27 1.27)) hide)
    )
    (pin "1" (uuid cd371308-a126-4ff9-8cee-d79195c01457))
    (instances
      (project "Valves-BDC-IC"
        (path "/e7e61ffa-4e25-4fc5-9449-1d6f0a2e2f78/afcd4060-1698-49e0-97c4-358753a9e508"
          (reference "#PWR010") (unit 1)
        )
      )
    )
  )

  (symbol (lib_id "Connector:Conn_01x04_Pin") (at 73.66 78.74 0) (unit 1)
    (in_bom yes) (on_board yes) (dnp no) (fields_autoplaced)
    (uuid 585b43cd-b809-4b64-94bf-303f51a48536)
    (property "Reference" "J1" (at 74.295 71.12 0)
      (effects (font (size 1.27 1.27)))
    )
    (property "Value" "Conn_01x04_Pin" (at 74.295 73.66 0)
      (effects (font (size 1.27 1.27)))
    )
    (property "Footprint" "Connector_PinHeader_2.54mm:PinHeader_1x04_P2.54mm_Horizontal" (at 73.66 78.74 0)
      (effects (font (size 1.27 1.27)) hide)
    )
    (property "Datasheet" "~" (at 73.66 78.74 0)
      (effects (font (size 1.27 1.27)) hide)
    )
    (pin "1" (uuid 6ca21091-4596-4bcd-acaf-0a93f1d715a2))
    (pin "2" (uuid 865407fc-9497-4a29-8189-115fe2d45ff6))
    (pin "3" (uuid 086ae74e-6711-441f-ab7b-397f5d72c9fc))
    (pin "4" (uuid 5f3bc504-3b1f-4d63-b616-4b1b490247eb))
    (instances
      (project "Valves-BDC-IC"
        (path "/e7e61ffa-4e25-4fc5-9449-1d6f0a2e2f78/afcd4060-1698-49e0-97c4-358753a9e508"
          (reference "J1") (unit 1)
        )
      )
    )
  )

  (symbol (lib_id "Connector:Conn_01x02_Pin") (at 97.79 78.74 0) (unit 1)
    (in_bom yes) (on_board yes) (dnp no) (fields_autoplaced)
    (uuid 5c21d442-6eb9-4131-bce4-b9fda3930955)
    (property "Reference" "J2" (at 98.425 73.66 0)
      (effects (font (size 1.27 1.27)))
    )
    (property "Value" "Conn_01x02_Pin" (at 98.425 76.2 0)
      (effects (font (size 1.27 1.27)))
    )
    (property "Footprint" "Valves-BDC-DRV:valves_mounting_holes" (at 97.79 78.74 0)
      (effects (font (size 1.27 1.27)) hide)
    )
    (property "Datasheet" "~" (at 97.79 78.74 0)
      (effects (font (size 1.27 1.27)) hide)
    )
    (pin "1" (uuid 9acfdbf5-cd7b-4ed9-aee8-aa09fe4accb8))
    (pin "2" (uuid cce5fcaf-f88f-41f6-9f37-51a66326eedd))
    (instances
      (project "Valves-BDC-IC"
        (path "/e7e61ffa-4e25-4fc5-9449-1d6f0a2e2f78/afcd4060-1698-49e0-97c4-358753a9e508"
          (reference "J2") (unit 1)
        )
      )
    )
  )

  (symbol (lib_id "Device:C") (at 107.95 34.29 0) (unit 1)
    (in_bom yes) (on_board yes) (dnp no)
    (uuid 7588881a-24ac-426d-9e30-9d4b35c80da4)
    (property "Reference" "C2" (at 110.49 33.02 0)
      (effects (font (size 1.27 1.27)) (justify left))
    )
    (property "Value" "0.1u" (at 110.49 35.56 0)
      (effects (font (size 1.27 1.27)) (justify left))
    )
    (property "Footprint" "Capacitor_SMD:C_0402_1005Metric_Pad0.74x0.62mm_HandSolder" (at 108.9152 38.1 0)
      (effects (font (size 1.27 1.27)) hide)
    )
    (property "Datasheet" "~" (at 107.95 34.29 0)
      (effects (font (size 1.27 1.27)) hide)
    )
    (pin "2" (uuid 0270ead3-16a9-4337-afbf-43e222028f2d))
    (pin "1" (uuid 3cc14757-1ddd-4807-9ec0-fd1be1a48e1a))
    (instances
      (project "Valves-BDC-IC"
        (path "/e7e61ffa-4e25-4fc5-9449-1d6f0a2e2f78/afcd4060-1698-49e0-97c4-358753a9e508"
          (reference "C2") (unit 1)
        )
      )
    )
  )

  (symbol (lib_id "power:+5V") (at 66.04 39.37 90) (unit 1)
    (in_bom yes) (on_board yes) (dnp no)
    (uuid 9539d961-80a8-4305-8fb3-141657f1c51d)
    (property "Reference" "#PWR01" (at 69.85 39.37 0)
      (effects (font (size 1.27 1.27)) hide)
    )
    (property "Value" "+5V" (at 63.5 39.37 90)
      (effects (font (size 1.27 1.27)) (justify left))
    )
    (property "Footprint" "" (at 66.04 39.37 0)
      (effects (font (size 1.27 1.27)) hide)
    )
    (property "Datasheet" "" (at 66.04 39.37 0)
      (effects (font (size 1.27 1.27)) hide)
    )
    (pin "1" (uuid 535db97f-70a5-4ab2-9bc1-902d25585252))
    (instances
      (project "Valves-BDC-IC"
        (path "/e7e61ffa-4e25-4fc5-9449-1d6f0a2e2f78/afcd4060-1698-49e0-97c4-358753a9e508"
          (reference "#PWR01") (unit 1)
        )
      )
    )
  )

  (symbol (lib_id "Device:C") (at 95.25 95.25 90) (unit 1)
    (in_bom yes) (on_board yes) (dnp no)
    (uuid 9a322cbe-7f39-4803-8bae-832c1bf0ecaa)
    (property "Reference" "C13" (at 95.25 91.44 90)
      (effects (font (size 1.27 1.27)))
    )
    (property "Value" "TBD" (at 95.25 99.06 90)
      (effects (font (size 1.27 1.27)))
    )
    (property "Footprint" "Capacitor_SMD:C_0402_1005Metric_Pad0.74x0.62mm_HandSolder" (at 99.06 94.2848 0)
      (effects (font (size 1.27 1.27)) hide)
    )
    (property "Datasheet" "~" (at 95.25 95.25 0)
      (effects (font (size 1.27 1.27)) hide)
    )
    (pin "2" (uuid 2af241f4-b3d5-4ad2-b856-bf055a6050f3))
    (pin "1" (uuid 3cdc9604-3947-4320-a0b1-28654c2e7c6e))
    (instances
      (project "Valves-BDC-IC"
        (path "/e7e61ffa-4e25-4fc5-9449-1d6f0a2e2f78/afcd4060-1698-49e0-97c4-358753a9e508"
          (reference "C13") (unit 1)
        )
      )
    )
  )

  (symbol (lib_id "power:GND") (at 78.74 81.28 90) (unit 1)
    (in_bom yes) (on_board yes) (dnp no)
    (uuid a6a46033-7eb3-435b-956b-9ed7a8b1e659)
    (property "Reference" "#PWR07" (at 85.09 81.28 0)
      (effects (font (size 1.27 1.27)) hide)
    )
    (property "Value" "GND" (at 81.28 81.28 90)
      (effects (font (size 1.27 1.27)) (justify right))
    )
    (property "Footprint" "" (at 78.74 81.28 0)
      (effects (font (size 1.27 1.27)) hide)
    )
    (property "Datasheet" "" (at 78.74 81.28 0)
      (effects (font (size 1.27 1.27)) hide)
    )
    (pin "1" (uuid b8eb5201-bb48-42a3-b5f5-68f3cc74ec2c))
    (instances
      (project "Valves-BDC-IC"
        (path "/e7e61ffa-4e25-4fc5-9449-1d6f0a2e2f78/afcd4060-1698-49e0-97c4-358753a9e508"
          (reference "#PWR07") (unit 1)
        )
      )
    )
  )

  (symbol (lib_id "Device:C") (at 69.85 34.29 0) (unit 1)
    (in_bom yes) (on_board yes) (dnp no)
    (uuid b8ea23f1-f93a-44d3-ba81-651a06fde37e)
    (property "Reference" "C1" (at 72.39 33.02 0)
      (effects (font (size 1.27 1.27)) (justify left))
    )
    (property "Value" "0.1u" (at 72.39 35.56 0)
      (effects (font (size 1.27 1.27)) (justify left))
    )
    (property "Footprint" "Capacitor_SMD:C_0402_1005Metric_Pad0.74x0.62mm_HandSolder" (at 70.8152 38.1 0)
      (effects (font (size 1.27 1.27)) hide)
    )
    (property "Datasheet" "~" (at 69.85 34.29 0)
      (effects (font (size 1.27 1.27)) hide)
    )
    (pin "2" (uuid c2bad6be-30ac-466f-9608-48a82dcecf1f))
    (pin "1" (uuid 9ef8e0f5-9533-4b8b-827c-8926bf49d695))
    (instances
      (project "Valves-BDC-IC"
        (path "/e7e61ffa-4e25-4fc5-9449-1d6f0a2e2f78/afcd4060-1698-49e0-97c4-358753a9e508"
          (reference "C1") (unit 1)
        )
      )
    )
  )

  (symbol (lib_id "power:GND") (at 107.95 30.48 180) (unit 1)
    (in_bom yes) (on_board yes) (dnp no)
    (uuid bc7e7a71-fddc-4c85-a6ca-e31b96520af2)
    (property "Reference" "#PWR09" (at 107.95 24.13 0)
      (effects (font (size 1.27 1.27)) hide)
    )
    (property "Value" "GND" (at 107.95 26.67 0)
      (effects (font (size 1.27 1.27)))
    )
    (property "Footprint" "" (at 107.95 30.48 0)
      (effects (font (size 1.27 1.27)) hide)
    )
    (property "Datasheet" "" (at 107.95 30.48 0)
      (effects (font (size 1.27 1.27)) hide)
    )
    (pin "1" (uuid e20de244-24c8-440d-8109-75c833046fc1))
    (instances
      (project "Valves-BDC-IC"
        (path "/e7e61ffa-4e25-4fc5-9449-1d6f0a2e2f78/afcd4060-1698-49e0-97c4-358753a9e508"
          (reference "#PWR09") (unit 1)
        )
      )
    )
  )

  (symbol (lib_id "Device:R") (at 85.09 95.25 90) (unit 1)
    (in_bom yes) (on_board yes) (dnp no)
    (uuid e3499bf5-89ad-44cb-b0a5-508d3e511fa1)
    (property "Reference" "R16" (at 85.09 92.71 90)
      (effects (font (size 1.27 1.27)))
    )
    (property "Value" "TBD" (at 85.09 95.25 90)
      (effects (font (size 1.27 1.27)))
    )
    (property "Footprint" "Resistor_SMD:R_0402_1005Metric_Pad0.72x0.64mm_HandSolder" (at 85.09 97.028 90)
      (effects (font (size 1.27 1.27)) hide)
    )
    (property "Datasheet" "~" (at 85.09 95.25 0)
      (effects (font (size 1.27 1.27)) hide)
    )
    (pin "2" (uuid 17c1a0e6-da18-492a-a6b2-03cfb6bacfcc))
    (pin "1" (uuid 0fd60724-5eeb-4c7e-9cb5-8167cec84412))
    (instances
      (project "Valves-BDC-IC"
        (path "/e7e61ffa-4e25-4fc5-9449-1d6f0a2e2f78/afcd4060-1698-49e0-97c4-358753a9e508"
          (reference "R16") (unit 1)
        )
      )
    )
  )

  (symbol (lib_id "power:GND") (at 73.66 46.99 270) (unit 1)
    (in_bom yes) (on_board yes) (dnp no)
    (uuid ecbc450b-6454-422b-8968-af9cf605da7e)
    (property "Reference" "#PWR06" (at 67.31 46.99 0)
      (effects (font (size 1.27 1.27)) hide)
    )
    (property "Value" "GND" (at 71.12 46.99 90)
      (effects (font (size 1.27 1.27)) (justify right))
    )
    (property "Footprint" "" (at 73.66 46.99 0)
      (effects (font (size 1.27 1.27)) hide)
    )
    (property "Datasheet" "" (at 73.66 46.99 0)
      (effects (font (size 1.27 1.27)) hide)
    )
    (pin "1" (uuid 1e569130-d61e-45bb-b543-0c4b75f7c3ab))
    (instances
      (project "Valves-BDC-IC"
        (path "/e7e61ffa-4e25-4fc5-9449-1d6f0a2e2f78/afcd4060-1698-49e0-97c4-358753a9e508"
          (reference "#PWR06") (unit 1)
        )
      )
    )
  )
)
