(kicad_symbol_lib (version 20220914) (generator kicad_symbol_editor)
  (symbol "DRV8428PPWPR" (in_bom yes) (on_board yes)
    (property "Reference" "IC" (at 36.83 7.62 0)
      (effects (font (size 1.27 1.27)) (justify left top))
    )
    (property "Value" "DRV8428PPWPR" (at 36.83 5.08 0)
      (effects (font (size 1.27 1.27)) (justify left top))
    )
    (property "Footprint" "SOP65P640X120-17N" (at 36.83 -94.92 0)
      (effects (font (size 1.27 1.27)) (justify left top) hide)
    )
    (property "Datasheet" "https://www.ti.com/lit/ds/symlink/drv8428e.pdf" (at 36.83 -194.92 0)
      (effects (font (size 1.27 1.27)) (justify left top) hide)
    )
    (property "Height" "1.2" (at 36.83 -394.92 0)
      (effects (font (size 1.27 1.27)) (justify left top) hide)
    )
    (property "Mouser Part Number" "595-DRV8428PPWPR" (at 36.83 -494.92 0)
      (effects (font (size 1.27 1.27)) (justify left top) hide)
    )
    (property "Mouser Price/Stock" "https://www.mouser.co.uk/ProductDetail/Texas-Instruments/DRV8428PPWPR?qs=81r%252BiQLm7BQEgb3p7kyCzg%3D%3D" (at 36.83 -594.92 0)
      (effects (font (size 1.27 1.27)) (justify left top) hide)
    )
    (property "Manufacturer_Name" "Texas Instruments" (at 36.83 -694.92 0)
      (effects (font (size 1.27 1.27)) (justify left top) hide)
    )
    (property "Manufacturer_Part_Number" "DRV8428PPWPR" (at 36.83 -794.92 0)
      (effects (font (size 1.27 1.27)) (justify left top) hide)
    )
    (property "ki_description" "DRV8428E P Dual H Bridge Motor Drivers With Integrated Current Sense and Smart Tune Technology" (at 0 0 0)
      (effects (font (size 1.27 1.27)) hide)
    )
    (symbol "DRV8428PPWPR_1_1"
      (rectangle (start 5.08 2.54) (end 35.56 -25.4)
        (stroke (width 0.254) (type default))
        (fill (type background))
      )
      (pin passive line (at 0 0 0) (length 5.08)
        (name "VM" (effects (font (size 1.27 1.27))))
        (number "1" (effects (font (size 1.27 1.27))))
      )
      (pin passive line (at 40.64 -15.24 180) (length 5.08)
        (name "VREFA" (effects (font (size 1.27 1.27))))
        (number "10" (effects (font (size 1.27 1.27))))
      )
      (pin passive line (at 40.64 -12.7 180) (length 5.08)
        (name "DECAY/TOFF" (effects (font (size 1.27 1.27))))
        (number "11" (effects (font (size 1.27 1.27))))
      )
      (pin passive line (at 40.64 -10.16 180) (length 5.08)
        (name "BIN2" (effects (font (size 1.27 1.27))))
        (number "12" (effects (font (size 1.27 1.27))))
      )
      (pin passive line (at 40.64 -7.62 180) (length 5.08)
        (name "BIN1" (effects (font (size 1.27 1.27))))
        (number "13" (effects (font (size 1.27 1.27))))
      )
      (pin passive line (at 40.64 -5.08 180) (length 5.08)
        (name "AIN2" (effects (font (size 1.27 1.27))))
        (number "14" (effects (font (size 1.27 1.27))))
      )
      (pin passive line (at 40.64 -2.54 180) (length 5.08)
        (name "AIN1" (effects (font (size 1.27 1.27))))
        (number "15" (effects (font (size 1.27 1.27))))
      )
      (pin passive line (at 40.64 0 180) (length 5.08)
        (name "NSLEEP" (effects (font (size 1.27 1.27))))
        (number "16" (effects (font (size 1.27 1.27))))
      )
      (pin passive line (at 20.32 -30.48 90) (length 5.08)
        (name "EP" (effects (font (size 1.27 1.27))))
        (number "17" (effects (font (size 1.27 1.27))))
      )
      (pin passive line (at 0 -2.54 0) (length 5.08)
        (name "PGND" (effects (font (size 1.27 1.27))))
        (number "2" (effects (font (size 1.27 1.27))))
      )
      (pin passive line (at 0 -5.08 0) (length 5.08)
        (name "AOUT1" (effects (font (size 1.27 1.27))))
        (number "3" (effects (font (size 1.27 1.27))))
      )
      (pin passive line (at 0 -7.62 0) (length 5.08)
        (name "AOUT2" (effects (font (size 1.27 1.27))))
        (number "4" (effects (font (size 1.27 1.27))))
      )
      (pin passive line (at 0 -10.16 0) (length 5.08)
        (name "BOUT2" (effects (font (size 1.27 1.27))))
        (number "5" (effects (font (size 1.27 1.27))))
      )
      (pin passive line (at 0 -12.7 0) (length 5.08)
        (name "BOUT1" (effects (font (size 1.27 1.27))))
        (number "6" (effects (font (size 1.27 1.27))))
      )
      (pin passive line (at 0 -15.24 0) (length 5.08)
        (name "GND" (effects (font (size 1.27 1.27))))
        (number "7" (effects (font (size 1.27 1.27))))
      )
      (pin passive line (at 0 -17.78 0) (length 5.08)
        (name "DVDD" (effects (font (size 1.27 1.27))))
        (number "8" (effects (font (size 1.27 1.27))))
      )
      (pin passive line (at 40.64 -17.78 180) (length 5.08)
        (name "VREFB" (effects (font (size 1.27 1.27))))
        (number "9" (effects (font (size 1.27 1.27))))
      )
    )
  )
  (symbol "DRV8428PWPR" (in_bom yes) (on_board yes)
    (property "Reference" "IC" (at 36.83 7.62 0)
      (effects (font (size 1.27 1.27)) (justify left top))
    )
    (property "Value" "DRV8428PWPR" (at 36.83 5.08 0)
      (effects (font (size 1.27 1.27)) (justify left top))
    )
    (property "Footprint" "SOP65P640X120-17N" (at 36.83 -94.92 0)
      (effects (font (size 1.27 1.27)) (justify left top) hide)
    )
    (property "Datasheet" "https://www.ti.com/lit/ds/symlink/drv8428.pdf" (at 36.83 -194.92 0)
      (effects (font (size 1.27 1.27)) (justify left top) hide)
    )
    (property "Height" "1.2" (at 36.83 -394.92 0)
      (effects (font (size 1.27 1.27)) (justify left top) hide)
    )
    (property "Mouser Part Number" "595-DRV8428PWPR" (at 36.83 -494.92 0)
      (effects (font (size 1.27 1.27)) (justify left top) hide)
    )
    (property "Mouser Price/Stock" "https://www.mouser.co.uk/ProductDetail/Texas-Instruments/DRV8428PWPR?qs=81r%252BiQLm7BREsr%252Bo84H%2F%252BQ%3D%3D" (at 36.83 -594.92 0)
      (effects (font (size 1.27 1.27)) (justify left top) hide)
    )
    (property "Manufacturer_Name" "Texas Instruments" (at 36.83 -694.92 0)
      (effects (font (size 1.27 1.27)) (justify left top) hide)
    )
    (property "Manufacturer_Part_Number" "DRV8428PWPR" (at 36.83 -794.92 0)
      (effects (font (size 1.27 1.27)) (justify left top) hide)
    )
    (property "ki_description" "DRV8428 Stepper Driver With Integrated Current Sense 1 256 Micro stepping STEP Interface and smart tune Technology" (at 0 0 0)
      (effects (font (size 1.27 1.27)) hide)
    )
    (symbol "DRV8428PWPR_1_1"
      (rectangle (start 5.08 2.54) (end 35.56 -25.4)
        (stroke (width 0.254) (type default))
        (fill (type background))
      )
      (pin passive line (at 0 0 0) (length 5.08)
        (name "VM" (effects (font (size 1.27 1.27))))
        (number "1" (effects (font (size 1.27 1.27))))
      )
      (pin passive line (at 40.64 -15.24 180) (length 5.08)
        (name "M0" (effects (font (size 1.27 1.27))))
        (number "10" (effects (font (size 1.27 1.27))))
      )
      (pin passive line (at 40.64 -12.7 180) (length 5.08)
        (name "DECAY/TOFF" (effects (font (size 1.27 1.27))))
        (number "11" (effects (font (size 1.27 1.27))))
      )
      (pin passive line (at 40.64 -10.16 180) (length 5.08)
        (name "M1" (effects (font (size 1.27 1.27))))
        (number "12" (effects (font (size 1.27 1.27))))
      )
      (pin passive line (at 40.64 -7.62 180) (length 5.08)
        (name "STEP" (effects (font (size 1.27 1.27))))
        (number "13" (effects (font (size 1.27 1.27))))
      )
      (pin passive line (at 40.64 -5.08 180) (length 5.08)
        (name "DIR" (effects (font (size 1.27 1.27))))
        (number "14" (effects (font (size 1.27 1.27))))
      )
      (pin passive line (at 40.64 -2.54 180) (length 5.08)
        (name "EN/NFAULT" (effects (font (size 1.27 1.27))))
        (number "15" (effects (font (size 1.27 1.27))))
      )
      (pin passive line (at 40.64 0 180) (length 5.08)
        (name "NSLEEP" (effects (font (size 1.27 1.27))))
        (number "16" (effects (font (size 1.27 1.27))))
      )
      (pin passive line (at 20.32 -30.48 90) (length 5.08)
        (name "EP" (effects (font (size 1.27 1.27))))
        (number "17" (effects (font (size 1.27 1.27))))
      )
      (pin passive line (at 0 -2.54 0) (length 5.08)
        (name "PGND" (effects (font (size 1.27 1.27))))
        (number "2" (effects (font (size 1.27 1.27))))
      )
      (pin passive line (at 0 -5.08 0) (length 5.08)
        (name "AOUT1" (effects (font (size 1.27 1.27))))
        (number "3" (effects (font (size 1.27 1.27))))
      )
      (pin passive line (at 0 -7.62 0) (length 5.08)
        (name "AOUT2" (effects (font (size 1.27 1.27))))
        (number "4" (effects (font (size 1.27 1.27))))
      )
      (pin passive line (at 0 -10.16 0) (length 5.08)
        (name "BOUT2" (effects (font (size 1.27 1.27))))
        (number "5" (effects (font (size 1.27 1.27))))
      )
      (pin passive line (at 0 -12.7 0) (length 5.08)
        (name "BOUT1" (effects (font (size 1.27 1.27))))
        (number "6" (effects (font (size 1.27 1.27))))
      )
      (pin passive line (at 0 -15.24 0) (length 5.08)
        (name "GND" (effects (font (size 1.27 1.27))))
        (number "7" (effects (font (size 1.27 1.27))))
      )
      (pin passive line (at 0 -17.78 0) (length 5.08)
        (name "DVDD" (effects (font (size 1.27 1.27))))
        (number "8" (effects (font (size 1.27 1.27))))
      )
      (pin passive line (at 40.64 -17.78 180) (length 5.08)
        (name "VREF" (effects (font (size 1.27 1.27))))
        (number "9" (effects (font (size 1.27 1.27))))
      )
    )
  )
)
