G04 #@! TF.GenerationSoftware,KiCad,Pcbnew,8.0.4+1*
G04 #@! TF.CreationDate,2024-08-22T23:24:42+03:00*
G04 #@! TF.ProjectId,DRV883x,44525638-3833-4782-9e6b-696361645f70,1*
G04 #@! TF.SameCoordinates,Original*
G04 #@! TF.FileFunction,Copper,L2,Bot*
G04 #@! TF.FilePolarity,Positive*
%FSLAX46Y46*%
G04 Gerber Fmt 4.6, Leading zero omitted, Abs format (unit mm)*
G04 Created by KiCad (PCBNEW 8.0.4+1) date 2024-08-22 23:24:42*
%MOMM*%
%LPD*%
G01*
G04 APERTURE LIST*
G04 #@! TA.AperFunction,ComponentPad*
%ADD10R,1.700000X1.700000*%
G04 #@! TD*
G04 #@! TA.AperFunction,ComponentPad*
%ADD11O,1.700000X1.700000*%
G04 #@! TD*
G04 #@! TA.AperFunction,ComponentPad*
%ADD12R,1.508000X1.508000*%
G04 #@! TD*
G04 #@! TA.AperFunction,ComponentPad*
%ADD13C,1.508000*%
G04 #@! TD*
G04 #@! TA.AperFunction,ViaPad*
%ADD14C,0.600000*%
G04 #@! TD*
G04 APERTURE END LIST*
D10*
X96970000Y-44460000D03*
D11*
X96970000Y-47000000D03*
X96970000Y-49540000D03*
X96970000Y-52080000D03*
X96970000Y-54620000D03*
D10*
X103170000Y-62460000D03*
D11*
X103170000Y-65000000D03*
X103170000Y-67540000D03*
X103170000Y-70080000D03*
X103170000Y-72620000D03*
D10*
X94460000Y-78500000D03*
D11*
X97000000Y-78500000D03*
X99540000Y-78500000D03*
D12*
X75270000Y-65060000D03*
D13*
X70270000Y-68560000D03*
X75270000Y-72060000D03*
X70270000Y-75560000D03*
D10*
X81000000Y-57000000D03*
D11*
X83540000Y-57000000D03*
X86080000Y-57000000D03*
D10*
X84770000Y-42060000D03*
D11*
X87310000Y-42060000D03*
X89850000Y-42060000D03*
D12*
X75270000Y-45860000D03*
D13*
X70270000Y-49360000D03*
X75270000Y-52860000D03*
X70270000Y-56360000D03*
D10*
X83430000Y-78460000D03*
D11*
X85970000Y-78460000D03*
D14*
X88200000Y-62600000D03*
X95000000Y-68600000D03*
X84200000Y-49800000D03*
X86800000Y-46400000D03*
X84200000Y-48800000D03*
X89770000Y-69260000D03*
X81200000Y-44400000D03*
X88170000Y-69260000D03*
X89600000Y-75200000D03*
X88170000Y-67660000D03*
X81200000Y-47000000D03*
X95600000Y-67400000D03*
X88970000Y-68460000D03*
X83200000Y-51000000D03*
X88400000Y-45800000D03*
X90800000Y-68200000D03*
X89770000Y-67660000D03*
G04 #@! TA.AperFunction,Conductor*
G36*
X120003032Y-36508649D02*
G01*
X120061741Y-36511533D01*
X120336149Y-36525014D01*
X120348251Y-36526206D01*
X120675142Y-36574695D01*
X120687052Y-36577064D01*
X121007638Y-36657367D01*
X121019261Y-36660894D01*
X121330401Y-36772221D01*
X121341631Y-36776872D01*
X121640392Y-36918175D01*
X121651100Y-36923899D01*
X121934543Y-37093789D01*
X121944661Y-37100549D01*
X122210095Y-37297408D01*
X122219501Y-37305128D01*
X122464356Y-37527052D01*
X122472947Y-37535643D01*
X122661404Y-37743573D01*
X122694871Y-37780498D01*
X122702591Y-37789904D01*
X122899450Y-38055338D01*
X122906210Y-38065456D01*
X123066615Y-38333075D01*
X123076093Y-38348887D01*
X123081828Y-38359615D01*
X123161880Y-38528873D01*
X123223124Y-38658362D01*
X123227780Y-38669605D01*
X123339102Y-38980728D01*
X123342635Y-38992372D01*
X123422932Y-39312934D01*
X123425306Y-39324870D01*
X123473792Y-39651744D01*
X123474985Y-39663853D01*
X123491351Y-39996967D01*
X123491500Y-40003052D01*
X123491500Y-79996947D01*
X123491351Y-80003032D01*
X123474985Y-80336146D01*
X123473792Y-80348255D01*
X123425306Y-80675129D01*
X123422932Y-80687065D01*
X123342635Y-81007627D01*
X123339102Y-81019271D01*
X123227780Y-81330394D01*
X123223124Y-81341637D01*
X123081830Y-81640380D01*
X123076093Y-81651112D01*
X122906210Y-81934543D01*
X122899450Y-81944661D01*
X122702591Y-82210095D01*
X122694871Y-82219501D01*
X122472954Y-82464349D01*
X122464349Y-82472954D01*
X122219501Y-82694871D01*
X122210095Y-82702591D01*
X121944661Y-82899450D01*
X121934543Y-82906210D01*
X121651112Y-83076093D01*
X121640380Y-83081830D01*
X121341637Y-83223124D01*
X121330394Y-83227780D01*
X121019271Y-83339102D01*
X121007627Y-83342635D01*
X120687065Y-83422932D01*
X120675129Y-83425306D01*
X120348255Y-83473792D01*
X120336146Y-83474985D01*
X120003033Y-83491351D01*
X119996948Y-83491500D01*
X60003052Y-83491500D01*
X59996967Y-83491351D01*
X59663853Y-83474985D01*
X59651744Y-83473792D01*
X59324870Y-83425306D01*
X59312934Y-83422932D01*
X58992372Y-83342635D01*
X58980728Y-83339102D01*
X58669605Y-83227780D01*
X58658362Y-83223124D01*
X58359619Y-83081830D01*
X58348892Y-83076095D01*
X58065456Y-82906210D01*
X58055338Y-82899450D01*
X57789904Y-82702591D01*
X57780498Y-82694871D01*
X57743573Y-82661404D01*
X57535643Y-82472947D01*
X57527052Y-82464356D01*
X57305128Y-82219501D01*
X57297408Y-82210095D01*
X57100549Y-81944661D01*
X57093789Y-81934543D01*
X56923899Y-81651100D01*
X56918175Y-81640392D01*
X56776872Y-81341631D01*
X56772219Y-81330394D01*
X56660894Y-81019261D01*
X56657367Y-81007638D01*
X56577064Y-80687052D01*
X56574695Y-80675142D01*
X56526206Y-80348251D01*
X56525014Y-80336145D01*
X56508649Y-80003031D01*
X56508500Y-79996947D01*
X56508500Y-79868872D01*
X57999500Y-79868872D01*
X57999500Y-80131127D01*
X58026123Y-80333339D01*
X58033730Y-80391116D01*
X58086763Y-80589038D01*
X58101602Y-80644418D01*
X58101605Y-80644428D01*
X58201953Y-80886690D01*
X58201958Y-80886700D01*
X58333075Y-81113803D01*
X58492718Y-81321851D01*
X58492726Y-81321860D01*
X58678140Y-81507274D01*
X58678148Y-81507281D01*
X58886196Y-81666924D01*
X59113299Y-81798041D01*
X59113309Y-81798046D01*
X59355571Y-81898394D01*
X59355581Y-81898398D01*
X59608884Y-81966270D01*
X59868880Y-82000500D01*
X59868887Y-82000500D01*
X60131113Y-82000500D01*
X60131120Y-82000500D01*
X60391116Y-81966270D01*
X60644419Y-81898398D01*
X60886697Y-81798043D01*
X61113803Y-81666924D01*
X61321851Y-81507282D01*
X61321855Y-81507277D01*
X61321860Y-81507274D01*
X61507274Y-81321860D01*
X61507277Y-81321855D01*
X61507282Y-81321851D01*
X61666924Y-81113803D01*
X61798043Y-80886697D01*
X61898398Y-80644419D01*
X61966270Y-80391116D01*
X62000500Y-80131120D01*
X62000500Y-79868880D01*
X62000499Y-79868872D01*
X117999500Y-79868872D01*
X117999500Y-80131127D01*
X118026123Y-80333339D01*
X118033730Y-80391116D01*
X118086763Y-80589038D01*
X118101602Y-80644418D01*
X118101605Y-80644428D01*
X118201953Y-80886690D01*
X118201958Y-80886700D01*
X118333075Y-81113803D01*
X118492718Y-81321851D01*
X118492726Y-81321860D01*
X118678140Y-81507274D01*
X118678148Y-81507281D01*
X118886196Y-81666924D01*
X119113299Y-81798041D01*
X119113309Y-81798046D01*
X119355571Y-81898394D01*
X119355581Y-81898398D01*
X119608884Y-81966270D01*
X119868880Y-82000500D01*
X119868887Y-82000500D01*
X120131113Y-82000500D01*
X120131120Y-82000500D01*
X120391116Y-81966270D01*
X120644419Y-81898398D01*
X120886697Y-81798043D01*
X121113803Y-81666924D01*
X121321851Y-81507282D01*
X121321855Y-81507277D01*
X121321860Y-81507274D01*
X121507274Y-81321860D01*
X121507277Y-81321855D01*
X121507282Y-81321851D01*
X121666924Y-81113803D01*
X121798043Y-80886697D01*
X121898398Y-80644419D01*
X121966270Y-80391116D01*
X122000500Y-80131120D01*
X122000500Y-79868880D01*
X121966270Y-79608884D01*
X121898398Y-79355581D01*
X121824771Y-79177830D01*
X121798046Y-79113309D01*
X121798041Y-79113299D01*
X121666924Y-78886196D01*
X121507281Y-78678148D01*
X121507274Y-78678140D01*
X121321860Y-78492726D01*
X121321851Y-78492718D01*
X121113803Y-78333075D01*
X120886700Y-78201958D01*
X120886690Y-78201953D01*
X120644428Y-78101605D01*
X120644421Y-78101603D01*
X120644419Y-78101602D01*
X120391116Y-78033730D01*
X120333339Y-78026123D01*
X120131127Y-77999500D01*
X120131120Y-77999500D01*
X119868880Y-77999500D01*
X119868872Y-77999500D01*
X119637772Y-78029926D01*
X119608884Y-78033730D01*
X119361929Y-78099901D01*
X119355581Y-78101602D01*
X119355571Y-78101605D01*
X119113309Y-78201953D01*
X119113299Y-78201958D01*
X118886196Y-78333075D01*
X118678148Y-78492718D01*
X118492718Y-78678148D01*
X118333075Y-78886196D01*
X118201958Y-79113299D01*
X118201953Y-79113309D01*
X118101605Y-79355571D01*
X118101602Y-79355581D01*
X118038165Y-79592335D01*
X118033730Y-79608885D01*
X117999500Y-79868872D01*
X62000499Y-79868872D01*
X61966270Y-79608884D01*
X61898398Y-79355581D01*
X61824771Y-79177830D01*
X61798046Y-79113309D01*
X61798041Y-79113299D01*
X61666924Y-78886196D01*
X61507281Y-78678148D01*
X61507274Y-78678140D01*
X61321860Y-78492726D01*
X61321851Y-78492718D01*
X61113803Y-78333075D01*
X60886700Y-78201958D01*
X60886690Y-78201953D01*
X60644428Y-78101605D01*
X60644421Y-78101603D01*
X60644419Y-78101602D01*
X60391116Y-78033730D01*
X60333339Y-78026123D01*
X60131127Y-77999500D01*
X60131120Y-77999500D01*
X59868880Y-77999500D01*
X59868872Y-77999500D01*
X59637772Y-78029926D01*
X59608884Y-78033730D01*
X59361929Y-78099901D01*
X59355581Y-78101602D01*
X59355571Y-78101605D01*
X59113309Y-78201953D01*
X59113299Y-78201958D01*
X58886196Y-78333075D01*
X58678148Y-78492718D01*
X58492718Y-78678148D01*
X58333075Y-78886196D01*
X58201958Y-79113299D01*
X58201953Y-79113309D01*
X58101605Y-79355571D01*
X58101602Y-79355581D01*
X58038165Y-79592335D01*
X58033730Y-79608885D01*
X57999500Y-79868872D01*
X56508500Y-79868872D01*
X56508500Y-77562135D01*
X82079500Y-77562135D01*
X82079500Y-79357870D01*
X82079501Y-79357876D01*
X82085908Y-79417483D01*
X82136202Y-79552328D01*
X82136206Y-79552335D01*
X82222452Y-79667544D01*
X82222455Y-79667547D01*
X82337664Y-79753793D01*
X82337671Y-79753797D01*
X82472517Y-79804091D01*
X82472516Y-79804091D01*
X82479444Y-79804835D01*
X82532127Y-79810500D01*
X84327872Y-79810499D01*
X84387483Y-79804091D01*
X84522331Y-79753796D01*
X84637546Y-79667546D01*
X84723796Y-79552331D01*
X84728957Y-79538495D01*
X84773002Y-79420402D01*
X84814872Y-79364468D01*
X84880337Y-79340050D01*
X84948610Y-79354901D01*
X84976865Y-79376053D01*
X85098917Y-79498105D01*
X85292421Y-79633600D01*
X85506507Y-79733429D01*
X85506516Y-79733433D01*
X85720000Y-79790634D01*
X85720000Y-78893012D01*
X85777007Y-78925925D01*
X85904174Y-78960000D01*
X86035826Y-78960000D01*
X86162993Y-78925925D01*
X86220000Y-78893012D01*
X86220000Y-79790633D01*
X86433483Y-79733433D01*
X86433492Y-79733429D01*
X86647578Y-79633600D01*
X86841082Y-79498105D01*
X87008105Y-79331082D01*
X87143600Y-79137578D01*
X87243429Y-78923492D01*
X87243432Y-78923486D01*
X87300636Y-78710000D01*
X86403012Y-78710000D01*
X86435925Y-78652993D01*
X86470000Y-78525826D01*
X86470000Y-78394174D01*
X86435925Y-78267007D01*
X86403012Y-78210000D01*
X87300636Y-78210000D01*
X87300635Y-78209999D01*
X87243432Y-77996513D01*
X87243429Y-77996507D01*
X87143600Y-77782422D01*
X87143599Y-77782420D01*
X87017362Y-77602135D01*
X93109500Y-77602135D01*
X93109500Y-79397870D01*
X93109501Y-79397876D01*
X93115908Y-79457483D01*
X93166202Y-79592328D01*
X93166206Y-79592335D01*
X93252452Y-79707544D01*
X93252455Y-79707547D01*
X93367664Y-79793793D01*
X93367671Y-79793797D01*
X93502517Y-79844091D01*
X93502516Y-79844091D01*
X93509444Y-79844835D01*
X93562127Y-79850500D01*
X95357872Y-79850499D01*
X95417483Y-79844091D01*
X95552331Y-79793796D01*
X95667546Y-79707546D01*
X95753796Y-79592331D01*
X95803002Y-79460401D01*
X95844872Y-79404468D01*
X95910337Y-79380050D01*
X95978610Y-79394901D01*
X96006865Y-79416053D01*
X96128917Y-79538105D01*
X96322421Y-79673600D01*
X96536507Y-79773429D01*
X96536516Y-79773433D01*
X96750000Y-79830634D01*
X96750000Y-78933012D01*
X96807007Y-78965925D01*
X96934174Y-79000000D01*
X97065826Y-79000000D01*
X97192993Y-78965925D01*
X97250000Y-78933012D01*
X97250000Y-79830633D01*
X97463483Y-79773433D01*
X97463492Y-79773429D01*
X97677578Y-79673600D01*
X97871082Y-79538105D01*
X98038105Y-79371082D01*
X98168119Y-79185405D01*
X98222696Y-79141781D01*
X98292195Y-79134588D01*
X98354549Y-79166110D01*
X98371269Y-79185405D01*
X98501505Y-79371401D01*
X98668599Y-79538495D01*
X98765384Y-79606265D01*
X98862165Y-79674032D01*
X98862167Y-79674033D01*
X98862170Y-79674035D01*
X99076337Y-79773903D01*
X99304592Y-79835063D01*
X99481034Y-79850500D01*
X99539999Y-79855659D01*
X99540000Y-79855659D01*
X99540001Y-79855659D01*
X99598966Y-79850500D01*
X99775408Y-79835063D01*
X100003663Y-79773903D01*
X100217830Y-79674035D01*
X100411401Y-79538495D01*
X100578495Y-79371401D01*
X100714035Y-79177830D01*
X100813903Y-78963663D01*
X100875063Y-78735408D01*
X100895659Y-78500000D01*
X100875063Y-78264592D01*
X100813903Y-78036337D01*
X100714035Y-77822171D01*
X100708731Y-77814595D01*
X100578494Y-77628597D01*
X100411402Y-77461506D01*
X100411395Y-77461501D01*
X100217834Y-77325967D01*
X100217830Y-77325965D01*
X100217828Y-77325964D01*
X100003663Y-77226097D01*
X100003659Y-77226096D01*
X100003655Y-77226094D01*
X99775413Y-77164938D01*
X99775403Y-77164936D01*
X99540001Y-77144341D01*
X99539999Y-77144341D01*
X99304596Y-77164936D01*
X99304586Y-77164938D01*
X99076344Y-77226094D01*
X99076335Y-77226098D01*
X98862171Y-77325964D01*
X98862169Y-77325965D01*
X98668597Y-77461505D01*
X98501508Y-77628594D01*
X98371269Y-77814595D01*
X98316692Y-77858219D01*
X98247193Y-77865412D01*
X98184839Y-77833890D01*
X98168119Y-77814594D01*
X98038113Y-77628926D01*
X98038108Y-77628920D01*
X97871082Y-77461894D01*
X97677578Y-77326399D01*
X97463492Y-77226570D01*
X97463486Y-77226567D01*
X97250000Y-77169364D01*
X97250000Y-78066988D01*
X97192993Y-78034075D01*
X97065826Y-78000000D01*
X96934174Y-78000000D01*
X96807007Y-78034075D01*
X96750000Y-78066988D01*
X96750000Y-77169364D01*
X96749999Y-77169364D01*
X96536513Y-77226567D01*
X96536507Y-77226570D01*
X96322422Y-77326399D01*
X96322420Y-77326400D01*
X96128926Y-77461886D01*
X96006865Y-77583947D01*
X95945542Y-77617431D01*
X95875850Y-77612447D01*
X95819917Y-77570575D01*
X95803002Y-77539598D01*
X95753797Y-77407671D01*
X95753793Y-77407664D01*
X95667547Y-77292455D01*
X95667544Y-77292452D01*
X95552335Y-77206206D01*
X95552328Y-77206202D01*
X95417482Y-77155908D01*
X95417483Y-77155908D01*
X95357883Y-77149501D01*
X95357881Y-77149500D01*
X95357873Y-77149500D01*
X95357864Y-77149500D01*
X93562129Y-77149500D01*
X93562123Y-77149501D01*
X93502516Y-77155908D01*
X93367671Y-77206202D01*
X93367664Y-77206206D01*
X93252455Y-77292452D01*
X93252452Y-77292455D01*
X93166206Y-77407664D01*
X93166202Y-77407671D01*
X93115908Y-77542517D01*
X93109501Y-77602116D01*
X93109500Y-77602135D01*
X87017362Y-77602135D01*
X87008113Y-77588926D01*
X87008108Y-77588920D01*
X86841082Y-77421894D01*
X86647578Y-77286399D01*
X86433492Y-77186570D01*
X86433486Y-77186567D01*
X86220000Y-77129364D01*
X86220000Y-78026988D01*
X86162993Y-77994075D01*
X86035826Y-77960000D01*
X85904174Y-77960000D01*
X85777007Y-77994075D01*
X85720000Y-78026988D01*
X85720000Y-77129364D01*
X85719999Y-77129364D01*
X85506513Y-77186567D01*
X85506507Y-77186570D01*
X85292422Y-77286399D01*
X85292420Y-77286400D01*
X85098926Y-77421886D01*
X84976865Y-77543947D01*
X84915542Y-77577431D01*
X84845850Y-77572447D01*
X84789917Y-77530575D01*
X84773002Y-77499598D01*
X84758939Y-77461894D01*
X84723796Y-77367669D01*
X84723795Y-77367668D01*
X84723793Y-77367664D01*
X84637547Y-77252455D01*
X84637544Y-77252452D01*
X84522335Y-77166206D01*
X84522328Y-77166202D01*
X84387482Y-77115908D01*
X84387483Y-77115908D01*
X84327883Y-77109501D01*
X84327881Y-77109500D01*
X84327873Y-77109500D01*
X84327864Y-77109500D01*
X82532129Y-77109500D01*
X82532123Y-77109501D01*
X82472516Y-77115908D01*
X82337671Y-77166202D01*
X82337664Y-77166206D01*
X82222455Y-77252452D01*
X82222452Y-77252455D01*
X82136206Y-77367664D01*
X82136202Y-77367671D01*
X82085908Y-77502517D01*
X82079501Y-77562116D01*
X82079500Y-77562135D01*
X56508500Y-77562135D01*
X56508500Y-75559997D01*
X69010708Y-75559997D01*
X69010708Y-75560000D01*
X69029839Y-75778674D01*
X69086653Y-75990703D01*
X69086654Y-75990706D01*
X69086655Y-75990708D01*
X69179419Y-76189642D01*
X69179423Y-76189650D01*
X69305322Y-76369452D01*
X69305327Y-76369458D01*
X69460541Y-76524672D01*
X69460547Y-76524677D01*
X69640349Y-76650576D01*
X69640351Y-76650577D01*
X69640354Y-76650579D01*
X69839297Y-76743347D01*
X70051326Y-76800161D01*
X70207521Y-76813826D01*
X70269998Y-76819292D01*
X70270000Y-76819292D01*
X70270002Y-76819292D01*
X70324668Y-76814509D01*
X70488674Y-76800161D01*
X70700703Y-76743347D01*
X70899646Y-76650579D01*
X71079457Y-76524674D01*
X71234674Y-76369457D01*
X71360579Y-76189646D01*
X71453347Y-75990703D01*
X71510161Y-75778674D01*
X71529292Y-75560000D01*
X71510161Y-75341326D01*
X71453347Y-75129297D01*
X71360579Y-74930354D01*
X71360577Y-74930351D01*
X71360576Y-74930349D01*
X71234677Y-74750547D01*
X71234672Y-74750541D01*
X71079458Y-74595327D01*
X71079452Y-74595322D01*
X70899650Y-74469423D01*
X70899642Y-74469419D01*
X70700708Y-74376655D01*
X70700706Y-74376654D01*
X70700703Y-74376653D01*
X70549885Y-74336240D01*
X70488675Y-74319839D01*
X70488668Y-74319838D01*
X70270002Y-74300708D01*
X70269998Y-74300708D01*
X70051331Y-74319838D01*
X70051324Y-74319839D01*
X69928902Y-74352642D01*
X69839297Y-74376653D01*
X69839295Y-74376653D01*
X69839291Y-74376655D01*
X69640357Y-74469419D01*
X69640349Y-74469423D01*
X69460547Y-74595322D01*
X69460541Y-74595327D01*
X69305327Y-74750541D01*
X69305322Y-74750547D01*
X69179423Y-74930349D01*
X69179419Y-74930357D01*
X69086655Y-75129291D01*
X69029839Y-75341324D01*
X69029838Y-75341331D01*
X69010708Y-75559997D01*
X56508500Y-75559997D01*
X56508500Y-72059997D01*
X74010708Y-72059997D01*
X74010708Y-72060002D01*
X74019136Y-72156344D01*
X74029839Y-72278674D01*
X74086653Y-72490703D01*
X74086654Y-72490706D01*
X74086655Y-72490708D01*
X74179419Y-72689642D01*
X74179423Y-72689650D01*
X74305322Y-72869452D01*
X74305327Y-72869458D01*
X74460541Y-73024672D01*
X74460547Y-73024677D01*
X74640349Y-73150576D01*
X74640351Y-73150577D01*
X74640354Y-73150579D01*
X74839297Y-73243347D01*
X75051326Y-73300161D01*
X75207521Y-73313826D01*
X75269998Y-73319292D01*
X75270000Y-73319292D01*
X75270002Y-73319292D01*
X75324668Y-73314509D01*
X75488674Y-73300161D01*
X75700703Y-73243347D01*
X75899646Y-73150579D01*
X76079457Y-73024674D01*
X76234674Y-72869457D01*
X76360579Y-72689646D01*
X76453347Y-72490703D01*
X76510161Y-72278674D01*
X76529292Y-72060000D01*
X76510161Y-71841326D01*
X76453347Y-71629297D01*
X76360579Y-71430354D01*
X76360577Y-71430351D01*
X76360576Y-71430349D01*
X76234677Y-71250547D01*
X76234672Y-71250541D01*
X76079458Y-71095327D01*
X76079452Y-71095322D01*
X75899650Y-70969423D01*
X75899642Y-70969419D01*
X75700708Y-70876655D01*
X75700706Y-70876654D01*
X75700703Y-70876653D01*
X75549885Y-70836240D01*
X75488675Y-70819839D01*
X75488668Y-70819838D01*
X75270002Y-70800708D01*
X75269998Y-70800708D01*
X75051331Y-70819838D01*
X75051324Y-70819839D01*
X74928902Y-70852642D01*
X74839297Y-70876653D01*
X74839295Y-70876653D01*
X74839291Y-70876655D01*
X74640357Y-70969419D01*
X74640349Y-70969423D01*
X74460547Y-71095322D01*
X74460541Y-71095327D01*
X74305327Y-71250541D01*
X74305322Y-71250547D01*
X74179423Y-71430349D01*
X74179419Y-71430357D01*
X74086655Y-71629291D01*
X74029839Y-71841324D01*
X74029838Y-71841331D01*
X74010708Y-72059997D01*
X56508500Y-72059997D01*
X56508500Y-68559997D01*
X69010708Y-68559997D01*
X69010708Y-68560002D01*
X69029838Y-68778668D01*
X69029839Y-68778675D01*
X69037187Y-68806097D01*
X69086653Y-68990703D01*
X69086654Y-68990706D01*
X69086655Y-68990708D01*
X69179419Y-69189642D01*
X69179423Y-69189650D01*
X69305322Y-69369452D01*
X69305327Y-69369458D01*
X69460541Y-69524672D01*
X69460547Y-69524677D01*
X69640349Y-69650576D01*
X69640351Y-69650577D01*
X69640354Y-69650579D01*
X69839297Y-69743347D01*
X70051326Y-69800161D01*
X70207521Y-69813826D01*
X70269998Y-69819292D01*
X70270000Y-69819292D01*
X70270002Y-69819292D01*
X70324668Y-69814509D01*
X70488674Y-69800161D01*
X70700703Y-69743347D01*
X70899646Y-69650579D01*
X71079457Y-69524674D01*
X71234674Y-69369457D01*
X71360579Y-69189646D01*
X71453347Y-68990703D01*
X71510161Y-68778674D01*
X71529292Y-68560000D01*
X71510161Y-68341326D01*
X71453347Y-68129297D01*
X71360579Y-67930354D01*
X71360577Y-67930351D01*
X71360576Y-67930349D01*
X71234677Y-67750547D01*
X71234672Y-67750541D01*
X71079458Y-67595327D01*
X71079452Y-67595322D01*
X70899650Y-67469423D01*
X70899642Y-67469419D01*
X70700708Y-67376655D01*
X70700706Y-67376654D01*
X70700703Y-67376653D01*
X70549885Y-67336240D01*
X70488675Y-67319839D01*
X70488668Y-67319838D01*
X70270002Y-67300708D01*
X70269998Y-67300708D01*
X70051331Y-67319838D01*
X70051324Y-67319839D01*
X69949935Y-67347007D01*
X69839297Y-67376653D01*
X69839295Y-67376653D01*
X69839291Y-67376655D01*
X69640357Y-67469419D01*
X69640349Y-67469423D01*
X69460547Y-67595322D01*
X69460541Y-67595327D01*
X69305327Y-67750541D01*
X69305322Y-67750547D01*
X69179423Y-67930349D01*
X69179419Y-67930357D01*
X69086655Y-68129291D01*
X69029839Y-68341324D01*
X69029838Y-68341331D01*
X69010708Y-68559997D01*
X56508500Y-68559997D01*
X56508500Y-64258135D01*
X74015500Y-64258135D01*
X74015500Y-65861870D01*
X74015501Y-65861876D01*
X74021908Y-65921483D01*
X74072202Y-66056328D01*
X74072206Y-66056335D01*
X74158452Y-66171544D01*
X74158455Y-66171547D01*
X74273664Y-66257793D01*
X74273671Y-66257797D01*
X74408517Y-66308091D01*
X74408516Y-66308091D01*
X74415444Y-66308835D01*
X74468127Y-66314500D01*
X76071872Y-66314499D01*
X76131483Y-66308091D01*
X76266331Y-66257796D01*
X76381546Y-66171546D01*
X76467796Y-66056331D01*
X76518091Y-65921483D01*
X76524500Y-65861873D01*
X76524499Y-64999999D01*
X101814341Y-64999999D01*
X101814341Y-65000000D01*
X101834936Y-65235403D01*
X101834938Y-65235413D01*
X101896094Y-65463655D01*
X101896096Y-65463659D01*
X101896097Y-65463663D01*
X101995965Y-65677830D01*
X101995967Y-65677834D01*
X102104281Y-65832521D01*
X102124840Y-65861883D01*
X102131501Y-65871395D01*
X102131506Y-65871402D01*
X102298597Y-66038493D01*
X102298603Y-66038498D01*
X102484594Y-66168730D01*
X102528219Y-66223307D01*
X102535413Y-66292805D01*
X102503890Y-66355160D01*
X102484595Y-66371880D01*
X102298922Y-66501890D01*
X102298920Y-66501891D01*
X102131891Y-66668920D01*
X102131886Y-66668926D01*
X101996400Y-66862420D01*
X101996399Y-66862422D01*
X101896570Y-67076507D01*
X101896567Y-67076513D01*
X101839364Y-67289999D01*
X101839364Y-67290000D01*
X102736988Y-67290000D01*
X102704075Y-67347007D01*
X102670000Y-67474174D01*
X102670000Y-67605826D01*
X102704075Y-67732993D01*
X102736988Y-67790000D01*
X101839364Y-67790000D01*
X101896567Y-68003486D01*
X101896570Y-68003492D01*
X101996399Y-68217578D01*
X102131894Y-68411082D01*
X102298917Y-68578105D01*
X102484595Y-68708119D01*
X102528219Y-68762696D01*
X102535412Y-68832195D01*
X102503890Y-68894549D01*
X102484595Y-68911269D01*
X102298594Y-69041508D01*
X102131505Y-69208597D01*
X101995965Y-69402169D01*
X101995964Y-69402171D01*
X101896098Y-69616335D01*
X101896094Y-69616344D01*
X101834938Y-69844586D01*
X101834936Y-69844596D01*
X101814341Y-70079999D01*
X101814341Y-70080000D01*
X101834936Y-70315403D01*
X101834938Y-70315413D01*
X101896094Y-70543655D01*
X101896096Y-70543659D01*
X101896097Y-70543663D01*
X101995965Y-70757830D01*
X101995967Y-70757834D01*
X102131501Y-70951395D01*
X102131506Y-70951402D01*
X102298597Y-71118493D01*
X102298603Y-71118498D01*
X102484158Y-71248425D01*
X102527783Y-71303002D01*
X102534977Y-71372500D01*
X102503454Y-71434855D01*
X102484158Y-71451575D01*
X102298597Y-71581505D01*
X102131505Y-71748597D01*
X101995965Y-71942169D01*
X101995964Y-71942171D01*
X101896098Y-72156335D01*
X101896094Y-72156344D01*
X101834938Y-72384586D01*
X101834936Y-72384596D01*
X101814341Y-72619999D01*
X101814341Y-72620000D01*
X101834936Y-72855403D01*
X101834938Y-72855413D01*
X101896094Y-73083655D01*
X101896096Y-73083659D01*
X101896097Y-73083663D01*
X101927301Y-73150579D01*
X101995965Y-73297830D01*
X101995967Y-73297834D01*
X102104281Y-73452521D01*
X102131505Y-73491401D01*
X102298599Y-73658495D01*
X102395384Y-73726265D01*
X102492165Y-73794032D01*
X102492167Y-73794033D01*
X102492170Y-73794035D01*
X102706337Y-73893903D01*
X102934592Y-73955063D01*
X103122918Y-73971539D01*
X103169999Y-73975659D01*
X103170000Y-73975659D01*
X103170001Y-73975659D01*
X103209234Y-73972226D01*
X103405408Y-73955063D01*
X103633663Y-73893903D01*
X103847830Y-73794035D01*
X104041401Y-73658495D01*
X104208495Y-73491401D01*
X104344035Y-73297830D01*
X104443903Y-73083663D01*
X104505063Y-72855408D01*
X104525659Y-72620000D01*
X104505063Y-72384592D01*
X104443903Y-72156337D01*
X104344035Y-71942171D01*
X104273427Y-71841331D01*
X104208494Y-71748597D01*
X104041402Y-71581506D01*
X104041396Y-71581501D01*
X103855842Y-71451575D01*
X103812217Y-71396998D01*
X103805023Y-71327500D01*
X103836546Y-71265145D01*
X103855842Y-71248425D01*
X103878026Y-71232891D01*
X104041401Y-71118495D01*
X104208495Y-70951401D01*
X104344035Y-70757830D01*
X104443903Y-70543663D01*
X104505063Y-70315408D01*
X104525659Y-70080000D01*
X104505063Y-69844592D01*
X104443903Y-69616337D01*
X104344035Y-69402171D01*
X104321130Y-69369458D01*
X104208494Y-69208597D01*
X104041402Y-69041506D01*
X104041401Y-69041505D01*
X103855405Y-68911269D01*
X103811781Y-68856692D01*
X103804588Y-68787193D01*
X103836110Y-68724839D01*
X103855405Y-68708119D01*
X104041082Y-68578105D01*
X104208105Y-68411082D01*
X104343600Y-68217578D01*
X104443429Y-68003492D01*
X104443432Y-68003486D01*
X104500636Y-67790000D01*
X103603012Y-67790000D01*
X103635925Y-67732993D01*
X103670000Y-67605826D01*
X103670000Y-67474174D01*
X103635925Y-67347007D01*
X103603012Y-67290000D01*
X104500636Y-67290000D01*
X104500635Y-67289999D01*
X104443432Y-67076513D01*
X104443429Y-67076507D01*
X104343600Y-66862422D01*
X104343599Y-66862420D01*
X104208113Y-66668926D01*
X104208108Y-66668920D01*
X104041078Y-66501890D01*
X103855405Y-66371879D01*
X103811780Y-66317302D01*
X103804588Y-66247804D01*
X103836110Y-66185449D01*
X103855406Y-66168730D01*
X104041401Y-66038495D01*
X104208495Y-65871401D01*
X104344035Y-65677830D01*
X104443903Y-65463663D01*
X104505063Y-65235408D01*
X104525659Y-65000000D01*
X104505063Y-64764592D01*
X104443903Y-64536337D01*
X104344035Y-64322171D01*
X104299192Y-64258129D01*
X104208496Y-64128600D01*
X104208495Y-64128599D01*
X104086567Y-64006671D01*
X104053084Y-63945351D01*
X104058068Y-63875659D01*
X104099939Y-63819725D01*
X104130915Y-63802810D01*
X104262331Y-63753796D01*
X104377546Y-63667546D01*
X104463796Y-63552331D01*
X104514091Y-63417483D01*
X104520500Y-63357873D01*
X104520499Y-61562128D01*
X104514091Y-61502517D01*
X104463796Y-61367669D01*
X104463795Y-61367668D01*
X104463793Y-61367664D01*
X104377547Y-61252455D01*
X104377544Y-61252452D01*
X104262335Y-61166206D01*
X104262328Y-61166202D01*
X104127482Y-61115908D01*
X104127483Y-61115908D01*
X104067883Y-61109501D01*
X104067881Y-61109500D01*
X104067873Y-61109500D01*
X104067864Y-61109500D01*
X102272129Y-61109500D01*
X102272123Y-61109501D01*
X102212516Y-61115908D01*
X102077671Y-61166202D01*
X102077664Y-61166206D01*
X101962455Y-61252452D01*
X101962452Y-61252455D01*
X101876206Y-61367664D01*
X101876202Y-61367671D01*
X101825908Y-61502517D01*
X101819501Y-61562116D01*
X101819501Y-61562123D01*
X101819500Y-61562135D01*
X101819500Y-63357870D01*
X101819501Y-63357876D01*
X101825908Y-63417483D01*
X101876202Y-63552328D01*
X101876206Y-63552335D01*
X101962452Y-63667544D01*
X101962455Y-63667547D01*
X102077664Y-63753793D01*
X102077671Y-63753797D01*
X102209081Y-63802810D01*
X102265015Y-63844681D01*
X102289432Y-63910145D01*
X102274580Y-63978418D01*
X102253430Y-64006673D01*
X102131503Y-64128600D01*
X101995965Y-64322169D01*
X101995964Y-64322171D01*
X101896098Y-64536335D01*
X101896094Y-64536344D01*
X101834938Y-64764586D01*
X101834936Y-64764596D01*
X101814341Y-64999999D01*
X76524499Y-64999999D01*
X76524499Y-64258128D01*
X76518091Y-64198517D01*
X76492013Y-64128599D01*
X76467797Y-64063671D01*
X76467793Y-64063664D01*
X76381547Y-63948455D01*
X76381544Y-63948452D01*
X76266335Y-63862206D01*
X76266328Y-63862202D01*
X76131482Y-63811908D01*
X76131483Y-63811908D01*
X76071883Y-63805501D01*
X76071881Y-63805500D01*
X76071873Y-63805500D01*
X76071864Y-63805500D01*
X74468129Y-63805500D01*
X74468123Y-63805501D01*
X74408516Y-63811908D01*
X74273671Y-63862202D01*
X74273664Y-63862206D01*
X74158455Y-63948452D01*
X74158452Y-63948455D01*
X74072206Y-64063664D01*
X74072202Y-64063671D01*
X74021908Y-64198517D01*
X74015501Y-64258116D01*
X74015501Y-64258123D01*
X74015500Y-64258135D01*
X56508500Y-64258135D01*
X56508500Y-56359997D01*
X69010708Y-56359997D01*
X69010708Y-56360002D01*
X69026135Y-56536344D01*
X69029839Y-56578674D01*
X69086653Y-56790703D01*
X69086654Y-56790706D01*
X69086655Y-56790708D01*
X69179419Y-56989642D01*
X69179423Y-56989650D01*
X69305322Y-57169452D01*
X69305327Y-57169458D01*
X69460541Y-57324672D01*
X69460547Y-57324677D01*
X69640349Y-57450576D01*
X69640351Y-57450577D01*
X69640354Y-57450579D01*
X69839297Y-57543347D01*
X70051326Y-57600161D01*
X70207521Y-57613826D01*
X70269998Y-57619292D01*
X70270000Y-57619292D01*
X70270002Y-57619292D01*
X70324668Y-57614509D01*
X70488674Y-57600161D01*
X70700703Y-57543347D01*
X70899646Y-57450579D01*
X71079457Y-57324674D01*
X71234674Y-57169457D01*
X71360579Y-56989646D01*
X71453347Y-56790703D01*
X71510161Y-56578674D01*
X71529292Y-56360000D01*
X71525982Y-56322171D01*
X71510161Y-56141331D01*
X71510161Y-56141326D01*
X71499660Y-56102135D01*
X79649500Y-56102135D01*
X79649500Y-57897870D01*
X79649501Y-57897876D01*
X79655908Y-57957483D01*
X79706202Y-58092328D01*
X79706206Y-58092335D01*
X79792452Y-58207544D01*
X79792455Y-58207547D01*
X79907664Y-58293793D01*
X79907671Y-58293797D01*
X80042517Y-58344091D01*
X80042516Y-58344091D01*
X80049444Y-58344835D01*
X80102127Y-58350500D01*
X81897872Y-58350499D01*
X81957483Y-58344091D01*
X82092331Y-58293796D01*
X82207546Y-58207546D01*
X82293796Y-58092331D01*
X82343002Y-57960401D01*
X82384872Y-57904468D01*
X82450337Y-57880050D01*
X82518610Y-57894901D01*
X82546865Y-57916053D01*
X82668917Y-58038105D01*
X82862421Y-58173600D01*
X83076507Y-58273429D01*
X83076516Y-58273433D01*
X83290000Y-58330634D01*
X83290000Y-57433012D01*
X83347007Y-57465925D01*
X83474174Y-57500000D01*
X83605826Y-57500000D01*
X83732993Y-57465925D01*
X83790000Y-57433012D01*
X83790000Y-58330633D01*
X84003483Y-58273433D01*
X84003492Y-58273429D01*
X84217578Y-58173600D01*
X84411082Y-58038105D01*
X84578105Y-57871082D01*
X84708119Y-57685405D01*
X84762696Y-57641781D01*
X84832195Y-57634588D01*
X84894549Y-57666110D01*
X84911269Y-57685405D01*
X85041505Y-57871401D01*
X85208599Y-58038495D01*
X85305384Y-58106265D01*
X85402165Y-58174032D01*
X85402167Y-58174033D01*
X85402170Y-58174035D01*
X85616337Y-58273903D01*
X85844592Y-58335063D01*
X86021034Y-58350500D01*
X86079999Y-58355659D01*
X86080000Y-58355659D01*
X86080001Y-58355659D01*
X86138966Y-58350500D01*
X86315408Y-58335063D01*
X86543663Y-58273903D01*
X86757830Y-58174035D01*
X86951401Y-58038495D01*
X87118495Y-57871401D01*
X87254035Y-57677830D01*
X87353903Y-57463663D01*
X87415063Y-57235408D01*
X87435659Y-57000000D01*
X87434753Y-56989650D01*
X87415063Y-56764596D01*
X87415063Y-56764592D01*
X87353903Y-56536337D01*
X87254035Y-56322171D01*
X87248731Y-56314595D01*
X87118494Y-56128597D01*
X86951402Y-55961506D01*
X86951395Y-55961501D01*
X86757834Y-55825967D01*
X86757830Y-55825965D01*
X86689354Y-55794034D01*
X86543663Y-55726097D01*
X86543659Y-55726096D01*
X86543655Y-55726094D01*
X86315413Y-55664938D01*
X86315403Y-55664936D01*
X86080001Y-55644341D01*
X86079999Y-55644341D01*
X85844596Y-55664936D01*
X85844586Y-55664938D01*
X85616344Y-55726094D01*
X85616337Y-55726096D01*
X85616337Y-55726097D01*
X85602816Y-55732401D01*
X85402171Y-55825964D01*
X85402169Y-55825965D01*
X85208597Y-55961505D01*
X85041508Y-56128594D01*
X84911269Y-56314595D01*
X84856692Y-56358219D01*
X84787193Y-56365412D01*
X84724839Y-56333890D01*
X84708119Y-56314594D01*
X84578113Y-56128926D01*
X84578108Y-56128920D01*
X84411082Y-55961894D01*
X84217578Y-55826399D01*
X84003492Y-55726570D01*
X84003486Y-55726567D01*
X83790000Y-55669364D01*
X83790000Y-56566988D01*
X83732993Y-56534075D01*
X83605826Y-56500000D01*
X83474174Y-56500000D01*
X83347007Y-56534075D01*
X83290000Y-56566988D01*
X83290000Y-55669364D01*
X83289999Y-55669364D01*
X83076513Y-55726567D01*
X83076507Y-55726570D01*
X82862422Y-55826399D01*
X82862420Y-55826400D01*
X82668926Y-55961886D01*
X82546865Y-56083947D01*
X82485542Y-56117431D01*
X82415850Y-56112447D01*
X82359917Y-56070575D01*
X82343002Y-56039598D01*
X82293797Y-55907671D01*
X82293793Y-55907664D01*
X82207547Y-55792455D01*
X82207544Y-55792452D01*
X82092335Y-55706206D01*
X82092328Y-55706202D01*
X81957482Y-55655908D01*
X81957483Y-55655908D01*
X81897883Y-55649501D01*
X81897881Y-55649500D01*
X81897873Y-55649500D01*
X81897864Y-55649500D01*
X80102129Y-55649500D01*
X80102123Y-55649501D01*
X80042516Y-55655908D01*
X79907671Y-55706202D01*
X79907664Y-55706206D01*
X79792455Y-55792452D01*
X79792452Y-55792455D01*
X79706206Y-55907664D01*
X79706202Y-55907671D01*
X79655908Y-56042517D01*
X79649501Y-56102116D01*
X79649500Y-56102135D01*
X71499660Y-56102135D01*
X71453347Y-55929297D01*
X71360579Y-55730354D01*
X71360577Y-55730351D01*
X71360576Y-55730349D01*
X71234677Y-55550547D01*
X71234672Y-55550541D01*
X71079458Y-55395327D01*
X71079452Y-55395322D01*
X70899650Y-55269423D01*
X70899642Y-55269419D01*
X70700708Y-55176655D01*
X70700706Y-55176654D01*
X70700703Y-55176653D01*
X70549885Y-55136240D01*
X70488675Y-55119839D01*
X70488668Y-55119838D01*
X70270002Y-55100708D01*
X70269998Y-55100708D01*
X70051331Y-55119838D01*
X70051324Y-55119839D01*
X69928902Y-55152642D01*
X69839297Y-55176653D01*
X69839295Y-55176653D01*
X69839291Y-55176655D01*
X69640357Y-55269419D01*
X69640349Y-55269423D01*
X69460547Y-55395322D01*
X69460541Y-55395327D01*
X69305327Y-55550541D01*
X69305322Y-55550547D01*
X69179423Y-55730349D01*
X69179419Y-55730357D01*
X69086655Y-55929291D01*
X69086653Y-55929295D01*
X69086653Y-55929297D01*
X69077921Y-55961886D01*
X69029839Y-56141324D01*
X69029838Y-56141331D01*
X69010708Y-56359997D01*
X56508500Y-56359997D01*
X56508500Y-52860000D01*
X74010708Y-52860000D01*
X74029839Y-53078674D01*
X74086653Y-53290703D01*
X74086654Y-53290706D01*
X74086655Y-53290708D01*
X74179419Y-53489642D01*
X74179423Y-53489650D01*
X74305322Y-53669452D01*
X74305327Y-53669458D01*
X74460541Y-53824672D01*
X74460547Y-53824677D01*
X74640349Y-53950576D01*
X74640351Y-53950577D01*
X74640354Y-53950579D01*
X74839297Y-54043347D01*
X75051326Y-54100161D01*
X75207521Y-54113826D01*
X75269998Y-54119292D01*
X75270000Y-54119292D01*
X75270002Y-54119292D01*
X75324668Y-54114509D01*
X75488674Y-54100161D01*
X75700703Y-54043347D01*
X75899646Y-53950579D01*
X76079457Y-53824674D01*
X76234674Y-53669457D01*
X76360579Y-53489646D01*
X76453347Y-53290703D01*
X76510161Y-53078674D01*
X76529292Y-52860000D01*
X76510161Y-52641326D01*
X76453347Y-52429297D01*
X76360579Y-52230354D01*
X76360577Y-52230351D01*
X76360576Y-52230349D01*
X76234677Y-52050547D01*
X76234672Y-52050541D01*
X76079458Y-51895327D01*
X76079452Y-51895322D01*
X75899650Y-51769423D01*
X75899642Y-51769419D01*
X75700708Y-51676655D01*
X75700706Y-51676654D01*
X75700703Y-51676653D01*
X75549885Y-51636240D01*
X75488675Y-51619839D01*
X75488668Y-51619838D01*
X75270002Y-51600708D01*
X75269998Y-51600708D01*
X75051331Y-51619838D01*
X75051324Y-51619839D01*
X74928902Y-51652642D01*
X74839297Y-51676653D01*
X74839295Y-51676653D01*
X74839291Y-51676655D01*
X74640357Y-51769419D01*
X74640349Y-51769423D01*
X74460547Y-51895322D01*
X74460541Y-51895327D01*
X74305327Y-52050541D01*
X74305322Y-52050547D01*
X74179423Y-52230349D01*
X74179419Y-52230357D01*
X74086655Y-52429291D01*
X74029839Y-52641324D01*
X74029838Y-52641331D01*
X74019646Y-52757830D01*
X74010708Y-52860000D01*
X56508500Y-52860000D01*
X56508500Y-49359997D01*
X69010708Y-49359997D01*
X69010708Y-49360002D01*
X69020696Y-49474174D01*
X69029839Y-49578674D01*
X69086653Y-49790703D01*
X69086654Y-49790706D01*
X69086655Y-49790708D01*
X69179419Y-49989642D01*
X69179423Y-49989650D01*
X69305322Y-50169452D01*
X69305327Y-50169458D01*
X69460541Y-50324672D01*
X69460547Y-50324677D01*
X69640349Y-50450576D01*
X69640351Y-50450577D01*
X69640354Y-50450579D01*
X69839297Y-50543347D01*
X70051326Y-50600161D01*
X70207521Y-50613826D01*
X70269998Y-50619292D01*
X70270000Y-50619292D01*
X70270002Y-50619292D01*
X70324668Y-50614509D01*
X70488674Y-50600161D01*
X70700703Y-50543347D01*
X70899646Y-50450579D01*
X71079457Y-50324674D01*
X71234674Y-50169457D01*
X71360579Y-49989646D01*
X71453347Y-49790703D01*
X71510161Y-49578674D01*
X71529292Y-49360000D01*
X71528155Y-49347007D01*
X71522117Y-49277997D01*
X71510161Y-49141326D01*
X71453347Y-48929297D01*
X71360579Y-48730354D01*
X71360577Y-48730351D01*
X71360576Y-48730349D01*
X71234677Y-48550547D01*
X71234672Y-48550541D01*
X71079458Y-48395327D01*
X71079452Y-48395322D01*
X70899650Y-48269423D01*
X70899642Y-48269419D01*
X70700708Y-48176655D01*
X70700706Y-48176654D01*
X70700703Y-48176653D01*
X70549885Y-48136240D01*
X70488675Y-48119839D01*
X70488668Y-48119838D01*
X70270002Y-48100708D01*
X70269998Y-48100708D01*
X70051331Y-48119838D01*
X70051324Y-48119839D01*
X69928902Y-48152642D01*
X69839297Y-48176653D01*
X69839295Y-48176653D01*
X69839291Y-48176655D01*
X69640357Y-48269419D01*
X69640349Y-48269423D01*
X69460547Y-48395322D01*
X69460541Y-48395327D01*
X69305327Y-48550541D01*
X69305322Y-48550547D01*
X69179423Y-48730349D01*
X69179419Y-48730357D01*
X69086655Y-48929291D01*
X69029839Y-49141324D01*
X69029838Y-49141331D01*
X69010708Y-49359997D01*
X56508500Y-49359997D01*
X56508500Y-45058135D01*
X74015500Y-45058135D01*
X74015500Y-46661870D01*
X74015501Y-46661876D01*
X74021908Y-46721483D01*
X74072202Y-46856328D01*
X74072206Y-46856335D01*
X74158452Y-46971544D01*
X74158455Y-46971547D01*
X74273664Y-47057793D01*
X74273671Y-47057797D01*
X74408517Y-47108091D01*
X74408516Y-47108091D01*
X74415444Y-47108835D01*
X74468127Y-47114500D01*
X76071872Y-47114499D01*
X76131483Y-47108091D01*
X76266331Y-47057796D01*
X76343538Y-46999999D01*
X95614341Y-46999999D01*
X95614341Y-47000000D01*
X95634936Y-47235403D01*
X95634938Y-47235413D01*
X95696094Y-47463655D01*
X95696096Y-47463659D01*
X95696097Y-47463663D01*
X95795965Y-47677830D01*
X95795967Y-47677834D01*
X95931501Y-47871395D01*
X95931506Y-47871402D01*
X96098597Y-48038493D01*
X96098603Y-48038498D01*
X96284594Y-48168730D01*
X96328219Y-48223307D01*
X96335413Y-48292805D01*
X96303890Y-48355160D01*
X96284595Y-48371880D01*
X96098922Y-48501890D01*
X96098920Y-48501891D01*
X95931891Y-48668920D01*
X95931886Y-48668926D01*
X95796400Y-48862420D01*
X95796399Y-48862422D01*
X95696570Y-49076507D01*
X95696567Y-49076513D01*
X95639364Y-49289999D01*
X95639364Y-49290000D01*
X96536988Y-49290000D01*
X96504075Y-49347007D01*
X96470000Y-49474174D01*
X96470000Y-49605826D01*
X96504075Y-49732993D01*
X96536988Y-49790000D01*
X95639364Y-49790000D01*
X95696567Y-50003486D01*
X95696570Y-50003492D01*
X95796399Y-50217578D01*
X95931894Y-50411082D01*
X96098917Y-50578105D01*
X96284595Y-50708119D01*
X96328219Y-50762696D01*
X96335412Y-50832195D01*
X96303890Y-50894549D01*
X96284595Y-50911269D01*
X96098594Y-51041508D01*
X95931505Y-51208597D01*
X95795965Y-51402169D01*
X95795964Y-51402171D01*
X95696098Y-51616335D01*
X95696094Y-51616344D01*
X95634938Y-51844586D01*
X95634936Y-51844596D01*
X95614341Y-52079999D01*
X95614341Y-52080000D01*
X95634936Y-52315403D01*
X95634938Y-52315413D01*
X95696094Y-52543655D01*
X95696096Y-52543659D01*
X95696097Y-52543663D01*
X95795965Y-52757830D01*
X95795967Y-52757834D01*
X95931501Y-52951395D01*
X95931506Y-52951402D01*
X96098597Y-53118493D01*
X96098603Y-53118498D01*
X96284158Y-53248425D01*
X96327783Y-53303002D01*
X96334977Y-53372500D01*
X96303454Y-53434855D01*
X96284158Y-53451575D01*
X96098597Y-53581505D01*
X95931505Y-53748597D01*
X95795965Y-53942169D01*
X95795964Y-53942171D01*
X95696098Y-54156335D01*
X95696094Y-54156344D01*
X95634938Y-54384586D01*
X95634936Y-54384596D01*
X95614341Y-54619999D01*
X95614341Y-54620000D01*
X95634936Y-54855403D01*
X95634938Y-54855413D01*
X95696094Y-55083655D01*
X95696096Y-55083659D01*
X95696097Y-55083663D01*
X95739459Y-55176653D01*
X95795965Y-55297830D01*
X95795967Y-55297834D01*
X95864232Y-55395326D01*
X95931505Y-55491401D01*
X96098599Y-55658495D01*
X96195140Y-55726094D01*
X96292165Y-55794032D01*
X96292167Y-55794033D01*
X96292170Y-55794035D01*
X96506337Y-55893903D01*
X96734592Y-55955063D01*
X96922918Y-55971539D01*
X96969999Y-55975659D01*
X96970000Y-55975659D01*
X96970001Y-55975659D01*
X97009234Y-55972226D01*
X97205408Y-55955063D01*
X97433663Y-55893903D01*
X97647830Y-55794035D01*
X97841401Y-55658495D01*
X98008495Y-55491401D01*
X98144035Y-55297830D01*
X98243903Y-55083663D01*
X98305063Y-54855408D01*
X98325659Y-54620000D01*
X98305063Y-54384592D01*
X98243903Y-54156337D01*
X98144035Y-53942171D01*
X98061766Y-53824677D01*
X98008494Y-53748597D01*
X97841402Y-53581506D01*
X97841396Y-53581501D01*
X97655842Y-53451575D01*
X97612217Y-53396998D01*
X97605023Y-53327500D01*
X97636546Y-53265145D01*
X97655842Y-53248425D01*
X97678026Y-53232891D01*
X97841401Y-53118495D01*
X98008495Y-52951401D01*
X98144035Y-52757830D01*
X98243903Y-52543663D01*
X98305063Y-52315408D01*
X98325659Y-52080000D01*
X98305063Y-51844592D01*
X98243903Y-51616337D01*
X98144035Y-51402171D01*
X98008495Y-51208599D01*
X98008494Y-51208597D01*
X97841402Y-51041506D01*
X97841401Y-51041505D01*
X97655405Y-50911269D01*
X97611781Y-50856692D01*
X97604588Y-50787193D01*
X97636110Y-50724839D01*
X97655405Y-50708119D01*
X97841082Y-50578105D01*
X98008105Y-50411082D01*
X98143600Y-50217578D01*
X98243429Y-50003492D01*
X98243432Y-50003486D01*
X98300636Y-49790000D01*
X97403012Y-49790000D01*
X97435925Y-49732993D01*
X97470000Y-49605826D01*
X97470000Y-49474174D01*
X97435925Y-49347007D01*
X97403012Y-49290000D01*
X98300636Y-49290000D01*
X98300635Y-49289999D01*
X98243432Y-49076513D01*
X98243429Y-49076507D01*
X98143600Y-48862422D01*
X98143599Y-48862420D01*
X98008113Y-48668926D01*
X98008108Y-48668920D01*
X97841078Y-48501890D01*
X97655405Y-48371879D01*
X97611780Y-48317302D01*
X97604588Y-48247804D01*
X97636110Y-48185449D01*
X97655406Y-48168730D01*
X97841401Y-48038495D01*
X98008495Y-47871401D01*
X98144035Y-47677830D01*
X98243903Y-47463663D01*
X98305063Y-47235408D01*
X98325659Y-47000000D01*
X98305063Y-46764592D01*
X98243903Y-46536337D01*
X98144035Y-46322171D01*
X98008495Y-46128599D01*
X97886567Y-46006671D01*
X97853084Y-45945351D01*
X97858068Y-45875659D01*
X97899939Y-45819725D01*
X97930915Y-45802810D01*
X98062331Y-45753796D01*
X98177546Y-45667546D01*
X98263796Y-45552331D01*
X98314091Y-45417483D01*
X98320500Y-45357873D01*
X98320499Y-43562128D01*
X98314091Y-43502517D01*
X98274013Y-43395063D01*
X98263797Y-43367671D01*
X98263793Y-43367664D01*
X98177547Y-43252455D01*
X98177544Y-43252452D01*
X98062335Y-43166206D01*
X98062328Y-43166202D01*
X97927482Y-43115908D01*
X97927483Y-43115908D01*
X97867883Y-43109501D01*
X97867881Y-43109500D01*
X97867873Y-43109500D01*
X97867864Y-43109500D01*
X96072129Y-43109500D01*
X96072123Y-43109501D01*
X96012516Y-43115908D01*
X95877671Y-43166202D01*
X95877664Y-43166206D01*
X95762455Y-43252452D01*
X95762452Y-43252455D01*
X95676206Y-43367664D01*
X95676202Y-43367671D01*
X95625908Y-43502517D01*
X95619501Y-43562116D01*
X95619501Y-43562123D01*
X95619500Y-43562135D01*
X95619500Y-45357870D01*
X95619501Y-45357876D01*
X95625908Y-45417483D01*
X95676202Y-45552328D01*
X95676206Y-45552335D01*
X95762452Y-45667544D01*
X95762455Y-45667547D01*
X95877664Y-45753793D01*
X95877671Y-45753797D01*
X96009081Y-45802810D01*
X96065015Y-45844681D01*
X96089432Y-45910145D01*
X96074580Y-45978418D01*
X96053430Y-46006673D01*
X95931503Y-46128600D01*
X95795965Y-46322169D01*
X95795964Y-46322171D01*
X95696098Y-46536335D01*
X95696094Y-46536344D01*
X95634938Y-46764586D01*
X95634936Y-46764596D01*
X95614341Y-46999999D01*
X76343538Y-46999999D01*
X76381546Y-46971546D01*
X76467796Y-46856331D01*
X76518091Y-46721483D01*
X76524500Y-46661873D01*
X76524499Y-45058128D01*
X76518091Y-44998517D01*
X76467796Y-44863669D01*
X76467795Y-44863668D01*
X76467793Y-44863664D01*
X76381547Y-44748455D01*
X76381544Y-44748452D01*
X76266335Y-44662206D01*
X76266328Y-44662202D01*
X76131482Y-44611908D01*
X76131483Y-44611908D01*
X76071883Y-44605501D01*
X76071881Y-44605500D01*
X76071873Y-44605500D01*
X76071864Y-44605500D01*
X74468129Y-44605500D01*
X74468123Y-44605501D01*
X74408516Y-44611908D01*
X74273671Y-44662202D01*
X74273664Y-44662206D01*
X74158455Y-44748452D01*
X74158452Y-44748455D01*
X74072206Y-44863664D01*
X74072202Y-44863671D01*
X74021908Y-44998517D01*
X74015501Y-45058116D01*
X74015501Y-45058123D01*
X74015500Y-45058135D01*
X56508500Y-45058135D01*
X56508500Y-40003052D01*
X56508649Y-39996968D01*
X56514942Y-39868872D01*
X57999500Y-39868872D01*
X57999500Y-40131127D01*
X58026123Y-40333339D01*
X58033730Y-40391116D01*
X58101602Y-40644418D01*
X58101605Y-40644428D01*
X58201953Y-40886690D01*
X58201958Y-40886700D01*
X58333075Y-41113803D01*
X58492718Y-41321851D01*
X58492726Y-41321860D01*
X58678140Y-41507274D01*
X58678148Y-41507281D01*
X58886196Y-41666924D01*
X59113299Y-41798041D01*
X59113309Y-41798046D01*
X59355571Y-41898394D01*
X59355581Y-41898398D01*
X59608884Y-41966270D01*
X59868880Y-42000500D01*
X59868887Y-42000500D01*
X60131113Y-42000500D01*
X60131120Y-42000500D01*
X60391116Y-41966270D01*
X60644419Y-41898398D01*
X60886697Y-41798043D01*
X61113803Y-41666924D01*
X61321851Y-41507282D01*
X61321855Y-41507277D01*
X61321860Y-41507274D01*
X61507274Y-41321860D01*
X61507277Y-41321855D01*
X61507282Y-41321851D01*
X61629837Y-41162135D01*
X83419500Y-41162135D01*
X83419500Y-42957870D01*
X83419501Y-42957876D01*
X83425908Y-43017483D01*
X83476202Y-43152328D01*
X83476206Y-43152335D01*
X83562452Y-43267544D01*
X83562455Y-43267547D01*
X83677664Y-43353793D01*
X83677671Y-43353797D01*
X83812517Y-43404091D01*
X83812516Y-43404091D01*
X83819444Y-43404835D01*
X83872127Y-43410500D01*
X85667872Y-43410499D01*
X85727483Y-43404091D01*
X85862331Y-43353796D01*
X85977546Y-43267546D01*
X86063796Y-43152331D01*
X86112810Y-43020916D01*
X86154681Y-42964984D01*
X86220145Y-42940566D01*
X86288418Y-42955417D01*
X86316673Y-42976569D01*
X86438599Y-43098495D01*
X86535295Y-43166202D01*
X86632165Y-43234032D01*
X86632167Y-43234033D01*
X86632170Y-43234035D01*
X86846337Y-43333903D01*
X87074592Y-43395063D01*
X87251034Y-43410500D01*
X87309999Y-43415659D01*
X87310000Y-43415659D01*
X87310001Y-43415659D01*
X87368966Y-43410500D01*
X87545408Y-43395063D01*
X87773663Y-43333903D01*
X87987830Y-43234035D01*
X88181401Y-43098495D01*
X88348495Y-42931401D01*
X88478425Y-42745842D01*
X88533002Y-42702217D01*
X88602500Y-42695023D01*
X88664855Y-42726546D01*
X88681575Y-42745842D01*
X88811500Y-42931395D01*
X88811505Y-42931401D01*
X88978599Y-43098495D01*
X89075295Y-43166202D01*
X89172165Y-43234032D01*
X89172167Y-43234033D01*
X89172170Y-43234035D01*
X89386337Y-43333903D01*
X89614592Y-43395063D01*
X89791034Y-43410500D01*
X89849999Y-43415659D01*
X89850000Y-43415659D01*
X89850001Y-43415659D01*
X89908966Y-43410500D01*
X90085408Y-43395063D01*
X90313663Y-43333903D01*
X90527830Y-43234035D01*
X90721401Y-43098495D01*
X90888495Y-42931401D01*
X91024035Y-42737830D01*
X91123903Y-42523663D01*
X91185063Y-42295408D01*
X91205659Y-42060000D01*
X91185063Y-41824592D01*
X91123903Y-41596337D01*
X91024035Y-41382171D01*
X91018425Y-41374158D01*
X90888494Y-41188597D01*
X90721402Y-41021506D01*
X90721395Y-41021501D01*
X90527834Y-40885967D01*
X90527830Y-40885965D01*
X90527828Y-40885964D01*
X90313663Y-40786097D01*
X90313659Y-40786096D01*
X90313655Y-40786094D01*
X90085413Y-40724938D01*
X90085403Y-40724936D01*
X89850001Y-40704341D01*
X89849999Y-40704341D01*
X89614596Y-40724936D01*
X89614586Y-40724938D01*
X89386344Y-40786094D01*
X89386335Y-40786098D01*
X89172171Y-40885964D01*
X89172169Y-40885965D01*
X88978597Y-41021505D01*
X88811505Y-41188597D01*
X88681575Y-41374158D01*
X88626998Y-41417783D01*
X88557500Y-41424977D01*
X88495145Y-41393454D01*
X88478425Y-41374158D01*
X88348494Y-41188597D01*
X88181402Y-41021506D01*
X88181395Y-41021501D01*
X87987834Y-40885967D01*
X87987830Y-40885965D01*
X87987828Y-40885964D01*
X87773663Y-40786097D01*
X87773659Y-40786096D01*
X87773655Y-40786094D01*
X87545413Y-40724938D01*
X87545403Y-40724936D01*
X87310001Y-40704341D01*
X87309999Y-40704341D01*
X87074596Y-40724936D01*
X87074586Y-40724938D01*
X86846344Y-40786094D01*
X86846335Y-40786098D01*
X86632171Y-40885964D01*
X86632169Y-40885965D01*
X86438600Y-41021503D01*
X86316673Y-41143430D01*
X86255350Y-41176914D01*
X86185658Y-41171930D01*
X86129725Y-41130058D01*
X86112810Y-41099081D01*
X86063797Y-40967671D01*
X86063793Y-40967664D01*
X85977547Y-40852455D01*
X85977544Y-40852452D01*
X85862335Y-40766206D01*
X85862328Y-40766202D01*
X85727482Y-40715908D01*
X85727483Y-40715908D01*
X85667883Y-40709501D01*
X85667881Y-40709500D01*
X85667873Y-40709500D01*
X85667864Y-40709500D01*
X83872129Y-40709500D01*
X83872123Y-40709501D01*
X83812516Y-40715908D01*
X83677671Y-40766202D01*
X83677664Y-40766206D01*
X83562455Y-40852452D01*
X83562452Y-40852455D01*
X83476206Y-40967664D01*
X83476202Y-40967671D01*
X83425908Y-41102517D01*
X83419501Y-41162116D01*
X83419500Y-41162135D01*
X61629837Y-41162135D01*
X61666924Y-41113803D01*
X61798043Y-40886697D01*
X61898398Y-40644419D01*
X61966270Y-40391116D01*
X62000500Y-40131120D01*
X62000500Y-39868880D01*
X62000499Y-39868872D01*
X117999500Y-39868872D01*
X117999500Y-40131127D01*
X118026123Y-40333339D01*
X118033730Y-40391116D01*
X118101602Y-40644418D01*
X118101605Y-40644428D01*
X118201953Y-40886690D01*
X118201958Y-40886700D01*
X118333075Y-41113803D01*
X118492718Y-41321851D01*
X118492726Y-41321860D01*
X118678140Y-41507274D01*
X118678148Y-41507281D01*
X118886196Y-41666924D01*
X119113299Y-41798041D01*
X119113309Y-41798046D01*
X119355571Y-41898394D01*
X119355581Y-41898398D01*
X119608884Y-41966270D01*
X119868880Y-42000500D01*
X119868887Y-42000500D01*
X120131113Y-42000500D01*
X120131120Y-42000500D01*
X120391116Y-41966270D01*
X120644419Y-41898398D01*
X120886697Y-41798043D01*
X121113803Y-41666924D01*
X121321851Y-41507282D01*
X121321855Y-41507277D01*
X121321860Y-41507274D01*
X121507274Y-41321860D01*
X121507277Y-41321855D01*
X121507282Y-41321851D01*
X121666924Y-41113803D01*
X121798043Y-40886697D01*
X121898398Y-40644419D01*
X121966270Y-40391116D01*
X122000500Y-40131120D01*
X122000500Y-39868880D01*
X121966270Y-39608884D01*
X121898398Y-39355581D01*
X121880733Y-39312934D01*
X121798046Y-39113309D01*
X121798041Y-39113299D01*
X121666924Y-38886196D01*
X121507281Y-38678148D01*
X121507274Y-38678140D01*
X121321860Y-38492726D01*
X121321851Y-38492718D01*
X121113803Y-38333075D01*
X120886700Y-38201958D01*
X120886690Y-38201953D01*
X120644428Y-38101605D01*
X120644421Y-38101603D01*
X120644419Y-38101602D01*
X120391116Y-38033730D01*
X120333339Y-38026123D01*
X120131127Y-37999500D01*
X120131120Y-37999500D01*
X119868880Y-37999500D01*
X119868872Y-37999500D01*
X119637772Y-38029926D01*
X119608884Y-38033730D01*
X119355581Y-38101602D01*
X119355571Y-38101605D01*
X119113309Y-38201953D01*
X119113299Y-38201958D01*
X118886196Y-38333075D01*
X118678148Y-38492718D01*
X118492718Y-38678148D01*
X118333075Y-38886196D01*
X118201958Y-39113299D01*
X118201953Y-39113309D01*
X118101605Y-39355571D01*
X118101602Y-39355581D01*
X118033730Y-39608885D01*
X117999500Y-39868872D01*
X62000499Y-39868872D01*
X61966270Y-39608884D01*
X61898398Y-39355581D01*
X61880733Y-39312934D01*
X61798046Y-39113309D01*
X61798041Y-39113299D01*
X61666924Y-38886196D01*
X61507281Y-38678148D01*
X61507274Y-38678140D01*
X61321860Y-38492726D01*
X61321851Y-38492718D01*
X61113803Y-38333075D01*
X60886700Y-38201958D01*
X60886690Y-38201953D01*
X60644428Y-38101605D01*
X60644421Y-38101603D01*
X60644419Y-38101602D01*
X60391116Y-38033730D01*
X60333339Y-38026123D01*
X60131127Y-37999500D01*
X60131120Y-37999500D01*
X59868880Y-37999500D01*
X59868872Y-37999500D01*
X59637772Y-38029926D01*
X59608884Y-38033730D01*
X59355581Y-38101602D01*
X59355571Y-38101605D01*
X59113309Y-38201953D01*
X59113299Y-38201958D01*
X58886196Y-38333075D01*
X58678148Y-38492718D01*
X58492718Y-38678148D01*
X58333075Y-38886196D01*
X58201958Y-39113299D01*
X58201953Y-39113309D01*
X58101605Y-39355571D01*
X58101602Y-39355581D01*
X58033730Y-39608885D01*
X57999500Y-39868872D01*
X56514942Y-39868872D01*
X56525014Y-39663854D01*
X56526207Y-39651744D01*
X56574696Y-39324853D01*
X56577063Y-39312951D01*
X56657368Y-38992355D01*
X56660892Y-38980744D01*
X56772224Y-38669591D01*
X56776869Y-38658376D01*
X56918179Y-38359599D01*
X56923894Y-38348907D01*
X57093797Y-38065443D01*
X57100540Y-38055350D01*
X57297416Y-37789893D01*
X57305119Y-37780508D01*
X57527062Y-37535632D01*
X57535632Y-37527062D01*
X57780508Y-37305119D01*
X57789893Y-37297416D01*
X58055350Y-37100540D01*
X58065443Y-37093797D01*
X58348907Y-36923894D01*
X58359599Y-36918179D01*
X58658376Y-36776869D01*
X58669591Y-36772224D01*
X58980744Y-36660892D01*
X58992355Y-36657368D01*
X59312951Y-36577063D01*
X59324853Y-36574696D01*
X59651750Y-36526206D01*
X59663848Y-36525014D01*
X59948048Y-36511052D01*
X59996968Y-36508649D01*
X60003052Y-36508500D01*
X60066945Y-36508500D01*
X119933055Y-36508500D01*
X119996948Y-36508500D01*
X120003032Y-36508649D01*
G37*
G04 #@! TD.AperFunction*
M02*
