(kicad_sch (version 20230121) (generator eeschema)

  (uuid 58a0c984-2dd0-45c1-b50d-882de56afa2c)

  (paper "A4")

  (lib_symbols
    (symbol "Device:NetTie_2" (pin_numbers hide) (pin_names (offset 0) hide) (in_bom no) (on_board yes)
      (property "Reference" "NT" (at 0 1.27 0)
        (effects (font (size 1.27 1.27)))
      )
      (property "Value" "NetTie_2" (at 0 -1.27 0)
        (effects (font (size 1.27 1.27)))
      )
      (property "Footprint" "" (at 0 0 0)
        (effects (font (size 1.27 1.27)) hide)
      )
      (property "Datasheet" "~" (at 0 0 0)
        (effects (font (size 1.27 1.27)) hide)
      )
      (property "ki_keywords" "net tie short" (at 0 0 0)
        (effects (font (size 1.27 1.27)) hide)
      )
      (property "ki_description" "Net tie, 2 pins" (at 0 0 0)
        (effects (font (size 1.27 1.27)) hide)
      )
      (property "ki_fp_filters" "Net*Tie*" (at 0 0 0)
        (effects (font (size 1.27 1.27)) hide)
      )
      (symbol "NetTie_2_0_1"
        (polyline
          (pts
            (xy -1.27 0)
            (xy 1.27 0)
          )
          (stroke (width 0.254) (type default))
          (fill (type none))
        )
      )
      (symbol "NetTie_2_1_1"
        (pin passive line (at -2.54 0 0) (length 2.54)
          (name "1" (effects (font (size 1.27 1.27))))
          (number "1" (effects (font (size 1.27 1.27))))
        )
        (pin passive line (at 2.54 0 180) (length 2.54)
          (name "2" (effects (font (size 1.27 1.27))))
          (number "2" (effects (font (size 1.27 1.27))))
        )
      )
    )
  )


  (wire (pts (xy 134.493 56.642) (xy 136.525 56.642))
    (stroke (width 0) (type default))
    (uuid 1ca8a0fc-d9ae-4b39-b7de-5fa3c41c386a)
  )
  (wire (pts (xy 141.605 56.642) (xy 143.51 56.642))
    (stroke (width 0) (type default))
    (uuid 93e11fff-e3d3-4c83-9bbd-f6ef6a0d2591)
  )

  (global_label "Vin-" (shape input) (at 143.51 56.642 0) (fields_autoplaced)
    (effects (font (size 1.27 1.27)) (justify left))
    (uuid 641a873c-71b3-40ca-b019-955ff19037d5)
    (property "Intersheetrefs" "${INTERSHEET_REFS}" (at 150.8306 56.642 0)
      (effects (font (size 1.27 1.27)) (justify left) hide)
    )
  )
  (global_label "Vin+" (shape input) (at 134.493 56.642 180) (fields_autoplaced)
    (effects (font (size 1.27 1.27)) (justify right))
    (uuid ee11efa3-9fdb-4fa8-b629-b5724c4a677c)
    (property "Intersheetrefs" "${INTERSHEET_REFS}" (at 127.1724 56.642 0)
      (effects (font (size 1.27 1.27)) (justify right) hide)
    )
  )

  (symbol (lib_id "Device:NetTie_2") (at 139.065 56.642 0) (unit 1)
    (in_bom no) (on_board yes) (dnp no) (fields_autoplaced)
    (uuid 4c1330b7-c437-41b1-92e4-3a40d0753641)
    (property "Reference" "NT1" (at 139.065 51.816 0)
      (effects (font (size 1.27 1.27)))
    )
    (property "Value" "NetTie_2" (at 139.065 54.356 0)
      (effects (font (size 1.27 1.27)))
    )
    (property "Footprint" "NetTie:NetTie-2_SMD_Pad0.5mm" (at 139.065 56.642 0)
      (effects (font (size 1.27 1.27)) hide)
    )
    (property "Datasheet" "~" (at 139.065 56.642 0)
      (effects (font (size 1.27 1.27)) hide)
    )
    (pin "1" (uuid ad3f8008-d56a-4db9-bcb7-ca5e775d340a))
    (pin "2" (uuid accb75d8-e82c-4f46-ad03-1b4ec5a6e5a5))
    (instances
      (project "flex-heater-2"
        (path "/58a0c984-2dd0-45c1-b50d-882de56afa2c"
          (reference "NT1") (unit 1)
        )
      )
      (project "flex-heater"
        (path "/8d8672bf-d156-4806-9539-e2797e9fef33"
          (reference "NT1") (unit 1)
        )
      )
    )
  )

  (sheet_instances
    (path "/" (page "1"))
  )
)
