(footprint "SOP65P640X110-28N" (version 20221018) (generator pcbnew)
  (layer "F.Cu")
  (descr "28-LEAD TSSOP")
  (tags "Integrated Circuit")
  (attr smd)
  (fp_text reference "IC**" (at 0 0) (layer "F.SilkS")
      (effects (font (size 1.27 1.27) (thickness 0.254)))
    (tstamp bcfaa23e-c2e3-47ea-ad14-68ba2476f7e6)
  )
  (fp_text value "SOP65P640X110-28N" (at 0 0) (layer "F.SilkS") hide
      (effects (font (size 1.27 1.27) (thickness 0.254)))
    (tstamp 8c4bff9f-5f07-47bd-930e-7d3df6f981a6)
  )
  (fp_text user "${REFERENCE}" (at 0 0) (layer "F.Fab")
      (effects (font (size 1.27 1.27) (thickness 0.254)))
    (tstamp c8c5df6d-4202-427f-a94a-d0a5fbc85b74)
  )
  (fp_line (start -3.675 -4.8) (end -2.2 -4.8)
    (stroke (width 0.2) (type solid)) (layer "F.SilkS") (tstamp 07ebb044-3741-4263-bdf4-8a4d8633468a))
  (fp_line (start -1.85 -4.85) (end 1.85 -4.85)
    (stroke (width 0.2) (type solid)) (layer "F.SilkS") (tstamp 88551fa3-729d-46c9-a5e0-dbaa1df07b88))
  (fp_line (start -1.85 4.85) (end -1.85 -4.85)
    (stroke (width 0.2) (type solid)) (layer "F.SilkS") (tstamp f6a3bf1f-edeb-4562-a32c-004e3d671832))
  (fp_line (start 1.85 -4.85) (end 1.85 4.85)
    (stroke (width 0.2) (type solid)) (layer "F.SilkS") (tstamp 73601a79-09a1-4831-a5d3-7fb676984e1b))
  (fp_line (start 1.85 4.85) (end -1.85 4.85)
    (stroke (width 0.2) (type solid)) (layer "F.SilkS") (tstamp c4154ee9-f61a-4a7f-80cc-ace1c38c3f6c))
  (fp_line (start -3.925 -5.15) (end 3.925 -5.15)
    (stroke (width 0.05) (type solid)) (layer "F.CrtYd") (tstamp 2728f91b-d31c-4c29-a706-3f99c1c79d58))
  (fp_line (start -3.925 5.15) (end -3.925 -5.15)
    (stroke (width 0.05) (type solid)) (layer "F.CrtYd") (tstamp 12d4dcb2-25a9-4bbc-9cd1-5bb79fc4b7d9))
  (fp_line (start 3.925 -5.15) (end 3.925 5.15)
    (stroke (width 0.05) (type solid)) (layer "F.CrtYd") (tstamp 70f6ef44-d715-41f9-b042-f84dff08edd1))
  (fp_line (start 3.925 5.15) (end -3.925 5.15)
    (stroke (width 0.05) (type solid)) (layer "F.CrtYd") (tstamp 4e5ea57d-2f6c-478b-aa4b-19a82970390d))
  (fp_line (start -2.2 -4.85) (end 2.2 -4.85)
    (stroke (width 0.1) (type solid)) (layer "F.Fab") (tstamp c3528710-1aeb-4d65-996f-308468bcbe73))
  (fp_line (start -2.2 -4.2) (end -1.55 -4.85)
    (stroke (width 0.1) (type solid)) (layer "F.Fab") (tstamp b6cd31ad-14bf-4045-9d9f-050660fde1de))
  (fp_line (start -2.2 4.85) (end -2.2 -4.85)
    (stroke (width 0.1) (type solid)) (layer "F.Fab") (tstamp fa1c1cda-8144-48b5-be16-3b8edbfcad38))
  (fp_line (start 2.2 -4.85) (end 2.2 4.85)
    (stroke (width 0.1) (type solid)) (layer "F.Fab") (tstamp cb342c0e-c0b9-4832-8182-48eb6b4ef276))
  (fp_line (start 2.2 4.85) (end -2.2 4.85)
    (stroke (width 0.1) (type solid)) (layer "F.Fab") (tstamp 2a4342ba-9e08-420c-9f93-512a091183ae))
  (pad "1" smd rect (at -2.938 -4.225 90) (size 0.45 1.475) (layers "F.Cu" "F.Paste" "F.Mask") (tstamp 7a3dc572-4777-4ccc-9b31-5c34fe1a9fd4))
  (pad "2" smd rect (at -2.938 -3.575 90) (size 0.45 1.475) (layers "F.Cu" "F.Paste" "F.Mask") (tstamp 15a20002-efba-417e-9c19-62c35ced36cf))
  (pad "3" smd rect (at -2.938 -2.925 90) (size 0.45 1.475) (layers "F.Cu" "F.Paste" "F.Mask") (tstamp 6b4abaf6-2fbc-42bd-81f6-74fd0e4d9d62))
  (pad "4" smd rect (at -2.938 -2.275 90) (size 0.45 1.475) (layers "F.Cu" "F.Paste" "F.Mask") (tstamp 9d8f27bd-1608-4c83-b981-de05bdb35f95))
  (pad "5" smd rect (at -2.938 -1.625 90) (size 0.45 1.475) (layers "F.Cu" "F.Paste" "F.Mask") (tstamp 2499fe5a-57b1-441f-98bd-7d39c1ffec18))
  (pad "6" smd rect (at -2.938 -0.975 90) (size 0.45 1.475) (layers "F.Cu" "F.Paste" "F.Mask") (tstamp c2b4833c-dde0-4ac8-8f9d-7d3514188ddf))
  (pad "7" smd rect (at -2.938 -0.325 90) (size 0.45 1.475) (layers "F.Cu" "F.Paste" "F.Mask") (tstamp 58ccbb08-fe5d-4ea9-ae77-ce30aafb9b52))
  (pad "8" smd rect (at -2.938 0.325 90) (size 0.45 1.475) (layers "F.Cu" "F.Paste" "F.Mask") (tstamp 30c77c26-22c8-4e19-a83c-892d1ea435b6))
  (pad "9" smd rect (at -2.938 0.975 90) (size 0.45 1.475) (layers "F.Cu" "F.Paste" "F.Mask") (tstamp 32ea139a-dff8-423d-8ab9-b282ddf728bf))
  (pad "10" smd rect (at -2.938 1.625 90) (size 0.45 1.475) (layers "F.Cu" "F.Paste" "F.Mask") (tstamp 378f9cac-acd0-4b93-938d-618a5539a1b5))
  (pad "11" smd rect (at -2.938 2.275 90) (size 0.45 1.475) (layers "F.Cu" "F.Paste" "F.Mask") (tstamp 4a426e0c-bda9-45ff-a5e3-2e0e6abfd851))
  (pad "12" smd rect (at -2.938 2.925 90) (size 0.45 1.475) (layers "F.Cu" "F.Paste" "F.Mask") (tstamp ce727cb4-e2f6-481e-8408-15163775ccff))
  (pad "13" smd rect (at -2.938 3.575 90) (size 0.45 1.475) (layers "F.Cu" "F.Paste" "F.Mask") (tstamp cc64660f-ae5e-4dab-89ac-1d2b9a018765))
  (pad "14" smd rect (at -2.938 4.225 90) (size 0.45 1.475) (layers "F.Cu" "F.Paste" "F.Mask") (tstamp ae34d1c5-997e-420b-a679-519ce42dbcfe))
  (pad "15" smd rect (at 2.938 4.225 90) (size 0.45 1.475) (layers "F.Cu" "F.Paste" "F.Mask") (tstamp f01e0787-e3b4-47a7-915b-6ca8f3b227b3))
  (pad "16" smd rect (at 2.938 3.575 90) (size 0.45 1.475) (layers "F.Cu" "F.Paste" "F.Mask") (tstamp 68fa5e59-7d95-42c5-b2d1-27b4b5d2dd07))
  (pad "17" smd rect (at 2.938 2.925 90) (size 0.45 1.475) (layers "F.Cu" "F.Paste" "F.Mask") (tstamp 44a71699-78ce-4a1e-8d5f-f733dcc048ce))
  (pad "18" smd rect (at 2.938 2.275 90) (size 0.45 1.475) (layers "F.Cu" "F.Paste" "F.Mask") (tstamp ea1dbb10-2f21-4438-a900-e59bf20070ea))
  (pad "19" smd rect (at 2.938 1.625 90) (size 0.45 1.475) (layers "F.Cu" "F.Paste" "F.Mask") (tstamp efd6d6a0-3a7f-42b1-a2b0-64c98bf77a95))
  (pad "20" smd rect (at 2.938 0.975 90) (size 0.45 1.475) (layers "F.Cu" "F.Paste" "F.Mask") (tstamp 929f751f-d377-4401-abcf-a1699195f3c3))
  (pad "21" smd rect (at 2.938 0.325 90) (size 0.45 1.475) (layers "F.Cu" "F.Paste" "F.Mask") (tstamp ff17f3a1-25f4-409d-8da3-45b6dd5418fd))
  (pad "22" smd rect (at 2.938 -0.325 90) (size 0.45 1.475) (layers "F.Cu" "F.Paste" "F.Mask") (tstamp f1cf844f-ead0-43a2-8d53-f8266fa60810))
  (pad "23" smd rect (at 2.938 -0.975 90) (size 0.45 1.475) (layers "F.Cu" "F.Paste" "F.Mask") (tstamp 41f394cd-c559-42f6-9d7b-d737b9dc6ef1))
  (pad "24" smd rect (at 2.938 -1.625 90) (size 0.45 1.475) (layers "F.Cu" "F.Paste" "F.Mask") (tstamp b498bb00-796b-4e1f-8e8a-a7d117f02ea1))
  (pad "25" smd rect (at 2.938 -2.275 90) (size 0.45 1.475) (layers "F.Cu" "F.Paste" "F.Mask") (tstamp 632b4074-2a4f-453c-ab7a-060079b46354))
  (pad "26" smd rect (at 2.938 -2.925 90) (size 0.45 1.475) (layers "F.Cu" "F.Paste" "F.Mask") (tstamp f7934175-728c-4ac5-adf4-21a9102be8fb))
  (pad "27" smd rect (at 2.938 -3.575 90) (size 0.45 1.475) (layers "F.Cu" "F.Paste" "F.Mask") (tstamp b92def29-74eb-4ae1-bd86-667e6640a22b))
  (pad "28" smd rect (at 2.938 -4.225 90) (size 0.45 1.475) (layers "F.Cu" "F.Paste" "F.Mask") (tstamp cd792cfb-7756-424d-a41f-4515a012e0e5))
  (model "${KIPRJMOD}/3D/PCA9685PW,118.stp"
    (offset (xyz 0 0 0))
    (scale (xyz 1 1 1))
    (rotate (xyz 0 0 0))
  )
)
