(kicad_symbol_lib (version 20220914) (generator kicad_symbol_editor)
  (symbol "DRV8220DRLR" (in_bom yes) (on_board yes)
    (property "Reference" "IC" (at 24.13 7.62 0)
      (effects (font (size 1.27 1.27)) (justify left top))
    )
    (property "Value" "DRV8220DRLR" (at 24.13 5.08 0)
      (effects (font (size 1.27 1.27)) (justify left top))
    )
    (property "Footprint" "SOTFL50P160X60-6N" (at 24.13 -94.92 0)
      (effects (font (size 1.27 1.27)) (justify left top) hide)
    )
    (property "Datasheet" "https://www.ti.com/lit/ds/symlink/drv8220.pdf?ts=1631525955787&ref_url=https%253A%252F%252Fwww.google.com%252F" (at 24.13 -194.92 0)
      (effects (font (size 1.27 1.27)) (justify left top) hide)
    )
    (property "Height" "0.6" (at 24.13 -394.92 0)
      (effects (font (size 1.27 1.27)) (justify left top) hide)
    )
    (property "Mouser Part Number" "595-DRV8220DRLR" (at 24.13 -494.92 0)
      (effects (font (size 1.27 1.27)) (justify left top) hide)
    )
    (property "Mouser Price/Stock" "https://www.mouser.co.uk/ProductDetail/Texas-Instruments/DRV8220DRLR?qs=A6eO%252BMLsxmTbgRMs5Sh%2FhA%3D%3D" (at 24.13 -594.92 0)
      (effects (font (size 1.27 1.27)) (justify left top) hide)
    )
    (property "Manufacturer_Name" "Texas Instruments" (at 24.13 -694.92 0)
      (effects (font (size 1.27 1.27)) (justify left top) hide)
    )
    (property "Manufacturer_Part_Number" "DRV8220DRLR" (at 24.13 -794.92 0)
      (effects (font (size 1.27 1.27)) (justify left top) hide)
    )
    (property "ki_description" "DRV8220 18-V H-Bridge Motor Driver with PWM, PH/EN, and Half-Bridge Control Interfaces and Low-Power Sleep Mode" (at 0 0 0)
      (effects (font (size 1.27 1.27)) hide)
    )
    (symbol "DRV8220DRLR_1_1"
      (rectangle (start 5.08 2.54) (end 22.86 -7.62)
        (stroke (width 0.254) (type default))
        (fill (type background))
      )
      (pin passive line (at 0 0 0) (length 5.08)
        (name "IN1" (effects (font (size 1.27 1.27))))
        (number "1" (effects (font (size 1.27 1.27))))
      )
      (pin passive line (at 0 -2.54 0) (length 5.08)
        (name "IN2" (effects (font (size 1.27 1.27))))
        (number "2" (effects (font (size 1.27 1.27))))
      )
      (pin passive line (at 0 -5.08 0) (length 5.08)
        (name "GND" (effects (font (size 1.27 1.27))))
        (number "3" (effects (font (size 1.27 1.27))))
      )
      (pin passive line (at 27.94 0 180) (length 5.08)
        (name "OUT2" (effects (font (size 1.27 1.27))))
        (number "4" (effects (font (size 1.27 1.27))))
      )
      (pin passive line (at 27.94 -2.54 180) (length 5.08)
        (name "VM" (effects (font (size 1.27 1.27))))
        (number "5" (effects (font (size 1.27 1.27))))
      )
      (pin passive line (at 27.94 -5.08 180) (length 5.08)
        (name "OUT1" (effects (font (size 1.27 1.27))))
        (number "6" (effects (font (size 1.27 1.27))))
      )
    )
  )
  (symbol "ECS-2520MVLC-120-CN-TR" (pin_names (offset 0.762)) (in_bom yes) (on_board yes)
    (property "Reference" "Y" (at 34.29 7.62 0)
      (effects (font (size 1.27 1.27)) (justify left))
    )
    (property "Value" "ECS-2520MVLC-120-CN-TR" (at 34.29 5.08 0)
      (effects (font (size 1.27 1.27)) (justify left))
    )
    (property "Footprint" "ECS2520MVLC120CNTR" (at 34.29 2.54 0)
      (effects (font (size 1.27 1.27)) (justify left) hide)
    )
    (property "Datasheet" "https://www.google.com/url?sa=t&rct=j&q=&esrc=s&source=web&cd=&ved=2ahUKEwi43cyW_bj2AhVBXBoKHeoCBjUQFnoECBUQAQ&url=https%3A%2F%2Fecsxtal.com%2Fstore%2Fpdf%2FECS-2520MVLC.pdf&usg=AOvVaw1FVHdgV02YD-i1ba9jFZ6a" (at 34.29 0 0)
      (effects (font (size 1.27 1.27)) (justify left) hide)
    )
    (property "Description" "Standard Clock Oscillators 12.000MHz HCMOS Supply Voltage 1.6 3.6 +/-25 ppm -40 +85C" (at 34.29 -2.54 0)
      (effects (font (size 1.27 1.27)) (justify left) hide)
    )
    (property "Height" "0.9" (at 34.29 -5.08 0)
      (effects (font (size 1.27 1.27)) (justify left) hide)
    )
    (property "Mouser Part Number" "520-2520MVLC-120CNTR" (at 34.29 -7.62 0)
      (effects (font (size 1.27 1.27)) (justify left) hide)
    )
    (property "Mouser Price/Stock" "https://www.mouser.co.uk/ProductDetail/ECS/ECS-2520MVLC-120-CN-TR?qs=QNEnbhJQKvYlXhmgfzaaOw%3D%3D" (at 34.29 -10.16 0)
      (effects (font (size 1.27 1.27)) (justify left) hide)
    )
    (property "Manufacturer_Name" "ECS" (at 34.29 -12.7 0)
      (effects (font (size 1.27 1.27)) (justify left) hide)
    )
    (property "Manufacturer_Part_Number" "ECS-2520MVLC-120-CN-TR" (at 34.29 -15.24 0)
      (effects (font (size 1.27 1.27)) (justify left) hide)
    )
    (property "ki_description" "Standard Clock Oscillators 12.000MHz HCMOS Supply Voltage 1.6 3.6 +/-25 ppm -40 +85C" (at 0 0 0)
      (effects (font (size 1.27 1.27)) hide)
    )
    (symbol "ECS-2520MVLC-120-CN-TR_0_0"
      (pin passive line (at 0 -2.54 0) (length 5.08)
        (name "TRI-STATE" (effects (font (size 1.27 1.27))))
        (number "1" (effects (font (size 1.27 1.27))))
      )
      (pin passive line (at 38.1 -2.54 180) (length 5.08)
        (name "GND" (effects (font (size 1.27 1.27))))
        (number "2" (effects (font (size 1.27 1.27))))
      )
      (pin passive line (at 38.1 0 180) (length 5.08)
        (name "OUTPUT" (effects (font (size 1.27 1.27))))
        (number "3" (effects (font (size 1.27 1.27))))
      )
      (pin passive line (at 0 0 0) (length 5.08)
        (name "VDD" (effects (font (size 1.27 1.27))))
        (number "4" (effects (font (size 1.27 1.27))))
      )
    )
    (symbol "ECS-2520MVLC-120-CN-TR_0_1"
      (polyline
        (pts
          (xy 5.08 2.54)
          (xy 33.02 2.54)
          (xy 33.02 -5.08)
          (xy 5.08 -5.08)
          (xy 5.08 2.54)
        )
        (stroke (width 0.1524) (type solid))
        (fill (type none))
      )
    )
  )
  (symbol "NTK3134NT1G" (pin_names (offset 0.762)) (in_bom yes) (on_board yes)
    (property "Reference" "Q" (at 11.43 3.81 0)
      (effects (font (size 1.27 1.27)) (justify left))
    )
    (property "Value" "NTK3134NT1G" (at 11.43 1.27 0)
      (effects (font (size 1.27 1.27)) (justify left))
    )
    (property "Footprint" "NTK3134NT1G" (at 11.43 -1.27 0)
      (effects (font (size 1.27 1.27)) (justify left) hide)
    )
    (property "Datasheet" "http://www.onsemi.com/pub/Collateral/NTK3134N-D.PDF" (at 11.43 -3.81 0)
      (effects (font (size 1.27 1.27)) (justify left) hide)
    )
    (property "Description" "Power MOSFET" (at 11.43 -6.35 0)
      (effects (font (size 1.27 1.27)) (justify left) hide)
    )
    (property "Height" "0.55" (at 11.43 -8.89 0)
      (effects (font (size 1.27 1.27)) (justify left) hide)
    )
    (property "Mouser Part Number" "863-NTK3134NT1G" (at 11.43 -11.43 0)
      (effects (font (size 1.27 1.27)) (justify left) hide)
    )
    (property "Mouser Price/Stock" "https://www.mouser.co.uk/ProductDetail/onsemi/NTK3134NT1G?qs=g97OBWmz8%2FXjV%2Fg5rjrz3Q%3D%3D" (at 11.43 -13.97 0)
      (effects (font (size 1.27 1.27)) (justify left) hide)
    )
    (property "Manufacturer_Name" "onsemi" (at 11.43 -16.51 0)
      (effects (font (size 1.27 1.27)) (justify left) hide)
    )
    (property "Manufacturer_Part_Number" "NTK3134NT1G" (at 11.43 -19.05 0)
      (effects (font (size 1.27 1.27)) (justify left) hide)
    )
    (property "ki_description" "Power MOSFET" (at 0 0 0)
      (effects (font (size 1.27 1.27)) hide)
    )
    (symbol "NTK3134NT1G_0_0"
      (pin passive line (at 0 0 0) (length 2.54)
        (name "~" (effects (font (size 1.27 1.27))))
        (number "1" (effects (font (size 1.27 1.27))))
      )
      (pin passive line (at 7.62 -5.08 90) (length 2.54)
        (name "~" (effects (font (size 1.27 1.27))))
        (number "2" (effects (font (size 1.27 1.27))))
      )
      (pin passive line (at 7.62 10.16 270) (length 2.54)
        (name "~" (effects (font (size 1.27 1.27))))
        (number "3" (effects (font (size 1.27 1.27))))
      )
    )
    (symbol "NTK3134NT1G_0_1"
      (polyline
        (pts
          (xy 5.842 -0.508)
          (xy 5.842 0.508)
        )
        (stroke (width 0.1524) (type solid))
        (fill (type none))
      )
      (polyline
        (pts
          (xy 5.842 0)
          (xy 7.62 0)
        )
        (stroke (width 0.1524) (type solid))
        (fill (type none))
      )
      (polyline
        (pts
          (xy 5.842 2.032)
          (xy 5.842 3.048)
        )
        (stroke (width 0.1524) (type solid))
        (fill (type none))
      )
      (polyline
        (pts
          (xy 5.842 5.588)
          (xy 5.842 4.572)
        )
        (stroke (width 0.1524) (type solid))
        (fill (type none))
      )
      (polyline
        (pts
          (xy 7.62 2.54)
          (xy 5.842 2.54)
        )
        (stroke (width 0.1524) (type solid))
        (fill (type none))
      )
      (polyline
        (pts
          (xy 7.62 2.54)
          (xy 7.62 -2.54)
        )
        (stroke (width 0.1524) (type solid))
        (fill (type none))
      )
      (polyline
        (pts
          (xy 7.62 5.08)
          (xy 5.842 5.08)
        )
        (stroke (width 0.1524) (type solid))
        (fill (type none))
      )
      (polyline
        (pts
          (xy 7.62 5.08)
          (xy 7.62 7.62)
        )
        (stroke (width 0.1524) (type solid))
        (fill (type none))
      )
      (polyline
        (pts
          (xy 2.54 0)
          (xy 5.08 0)
          (xy 5.08 5.08)
        )
        (stroke (width 0.1524) (type solid))
        (fill (type none))
      )
      (polyline
        (pts
          (xy 5.842 2.54)
          (xy 6.858 3.048)
          (xy 6.858 2.032)
          (xy 5.842 2.54)
        )
        (stroke (width 0.254) (type solid))
        (fill (type outline))
      )
      (circle (center 6.35 2.54) (radius 3.81)
        (stroke (width 0.254) (type solid))
        (fill (type none))
      )
    )
  )
  (symbol "PCA9685PW,118" (pin_names (offset 0.762)) (in_bom yes) (on_board yes)
    (property "Reference" "IC" (at 26.67 7.62 0)
      (effects (font (size 1.27 1.27)) (justify left))
    )
    (property "Value" "PCA9685PW,118" (at 26.67 5.08 0)
      (effects (font (size 1.27 1.27)) (justify left))
    )
    (property "Footprint" "SOP65P640X110-28N" (at 26.67 2.54 0)
      (effects (font (size 1.27 1.27)) (justify left) hide)
    )
    (property "Datasheet" "http://www.nxp.com/docs/en/data-sheet/PCA9685.pdf" (at 26.67 0 0)
      (effects (font (size 1.27 1.27)) (justify left) hide)
    )
    (property "Description" "LED Display Drivers" (at 26.67 -2.54 0)
      (effects (font (size 1.27 1.27)) (justify left) hide)
    )
    (property "Height" "1.1" (at 26.67 -5.08 0)
      (effects (font (size 1.27 1.27)) (justify left) hide)
    )
    (property "Mouser Part Number" "771-PCA9685PW,118" (at 26.67 -7.62 0)
      (effects (font (size 1.27 1.27)) (justify left) hide)
    )
    (property "Mouser Price/Stock" "https://www.mouser.co.uk/ProductDetail/NXP-Semiconductors/PCA9685PW118?qs=6YAT8rHPFU%252BtfwwKq4nwEQ%3D%3D" (at 26.67 -10.16 0)
      (effects (font (size 1.27 1.27)) (justify left) hide)
    )
    (property "Manufacturer_Name" "NXP" (at 26.67 -12.7 0)
      (effects (font (size 1.27 1.27)) (justify left) hide)
    )
    (property "Manufacturer_Part_Number" "PCA9685PW,118" (at 26.67 -15.24 0)
      (effects (font (size 1.27 1.27)) (justify left) hide)
    )
    (property "ki_description" "LED Display Drivers" (at 0 0 0)
      (effects (font (size 1.27 1.27)) hide)
    )
    (symbol "PCA9685PW,118_0_0"
      (pin passive line (at 0 0 0) (length 5.08)
        (name "A0" (effects (font (size 1.27 1.27))))
        (number "1" (effects (font (size 1.27 1.27))))
      )
      (pin passive line (at 0 -22.86 0) (length 5.08)
        (name "LED4" (effects (font (size 1.27 1.27))))
        (number "10" (effects (font (size 1.27 1.27))))
      )
      (pin passive line (at 0 -25.4 0) (length 5.08)
        (name "LED5" (effects (font (size 1.27 1.27))))
        (number "11" (effects (font (size 1.27 1.27))))
      )
      (pin passive line (at 0 -27.94 0) (length 5.08)
        (name "LED6" (effects (font (size 1.27 1.27))))
        (number "12" (effects (font (size 1.27 1.27))))
      )
      (pin passive line (at 0 -30.48 0) (length 5.08)
        (name "LED7" (effects (font (size 1.27 1.27))))
        (number "13" (effects (font (size 1.27 1.27))))
      )
      (pin passive line (at 0 -33.02 0) (length 5.08)
        (name "VSS" (effects (font (size 1.27 1.27))))
        (number "14" (effects (font (size 1.27 1.27))))
      )
      (pin passive line (at 30.48 -33.02 180) (length 5.08)
        (name "LED8" (effects (font (size 1.27 1.27))))
        (number "15" (effects (font (size 1.27 1.27))))
      )
      (pin passive line (at 30.48 -30.48 180) (length 5.08)
        (name "LED9" (effects (font (size 1.27 1.27))))
        (number "16" (effects (font (size 1.27 1.27))))
      )
      (pin passive line (at 30.48 -27.94 180) (length 5.08)
        (name "LED10" (effects (font (size 1.27 1.27))))
        (number "17" (effects (font (size 1.27 1.27))))
      )
      (pin passive line (at 30.48 -25.4 180) (length 5.08)
        (name "LED11" (effects (font (size 1.27 1.27))))
        (number "18" (effects (font (size 1.27 1.27))))
      )
      (pin passive line (at 30.48 -22.86 180) (length 5.08)
        (name "LED12" (effects (font (size 1.27 1.27))))
        (number "19" (effects (font (size 1.27 1.27))))
      )
      (pin passive line (at 0 -2.54 0) (length 5.08)
        (name "A1" (effects (font (size 1.27 1.27))))
        (number "2" (effects (font (size 1.27 1.27))))
      )
      (pin passive line (at 30.48 -20.32 180) (length 5.08)
        (name "LED13" (effects (font (size 1.27 1.27))))
        (number "20" (effects (font (size 1.27 1.27))))
      )
      (pin passive line (at 30.48 -17.78 180) (length 5.08)
        (name "LED14" (effects (font (size 1.27 1.27))))
        (number "21" (effects (font (size 1.27 1.27))))
      )
      (pin passive line (at 30.48 -15.24 180) (length 5.08)
        (name "LED15" (effects (font (size 1.27 1.27))))
        (number "22" (effects (font (size 1.27 1.27))))
      )
      (pin passive line (at 30.48 -12.7 180) (length 5.08)
        (name "~{OE}" (effects (font (size 1.27 1.27))))
        (number "23" (effects (font (size 1.27 1.27))))
      )
      (pin passive line (at 30.48 -10.16 180) (length 5.08)
        (name "A5" (effects (font (size 1.27 1.27))))
        (number "24" (effects (font (size 1.27 1.27))))
      )
      (pin passive line (at 30.48 -7.62 180) (length 5.08)
        (name "EXTCLK" (effects (font (size 1.27 1.27))))
        (number "25" (effects (font (size 1.27 1.27))))
      )
      (pin passive line (at 30.48 -5.08 180) (length 5.08)
        (name "SCL" (effects (font (size 1.27 1.27))))
        (number "26" (effects (font (size 1.27 1.27))))
      )
      (pin passive line (at 30.48 -2.54 180) (length 5.08)
        (name "SDA" (effects (font (size 1.27 1.27))))
        (number "27" (effects (font (size 1.27 1.27))))
      )
      (pin passive line (at 30.48 0 180) (length 5.08)
        (name "VDD" (effects (font (size 1.27 1.27))))
        (number "28" (effects (font (size 1.27 1.27))))
      )
      (pin passive line (at 0 -5.08 0) (length 5.08)
        (name "A2" (effects (font (size 1.27 1.27))))
        (number "3" (effects (font (size 1.27 1.27))))
      )
      (pin passive line (at 0 -7.62 0) (length 5.08)
        (name "A3" (effects (font (size 1.27 1.27))))
        (number "4" (effects (font (size 1.27 1.27))))
      )
      (pin passive line (at 0 -10.16 0) (length 5.08)
        (name "A4" (effects (font (size 1.27 1.27))))
        (number "5" (effects (font (size 1.27 1.27))))
      )
      (pin passive line (at 0 -12.7 0) (length 5.08)
        (name "LED0" (effects (font (size 1.27 1.27))))
        (number "6" (effects (font (size 1.27 1.27))))
      )
      (pin passive line (at 0 -15.24 0) (length 5.08)
        (name "LED1" (effects (font (size 1.27 1.27))))
        (number "7" (effects (font (size 1.27 1.27))))
      )
      (pin passive line (at 0 -17.78 0) (length 5.08)
        (name "LED2" (effects (font (size 1.27 1.27))))
        (number "8" (effects (font (size 1.27 1.27))))
      )
      (pin passive line (at 0 -20.32 0) (length 5.08)
        (name "LED3" (effects (font (size 1.27 1.27))))
        (number "9" (effects (font (size 1.27 1.27))))
      )
    )
    (symbol "PCA9685PW,118_0_1"
      (polyline
        (pts
          (xy 5.08 2.54)
          (xy 25.4 2.54)
          (xy 25.4 -35.56)
          (xy 5.08 -35.56)
          (xy 5.08 2.54)
        )
        (stroke (width 0.1524) (type solid))
        (fill (type none))
      )
    )
  )
  (symbol "SN74LVC1G373DCKR" (pin_names (offset 0.762)) (in_bom yes) (on_board yes)
    (property "Reference" "IC" (at 21.59 7.62 0)
      (effects (font (size 1.27 1.27)) (justify left))
    )
    (property "Value" "SN74LVC1G373DCKR" (at 21.59 5.08 0)
      (effects (font (size 1.27 1.27)) (justify left))
    )
    (property "Footprint" "SOT65P210X110-6N" (at 21.59 2.54 0)
      (effects (font (size 1.27 1.27)) (justify left) hide)
    )
    (property "Datasheet" "http://www.ti.com/lit/gpn/sn74lvc1g373" (at 21.59 0 0)
      (effects (font (size 1.27 1.27)) (justify left) hide)
    )
    (property "Description" "Texas Instruments SN74LVC1G373DCKR, D Type Latch, Transparent, 3 State, 1.65  5.5 V, 6-Pin SC-70" (at 21.59 -2.54 0)
      (effects (font (size 1.27 1.27)) (justify left) hide)
    )
    (property "Height" "1.1" (at 21.59 -5.08 0)
      (effects (font (size 1.27 1.27)) (justify left) hide)
    )
    (property "Mouser Part Number" "595-SN74LVC1G373DCKR" (at 21.59 -7.62 0)
      (effects (font (size 1.27 1.27)) (justify left) hide)
    )
    (property "Mouser Price/Stock" "https://www.mouser.co.uk/ProductDetail/Texas-Instruments/SN74LVC1G373DCKR?qs=pajgIaoyDUitnicLxEgP7g%3D%3D" (at 21.59 -10.16 0)
      (effects (font (size 1.27 1.27)) (justify left) hide)
    )
    (property "Manufacturer_Name" "Texas Instruments" (at 21.59 -12.7 0)
      (effects (font (size 1.27 1.27)) (justify left) hide)
    )
    (property "Manufacturer_Part_Number" "SN74LVC1G373DCKR" (at 21.59 -15.24 0)
      (effects (font (size 1.27 1.27)) (justify left) hide)
    )
    (property "ki_description" "Texas Instruments SN74LVC1G373DCKR, D Type Latch, Transparent, 3 State, 1.65  5.5 V, 6-Pin SC-70" (at 0 0 0)
      (effects (font (size 1.27 1.27)) hide)
    )
    (symbol "SN74LVC1G373DCKR_0_0"
      (pin passive line (at 0 0 0) (length 5.08)
        (name "LE" (effects (font (size 1.27 1.27))))
        (number "1" (effects (font (size 1.27 1.27))))
      )
      (pin passive line (at 0 -2.54 0) (length 5.08)
        (name "GND" (effects (font (size 1.27 1.27))))
        (number "2" (effects (font (size 1.27 1.27))))
      )
      (pin passive line (at 0 -5.08 0) (length 5.08)
        (name "D" (effects (font (size 1.27 1.27))))
        (number "3" (effects (font (size 1.27 1.27))))
      )
      (pin passive line (at 25.4 -5.08 180) (length 5.08)
        (name "Q" (effects (font (size 1.27 1.27))))
        (number "4" (effects (font (size 1.27 1.27))))
      )
      (pin passive line (at 25.4 -2.54 180) (length 5.08)
        (name "VCC" (effects (font (size 1.27 1.27))))
        (number "5" (effects (font (size 1.27 1.27))))
      )
      (pin passive line (at 25.4 0 180) (length 5.08)
        (name "~{OE}" (effects (font (size 1.27 1.27))))
        (number "6" (effects (font (size 1.27 1.27))))
      )
    )
    (symbol "SN74LVC1G373DCKR_0_1"
      (polyline
        (pts
          (xy 5.08 2.54)
          (xy 20.32 2.54)
          (xy 20.32 -7.62)
          (xy 5.08 -7.62)
          (xy 5.08 2.54)
        )
        (stroke (width 0.1524) (type solid))
        (fill (type none))
      )
    )
  )
  (symbol "TLC5940PWP" (pin_names (offset 0.762)) (in_bom yes) (on_board yes)
    (property "Reference" "IC" (at 26.67 7.62 0)
      (effects (font (size 1.27 1.27)) (justify left))
    )
    (property "Value" "TLC5940PWP" (at 26.67 5.08 0)
      (effects (font (size 1.27 1.27)) (justify left))
    )
    (property "Footprint" "SOP65P640X120-29N" (at 26.67 2.54 0)
      (effects (font (size 1.27 1.27)) (justify left) hide)
    )
    (property "Datasheet" "http://www.ti.com/lit/ds/symlink/tlc5940.pdf" (at 26.67 0 0)
      (effects (font (size 1.27 1.27)) (justify left) hide)
    )
    (property "Description" "LED Driver IC 16 Output Linear Shift Register  Dimming 120mA 28-HTSSOP" (at 26.67 -2.54 0)
      (effects (font (size 1.27 1.27)) (justify left) hide)
    )
    (property "Height" "1.2" (at 26.67 -5.08 0)
      (effects (font (size 1.27 1.27)) (justify left) hide)
    )
    (property "Mouser Part Number" "595-TLC5940PWP" (at 26.67 -7.62 0)
      (effects (font (size 1.27 1.27)) (justify left) hide)
    )
    (property "Mouser Price/Stock" "https://www.mouser.co.uk/ProductDetail/Texas-Instruments/TLC5940PWP?qs=p6lVfQR1GSrLnNrxEviuaQ%3D%3D" (at 26.67 -10.16 0)
      (effects (font (size 1.27 1.27)) (justify left) hide)
    )
    (property "Manufacturer_Name" "Texas Instruments" (at 26.67 -12.7 0)
      (effects (font (size 1.27 1.27)) (justify left) hide)
    )
    (property "Manufacturer_Part_Number" "TLC5940PWP" (at 26.67 -15.24 0)
      (effects (font (size 1.27 1.27)) (justify left) hide)
    )
    (property "ki_description" "LED Driver IC 16 Output Linear Shift Register  Dimming 120mA 28-HTSSOP" (at 0 0 0)
      (effects (font (size 1.27 1.27)) hide)
    )
    (symbol "TLC5940PWP_0_0"
      (pin passive line (at 0 0 0) (length 5.08)
        (name "GND" (effects (font (size 1.27 1.27))))
        (number "1" (effects (font (size 1.27 1.27))))
      )
      (pin passive line (at 0 -22.86 0) (length 5.08)
        (name "OUT3" (effects (font (size 1.27 1.27))))
        (number "10" (effects (font (size 1.27 1.27))))
      )
      (pin passive line (at 0 -25.4 0) (length 5.08)
        (name "OUT4" (effects (font (size 1.27 1.27))))
        (number "11" (effects (font (size 1.27 1.27))))
      )
      (pin passive line (at 0 -27.94 0) (length 5.08)
        (name "OUT5" (effects (font (size 1.27 1.27))))
        (number "12" (effects (font (size 1.27 1.27))))
      )
      (pin passive line (at 0 -30.48 0) (length 5.08)
        (name "OUT6" (effects (font (size 1.27 1.27))))
        (number "13" (effects (font (size 1.27 1.27))))
      )
      (pin passive line (at 0 -33.02 0) (length 5.08)
        (name "OUT7" (effects (font (size 1.27 1.27))))
        (number "14" (effects (font (size 1.27 1.27))))
      )
      (pin passive line (at 30.48 -33.02 180) (length 5.08)
        (name "OUT8" (effects (font (size 1.27 1.27))))
        (number "15" (effects (font (size 1.27 1.27))))
      )
      (pin passive line (at 30.48 -30.48 180) (length 5.08)
        (name "OUT9" (effects (font (size 1.27 1.27))))
        (number "16" (effects (font (size 1.27 1.27))))
      )
      (pin passive line (at 30.48 -27.94 180) (length 5.08)
        (name "OUT10" (effects (font (size 1.27 1.27))))
        (number "17" (effects (font (size 1.27 1.27))))
      )
      (pin passive line (at 30.48 -25.4 180) (length 5.08)
        (name "OUT11" (effects (font (size 1.27 1.27))))
        (number "18" (effects (font (size 1.27 1.27))))
      )
      (pin passive line (at 30.48 -22.86 180) (length 5.08)
        (name "OUT12" (effects (font (size 1.27 1.27))))
        (number "19" (effects (font (size 1.27 1.27))))
      )
      (pin passive line (at 0 -2.54 0) (length 5.08)
        (name "BLANK" (effects (font (size 1.27 1.27))))
        (number "2" (effects (font (size 1.27 1.27))))
      )
      (pin passive line (at 30.48 -20.32 180) (length 5.08)
        (name "OUT13" (effects (font (size 1.27 1.27))))
        (number "20" (effects (font (size 1.27 1.27))))
      )
      (pin passive line (at 30.48 -17.78 180) (length 5.08)
        (name "OUT14" (effects (font (size 1.27 1.27))))
        (number "21" (effects (font (size 1.27 1.27))))
      )
      (pin passive line (at 30.48 -15.24 180) (length 5.08)
        (name "OUT15" (effects (font (size 1.27 1.27))))
        (number "22" (effects (font (size 1.27 1.27))))
      )
      (pin passive line (at 30.48 -12.7 180) (length 5.08)
        (name "XERR" (effects (font (size 1.27 1.27))))
        (number "23" (effects (font (size 1.27 1.27))))
      )
      (pin passive line (at 30.48 -10.16 180) (length 5.08)
        (name "SOUT" (effects (font (size 1.27 1.27))))
        (number "24" (effects (font (size 1.27 1.27))))
      )
      (pin passive line (at 30.48 -7.62 180) (length 5.08)
        (name "GSCLK" (effects (font (size 1.27 1.27))))
        (number "25" (effects (font (size 1.27 1.27))))
      )
      (pin passive line (at 30.48 -5.08 180) (length 5.08)
        (name "DCPRG" (effects (font (size 1.27 1.27))))
        (number "26" (effects (font (size 1.27 1.27))))
      )
      (pin passive line (at 30.48 -2.54 180) (length 5.08)
        (name "IREF" (effects (font (size 1.27 1.27))))
        (number "27" (effects (font (size 1.27 1.27))))
      )
      (pin passive line (at 30.48 0 180) (length 5.08)
        (name "VCC" (effects (font (size 1.27 1.27))))
        (number "28" (effects (font (size 1.27 1.27))))
      )
      (pin passive line (at 15.24 -45.72 90) (length 5.08)
        (name "EP" (effects (font (size 1.27 1.27))))
        (number "29" (effects (font (size 1.27 1.27))))
      )
      (pin passive line (at 0 -5.08 0) (length 5.08)
        (name "XLAT" (effects (font (size 1.27 1.27))))
        (number "3" (effects (font (size 1.27 1.27))))
      )
      (pin passive line (at 0 -7.62 0) (length 5.08)
        (name "SCLK" (effects (font (size 1.27 1.27))))
        (number "4" (effects (font (size 1.27 1.27))))
      )
      (pin passive line (at 0 -10.16 0) (length 5.08)
        (name "SIN" (effects (font (size 1.27 1.27))))
        (number "5" (effects (font (size 1.27 1.27))))
      )
      (pin passive line (at 0 -12.7 0) (length 5.08)
        (name "VPRG" (effects (font (size 1.27 1.27))))
        (number "6" (effects (font (size 1.27 1.27))))
      )
      (pin passive line (at 0 -15.24 0) (length 5.08)
        (name "OUT0" (effects (font (size 1.27 1.27))))
        (number "7" (effects (font (size 1.27 1.27))))
      )
      (pin passive line (at 0 -17.78 0) (length 5.08)
        (name "OUT1" (effects (font (size 1.27 1.27))))
        (number "8" (effects (font (size 1.27 1.27))))
      )
      (pin passive line (at 0 -20.32 0) (length 5.08)
        (name "OUT2" (effects (font (size 1.27 1.27))))
        (number "9" (effects (font (size 1.27 1.27))))
      )
    )
    (symbol "TLC5940PWP_0_1"
      (polyline
        (pts
          (xy 5.08 2.54)
          (xy 25.4 2.54)
          (xy 25.4 -40.64)
          (xy 5.08 -40.64)
          (xy 5.08 2.54)
        )
        (stroke (width 0.1524) (type solid))
        (fill (type none))
      )
    )
  )
  (symbol "ZXMHC3A01T8TA" (pin_names (offset 0.762)) (in_bom yes) (on_board yes)
    (property "Reference" "Q" (at 26.67 7.62 0)
      (effects (font (size 1.27 1.27)) (justify left))
    )
    (property "Value" "ZXMHC3A01T8TA" (at 26.67 5.08 0)
      (effects (font (size 1.27 1.27)) (justify left))
    )
    (property "Footprint" "SOT153P700X170-8N" (at 26.67 2.54 0)
      (effects (font (size 1.27 1.27)) (justify left) hide)
    )
    (property "Datasheet" "https://componentsearchengine.com/Datasheets/2/ZXMHC3A01T8TA.pdf" (at 26.67 0 0)
      (effects (font (size 1.27 1.27)) (justify left) hide)
    )
    (property "Description" "DIODES INC. - ZXMHC3A01T8TA - Dual MOSFET, Enhancement Mode, N and P Channel, 3.1 A, 30 V, 0.12 ohm, 10 V, 1 V" (at 26.67 -2.54 0)
      (effects (font (size 1.27 1.27)) (justify left) hide)
    )
    (property "Height" "1.7" (at 26.67 -5.08 0)
      (effects (font (size 1.27 1.27)) (justify left) hide)
    )
    (property "Mouser Part Number" "522-ZXMHC3A01T8TA" (at 26.67 -7.62 0)
      (effects (font (size 1.27 1.27)) (justify left) hide)
    )
    (property "Mouser Price/Stock" "https://www.mouser.co.uk/ProductDetail/Diodes-Incorporated/ZXMHC3A01T8TA?qs=Xl4UVSSad%2Fqyu39NiNDXJg%3D%3D" (at 26.67 -10.16 0)
      (effects (font (size 1.27 1.27)) (justify left) hide)
    )
    (property "Manufacturer_Name" "Diodes Inc." (at 26.67 -12.7 0)
      (effects (font (size 1.27 1.27)) (justify left) hide)
    )
    (property "Manufacturer_Part_Number" "ZXMHC3A01T8TA" (at 26.67 -15.24 0)
      (effects (font (size 1.27 1.27)) (justify left) hide)
    )
    (property "ki_description" "DIODES INC. - ZXMHC3A01T8TA - Dual MOSFET, Enhancement Mode, N and P Channel, 3.1 A, 30 V, 0.12 ohm, 10 V, 1 V" (at 0 0 0)
      (effects (font (size 1.27 1.27)) hide)
    )
    (symbol "ZXMHC3A01T8TA_0_0"
      (pin input line (at 0 0 0) (length 5.08)
        (name "G3" (effects (font (size 1.27 1.27))))
        (number "1" (effects (font (size 1.27 1.27))))
      )
      (pin bidirectional line (at 0 -2.54 0) (length 5.08)
        (name "S2_S3" (effects (font (size 1.27 1.27))))
        (number "2" (effects (font (size 1.27 1.27))))
      )
      (pin input line (at 0 -5.08 0) (length 5.08)
        (name "G2" (effects (font (size 1.27 1.27))))
        (number "3" (effects (font (size 1.27 1.27))))
      )
      (pin input line (at 0 -7.62 0) (length 5.08)
        (name "G1" (effects (font (size 1.27 1.27))))
        (number "4" (effects (font (size 1.27 1.27))))
      )
      (pin bidirectional line (at 30.48 0 180) (length 5.08)
        (name "D1_D2" (effects (font (size 1.27 1.27))))
        (number "5" (effects (font (size 1.27 1.27))))
      )
      (pin bidirectional line (at 30.48 -2.54 180) (length 5.08)
        (name "S1_S4" (effects (font (size 1.27 1.27))))
        (number "6" (effects (font (size 1.27 1.27))))
      )
      (pin bidirectional line (at 30.48 -5.08 180) (length 5.08)
        (name "D3_D4" (effects (font (size 1.27 1.27))))
        (number "7" (effects (font (size 1.27 1.27))))
      )
      (pin input line (at 30.48 -7.62 180) (length 5.08)
        (name "G4" (effects (font (size 1.27 1.27))))
        (number "8" (effects (font (size 1.27 1.27))))
      )
    )
    (symbol "ZXMHC3A01T8TA_0_1"
      (polyline
        (pts
          (xy 5.08 2.54)
          (xy 25.4 2.54)
          (xy 25.4 -10.16)
          (xy 5.08 -10.16)
          (xy 5.08 2.54)
        )
        (stroke (width 0.1524) (type solid))
        (fill (type none))
      )
    )
  )
)
