(kicad_symbol_lib (version 20220914) (generator kicad_symbol_editor)
  (symbol "74VHC4020FT" (pin_names (offset 0.762)) (in_bom yes) (on_board yes)
    (property "Reference" "IC" (at 21.59 7.62 0)
      (effects (font (size 1.27 1.27)) (justify left))
    )
    (property "Value" "74VHC4020FT" (at 21.59 5.08 0)
      (effects (font (size 1.27 1.27)) (justify left))
    )
    (property "Footprint" "SOP65P640X120-16N" (at 21.59 2.54 0)
      (effects (font (size 1.27 1.27)) (justify left) hide)
    )
    (property "Datasheet" "https://datasheet.datasheetarchive.com/originals/distributors/Datasheets_SAMA/8e241f39715ae149049ee31491abb83c.pdf" (at 21.59 0 0)
      (effects (font (size 1.27 1.27)) (justify left) hide)
    )
    (property "Description" "Toshiba 74VHC4020FT 14-stage Binary Counter, Uni-Directional, 16-Pin TSSOP" (at 21.59 -2.54 0)
      (effects (font (size 1.27 1.27)) (justify left) hide)
    )
    (property "Height" "1.2" (at 21.59 -5.08 0)
      (effects (font (size 1.27 1.27)) (justify left) hide)
    )
    (property "Mouser Part Number" "757-74VHC4020FT" (at 21.59 -7.62 0)
      (effects (font (size 1.27 1.27)) (justify left) hide)
    )
    (property "Mouser Price/Stock" "https://www.mouser.co.uk/ProductDetail/Toshiba/74VHC4020FT?qs=u16ybLDytRZAsoc5qmzxMA%3D%3D" (at 21.59 -10.16 0)
      (effects (font (size 1.27 1.27)) (justify left) hide)
    )
    (property "Manufacturer_Name" "Toshiba" (at 21.59 -12.7 0)
      (effects (font (size 1.27 1.27)) (justify left) hide)
    )
    (property "Manufacturer_Part_Number" "74VHC4020FT" (at 21.59 -15.24 0)
      (effects (font (size 1.27 1.27)) (justify left) hide)
    )
    (property "ki_description" "Toshiba 74VHC4020FT 14-stage Binary Counter, Uni-Directional, 16-Pin TSSOP" (at 0 0 0)
      (effects (font (size 1.27 1.27)) hide)
    )
    (symbol "74VHC4020FT_0_0"
      (pin passive line (at 0 0 0) (length 5.08)
        (name "Q12" (effects (font (size 1.27 1.27))))
        (number "1" (effects (font (size 1.27 1.27))))
      )
      (pin passive line (at 25.4 -15.24 180) (length 5.08)
        (name "~{CK}" (effects (font (size 1.27 1.27))))
        (number "10" (effects (font (size 1.27 1.27))))
      )
      (pin passive line (at 25.4 -12.7 180) (length 5.08)
        (name "CLR" (effects (font (size 1.27 1.27))))
        (number "11" (effects (font (size 1.27 1.27))))
      )
      (pin passive line (at 25.4 -10.16 180) (length 5.08)
        (name "Q9" (effects (font (size 1.27 1.27))))
        (number "12" (effects (font (size 1.27 1.27))))
      )
      (pin passive line (at 25.4 -7.62 180) (length 5.08)
        (name "Q8" (effects (font (size 1.27 1.27))))
        (number "13" (effects (font (size 1.27 1.27))))
      )
      (pin passive line (at 25.4 -5.08 180) (length 5.08)
        (name "Q10" (effects (font (size 1.27 1.27))))
        (number "14" (effects (font (size 1.27 1.27))))
      )
      (pin passive line (at 25.4 -2.54 180) (length 5.08)
        (name "Q11" (effects (font (size 1.27 1.27))))
        (number "15" (effects (font (size 1.27 1.27))))
      )
      (pin passive line (at 25.4 0 180) (length 5.08)
        (name "VCC" (effects (font (size 1.27 1.27))))
        (number "16" (effects (font (size 1.27 1.27))))
      )
      (pin passive line (at 0 -2.54 0) (length 5.08)
        (name "Q13" (effects (font (size 1.27 1.27))))
        (number "2" (effects (font (size 1.27 1.27))))
      )
      (pin passive line (at 0 -5.08 0) (length 5.08)
        (name "Q14" (effects (font (size 1.27 1.27))))
        (number "3" (effects (font (size 1.27 1.27))))
      )
      (pin passive line (at 0 -7.62 0) (length 5.08)
        (name "Q6" (effects (font (size 1.27 1.27))))
        (number "4" (effects (font (size 1.27 1.27))))
      )
      (pin passive line (at 0 -10.16 0) (length 5.08)
        (name "Q5" (effects (font (size 1.27 1.27))))
        (number "5" (effects (font (size 1.27 1.27))))
      )
      (pin passive line (at 0 -12.7 0) (length 5.08)
        (name "Q7" (effects (font (size 1.27 1.27))))
        (number "6" (effects (font (size 1.27 1.27))))
      )
      (pin passive line (at 0 -15.24 0) (length 5.08)
        (name "Q4" (effects (font (size 1.27 1.27))))
        (number "7" (effects (font (size 1.27 1.27))))
      )
      (pin passive line (at 0 -17.78 0) (length 5.08)
        (name "GND" (effects (font (size 1.27 1.27))))
        (number "8" (effects (font (size 1.27 1.27))))
      )
      (pin passive line (at 25.4 -17.78 180) (length 5.08)
        (name "Q1" (effects (font (size 1.27 1.27))))
        (number "9" (effects (font (size 1.27 1.27))))
      )
    )
    (symbol "74VHC4020FT_0_1"
      (polyline
        (pts
          (xy 5.08 2.54)
          (xy 20.32 2.54)
          (xy 20.32 -20.32)
          (xy 5.08 -20.32)
          (xy 5.08 2.54)
        )
        (stroke (width 0.1524) (type solid))
        (fill (type none))
      )
    )
  )
  (symbol "ECS-2520MVLC-120-CN-TR" (pin_names (offset 0.762)) (in_bom yes) (on_board yes)
    (property "Reference" "Y" (at 34.29 7.62 0)
      (effects (font (size 1.27 1.27)) (justify left))
    )
    (property "Value" "ECS-2520MVLC-120-CN-TR" (at 34.29 5.08 0)
      (effects (font (size 1.27 1.27)) (justify left))
    )
    (property "Footprint" "ECS2520MVLC120CNTR" (at 34.29 2.54 0)
      (effects (font (size 1.27 1.27)) (justify left) hide)
    )
    (property "Datasheet" "https://www.google.com/url?sa=t&rct=j&q=&esrc=s&source=web&cd=&ved=2ahUKEwi43cyW_bj2AhVBXBoKHeoCBjUQFnoECBUQAQ&url=https%3A%2F%2Fecsxtal.com%2Fstore%2Fpdf%2FECS-2520MVLC.pdf&usg=AOvVaw1FVHdgV02YD-i1ba9jFZ6a" (at 34.29 0 0)
      (effects (font (size 1.27 1.27)) (justify left) hide)
    )
    (property "Description" "Standard Clock Oscillators 12.000MHz HCMOS Supply Voltage 1.6 3.6 +/-25 ppm -40 +85C" (at 34.29 -2.54 0)
      (effects (font (size 1.27 1.27)) (justify left) hide)
    )
    (property "Height" "0.9" (at 34.29 -5.08 0)
      (effects (font (size 1.27 1.27)) (justify left) hide)
    )
    (property "Mouser Part Number" "520-2520MVLC-120CNTR" (at 34.29 -7.62 0)
      (effects (font (size 1.27 1.27)) (justify left) hide)
    )
    (property "Mouser Price/Stock" "https://www.mouser.co.uk/ProductDetail/ECS/ECS-2520MVLC-120-CN-TR?qs=QNEnbhJQKvYlXhmgfzaaOw%3D%3D" (at 34.29 -10.16 0)
      (effects (font (size 1.27 1.27)) (justify left) hide)
    )
    (property "Manufacturer_Name" "ECS" (at 34.29 -12.7 0)
      (effects (font (size 1.27 1.27)) (justify left) hide)
    )
    (property "Manufacturer_Part_Number" "ECS-2520MVLC-120-CN-TR" (at 34.29 -15.24 0)
      (effects (font (size 1.27 1.27)) (justify left) hide)
    )
    (property "ki_description" "Standard Clock Oscillators 12.000MHz HCMOS Supply Voltage 1.6 3.6 +/-25 ppm -40 +85C" (at 0 0 0)
      (effects (font (size 1.27 1.27)) hide)
    )
    (symbol "ECS-2520MVLC-120-CN-TR_0_0"
      (pin passive line (at 0 -2.54 0) (length 5.08)
        (name "TRI-STATE" (effects (font (size 1.27 1.27))))
        (number "1" (effects (font (size 1.27 1.27))))
      )
      (pin passive line (at 38.1 -2.54 180) (length 5.08)
        (name "GND" (effects (font (size 1.27 1.27))))
        (number "2" (effects (font (size 1.27 1.27))))
      )
      (pin passive line (at 38.1 0 180) (length 5.08)
        (name "OUTPUT" (effects (font (size 1.27 1.27))))
        (number "3" (effects (font (size 1.27 1.27))))
      )
      (pin passive line (at 0 0 0) (length 5.08)
        (name "VDD" (effects (font (size 1.27 1.27))))
        (number "4" (effects (font (size 1.27 1.27))))
      )
    )
    (symbol "ECS-2520MVLC-120-CN-TR_0_1"
      (polyline
        (pts
          (xy 5.08 2.54)
          (xy 33.02 2.54)
          (xy 33.02 -5.08)
          (xy 5.08 -5.08)
          (xy 5.08 2.54)
        )
        (stroke (width 0.1524) (type solid))
        (fill (type none))
      )
    )
  )
  (symbol "NE555D" (pin_names (offset 0.762)) (in_bom yes) (on_board yes)
    (property "Reference" "IC" (at 26.67 15.24 0)
      (effects (font (size 1.27 1.27)) (justify left))
    )
    (property "Value" "NE555D" (at 26.67 12.7 0)
      (effects (font (size 1.27 1.27)) (justify left))
    )
    (property "Footprint" "SOIC127P600X175-8N" (at 26.67 10.16 0)
      (effects (font (size 1.27 1.27)) (justify left) hide)
    )
    (property "Datasheet" "http://www.ti.com/lit/ds/symlink/ne555.pdf" (at 26.67 7.62 0)
      (effects (font (size 1.27 1.27)) (justify left) hide)
    )
    (property "Description" "NE555DG4, Timer, 4.5 to 16V, 8-Pin SOIC-8" (at 26.67 5.08 0)
      (effects (font (size 1.27 1.27)) (justify left) hide)
    )
    (property "Height" "1.75" (at 26.67 2.54 0)
      (effects (font (size 1.27 1.27)) (justify left) hide)
    )
    (property "Mouser Part Number" "595-NE555D" (at 26.67 0 0)
      (effects (font (size 1.27 1.27)) (justify left) hide)
    )
    (property "Mouser Price/Stock" "https://www.mouser.co.uk/ProductDetail/Texas-Instruments/NE555D?qs=gb35HGp1gQIV8t3Z88o0WA%3D%3D" (at 26.67 -2.54 0)
      (effects (font (size 1.27 1.27)) (justify left) hide)
    )
    (property "Manufacturer_Name" "Texas Instruments" (at 26.67 -5.08 0)
      (effects (font (size 1.27 1.27)) (justify left) hide)
    )
    (property "Manufacturer_Part_Number" "NE555D" (at 26.67 -7.62 0)
      (effects (font (size 1.27 1.27)) (justify left) hide)
    )
    (property "ki_description" "NE555DG4, Timer, 4.5 to 16V, 8-Pin SOIC-8" (at 0 0 0)
      (effects (font (size 1.27 1.27)) hide)
    )
    (symbol "NE555D_0_0"
      (pin power_in line (at 15.24 -20.32 90) (length 5.08)
        (name "GND" (effects (font (size 1.27 1.27))))
        (number "1" (effects (font (size 1.27 1.27))))
      )
      (pin input line (at 0 0 0) (length 5.08)
        (name "TRIG" (effects (font (size 1.27 1.27))))
        (number "2" (effects (font (size 1.27 1.27))))
      )
      (pin output line (at 30.48 0 180) (length 5.08)
        (name "OUT" (effects (font (size 1.27 1.27))))
        (number "3" (effects (font (size 1.27 1.27))))
      )
      (pin input line (at 0 -5.08 0) (length 5.08)
        (name "~{RESET}" (effects (font (size 1.27 1.27))))
        (number "4" (effects (font (size 1.27 1.27))))
      )
      (pin input line (at 0 -2.54 0) (length 5.08)
        (name "CONT" (effects (font (size 1.27 1.27))))
        (number "5" (effects (font (size 1.27 1.27))))
      )
      (pin input line (at 30.48 -5.08 180) (length 5.08)
        (name "THRES" (effects (font (size 1.27 1.27))))
        (number "6" (effects (font (size 1.27 1.27))))
      )
      (pin output line (at 30.48 -2.54 180) (length 5.08)
        (name "DISCH" (effects (font (size 1.27 1.27))))
        (number "7" (effects (font (size 1.27 1.27))))
      )
      (pin power_in line (at 15.24 15.24 270) (length 5.08)
        (name "VCC" (effects (font (size 1.27 1.27))))
        (number "8" (effects (font (size 1.27 1.27))))
      )
    )
    (symbol "NE555D_0_1"
      (polyline
        (pts
          (xy 5.08 10.16)
          (xy 25.4 10.16)
          (xy 25.4 -15.24)
          (xy 5.08 -15.24)
          (xy 5.08 10.16)
        )
        (stroke (width 0.1524) (type solid))
        (fill (type none))
      )
    )
  )
  (symbol "NE555PW" (pin_names (offset 0.762)) (in_bom yes) (on_board yes)
    (property "Reference" "IC" (at 26.67 7.62 0)
      (effects (font (size 1.27 1.27)) (justify left))
    )
    (property "Value" "NE555PW" (at 26.67 5.08 0)
      (effects (font (size 1.27 1.27)) (justify left))
    )
    (property "Footprint" "SOP65P640X120-8N" (at 26.67 2.54 0)
      (effects (font (size 1.27 1.27)) (justify left) hide)
    )
    (property "Datasheet" "http://www.ti.com/lit/ds/symlink/ne555.pdf" (at 26.67 0 0)
      (effects (font (size 1.27 1.27)) (justify left) hide)
    )
    (property "Description" "Timers & Support Products Sgl Prec Timer" (at 26.67 -2.54 0)
      (effects (font (size 1.27 1.27)) (justify left) hide)
    )
    (property "Height" "1.2" (at 26.67 -5.08 0)
      (effects (font (size 1.27 1.27)) (justify left) hide)
    )
    (property "Mouser Part Number" "595-NE555PW" (at 26.67 -7.62 0)
      (effects (font (size 1.27 1.27)) (justify left) hide)
    )
    (property "Mouser Price/Stock" "https://www.mouser.co.uk/ProductDetail/Texas-Instruments/NE555PW?qs=rLYyFdxB%2FmqqRs7WoMRSOw%3D%3D" (at 26.67 -10.16 0)
      (effects (font (size 1.27 1.27)) (justify left) hide)
    )
    (property "Manufacturer_Name" "Texas Instruments" (at 26.67 -12.7 0)
      (effects (font (size 1.27 1.27)) (justify left) hide)
    )
    (property "Manufacturer_Part_Number" "NE555PW" (at 26.67 -15.24 0)
      (effects (font (size 1.27 1.27)) (justify left) hide)
    )
    (property "ki_description" "Timers & Support Products Sgl Prec Timer" (at 0 0 0)
      (effects (font (size 1.27 1.27)) hide)
    )
    (symbol "NE555PW_0_0"
      (pin passive line (at 0 0 0) (length 5.08)
        (name "GND" (effects (font (size 1.27 1.27))))
        (number "1" (effects (font (size 1.27 1.27))))
      )
      (pin passive line (at 0 -2.54 0) (length 5.08)
        (name "TRIG" (effects (font (size 1.27 1.27))))
        (number "2" (effects (font (size 1.27 1.27))))
      )
      (pin passive line (at 0 -5.08 0) (length 5.08)
        (name "OUT" (effects (font (size 1.27 1.27))))
        (number "3" (effects (font (size 1.27 1.27))))
      )
      (pin passive line (at 0 -7.62 0) (length 5.08)
        (name "RESET" (effects (font (size 1.27 1.27))))
        (number "4" (effects (font (size 1.27 1.27))))
      )
      (pin passive line (at 30.48 -7.62 180) (length 5.08)
        (name "CONT" (effects (font (size 1.27 1.27))))
        (number "5" (effects (font (size 1.27 1.27))))
      )
      (pin passive line (at 30.48 -5.08 180) (length 5.08)
        (name "THRES" (effects (font (size 1.27 1.27))))
        (number "6" (effects (font (size 1.27 1.27))))
      )
      (pin passive line (at 30.48 -2.54 180) (length 5.08)
        (name "DISCH" (effects (font (size 1.27 1.27))))
        (number "7" (effects (font (size 1.27 1.27))))
      )
      (pin passive line (at 30.48 0 180) (length 5.08)
        (name "VCC" (effects (font (size 1.27 1.27))))
        (number "8" (effects (font (size 1.27 1.27))))
      )
    )
    (symbol "NE555PW_0_1"
      (polyline
        (pts
          (xy 5.08 2.54)
          (xy 25.4 2.54)
          (xy 25.4 -10.16)
          (xy 5.08 -10.16)
          (xy 5.08 2.54)
        )
        (stroke (width 0.1524) (type solid))
        (fill (type none))
      )
    )
  )
  (symbol "SN74AHC1G32TDCKRQ1" (pin_names (offset 0.762)) (in_bom yes) (on_board yes)
    (property "Reference" "IC" (at 21.59 7.62 0)
      (effects (font (size 1.27 1.27)) (justify left))
    )
    (property "Value" "SN74AHC1G32TDCKRQ1" (at 21.59 5.08 0)
      (effects (font (size 1.27 1.27)) (justify left))
    )
    (property "Footprint" "SOT65P210X110-5N" (at 21.59 2.54 0)
      (effects (font (size 1.27 1.27)) (justify left) hide)
    )
    (property "Datasheet" "http://www.ti.com/lit/gpn/sn74ahc1g32-q1" (at 21.59 0 0)
      (effects (font (size 1.27 1.27)) (justify left) hide)
    )
    (property "Description" "Automotive Catalog Single 2-Input Positive-OR Gate" (at 21.59 -2.54 0)
      (effects (font (size 1.27 1.27)) (justify left) hide)
    )
    (property "Height" "1.1" (at 21.59 -5.08 0)
      (effects (font (size 1.27 1.27)) (justify left) hide)
    )
    (property "Mouser Part Number" "595-SN74AHC1G32TDCQ1" (at 21.59 -7.62 0)
      (effects (font (size 1.27 1.27)) (justify left) hide)
    )
    (property "Mouser Price/Stock" "https://www.mouser.co.uk/ProductDetail/Texas-Instruments/SN74AHC1G32TDCKRQ1?qs=PVVDbbWpW3KmaRqfToZHQQ%3D%3D" (at 21.59 -10.16 0)
      (effects (font (size 1.27 1.27)) (justify left) hide)
    )
    (property "Manufacturer_Name" "Texas Instruments" (at 21.59 -12.7 0)
      (effects (font (size 1.27 1.27)) (justify left) hide)
    )
    (property "Manufacturer_Part_Number" "SN74AHC1G32TDCKRQ1" (at 21.59 -15.24 0)
      (effects (font (size 1.27 1.27)) (justify left) hide)
    )
    (property "ki_description" "Automotive Catalog Single 2-Input Positive-OR Gate" (at 0 0 0)
      (effects (font (size 1.27 1.27)) hide)
    )
    (symbol "SN74AHC1G32TDCKRQ1_0_0"
      (pin passive line (at 0 0 0) (length 5.08)
        (name "A" (effects (font (size 1.27 1.27))))
        (number "1" (effects (font (size 1.27 1.27))))
      )
      (pin passive line (at 0 -2.54 0) (length 5.08)
        (name "B" (effects (font (size 1.27 1.27))))
        (number "2" (effects (font (size 1.27 1.27))))
      )
      (pin passive line (at 0 -5.08 0) (length 5.08)
        (name "GND" (effects (font (size 1.27 1.27))))
        (number "3" (effects (font (size 1.27 1.27))))
      )
      (pin passive line (at 25.4 0 180) (length 5.08)
        (name "Y" (effects (font (size 1.27 1.27))))
        (number "4" (effects (font (size 1.27 1.27))))
      )
      (pin passive line (at 25.4 -2.54 180) (length 5.08)
        (name "VCC" (effects (font (size 1.27 1.27))))
        (number "5" (effects (font (size 1.27 1.27))))
      )
    )
    (symbol "SN74AHC1G32TDCKRQ1_0_1"
      (polyline
        (pts
          (xy 5.08 2.54)
          (xy 20.32 2.54)
          (xy 20.32 -7.62)
          (xy 5.08 -7.62)
          (xy 5.08 2.54)
        )
        (stroke (width 0.1524) (type solid))
        (fill (type none))
      )
    )
  )
  (symbol "SN74LV4040ADGVR" (pin_names (offset 0.762)) (in_bom yes) (on_board yes)
    (property "Reference" "IC" (at 21.59 7.62 0)
      (effects (font (size 1.27 1.27)) (justify left))
    )
    (property "Value" "SN74LV4040ADGVR" (at 21.59 5.08 0)
      (effects (font (size 1.27 1.27)) (justify left))
    )
    (property "Footprint" "SOP40P640X120-16N" (at 21.59 2.54 0)
      (effects (font (size 1.27 1.27)) (justify left) hide)
    )
    (property "Datasheet" "http://www.ti.com/lit/gpn/sn74lv4040a" (at 21.59 0 0)
      (effects (font (size 1.27 1.27)) (justify left) hide)
    )
    (property "Description" "12-Bit Asynchronous Binary Counter" (at 21.59 -2.54 0)
      (effects (font (size 1.27 1.27)) (justify left) hide)
    )
    (property "Height" "1.2" (at 21.59 -5.08 0)
      (effects (font (size 1.27 1.27)) (justify left) hide)
    )
    (property "Mouser Part Number" "595-SN74LV4040ADGVR" (at 21.59 -7.62 0)
      (effects (font (size 1.27 1.27)) (justify left) hide)
    )
    (property "Mouser Price/Stock" "https://www.mouser.co.uk/ProductDetail/Texas-Instruments/SN74LV4040ADGVR?qs=KaAwwOlwapuUBsLG9yHN0A%3D%3D" (at 21.59 -10.16 0)
      (effects (font (size 1.27 1.27)) (justify left) hide)
    )
    (property "Manufacturer_Name" "Texas Instruments" (at 21.59 -12.7 0)
      (effects (font (size 1.27 1.27)) (justify left) hide)
    )
    (property "Manufacturer_Part_Number" "SN74LV4040ADGVR" (at 21.59 -15.24 0)
      (effects (font (size 1.27 1.27)) (justify left) hide)
    )
    (property "ki_description" "12-Bit Asynchronous Binary Counter" (at 0 0 0)
      (effects (font (size 1.27 1.27)) hide)
    )
    (symbol "SN74LV4040ADGVR_0_0"
      (pin passive line (at 0 0 0) (length 5.08)
        (name "QL" (effects (font (size 1.27 1.27))))
        (number "1" (effects (font (size 1.27 1.27))))
      )
      (pin passive line (at 25.4 -15.24 180) (length 5.08)
        (name "CLK" (effects (font (size 1.27 1.27))))
        (number "10" (effects (font (size 1.27 1.27))))
      )
      (pin passive line (at 25.4 -12.7 180) (length 5.08)
        (name "CLR" (effects (font (size 1.27 1.27))))
        (number "11" (effects (font (size 1.27 1.27))))
      )
      (pin passive line (at 25.4 -10.16 180) (length 5.08)
        (name "QI" (effects (font (size 1.27 1.27))))
        (number "12" (effects (font (size 1.27 1.27))))
      )
      (pin passive line (at 25.4 -7.62 180) (length 5.08)
        (name "QH" (effects (font (size 1.27 1.27))))
        (number "13" (effects (font (size 1.27 1.27))))
      )
      (pin passive line (at 25.4 -5.08 180) (length 5.08)
        (name "QJ" (effects (font (size 1.27 1.27))))
        (number "14" (effects (font (size 1.27 1.27))))
      )
      (pin passive line (at 25.4 -2.54 180) (length 5.08)
        (name "QK" (effects (font (size 1.27 1.27))))
        (number "15" (effects (font (size 1.27 1.27))))
      )
      (pin passive line (at 25.4 0 180) (length 5.08)
        (name "VCC" (effects (font (size 1.27 1.27))))
        (number "16" (effects (font (size 1.27 1.27))))
      )
      (pin passive line (at 0 -2.54 0) (length 5.08)
        (name "QF" (effects (font (size 1.27 1.27))))
        (number "2" (effects (font (size 1.27 1.27))))
      )
      (pin passive line (at 0 -5.08 0) (length 5.08)
        (name "QE" (effects (font (size 1.27 1.27))))
        (number "3" (effects (font (size 1.27 1.27))))
      )
      (pin passive line (at 0 -7.62 0) (length 5.08)
        (name "QG" (effects (font (size 1.27 1.27))))
        (number "4" (effects (font (size 1.27 1.27))))
      )
      (pin passive line (at 0 -10.16 0) (length 5.08)
        (name "QD" (effects (font (size 1.27 1.27))))
        (number "5" (effects (font (size 1.27 1.27))))
      )
      (pin passive line (at 0 -12.7 0) (length 5.08)
        (name "QC" (effects (font (size 1.27 1.27))))
        (number "6" (effects (font (size 1.27 1.27))))
      )
      (pin passive line (at 0 -15.24 0) (length 5.08)
        (name "QB" (effects (font (size 1.27 1.27))))
        (number "7" (effects (font (size 1.27 1.27))))
      )
      (pin passive line (at 0 -17.78 0) (length 5.08)
        (name "GND" (effects (font (size 1.27 1.27))))
        (number "8" (effects (font (size 1.27 1.27))))
      )
      (pin passive line (at 25.4 -17.78 180) (length 5.08)
        (name "QA" (effects (font (size 1.27 1.27))))
        (number "9" (effects (font (size 1.27 1.27))))
      )
    )
    (symbol "SN74LV4040ADGVR_0_1"
      (polyline
        (pts
          (xy 5.08 2.54)
          (xy 20.32 2.54)
          (xy 20.32 -20.32)
          (xy 5.08 -20.32)
          (xy 5.08 2.54)
        )
        (stroke (width 0.1524) (type solid))
        (fill (type none))
      )
    )
  )
  (symbol "SN74LV4040ARGYR" (pin_names (offset 0.762)) (in_bom yes) (on_board yes)
    (property "Reference" "IC" (at 26.67 15.24 0)
      (effects (font (size 1.27 1.27)) (justify left))
    )
    (property "Value" "SN74LV4040ARGYR" (at 26.67 12.7 0)
      (effects (font (size 1.27 1.27)) (justify left))
    )
    (property "Footprint" "SN74AVC4T245RGYR" (at 26.67 10.16 0)
      (effects (font (size 1.27 1.27)) (justify left) hide)
    )
    (property "Datasheet" "http://www.ti.com/lit/gpn/sn74lv4040a" (at 26.67 7.62 0)
      (effects (font (size 1.27 1.27)) (justify left) hide)
    )
    (property "Description" "12-Bit Asynchronous Binary Counter" (at 26.67 5.08 0)
      (effects (font (size 1.27 1.27)) (justify left) hide)
    )
    (property "Height" "1" (at 26.67 2.54 0)
      (effects (font (size 1.27 1.27)) (justify left) hide)
    )
    (property "Mouser Part Number" "595-SN74LV4040ARGYR" (at 26.67 0 0)
      (effects (font (size 1.27 1.27)) (justify left) hide)
    )
    (property "Mouser Price/Stock" "https://www.mouser.co.uk/ProductDetail/Texas-Instruments/SN74LV4040ARGYR?qs=DcvZ7Fltd5xu6J2Y6JM%2FRA%3D%3D" (at 26.67 -2.54 0)
      (effects (font (size 1.27 1.27)) (justify left) hide)
    )
    (property "Manufacturer_Name" "Texas Instruments" (at 26.67 -5.08 0)
      (effects (font (size 1.27 1.27)) (justify left) hide)
    )
    (property "Manufacturer_Part_Number" "SN74LV4040ARGYR" (at 26.67 -7.62 0)
      (effects (font (size 1.27 1.27)) (justify left) hide)
    )
    (property "ki_description" "12-Bit Asynchronous Binary Counter" (at 0 0 0)
      (effects (font (size 1.27 1.27)) hide)
    )
    (symbol "SN74LV4040ARGYR_0_0"
      (pin passive line (at 0 -2.54 0) (length 5.08)
        (name "QL" (effects (font (size 1.27 1.27))))
        (number "1" (effects (font (size 1.27 1.27))))
      )
      (pin passive line (at 22.86 15.24 270) (length 5.08)
        (name "CLK" (effects (font (size 1.27 1.27))))
        (number "10" (effects (font (size 1.27 1.27))))
      )
      (pin passive line (at 20.32 15.24 270) (length 5.08)
        (name "CLR" (effects (font (size 1.27 1.27))))
        (number "11" (effects (font (size 1.27 1.27))))
      )
      (pin passive line (at 17.78 15.24 270) (length 5.08)
        (name "QI" (effects (font (size 1.27 1.27))))
        (number "12" (effects (font (size 1.27 1.27))))
      )
      (pin passive line (at 15.24 15.24 270) (length 5.08)
        (name "QH" (effects (font (size 1.27 1.27))))
        (number "13" (effects (font (size 1.27 1.27))))
      )
      (pin passive line (at 12.7 15.24 270) (length 5.08)
        (name "QJ" (effects (font (size 1.27 1.27))))
        (number "14" (effects (font (size 1.27 1.27))))
      )
      (pin passive line (at 10.16 15.24 270) (length 5.08)
        (name "QK" (effects (font (size 1.27 1.27))))
        (number "15" (effects (font (size 1.27 1.27))))
      )
      (pin passive line (at 0 0 0) (length 5.08)
        (name "VCC" (effects (font (size 1.27 1.27))))
        (number "16" (effects (font (size 1.27 1.27))))
      )
      (pin passive line (at 7.62 15.24 270) (length 5.08)
        (name "EP" (effects (font (size 1.27 1.27))))
        (number "17" (effects (font (size 1.27 1.27))))
      )
      (pin passive line (at 7.62 -15.24 90) (length 5.08)
        (name "QF" (effects (font (size 1.27 1.27))))
        (number "2" (effects (font (size 1.27 1.27))))
      )
      (pin passive line (at 10.16 -15.24 90) (length 5.08)
        (name "QE" (effects (font (size 1.27 1.27))))
        (number "3" (effects (font (size 1.27 1.27))))
      )
      (pin passive line (at 12.7 -15.24 90) (length 5.08)
        (name "QG" (effects (font (size 1.27 1.27))))
        (number "4" (effects (font (size 1.27 1.27))))
      )
      (pin passive line (at 15.24 -15.24 90) (length 5.08)
        (name "QD" (effects (font (size 1.27 1.27))))
        (number "5" (effects (font (size 1.27 1.27))))
      )
      (pin passive line (at 17.78 -15.24 90) (length 5.08)
        (name "QC" (effects (font (size 1.27 1.27))))
        (number "6" (effects (font (size 1.27 1.27))))
      )
      (pin passive line (at 20.32 -15.24 90) (length 5.08)
        (name "QB" (effects (font (size 1.27 1.27))))
        (number "7" (effects (font (size 1.27 1.27))))
      )
      (pin passive line (at 30.48 -2.54 180) (length 5.08)
        (name "GND" (effects (font (size 1.27 1.27))))
        (number "8" (effects (font (size 1.27 1.27))))
      )
      (pin passive line (at 30.48 0 180) (length 5.08)
        (name "QA" (effects (font (size 1.27 1.27))))
        (number "9" (effects (font (size 1.27 1.27))))
      )
    )
    (symbol "SN74LV4040ARGYR_0_1"
      (polyline
        (pts
          (xy 5.08 10.16)
          (xy 25.4 10.16)
          (xy 25.4 -10.16)
          (xy 5.08 -10.16)
          (xy 5.08 10.16)
        )
        (stroke (width 0.1524) (type solid))
        (fill (type none))
      )
    )
  )
  (symbol "SN74LVC1G123DCUR" (pin_names (offset 0.762)) (in_bom yes) (on_board yes)
    (property "Reference" "U" (at 31.75 7.62 0)
      (effects (font (size 1.27 1.27)) (justify left))
    )
    (property "Value" "SN74LVC1G123DCUR" (at 31.75 5.08 0)
      (effects (font (size 1.27 1.27)) (justify left))
    )
    (property "Footprint" "SOP50P310X90-8N" (at 31.75 2.54 0)
      (effects (font (size 1.27 1.27)) (justify left) hide)
    )
    (property "Datasheet" "http://www.ti.com/lit/gpn/sn74lvc1g123" (at 31.75 0 0)
      (effects (font (size 1.27 1.27)) (justify left) hide)
    )
    (property "Description" "Single Retriggerable Monostable Multivibrator with Schmitt-Trigger Inputs" (at 31.75 -2.54 0)
      (effects (font (size 1.27 1.27)) (justify left) hide)
    )
    (property "Height" "0.9" (at 31.75 -5.08 0)
      (effects (font (size 1.27 1.27)) (justify left) hide)
    )
    (property "Mouser Part Number" "595-SN74LVC1G123DCUR" (at 31.75 -7.62 0)
      (effects (font (size 1.27 1.27)) (justify left) hide)
    )
    (property "Mouser Price/Stock" "https://www.mouser.co.uk/ProductDetail/Texas-Instruments/SN74LVC1G123DCUR?qs=pajgIaoyDUi9FmCUXCE9eA%3D%3D" (at 31.75 -10.16 0)
      (effects (font (size 1.27 1.27)) (justify left) hide)
    )
    (property "Manufacturer_Name" "Texas Instruments" (at 31.75 -12.7 0)
      (effects (font (size 1.27 1.27)) (justify left) hide)
    )
    (property "Manufacturer_Part_Number" "SN74LVC1G123DCUR" (at 31.75 -15.24 0)
      (effects (font (size 1.27 1.27)) (justify left) hide)
    )
    (property "ki_description" "Single Retriggerable Monostable Multivibrator with Schmitt-Trigger Inputs" (at 0 0 0)
      (effects (font (size 1.27 1.27)) hide)
    )
    (symbol "SN74LVC1G123DCUR_0_0"
      (pin input line (at 0 0 0) (length 5.08)
        (name "~{A}" (effects (font (size 1.27 1.27))))
        (number "1" (effects (font (size 1.27 1.27))))
      )
      (pin input line (at 0 -2.54 0) (length 5.08)
        (name "B" (effects (font (size 1.27 1.27))))
        (number "2" (effects (font (size 1.27 1.27))))
      )
      (pin passive line (at 0 -5.08 0) (length 5.08)
        (name "~{CLR}" (effects (font (size 1.27 1.27))))
        (number "3" (effects (font (size 1.27 1.27))))
      )
      (pin power_in line (at 0 -7.62 0) (length 5.08)
        (name "GND" (effects (font (size 1.27 1.27))))
        (number "4" (effects (font (size 1.27 1.27))))
      )
      (pin output line (at 35.56 -7.62 180) (length 5.08)
        (name "Q" (effects (font (size 1.27 1.27))))
        (number "5" (effects (font (size 1.27 1.27))))
      )
      (pin passive line (at 35.56 -5.08 180) (length 5.08)
        (name "CEXT" (effects (font (size 1.27 1.27))))
        (number "6" (effects (font (size 1.27 1.27))))
      )
      (pin passive line (at 35.56 -2.54 180) (length 5.08)
        (name "REXT/CEXT" (effects (font (size 1.27 1.27))))
        (number "7" (effects (font (size 1.27 1.27))))
      )
      (pin power_in line (at 35.56 0 180) (length 5.08)
        (name "VCC" (effects (font (size 1.27 1.27))))
        (number "8" (effects (font (size 1.27 1.27))))
      )
    )
    (symbol "SN74LVC1G123DCUR_0_1"
      (polyline
        (pts
          (xy 5.08 2.54)
          (xy 30.48 2.54)
          (xy 30.48 -10.16)
          (xy 5.08 -10.16)
          (xy 5.08 2.54)
        )
        (stroke (width 0.1524) (type solid))
        (fill (type none))
      )
    )
  )
  (symbol "SN74LVC1G373DCKR" (pin_names (offset 0.762)) (in_bom yes) (on_board yes)
    (property "Reference" "IC" (at 21.59 7.62 0)
      (effects (font (size 1.27 1.27)) (justify left))
    )
    (property "Value" "SN74LVC1G373DCKR" (at 21.59 5.08 0)
      (effects (font (size 1.27 1.27)) (justify left))
    )
    (property "Footprint" "SOT65P210X110-6N" (at 21.59 2.54 0)
      (effects (font (size 1.27 1.27)) (justify left) hide)
    )
    (property "Datasheet" "http://www.ti.com/lit/gpn/sn74lvc1g373" (at 21.59 0 0)
      (effects (font (size 1.27 1.27)) (justify left) hide)
    )
    (property "Description" "Texas Instruments SN74LVC1G373DCKR, D Type Latch, Transparent, 3 State, 1.65  5.5 V, 6-Pin SC-70" (at 21.59 -2.54 0)
      (effects (font (size 1.27 1.27)) (justify left) hide)
    )
    (property "Height" "1.1" (at 21.59 -5.08 0)
      (effects (font (size 1.27 1.27)) (justify left) hide)
    )
    (property "Mouser Part Number" "595-SN74LVC1G373DCKR" (at 21.59 -7.62 0)
      (effects (font (size 1.27 1.27)) (justify left) hide)
    )
    (property "Mouser Price/Stock" "https://www.mouser.co.uk/ProductDetail/Texas-Instruments/SN74LVC1G373DCKR?qs=pajgIaoyDUitnicLxEgP7g%3D%3D" (at 21.59 -10.16 0)
      (effects (font (size 1.27 1.27)) (justify left) hide)
    )
    (property "Manufacturer_Name" "Texas Instruments" (at 21.59 -12.7 0)
      (effects (font (size 1.27 1.27)) (justify left) hide)
    )
    (property "Manufacturer_Part_Number" "SN74LVC1G373DCKR" (at 21.59 -15.24 0)
      (effects (font (size 1.27 1.27)) (justify left) hide)
    )
    (property "ki_description" "Texas Instruments SN74LVC1G373DCKR, D Type Latch, Transparent, 3 State, 1.65  5.5 V, 6-Pin SC-70" (at 0 0 0)
      (effects (font (size 1.27 1.27)) hide)
    )
    (symbol "SN74LVC1G373DCKR_0_0"
      (pin passive line (at 0 0 0) (length 5.08)
        (name "LE" (effects (font (size 1.27 1.27))))
        (number "1" (effects (font (size 1.27 1.27))))
      )
      (pin passive line (at 0 -2.54 0) (length 5.08)
        (name "GND" (effects (font (size 1.27 1.27))))
        (number "2" (effects (font (size 1.27 1.27))))
      )
      (pin passive line (at 0 -5.08 0) (length 5.08)
        (name "D" (effects (font (size 1.27 1.27))))
        (number "3" (effects (font (size 1.27 1.27))))
      )
      (pin passive line (at 25.4 -5.08 180) (length 5.08)
        (name "Q" (effects (font (size 1.27 1.27))))
        (number "4" (effects (font (size 1.27 1.27))))
      )
      (pin passive line (at 25.4 -2.54 180) (length 5.08)
        (name "VCC" (effects (font (size 1.27 1.27))))
        (number "5" (effects (font (size 1.27 1.27))))
      )
      (pin passive line (at 25.4 0 180) (length 5.08)
        (name "~{OE}" (effects (font (size 1.27 1.27))))
        (number "6" (effects (font (size 1.27 1.27))))
      )
    )
    (symbol "SN74LVC1G373DCKR_0_1"
      (polyline
        (pts
          (xy 5.08 2.54)
          (xy 20.32 2.54)
          (xy 20.32 -7.62)
          (xy 5.08 -7.62)
          (xy 5.08 2.54)
        )
        (stroke (width 0.1524) (type solid))
        (fill (type none))
      )
    )
  )
  (symbol "TLC5940PWP" (pin_names (offset 0.762)) (in_bom yes) (on_board yes)
    (property "Reference" "IC" (at 26.67 7.62 0)
      (effects (font (size 1.27 1.27)) (justify left))
    )
    (property "Value" "TLC5940PWP" (at 26.67 5.08 0)
      (effects (font (size 1.27 1.27)) (justify left))
    )
    (property "Footprint" "SOP65P640X120-29N" (at 26.67 2.54 0)
      (effects (font (size 1.27 1.27)) (justify left) hide)
    )
    (property "Datasheet" "http://www.ti.com/lit/ds/symlink/tlc5940.pdf" (at 26.67 0 0)
      (effects (font (size 1.27 1.27)) (justify left) hide)
    )
    (property "Description" "LED Driver IC 16 Output Linear Shift Register  Dimming 120mA 28-HTSSOP" (at 26.67 -2.54 0)
      (effects (font (size 1.27 1.27)) (justify left) hide)
    )
    (property "Height" "1.2" (at 26.67 -5.08 0)
      (effects (font (size 1.27 1.27)) (justify left) hide)
    )
    (property "Mouser Part Number" "595-TLC5940PWP" (at 26.67 -7.62 0)
      (effects (font (size 1.27 1.27)) (justify left) hide)
    )
    (property "Mouser Price/Stock" "https://www.mouser.co.uk/ProductDetail/Texas-Instruments/TLC5940PWP?qs=p6lVfQR1GSrLnNrxEviuaQ%3D%3D" (at 26.67 -10.16 0)
      (effects (font (size 1.27 1.27)) (justify left) hide)
    )
    (property "Manufacturer_Name" "Texas Instruments" (at 26.67 -12.7 0)
      (effects (font (size 1.27 1.27)) (justify left) hide)
    )
    (property "Manufacturer_Part_Number" "TLC5940PWP" (at 26.67 -15.24 0)
      (effects (font (size 1.27 1.27)) (justify left) hide)
    )
    (property "ki_description" "LED Driver IC 16 Output Linear Shift Register  Dimming 120mA 28-HTSSOP" (at 0 0 0)
      (effects (font (size 1.27 1.27)) hide)
    )
    (symbol "TLC5940PWP_0_0"
      (pin passive line (at 0 0 0) (length 5.08)
        (name "GND" (effects (font (size 1.27 1.27))))
        (number "1" (effects (font (size 1.27 1.27))))
      )
      (pin passive line (at 0 -22.86 0) (length 5.08)
        (name "OUT3" (effects (font (size 1.27 1.27))))
        (number "10" (effects (font (size 1.27 1.27))))
      )
      (pin passive line (at 0 -25.4 0) (length 5.08)
        (name "OUT4" (effects (font (size 1.27 1.27))))
        (number "11" (effects (font (size 1.27 1.27))))
      )
      (pin passive line (at 0 -27.94 0) (length 5.08)
        (name "OUT5" (effects (font (size 1.27 1.27))))
        (number "12" (effects (font (size 1.27 1.27))))
      )
      (pin passive line (at 0 -30.48 0) (length 5.08)
        (name "OUT6" (effects (font (size 1.27 1.27))))
        (number "13" (effects (font (size 1.27 1.27))))
      )
      (pin passive line (at 0 -33.02 0) (length 5.08)
        (name "OUT7" (effects (font (size 1.27 1.27))))
        (number "14" (effects (font (size 1.27 1.27))))
      )
      (pin passive line (at 30.48 -33.02 180) (length 5.08)
        (name "OUT8" (effects (font (size 1.27 1.27))))
        (number "15" (effects (font (size 1.27 1.27))))
      )
      (pin passive line (at 30.48 -30.48 180) (length 5.08)
        (name "OUT9" (effects (font (size 1.27 1.27))))
        (number "16" (effects (font (size 1.27 1.27))))
      )
      (pin passive line (at 30.48 -27.94 180) (length 5.08)
        (name "OUT10" (effects (font (size 1.27 1.27))))
        (number "17" (effects (font (size 1.27 1.27))))
      )
      (pin passive line (at 30.48 -25.4 180) (length 5.08)
        (name "OUT11" (effects (font (size 1.27 1.27))))
        (number "18" (effects (font (size 1.27 1.27))))
      )
      (pin passive line (at 30.48 -22.86 180) (length 5.08)
        (name "OUT12" (effects (font (size 1.27 1.27))))
        (number "19" (effects (font (size 1.27 1.27))))
      )
      (pin passive line (at 0 -2.54 0) (length 5.08)
        (name "BLANK" (effects (font (size 1.27 1.27))))
        (number "2" (effects (font (size 1.27 1.27))))
      )
      (pin passive line (at 30.48 -20.32 180) (length 5.08)
        (name "OUT13" (effects (font (size 1.27 1.27))))
        (number "20" (effects (font (size 1.27 1.27))))
      )
      (pin passive line (at 30.48 -17.78 180) (length 5.08)
        (name "OUT14" (effects (font (size 1.27 1.27))))
        (number "21" (effects (font (size 1.27 1.27))))
      )
      (pin passive line (at 30.48 -15.24 180) (length 5.08)
        (name "OUT15" (effects (font (size 1.27 1.27))))
        (number "22" (effects (font (size 1.27 1.27))))
      )
      (pin passive line (at 30.48 -12.7 180) (length 5.08)
        (name "XERR" (effects (font (size 1.27 1.27))))
        (number "23" (effects (font (size 1.27 1.27))))
      )
      (pin passive line (at 30.48 -10.16 180) (length 5.08)
        (name "SOUT" (effects (font (size 1.27 1.27))))
        (number "24" (effects (font (size 1.27 1.27))))
      )
      (pin passive line (at 30.48 -7.62 180) (length 5.08)
        (name "GSCLK" (effects (font (size 1.27 1.27))))
        (number "25" (effects (font (size 1.27 1.27))))
      )
      (pin passive line (at 30.48 -5.08 180) (length 5.08)
        (name "DCPRG" (effects (font (size 1.27 1.27))))
        (number "26" (effects (font (size 1.27 1.27))))
      )
      (pin passive line (at 30.48 -2.54 180) (length 5.08)
        (name "IREF" (effects (font (size 1.27 1.27))))
        (number "27" (effects (font (size 1.27 1.27))))
      )
      (pin passive line (at 30.48 0 180) (length 5.08)
        (name "VCC" (effects (font (size 1.27 1.27))))
        (number "28" (effects (font (size 1.27 1.27))))
      )
      (pin passive line (at 15.24 -45.72 90) (length 5.08)
        (name "EP" (effects (font (size 1.27 1.27))))
        (number "29" (effects (font (size 1.27 1.27))))
      )
      (pin passive line (at 0 -5.08 0) (length 5.08)
        (name "XLAT" (effects (font (size 1.27 1.27))))
        (number "3" (effects (font (size 1.27 1.27))))
      )
      (pin passive line (at 0 -7.62 0) (length 5.08)
        (name "SCLK" (effects (font (size 1.27 1.27))))
        (number "4" (effects (font (size 1.27 1.27))))
      )
      (pin passive line (at 0 -10.16 0) (length 5.08)
        (name "SIN" (effects (font (size 1.27 1.27))))
        (number "5" (effects (font (size 1.27 1.27))))
      )
      (pin passive line (at 0 -12.7 0) (length 5.08)
        (name "VPRG" (effects (font (size 1.27 1.27))))
        (number "6" (effects (font (size 1.27 1.27))))
      )
      (pin passive line (at 0 -15.24 0) (length 5.08)
        (name "OUT0" (effects (font (size 1.27 1.27))))
        (number "7" (effects (font (size 1.27 1.27))))
      )
      (pin passive line (at 0 -17.78 0) (length 5.08)
        (name "OUT1" (effects (font (size 1.27 1.27))))
        (number "8" (effects (font (size 1.27 1.27))))
      )
      (pin passive line (at 0 -20.32 0) (length 5.08)
        (name "OUT2" (effects (font (size 1.27 1.27))))
        (number "9" (effects (font (size 1.27 1.27))))
      )
    )
    (symbol "TLC5940PWP_0_1"
      (polyline
        (pts
          (xy 5.08 2.54)
          (xy 25.4 2.54)
          (xy 25.4 -40.64)
          (xy 5.08 -40.64)
          (xy 5.08 2.54)
        )
        (stroke (width 0.1524) (type solid))
        (fill (type none))
      )
    )
  )
)
