(kicad_symbol_lib (version 20220914) (generator kicad_symbol_editor)
  (symbol "150060BS75003" (pin_names hide) (in_bom yes) (on_board yes)
    (property "Reference" "LED" (at 12.7 8.89 0)
      (effects (font (size 1.27 1.27)) (justify left bottom))
    )
    (property "Value" "150060BS75003" (at 12.7 6.35 0)
      (effects (font (size 1.27 1.27)) (justify left bottom))
    )
    (property "Footprint" "150060BS75003" (at 12.7 -93.65 0)
      (effects (font (size 1.27 1.27)) (justify left bottom) hide)
    )
    (property "Datasheet" "https://www.we-online.com/components/products/datasheet/150060BS75003.pdf" (at 12.7 -193.65 0)
      (effects (font (size 1.27 1.27)) (justify left bottom) hide)
    )
    (property "Height" "0.8" (at 12.7 -393.65 0)
      (effects (font (size 1.27 1.27)) (justify left bottom) hide)
    )
    (property "Mouser Part Number" "710-150060BS75003" (at 12.7 -493.65 0)
      (effects (font (size 1.27 1.27)) (justify left bottom) hide)
    )
    (property "Mouser Price/Stock" "https://www.mouser.co.uk/ProductDetail/Wurth-Elektronik/150060BS75003?qs=Li%252BoUPsLEnu8LvIbM48DKA%3D%3D" (at 12.7 -593.65 0)
      (effects (font (size 1.27 1.27)) (justify left bottom) hide)
    )
    (property "Manufacturer_Name" "Wurth Elektronik" (at 12.7 -693.65 0)
      (effects (font (size 1.27 1.27)) (justify left bottom) hide)
    )
    (property "Manufacturer_Part_Number" "150060BS75003" (at 12.7 -793.65 0)
      (effects (font (size 1.27 1.27)) (justify left bottom) hide)
    )
    (property "ki_description" "Standard LEDs - SMD WL-SMCW 350mcd 3,2V 0603 Blue 470nm Adv" (at 0 0 0)
      (effects (font (size 1.27 1.27)) hide)
    )
    (symbol "150060BS75003_1_1"
      (polyline
        (pts
          (xy 2.54 0)
          (xy 5.08 0)
        )
        (stroke (width 0.254) (type default))
        (fill (type none))
      )
      (polyline
        (pts
          (xy 5.08 2.54)
          (xy 5.08 -2.54)
        )
        (stroke (width 0.254) (type default))
        (fill (type none))
      )
      (polyline
        (pts
          (xy 6.35 2.54)
          (xy 3.81 5.08)
        )
        (stroke (width 0.254) (type default))
        (fill (type none))
      )
      (polyline
        (pts
          (xy 8.89 2.54)
          (xy 6.35 5.08)
        )
        (stroke (width 0.254) (type default))
        (fill (type none))
      )
      (polyline
        (pts
          (xy 10.16 0)
          (xy 12.7 0)
        )
        (stroke (width 0.254) (type default))
        (fill (type none))
      )
      (polyline
        (pts
          (xy 5.08 0)
          (xy 10.16 2.54)
          (xy 10.16 -2.54)
          (xy 5.08 0)
        )
        (stroke (width 0.254) (type default))
        (fill (type outline))
      )
      (polyline
        (pts
          (xy 5.334 4.318)
          (xy 4.572 3.556)
          (xy 3.81 5.08)
          (xy 5.334 4.318)
        )
        (stroke (width 0.254) (type default))
        (fill (type outline))
      )
      (polyline
        (pts
          (xy 7.874 4.318)
          (xy 7.112 3.556)
          (xy 6.35 5.08)
          (xy 7.874 4.318)
        )
        (stroke (width 0.254) (type default))
        (fill (type outline))
      )
      (pin passive line (at 15.24 0 180) (length 2.54)
        (name "A" (effects (font (size 1.27 1.27))))
        (number "1" (effects (font (size 1.27 1.27))))
      )
      (pin passive line (at 0 0 0) (length 2.54)
        (name "K" (effects (font (size 1.27 1.27))))
        (number "2" (effects (font (size 1.27 1.27))))
      )
    )
  )
  (symbol "74HC14D,653" (in_bom yes) (on_board yes)
    (property "Reference" "IC" (at 21.59 7.62 0)
      (effects (font (size 1.27 1.27)) (justify left top))
    )
    (property "Value" "74HC14D,653" (at 21.59 5.08 0)
      (effects (font (size 1.27 1.27)) (justify left top))
    )
    (property "Footprint" "SOIC127P600X175-14N" (at 21.59 -94.92 0)
      (effects (font (size 1.27 1.27)) (justify left top) hide)
    )
    (property "Datasheet" "https://assets.nexperia.com/documents/data-sheet/74HC_HCT14.pdf" (at 21.59 -194.92 0)
      (effects (font (size 1.27 1.27)) (justify left top) hide)
    )
    (property "Height" "1.75" (at 21.59 -394.92 0)
      (effects (font (size 1.27 1.27)) (justify left top) hide)
    )
    (property "Mouser Part Number" "771-74HC14D-T" (at 21.59 -494.92 0)
      (effects (font (size 1.27 1.27)) (justify left top) hide)
    )
    (property "Mouser Price/Stock" "https://www.mouser.co.uk/ProductDetail/Nexperia/74HC14D653?qs=P62ublwmbi8OHaKXqv2GmQ%3D%3D" (at 21.59 -594.92 0)
      (effects (font (size 1.27 1.27)) (justify left top) hide)
    )
    (property "Manufacturer_Name" "Nexperia" (at 21.59 -694.92 0)
      (effects (font (size 1.27 1.27)) (justify left top) hide)
    )
    (property "Manufacturer_Part_Number" "74HC14D,653" (at 21.59 -794.92 0)
      (effects (font (size 1.27 1.27)) (justify left top) hide)
    )
    (property "ki_description" "NEXPERIA - 74HC14D,653 - INVERTING SCHMITT TRIGGER, HEX, SOIC-14" (at 0 0 0)
      (effects (font (size 1.27 1.27)) hide)
    )
    (symbol "74HC14D,653_1_1"
      (rectangle (start 5.08 2.54) (end 20.32 -17.78)
        (stroke (width 0.254) (type default))
        (fill (type background))
      )
      (pin passive line (at 0 0 0) (length 5.08)
        (name "1A" (effects (font (size 1.27 1.27))))
        (number "1" (effects (font (size 1.27 1.27))))
      )
      (pin passive line (at 25.4 -10.16 180) (length 5.08)
        (name "5Y" (effects (font (size 1.27 1.27))))
        (number "10" (effects (font (size 1.27 1.27))))
      )
      (pin passive line (at 25.4 -7.62 180) (length 5.08)
        (name "5A" (effects (font (size 1.27 1.27))))
        (number "11" (effects (font (size 1.27 1.27))))
      )
      (pin passive line (at 25.4 -5.08 180) (length 5.08)
        (name "6Y" (effects (font (size 1.27 1.27))))
        (number "12" (effects (font (size 1.27 1.27))))
      )
      (pin passive line (at 25.4 -2.54 180) (length 5.08)
        (name "6A" (effects (font (size 1.27 1.27))))
        (number "13" (effects (font (size 1.27 1.27))))
      )
      (pin passive line (at 25.4 0 180) (length 5.08)
        (name "VCC" (effects (font (size 1.27 1.27))))
        (number "14" (effects (font (size 1.27 1.27))))
      )
      (pin passive line (at 0 -2.54 0) (length 5.08)
        (name "1Y" (effects (font (size 1.27 1.27))))
        (number "2" (effects (font (size 1.27 1.27))))
      )
      (pin passive line (at 0 -5.08 0) (length 5.08)
        (name "2A" (effects (font (size 1.27 1.27))))
        (number "3" (effects (font (size 1.27 1.27))))
      )
      (pin passive line (at 0 -7.62 0) (length 5.08)
        (name "2Y" (effects (font (size 1.27 1.27))))
        (number "4" (effects (font (size 1.27 1.27))))
      )
      (pin passive line (at 0 -10.16 0) (length 5.08)
        (name "3A" (effects (font (size 1.27 1.27))))
        (number "5" (effects (font (size 1.27 1.27))))
      )
      (pin passive line (at 0 -12.7 0) (length 5.08)
        (name "3Y" (effects (font (size 1.27 1.27))))
        (number "6" (effects (font (size 1.27 1.27))))
      )
      (pin passive line (at 0 -15.24 0) (length 5.08)
        (name "GND" (effects (font (size 1.27 1.27))))
        (number "7" (effects (font (size 1.27 1.27))))
      )
      (pin passive line (at 25.4 -15.24 180) (length 5.08)
        (name "4Y" (effects (font (size 1.27 1.27))))
        (number "8" (effects (font (size 1.27 1.27))))
      )
      (pin passive line (at 25.4 -12.7 180) (length 5.08)
        (name "4A" (effects (font (size 1.27 1.27))))
        (number "9" (effects (font (size 1.27 1.27))))
      )
    )
  )
  (symbol "CSD25404Q3" (in_bom yes) (on_board yes)
    (property "Reference" "Q" (at 21.59 7.62 0)
      (effects (font (size 1.27 1.27)) (justify left top))
    )
    (property "Value" "CSD25404Q3" (at 21.59 5.08 0)
      (effects (font (size 1.27 1.27)) (justify left top))
    )
    (property "Footprint" "DQG_VSON-CLIP" (at 21.59 -94.92 0)
      (effects (font (size 1.27 1.27)) (justify left top) hide)
    )
    (property "Datasheet" "http://www.ti.com/lit/gpn/csd25404q3" (at 21.59 -194.92 0)
      (effects (font (size 1.27 1.27)) (justify left top) hide)
    )
    (property "Height" "" (at 21.59 -394.92 0)
      (effects (font (size 1.27 1.27)) (justify left top) hide)
    )
    (property "Mouser Part Number" "595-CSD25404Q3" (at 21.59 -494.92 0)
      (effects (font (size 1.27 1.27)) (justify left top) hide)
    )
    (property "Mouser Price/Stock" "https://www.mouser.co.uk/ProductDetail/Texas-Instruments/CSD25404Q3?qs=8%2FmU9qzJpL%252B6q%252BuQrXnWBA%3D%3D" (at 21.59 -594.92 0)
      (effects (font (size 1.27 1.27)) (justify left top) hide)
    )
    (property "Manufacturer_Name" "Texas Instruments" (at 21.59 -694.92 0)
      (effects (font (size 1.27 1.27)) (justify left top) hide)
    )
    (property "Manufacturer_Part_Number" "CSD25404Q3" (at 21.59 -794.92 0)
      (effects (font (size 1.27 1.27)) (justify left top) hide)
    )
    (property "ki_description" "-20V, P ch NexFET MOSFET, single SON 3x3, 6.5mOhm" (at 0 0 0)
      (effects (font (size 1.27 1.27)) hide)
    )
    (symbol "CSD25404Q3_1_1"
      (rectangle (start 5.08 2.54) (end 20.32 -10.16)
        (stroke (width 0.254) (type default))
        (fill (type background))
      )
      (pin passive line (at 0 0 0) (length 5.08)
        (name "D_1" (effects (font (size 1.27 1.27))))
        (number "1" (effects (font (size 1.27 1.27))))
      )
      (pin passive line (at 0 -2.54 0) (length 5.08)
        (name "D_2" (effects (font (size 1.27 1.27))))
        (number "2" (effects (font (size 1.27 1.27))))
      )
      (pin passive line (at 0 -5.08 0) (length 5.08)
        (name "D_3" (effects (font (size 1.27 1.27))))
        (number "3" (effects (font (size 1.27 1.27))))
      )
      (pin passive line (at 0 -7.62 0) (length 5.08)
        (name "G" (effects (font (size 1.27 1.27))))
        (number "4" (effects (font (size 1.27 1.27))))
      )
      (pin passive line (at 25.4 0 180) (length 5.08)
        (name "S_1" (effects (font (size 1.27 1.27))))
        (number "5" (effects (font (size 1.27 1.27))))
      )
      (pin passive line (at 25.4 -2.54 180) (length 5.08)
        (name "S_2" (effects (font (size 1.27 1.27))))
        (number "6" (effects (font (size 1.27 1.27))))
      )
      (pin passive line (at 25.4 -5.08 180) (length 5.08)
        (name "S_3" (effects (font (size 1.27 1.27))))
        (number "7" (effects (font (size 1.27 1.27))))
      )
      (pin passive line (at 25.4 -7.62 180) (length 5.08)
        (name "S_4" (effects (font (size 1.27 1.27))))
        (number "8" (effects (font (size 1.27 1.27))))
      )
    )
  )
  (symbol "DMHC3025LSD-13" (in_bom yes) (on_board yes)
    (property "Reference" "Q" (at 31.75 7.62 0)
      (effects (font (size 1.27 1.27)) (justify left top))
    )
    (property "Value" "DMHC3025LSD-13" (at 31.75 5.08 0)
      (effects (font (size 1.27 1.27)) (justify left top))
    )
    (property "Footprint" "SOIC127P600X175-8N" (at 31.75 -94.92 0)
      (effects (font (size 1.27 1.27)) (justify left top) hide)
    )
    (property "Datasheet" "https://www.diodes.com/assets/Datasheets/DMHC3025LSD.pdf" (at 31.75 -194.92 0)
      (effects (font (size 1.27 1.27)) (justify left top) hide)
    )
    (property "Height" "1.75" (at 31.75 -394.92 0)
      (effects (font (size 1.27 1.27)) (justify left top) hide)
    )
    (property "Mouser Part Number" "621-DMHC3025LSD-13" (at 31.75 -494.92 0)
      (effects (font (size 1.27 1.27)) (justify left top) hide)
    )
    (property "Mouser Price/Stock" "https://www.mouser.co.uk/ProductDetail/Diodes-Incorporated/DMHC3025LSD-13?qs=%252BjIv3iUnhaAcGsdIwh%2FJpA%3D%3D" (at 31.75 -594.92 0)
      (effects (font (size 1.27 1.27)) (justify left top) hide)
    )
    (property "Manufacturer_Name" "Diodes Incorporated" (at 31.75 -694.92 0)
      (effects (font (size 1.27 1.27)) (justify left top) hide)
    )
    (property "Manufacturer_Part_Number" "DMHC3025LSD-13" (at 31.75 -794.92 0)
      (effects (font (size 1.27 1.27)) (justify left top) hide)
    )
    (property "ki_description" "30V Enhancement MOSFET H-Bridge SOIC8 Diodes Inc DMHC3025LSD-13 Quad N/P-channel MOSFET Transistor, 8-Pin SOIC" (at 0 0 0)
      (effects (font (size 1.27 1.27)) hide)
    )
    (symbol "DMHC3025LSD-13_1_1"
      (rectangle (start 5.08 2.54) (end 30.48 -10.16)
        (stroke (width 0.254) (type default))
        (fill (type background))
      )
      (pin passive line (at 0 0 0) (length 5.08)
        (name "N1G" (effects (font (size 1.27 1.27))))
        (number "1" (effects (font (size 1.27 1.27))))
      )
      (pin passive line (at 0 -2.54 0) (length 5.08)
        (name "N1D/P1D" (effects (font (size 1.27 1.27))))
        (number "2" (effects (font (size 1.27 1.27))))
      )
      (pin passive line (at 0 -5.08 0) (length 5.08)
        (name "N1S/N2S" (effects (font (size 1.27 1.27))))
        (number "3" (effects (font (size 1.27 1.27))))
      )
      (pin passive line (at 0 -7.62 0) (length 5.08)
        (name "N2G" (effects (font (size 1.27 1.27))))
        (number "4" (effects (font (size 1.27 1.27))))
      )
      (pin passive line (at 35.56 -7.62 180) (length 5.08)
        (name "P2G" (effects (font (size 1.27 1.27))))
        (number "5" (effects (font (size 1.27 1.27))))
      )
      (pin passive line (at 35.56 -5.08 180) (length 5.08)
        (name "N2D/P2D" (effects (font (size 1.27 1.27))))
        (number "6" (effects (font (size 1.27 1.27))))
      )
      (pin passive line (at 35.56 -2.54 180) (length 5.08)
        (name "P1S/P2S" (effects (font (size 1.27 1.27))))
        (number "7" (effects (font (size 1.27 1.27))))
      )
      (pin passive line (at 35.56 0 180) (length 5.08)
        (name "P1G" (effects (font (size 1.27 1.27))))
        (number "8" (effects (font (size 1.27 1.27))))
      )
    )
  )
  (symbol "ECS-2520MV-480-CM-TR" (in_bom yes) (on_board yes)
    (property "Reference" "Y" (at 34.29 7.62 0)
      (effects (font (size 1.27 1.27)) (justify left top))
    )
    (property "Value" "ECS-2520MV-480-CM-TR" (at 34.29 5.08 0)
      (effects (font (size 1.27 1.27)) (justify left top))
    )
    (property "Footprint" "ECS2520MV480CMTR" (at 34.29 -94.92 0)
      (effects (font (size 1.27 1.27)) (justify left top) hide)
    )
    (property "Datasheet" "https://ecsxtal.com/store/pdf/ECS-2520MV.pdf" (at 34.29 -194.92 0)
      (effects (font (size 1.27 1.27)) (justify left top) hide)
    )
    (property "Height" "0.9" (at 34.29 -394.92 0)
      (effects (font (size 1.27 1.27)) (justify left top) hide)
    )
    (property "Mouser Part Number" "520-2520MV-480-CM-TR" (at 34.29 -494.92 0)
      (effects (font (size 1.27 1.27)) (justify left top) hide)
    )
    (property "Mouser Price/Stock" "https://www.mouser.co.uk/ProductDetail/ECS/ECS-2520MV-480-CM-TR?qs=vvQtp7zwQdPXlGQel9vc8Q%3D%3D" (at 34.29 -594.92 0)
      (effects (font (size 1.27 1.27)) (justify left top) hide)
    )
    (property "Manufacturer_Name" "ECS" (at 34.29 -694.92 0)
      (effects (font (size 1.27 1.27)) (justify left top) hide)
    )
    (property "Manufacturer_Part_Number" "ECS-2520MV-480-CM-TR" (at 34.29 -794.92 0)
      (effects (font (size 1.27 1.27)) (justify left top) hide)
    )
    (property "ki_description" "Standard Clock Oscillators 48MHz, Multi-Volt 1.6 3.6 V, STAB +/-25 ppm, -20 +70 C, 4-SMD 2.5 x 2.0 mm RoHS" (at 0 0 0)
      (effects (font (size 1.27 1.27)) hide)
    )
    (symbol "ECS-2520MV-480-CM-TR_1_1"
      (rectangle (start 5.08 2.54) (end 33.02 -5.08)
        (stroke (width 0.254) (type default))
        (fill (type background))
      )
      (pin passive line (at 0 -2.54 0) (length 5.08)
        (name "TRI-STATE" (effects (font (size 1.27 1.27))))
        (number "1" (effects (font (size 1.27 1.27))))
      )
      (pin passive line (at 38.1 -2.54 180) (length 5.08)
        (name "GND" (effects (font (size 1.27 1.27))))
        (number "2" (effects (font (size 1.27 1.27))))
      )
      (pin passive line (at 38.1 0 180) (length 5.08)
        (name "OUTPUT" (effects (font (size 1.27 1.27))))
        (number "3" (effects (font (size 1.27 1.27))))
      )
      (pin passive line (at 0 0 0) (length 5.08)
        (name "VDD" (effects (font (size 1.27 1.27))))
        (number "4" (effects (font (size 1.27 1.27))))
      )
    )
  )
  (symbol "ECS-2520MVLC-120-CN-TR" (in_bom yes) (on_board yes)
    (property "Reference" "Y" (at 34.29 7.62 0)
      (effects (font (size 1.27 1.27)) (justify left top))
    )
    (property "Value" "ECS-2520MVLC-120-CN-TR" (at 34.29 5.08 0)
      (effects (font (size 1.27 1.27)) (justify left top))
    )
    (property "Footprint" "ECS2520MVLC120CNTR" (at 34.29 -94.92 0)
      (effects (font (size 1.27 1.27)) (justify left top) hide)
    )
    (property "Datasheet" "https://www.google.com/url?sa=t&rct=j&q=&esrc=s&source=web&cd=&ved=2ahUKEwi43cyW_bj2AhVBXBoKHeoCBjUQFnoECBUQAQ&url=https%3A%2F%2Fecsxtal.com%2Fstore%2Fpdf%2FECS-2520MVLC.pdf&usg=AOvVaw1FVHdgV02YD-i1ba9jFZ6a" (at 34.29 -194.92 0)
      (effects (font (size 1.27 1.27)) (justify left top) hide)
    )
    (property "Height" "0.9" (at 34.29 -394.92 0)
      (effects (font (size 1.27 1.27)) (justify left top) hide)
    )
    (property "Mouser Part Number" "520-2520MVLC-120CNTR" (at 34.29 -494.92 0)
      (effects (font (size 1.27 1.27)) (justify left top) hide)
    )
    (property "Mouser Price/Stock" "https://www.mouser.co.uk/ProductDetail/ECS/ECS-2520MVLC-120-CN-TR?qs=QNEnbhJQKvYlXhmgfzaaOw%3D%3D" (at 34.29 -594.92 0)
      (effects (font (size 1.27 1.27)) (justify left top) hide)
    )
    (property "Manufacturer_Name" "ECS" (at 34.29 -694.92 0)
      (effects (font (size 1.27 1.27)) (justify left top) hide)
    )
    (property "Manufacturer_Part_Number" "ECS-2520MVLC-120-CN-TR" (at 34.29 -794.92 0)
      (effects (font (size 1.27 1.27)) (justify left top) hide)
    )
    (property "ki_description" "Standard Clock Oscillators 12.000MHz HCMOS Supply Voltage 1.6 3.6 +/-25 ppm -40 +85C" (at 0 0 0)
      (effects (font (size 1.27 1.27)) hide)
    )
    (symbol "ECS-2520MVLC-120-CN-TR_1_1"
      (rectangle (start 5.08 2.54) (end 33.02 -5.08)
        (stroke (width 0.254) (type default))
        (fill (type background))
      )
      (pin passive line (at 0 -2.54 0) (length 5.08)
        (name "TRI-STATE" (effects (font (size 1.27 1.27))))
        (number "1" (effects (font (size 1.27 1.27))))
      )
      (pin passive line (at 38.1 -2.54 180) (length 5.08)
        (name "GND" (effects (font (size 1.27 1.27))))
        (number "2" (effects (font (size 1.27 1.27))))
      )
      (pin passive line (at 38.1 0 180) (length 5.08)
        (name "OUTPUT" (effects (font (size 1.27 1.27))))
        (number "3" (effects (font (size 1.27 1.27))))
      )
      (pin passive line (at 0 0 0) (length 5.08)
        (name "VDD" (effects (font (size 1.27 1.27))))
        (number "4" (effects (font (size 1.27 1.27))))
      )
    )
  )
  (symbol "INA228AQDGSRQ1" (in_bom yes) (on_board yes)
    (property "Reference" "IC" (at 26.67 7.62 0)
      (effects (font (size 1.27 1.27)) (justify left top))
    )
    (property "Value" "INA228AQDGSRQ1" (at 26.67 5.08 0)
      (effects (font (size 1.27 1.27)) (justify left top))
    )
    (property "Footprint" "SOP50P490X110-10N" (at 26.67 -94.92 0)
      (effects (font (size 1.27 1.27)) (justify left top) hide)
    )
    (property "Datasheet" "https://www.ti.com/lit/gpn/ina228-q1" (at 26.67 -194.92 0)
      (effects (font (size 1.27 1.27)) (justify left top) hide)
    )
    (property "Height" "1.1" (at 26.67 -394.92 0)
      (effects (font (size 1.27 1.27)) (justify left top) hide)
    )
    (property "Mouser Part Number" "595-INA228AQDGSRQ1" (at 26.67 -494.92 0)
      (effects (font (size 1.27 1.27)) (justify left top) hide)
    )
    (property "Mouser Price/Stock" "https://www.mouser.co.uk/ProductDetail/Texas-Instruments/INA228AQDGSRQ1?qs=QNEnbhJQKvZw8LLjrvIyCg%3D%3D" (at 26.67 -594.92 0)
      (effects (font (size 1.27 1.27)) (justify left top) hide)
    )
    (property "Manufacturer_Name" "Texas Instruments" (at 26.67 -694.92 0)
      (effects (font (size 1.27 1.27)) (justify left top) hide)
    )
    (property "Manufacturer_Part_Number" "INA228AQDGSRQ1" (at 26.67 -794.92 0)
      (effects (font (size 1.27 1.27)) (justify left top) hide)
    )
    (property "ki_description" "Current & Power Monitors & Regulators AEC-Q100, 85-V, 20-bit, ultraprecise, I C output current/voltage/power/energy/charge monitor" (at 0 0 0)
      (effects (font (size 1.27 1.27)) hide)
    )
    (symbol "INA228AQDGSRQ1_1_1"
      (rectangle (start 5.08 2.54) (end 25.4 -12.7)
        (stroke (width 0.254) (type default))
        (fill (type background))
      )
      (pin passive line (at 0 0 0) (length 5.08)
        (name "A1" (effects (font (size 1.27 1.27))))
        (number "1" (effects (font (size 1.27 1.27))))
      )
      (pin passive line (at 30.48 0 180) (length 5.08)
        (name "IN+" (effects (font (size 1.27 1.27))))
        (number "10" (effects (font (size 1.27 1.27))))
      )
      (pin passive line (at 0 -2.54 0) (length 5.08)
        (name "A0" (effects (font (size 1.27 1.27))))
        (number "2" (effects (font (size 1.27 1.27))))
      )
      (pin passive line (at 0 -5.08 0) (length 5.08)
        (name "ALERT" (effects (font (size 1.27 1.27))))
        (number "3" (effects (font (size 1.27 1.27))))
      )
      (pin passive line (at 0 -7.62 0) (length 5.08)
        (name "SDA" (effects (font (size 1.27 1.27))))
        (number "4" (effects (font (size 1.27 1.27))))
      )
      (pin passive line (at 0 -10.16 0) (length 5.08)
        (name "SCL" (effects (font (size 1.27 1.27))))
        (number "5" (effects (font (size 1.27 1.27))))
      )
      (pin passive line (at 30.48 -10.16 180) (length 5.08)
        (name "VS" (effects (font (size 1.27 1.27))))
        (number "6" (effects (font (size 1.27 1.27))))
      )
      (pin passive line (at 30.48 -7.62 180) (length 5.08)
        (name "GND" (effects (font (size 1.27 1.27))))
        (number "7" (effects (font (size 1.27 1.27))))
      )
      (pin passive line (at 30.48 -5.08 180) (length 5.08)
        (name "VBUS" (effects (font (size 1.27 1.27))))
        (number "8" (effects (font (size 1.27 1.27))))
      )
      (pin passive line (at 30.48 -2.54 180) (length 5.08)
        (name "IN-" (effects (font (size 1.27 1.27))))
        (number "9" (effects (font (size 1.27 1.27))))
      )
    )
  )
  (symbol "IRLML0030TRPBF" (in_bom yes) (on_board yes)
    (property "Reference" "Q" (at 16.51 7.62 0)
      (effects (font (size 1.27 1.27)) (justify left top))
    )
    (property "Value" "IRLML0030TRPBF" (at 16.51 5.08 0)
      (effects (font (size 1.27 1.27)) (justify left top))
    )
    (property "Footprint" "SOT95P237X112-3N" (at 16.51 -94.92 0)
      (effects (font (size 1.27 1.27)) (justify left top) hide)
    )
    (property "Datasheet" "http://www.infineon.com/dgdl/irlml0030pbf.pdf?fileId=5546d462533600a401535664773825df" (at 16.51 -194.92 0)
      (effects (font (size 1.27 1.27)) (justify left top) hide)
    )
    (property "Height" "1.12" (at 16.51 -394.92 0)
      (effects (font (size 1.27 1.27)) (justify left top) hide)
    )
    (property "Mouser Part Number" "942-IRLML0030TRPBF" (at 16.51 -494.92 0)
      (effects (font (size 1.27 1.27)) (justify left top) hide)
    )
    (property "Mouser Price/Stock" "https://www.mouser.co.uk/ProductDetail/Infineon-Technologies/IRLML0030TRPBF?qs=9%252BKlkBgLFf0lLJi3xz1alg%3D%3D" (at 16.51 -594.92 0)
      (effects (font (size 1.27 1.27)) (justify left top) hide)
    )
    (property "Manufacturer_Name" "Infineon" (at 16.51 -694.92 0)
      (effects (font (size 1.27 1.27)) (justify left top) hide)
    )
    (property "Manufacturer_Part_Number" "IRLML0030TRPBF" (at 16.51 -794.92 0)
      (effects (font (size 1.27 1.27)) (justify left top) hide)
    )
    (property "ki_description" "INFINEON - IRLML0030TRPBF - MOSFET, N CH, 30V, 5.3A, SOT23-3" (at 0 0 0)
      (effects (font (size 1.27 1.27)) hide)
    )
    (symbol "IRLML0030TRPBF_1_1"
      (rectangle (start 5.08 2.54) (end 15.24 -5.08)
        (stroke (width 0.254) (type default))
        (fill (type background))
      )
      (pin passive line (at 0 0 0) (length 5.08)
        (name "G" (effects (font (size 1.27 1.27))))
        (number "1" (effects (font (size 1.27 1.27))))
      )
      (pin passive line (at 0 -2.54 0) (length 5.08)
        (name "S" (effects (font (size 1.27 1.27))))
        (number "2" (effects (font (size 1.27 1.27))))
      )
      (pin passive line (at 20.32 0 180) (length 5.08)
        (name "D" (effects (font (size 1.27 1.27))))
        (number "3" (effects (font (size 1.27 1.27))))
      )
    )
  )
  (symbol "IRLML6244TRPBF" (in_bom yes) (on_board yes)
    (property "Reference" "Q" (at 16.51 7.62 0)
      (effects (font (size 1.27 1.27)) (justify left top))
    )
    (property "Value" "IRLML6244TRPBF" (at 16.51 5.08 0)
      (effects (font (size 1.27 1.27)) (justify left top))
    )
    (property "Footprint" "SOT95P237X112-3N" (at 16.51 -94.92 0)
      (effects (font (size 1.27 1.27)) (justify left top) hide)
    )
    (property "Datasheet" "http://www.infineon.com/dgdl/irlml6244pbf.pdf?fileId=5546d462533600a4015356686fed261f" (at 16.51 -194.92 0)
      (effects (font (size 1.27 1.27)) (justify left top) hide)
    )
    (property "Height" "1.12" (at 16.51 -394.92 0)
      (effects (font (size 1.27 1.27)) (justify left top) hide)
    )
    (property "Mouser Part Number" "942-IRLML6244TRPBF" (at 16.51 -494.92 0)
      (effects (font (size 1.27 1.27)) (justify left top) hide)
    )
    (property "Mouser Price/Stock" "https://www.mouser.co.uk/ProductDetail/Infineon-Technologies/IRLML6244TRPBF?qs=9%252BKlkBgLFf1HkY%2F2U%252BIhLQ%3D%3D" (at 16.51 -594.92 0)
      (effects (font (size 1.27 1.27)) (justify left top) hide)
    )
    (property "Manufacturer_Name" "Infineon" (at 16.51 -694.92 0)
      (effects (font (size 1.27 1.27)) (justify left top) hide)
    )
    (property "Manufacturer_Part_Number" "IRLML6244TRPBF" (at 16.51 -794.92 0)
      (effects (font (size 1.27 1.27)) (justify left top) hide)
    )
    (property "ki_description" "INFINEON - IRLML6244TRPBF - MOSFET, N CH, 20V, 6.3A, SOT-23" (at 0 0 0)
      (effects (font (size 1.27 1.27)) hide)
    )
    (symbol "IRLML6244TRPBF_1_1"
      (rectangle (start 5.08 2.54) (end 15.24 -5.08)
        (stroke (width 0.254) (type default))
        (fill (type background))
      )
      (pin passive line (at 0 0 0) (length 5.08)
        (name "G" (effects (font (size 1.27 1.27))))
        (number "1" (effects (font (size 1.27 1.27))))
      )
      (pin passive line (at 0 -2.54 0) (length 5.08)
        (name "S" (effects (font (size 1.27 1.27))))
        (number "2" (effects (font (size 1.27 1.27))))
      )
      (pin passive line (at 20.32 0 180) (length 5.08)
        (name "D" (effects (font (size 1.27 1.27))))
        (number "3" (effects (font (size 1.27 1.27))))
      )
    )
  )
  (symbol "JB2835AWT-W-H40GA0000-N0000001" (pin_names hide) (in_bom yes) (on_board yes)
    (property "Reference" "LED" (at 12.7 8.89 0)
      (effects (font (size 1.27 1.27)) (justify left bottom))
    )
    (property "Value" "JB2835AWT-W-H40GA0000-N0000001" (at 12.7 6.35 0)
      (effects (font (size 1.27 1.27)) (justify left bottom))
    )
    (property "Footprint" "JB2835AWTWH40GA0000N0000001" (at 12.7 -93.65 0)
      (effects (font (size 1.27 1.27)) (justify left bottom) hide)
    )
    (property "Datasheet" "https://www.mouser.tw/datasheet/2/723/data_sheet_JSeries_2835_3v-2326943.pdf" (at 12.7 -193.65 0)
      (effects (font (size 1.27 1.27)) (justify left bottom) hide)
    )
    (property "Height" "0.8" (at 12.7 -393.65 0)
      (effects (font (size 1.27 1.27)) (justify left bottom) hide)
    )
    (property "Mouser Part Number" "941-JB2835AWTWH40GAN" (at 12.7 -493.65 0)
      (effects (font (size 1.27 1.27)) (justify left bottom) hide)
    )
    (property "Mouser Price/Stock" "https://www.mouser.co.uk/ProductDetail/Cree-LED/JB2835AWT-W-H40GA0000-N0000001?qs=wnTfsH77Xs71rJpOo%252B9TMg%3D%3D" (at 12.7 -593.65 0)
      (effects (font (size 1.27 1.27)) (justify left bottom) hide)
    )
    (property "Manufacturer_Name" "CREE LED" (at 12.7 -693.65 0)
      (effects (font (size 1.27 1.27)) (justify left bottom) hide)
    )
    (property "Manufacturer_Part_Number" "JB2835AWT-W-H40GA0000-N0000001" (at 12.7 -793.65 0)
      (effects (font (size 1.27 1.27)) (justify left bottom) hide)
    )
    (property "ki_description" "High Power LEDs - White White, 26.6lm 3V, 80CRI" (at 0 0 0)
      (effects (font (size 1.27 1.27)) hide)
    )
    (symbol "JB2835AWT-W-H40GA0000-N0000001_1_1"
      (polyline
        (pts
          (xy 2.54 0)
          (xy 5.08 0)
        )
        (stroke (width 0.254) (type default))
        (fill (type none))
      )
      (polyline
        (pts
          (xy 5.08 2.54)
          (xy 5.08 -2.54)
        )
        (stroke (width 0.254) (type default))
        (fill (type none))
      )
      (polyline
        (pts
          (xy 6.35 2.54)
          (xy 3.81 5.08)
        )
        (stroke (width 0.254) (type default))
        (fill (type none))
      )
      (polyline
        (pts
          (xy 8.89 2.54)
          (xy 6.35 5.08)
        )
        (stroke (width 0.254) (type default))
        (fill (type none))
      )
      (polyline
        (pts
          (xy 10.16 0)
          (xy 12.7 0)
        )
        (stroke (width 0.254) (type default))
        (fill (type none))
      )
      (polyline
        (pts
          (xy 5.08 0)
          (xy 10.16 2.54)
          (xy 10.16 -2.54)
          (xy 5.08 0)
        )
        (stroke (width 0.254) (type default))
        (fill (type outline))
      )
      (polyline
        (pts
          (xy 5.334 4.318)
          (xy 4.572 3.556)
          (xy 3.81 5.08)
          (xy 5.334 4.318)
        )
        (stroke (width 0.254) (type default))
        (fill (type outline))
      )
      (polyline
        (pts
          (xy 7.874 4.318)
          (xy 7.112 3.556)
          (xy 6.35 5.08)
          (xy 7.874 4.318)
        )
        (stroke (width 0.254) (type default))
        (fill (type outline))
      )
      (pin passive line (at 0 0 0) (length 2.54)
        (name "K" (effects (font (size 1.27 1.27))))
        (number "1" (effects (font (size 1.27 1.27))))
      )
      (pin passive line (at 15.24 0 180) (length 2.54)
        (name "A" (effects (font (size 1.27 1.27))))
        (number "2" (effects (font (size 1.27 1.27))))
      )
    )
  )
  (symbol "PCA9685PW,118" (in_bom yes) (on_board yes)
    (property "Reference" "IC" (at 26.67 7.62 0)
      (effects (font (size 1.27 1.27)) (justify left top))
    )
    (property "Value" "PCA9685PW,118" (at 26.67 5.08 0)
      (effects (font (size 1.27 1.27)) (justify left top))
    )
    (property "Footprint" "SOP65P640X110-28N" (at 26.67 -94.92 0)
      (effects (font (size 1.27 1.27)) (justify left top) hide)
    )
    (property "Datasheet" "http://www.nxp.com/docs/en/data-sheet/PCA9685.pdf" (at 26.67 -194.92 0)
      (effects (font (size 1.27 1.27)) (justify left top) hide)
    )
    (property "Height" "1.1" (at 26.67 -394.92 0)
      (effects (font (size 1.27 1.27)) (justify left top) hide)
    )
    (property "Mouser Part Number" "771-PCA9685PW,118" (at 26.67 -494.92 0)
      (effects (font (size 1.27 1.27)) (justify left top) hide)
    )
    (property "Mouser Price/Stock" "https://www.mouser.co.uk/ProductDetail/NXP-Semiconductors/PCA9685PW118?qs=6YAT8rHPFU%252BtfwwKq4nwEQ%3D%3D" (at 26.67 -594.92 0)
      (effects (font (size 1.27 1.27)) (justify left top) hide)
    )
    (property "Manufacturer_Name" "NXP" (at 26.67 -694.92 0)
      (effects (font (size 1.27 1.27)) (justify left top) hide)
    )
    (property "Manufacturer_Part_Number" "PCA9685PW,118" (at 26.67 -794.92 0)
      (effects (font (size 1.27 1.27)) (justify left top) hide)
    )
    (property "ki_description" "LED Display Drivers" (at 0 0 0)
      (effects (font (size 1.27 1.27)) hide)
    )
    (symbol "PCA9685PW,118_1_1"
      (rectangle (start 5.08 2.54) (end 25.4 -35.56)
        (stroke (width 0.254) (type default))
        (fill (type background))
      )
      (pin passive line (at 0 0 0) (length 5.08)
        (name "A0" (effects (font (size 1.27 1.27))))
        (number "1" (effects (font (size 1.27 1.27))))
      )
      (pin passive line (at 0 -22.86 0) (length 5.08)
        (name "LED4" (effects (font (size 1.27 1.27))))
        (number "10" (effects (font (size 1.27 1.27))))
      )
      (pin passive line (at 0 -25.4 0) (length 5.08)
        (name "LED5" (effects (font (size 1.27 1.27))))
        (number "11" (effects (font (size 1.27 1.27))))
      )
      (pin passive line (at 0 -27.94 0) (length 5.08)
        (name "LED6" (effects (font (size 1.27 1.27))))
        (number "12" (effects (font (size 1.27 1.27))))
      )
      (pin passive line (at 0 -30.48 0) (length 5.08)
        (name "LED7" (effects (font (size 1.27 1.27))))
        (number "13" (effects (font (size 1.27 1.27))))
      )
      (pin passive line (at 0 -33.02 0) (length 5.08)
        (name "VSS" (effects (font (size 1.27 1.27))))
        (number "14" (effects (font (size 1.27 1.27))))
      )
      (pin passive line (at 30.48 -33.02 180) (length 5.08)
        (name "LED8" (effects (font (size 1.27 1.27))))
        (number "15" (effects (font (size 1.27 1.27))))
      )
      (pin passive line (at 30.48 -30.48 180) (length 5.08)
        (name "LED9" (effects (font (size 1.27 1.27))))
        (number "16" (effects (font (size 1.27 1.27))))
      )
      (pin passive line (at 30.48 -27.94 180) (length 5.08)
        (name "LED10" (effects (font (size 1.27 1.27))))
        (number "17" (effects (font (size 1.27 1.27))))
      )
      (pin passive line (at 30.48 -25.4 180) (length 5.08)
        (name "LED11" (effects (font (size 1.27 1.27))))
        (number "18" (effects (font (size 1.27 1.27))))
      )
      (pin passive line (at 30.48 -22.86 180) (length 5.08)
        (name "LED12" (effects (font (size 1.27 1.27))))
        (number "19" (effects (font (size 1.27 1.27))))
      )
      (pin passive line (at 0 -2.54 0) (length 5.08)
        (name "A1" (effects (font (size 1.27 1.27))))
        (number "2" (effects (font (size 1.27 1.27))))
      )
      (pin passive line (at 30.48 -20.32 180) (length 5.08)
        (name "LED13" (effects (font (size 1.27 1.27))))
        (number "20" (effects (font (size 1.27 1.27))))
      )
      (pin passive line (at 30.48 -17.78 180) (length 5.08)
        (name "LED14" (effects (font (size 1.27 1.27))))
        (number "21" (effects (font (size 1.27 1.27))))
      )
      (pin passive line (at 30.48 -15.24 180) (length 5.08)
        (name "LED15" (effects (font (size 1.27 1.27))))
        (number "22" (effects (font (size 1.27 1.27))))
      )
      (pin passive line (at 30.48 -12.7 180) (length 5.08)
        (name "~{OE}" (effects (font (size 1.27 1.27))))
        (number "23" (effects (font (size 1.27 1.27))))
      )
      (pin passive line (at 30.48 -10.16 180) (length 5.08)
        (name "A5" (effects (font (size 1.27 1.27))))
        (number "24" (effects (font (size 1.27 1.27))))
      )
      (pin passive line (at 30.48 -7.62 180) (length 5.08)
        (name "EXTCLK" (effects (font (size 1.27 1.27))))
        (number "25" (effects (font (size 1.27 1.27))))
      )
      (pin passive line (at 30.48 -5.08 180) (length 5.08)
        (name "SCL" (effects (font (size 1.27 1.27))))
        (number "26" (effects (font (size 1.27 1.27))))
      )
      (pin passive line (at 30.48 -2.54 180) (length 5.08)
        (name "SDA" (effects (font (size 1.27 1.27))))
        (number "27" (effects (font (size 1.27 1.27))))
      )
      (pin passive line (at 30.48 0 180) (length 5.08)
        (name "VDD" (effects (font (size 1.27 1.27))))
        (number "28" (effects (font (size 1.27 1.27))))
      )
      (pin passive line (at 0 -5.08 0) (length 5.08)
        (name "A2" (effects (font (size 1.27 1.27))))
        (number "3" (effects (font (size 1.27 1.27))))
      )
      (pin passive line (at 0 -7.62 0) (length 5.08)
        (name "A3" (effects (font (size 1.27 1.27))))
        (number "4" (effects (font (size 1.27 1.27))))
      )
      (pin passive line (at 0 -10.16 0) (length 5.08)
        (name "A4" (effects (font (size 1.27 1.27))))
        (number "5" (effects (font (size 1.27 1.27))))
      )
      (pin passive line (at 0 -12.7 0) (length 5.08)
        (name "LED0" (effects (font (size 1.27 1.27))))
        (number "6" (effects (font (size 1.27 1.27))))
      )
      (pin passive line (at 0 -15.24 0) (length 5.08)
        (name "LED1" (effects (font (size 1.27 1.27))))
        (number "7" (effects (font (size 1.27 1.27))))
      )
      (pin passive line (at 0 -17.78 0) (length 5.08)
        (name "LED2" (effects (font (size 1.27 1.27))))
        (number "8" (effects (font (size 1.27 1.27))))
      )
      (pin passive line (at 0 -20.32 0) (length 5.08)
        (name "LED3" (effects (font (size 1.27 1.27))))
        (number "9" (effects (font (size 1.27 1.27))))
      )
    )
  )
  (symbol "PMV19XNEAR" (pin_names hide) (in_bom yes) (on_board yes)
    (property "Reference" "Q" (at 11.43 3.81 0)
      (effects (font (size 1.27 1.27)) (justify left top))
    )
    (property "Value" "PMV19XNEAR" (at 11.43 1.27 0)
      (effects (font (size 1.27 1.27)) (justify left top))
    )
    (property "Footprint" "SOT95P230X110-3N" (at 11.43 -98.73 0)
      (effects (font (size 1.27 1.27)) (justify left top) hide)
    )
    (property "Datasheet" "https://ms.componentsearchengine.com/Datasheets/2/PMV19XNEAR.pdf" (at 11.43 -198.73 0)
      (effects (font (size 1.27 1.27)) (justify left top) hide)
    )
    (property "Height" "1.1" (at 11.43 -398.73 0)
      (effects (font (size 1.27 1.27)) (justify left top) hide)
    )
    (property "Mouser Part Number" "771-PMV19XNEAR" (at 11.43 -498.73 0)
      (effects (font (size 1.27 1.27)) (justify left top) hide)
    )
    (property "Mouser Price/Stock" "https://www.mouser.co.uk/ProductDetail/Nexperia/PMV19XNEAR?qs=Cb2nCFKsA8o02et6mse8sg%3D%3D" (at 11.43 -598.73 0)
      (effects (font (size 1.27 1.27)) (justify left top) hide)
    )
    (property "Manufacturer_Name" "Nexperia" (at 11.43 -698.73 0)
      (effects (font (size 1.27 1.27)) (justify left top) hide)
    )
    (property "Manufacturer_Part_Number" "PMV19XNEAR" (at 11.43 -798.73 0)
      (effects (font (size 1.27 1.27)) (justify left top) hide)
    )
    (property "ki_description" "NEXPERIA - PMV19XNEAR - Power MOSFET, N Channel, 30 V, 6 A, 0.019 ohm, TO-236AB, Surface Mount" (at 0 0 0)
      (effects (font (size 1.27 1.27)) hide)
    )
    (symbol "PMV19XNEAR_1_1"
      (polyline
        (pts
          (xy 2.54 0)
          (xy 5.08 0)
        )
        (stroke (width 0.254) (type default))
        (fill (type none))
      )
      (polyline
        (pts
          (xy 5.08 5.08)
          (xy 5.08 0)
        )
        (stroke (width 0.254) (type default))
        (fill (type none))
      )
      (polyline
        (pts
          (xy 5.842 -0.508)
          (xy 5.842 0.508)
        )
        (stroke (width 0.254) (type default))
        (fill (type none))
      )
      (polyline
        (pts
          (xy 5.842 0)
          (xy 7.62 0)
        )
        (stroke (width 0.254) (type default))
        (fill (type none))
      )
      (polyline
        (pts
          (xy 5.842 2.032)
          (xy 5.842 3.048)
        )
        (stroke (width 0.254) (type default))
        (fill (type none))
      )
      (polyline
        (pts
          (xy 5.842 5.588)
          (xy 5.842 4.572)
        )
        (stroke (width 0.254) (type default))
        (fill (type none))
      )
      (polyline
        (pts
          (xy 7.62 2.54)
          (xy 5.842 2.54)
        )
        (stroke (width 0.254) (type default))
        (fill (type none))
      )
      (polyline
        (pts
          (xy 7.62 2.54)
          (xy 7.62 -2.54)
        )
        (stroke (width 0.254) (type default))
        (fill (type none))
      )
      (polyline
        (pts
          (xy 7.62 5.08)
          (xy 5.842 5.08)
        )
        (stroke (width 0.254) (type default))
        (fill (type none))
      )
      (polyline
        (pts
          (xy 7.62 5.08)
          (xy 7.62 7.62)
        )
        (stroke (width 0.254) (type default))
        (fill (type none))
      )
      (polyline
        (pts
          (xy 5.842 2.54)
          (xy 6.858 3.048)
          (xy 6.858 2.032)
          (xy 5.842 2.54)
        )
        (stroke (width 0.254) (type default))
        (fill (type outline))
      )
      (circle (center 6.35 2.54) (radius 3.81)
        (stroke (width 0.254) (type default))
        (fill (type none))
      )
      (pin passive line (at 0 0 0) (length 2.54)
        (name "G" (effects (font (size 1.27 1.27))))
        (number "1" (effects (font (size 1.27 1.27))))
      )
      (pin passive line (at 7.62 -5.08 90) (length 2.54)
        (name "S" (effects (font (size 1.27 1.27))))
        (number "2" (effects (font (size 1.27 1.27))))
      )
      (pin passive line (at 7.62 10.16 270) (length 2.54)
        (name "D" (effects (font (size 1.27 1.27))))
        (number "3" (effects (font (size 1.27 1.27))))
      )
    )
  )
  (symbol "RQ5C060BCTCL" (pin_names hide) (in_bom yes) (on_board yes)
    (property "Reference" "Q" (at 11.43 3.81 0)
      (effects (font (size 1.27 1.27)) (justify left top))
    )
    (property "Value" "RQ5C060BCTCL" (at 11.43 1.27 0)
      (effects (font (size 1.27 1.27)) (justify left top))
    )
    (property "Footprint" "SOT95P280X100-3N" (at 11.43 -98.73 0)
      (effects (font (size 1.27 1.27)) (justify left top) hide)
    )
    (property "Datasheet" "https://datasheet.datasheetarchive.com/originals/distributors/DKDS-18/356947.pdf" (at 11.43 -198.73 0)
      (effects (font (size 1.27 1.27)) (justify left top) hide)
    )
    (property "Height" "1" (at 11.43 -398.73 0)
      (effects (font (size 1.27 1.27)) (justify left top) hide)
    )
    (property "Mouser Part Number" "755-RQ5C060BCTCL" (at 11.43 -498.73 0)
      (effects (font (size 1.27 1.27)) (justify left top) hide)
    )
    (property "Mouser Price/Stock" "https://www.mouser.co.uk/ProductDetail/ROHM-Semiconductor/RQ5C060BCTCL?qs=4v%252BiZTmLVHFxUZ6hoMMSLw%3D%3D" (at 11.43 -598.73 0)
      (effects (font (size 1.27 1.27)) (justify left top) hide)
    )
    (property "Manufacturer_Name" "ROHM Semiconductor" (at 11.43 -698.73 0)
      (effects (font (size 1.27 1.27)) (justify left top) hide)
    )
    (property "Manufacturer_Part_Number" "RQ5C060BCTCL" (at 11.43 -798.73 0)
      (effects (font (size 1.27 1.27)) (justify left top) hide)
    )
    (property "ki_description" "Pch -20V -6A Middle Power MOSFET: RQ5C060BC is Low on-resistance and high power small mold package MOSFET for switching." (at 0 0 0)
      (effects (font (size 1.27 1.27)) hide)
    )
    (symbol "RQ5C060BCTCL_1_1"
      (polyline
        (pts
          (xy 2.54 0)
          (xy 5.08 0)
        )
        (stroke (width 0.254) (type default))
        (fill (type none))
      )
      (polyline
        (pts
          (xy 5.08 5.08)
          (xy 5.08 0)
        )
        (stroke (width 0.254) (type default))
        (fill (type none))
      )
      (polyline
        (pts
          (xy 5.842 -0.508)
          (xy 5.842 0.508)
        )
        (stroke (width 0.254) (type default))
        (fill (type none))
      )
      (polyline
        (pts
          (xy 5.842 0)
          (xy 7.62 0)
        )
        (stroke (width 0.254) (type default))
        (fill (type none))
      )
      (polyline
        (pts
          (xy 5.842 2.032)
          (xy 5.842 3.048)
        )
        (stroke (width 0.254) (type default))
        (fill (type none))
      )
      (polyline
        (pts
          (xy 5.842 5.588)
          (xy 5.842 4.572)
        )
        (stroke (width 0.254) (type default))
        (fill (type none))
      )
      (polyline
        (pts
          (xy 7.62 2.54)
          (xy 5.842 2.54)
        )
        (stroke (width 0.254) (type default))
        (fill (type none))
      )
      (polyline
        (pts
          (xy 7.62 2.54)
          (xy 7.62 -2.54)
        )
        (stroke (width 0.254) (type default))
        (fill (type none))
      )
      (polyline
        (pts
          (xy 7.62 5.08)
          (xy 5.842 5.08)
        )
        (stroke (width 0.254) (type default))
        (fill (type none))
      )
      (polyline
        (pts
          (xy 7.62 5.08)
          (xy 7.62 7.62)
        )
        (stroke (width 0.254) (type default))
        (fill (type none))
      )
      (polyline
        (pts
          (xy 7.62 2.54)
          (xy 6.604 3.048)
          (xy 6.604 2.032)
          (xy 7.62 2.54)
        )
        (stroke (width 0.254) (type default))
        (fill (type outline))
      )
      (circle (center 6.35 2.54) (radius 3.81)
        (stroke (width 0.254) (type default))
        (fill (type none))
      )
      (pin passive line (at 0 0 0) (length 2.54)
        (name "G" (effects (font (size 1.27 1.27))))
        (number "1" (effects (font (size 1.27 1.27))))
      )
      (pin passive line (at 7.62 -5.08 90) (length 2.54)
        (name "S" (effects (font (size 1.27 1.27))))
        (number "2" (effects (font (size 1.27 1.27))))
      )
      (pin passive line (at 7.62 10.16 270) (length 2.54)
        (name "D" (effects (font (size 1.27 1.27))))
        (number "3" (effects (font (size 1.27 1.27))))
      )
    )
  )
  (symbol "ZXMHC3F381N8TC" (in_bom yes) (on_board yes)
    (property "Reference" "Q" (at 31.75 7.62 0)
      (effects (font (size 1.27 1.27)) (justify left top))
    )
    (property "Value" "ZXMHC3F381N8TC" (at 31.75 5.08 0)
      (effects (font (size 1.27 1.27)) (justify left top))
    )
    (property "Footprint" "SOIC127P600X175-8N" (at 31.75 -94.92 0)
      (effects (font (size 1.27 1.27)) (justify left top) hide)
    )
    (property "Datasheet" "https://www.diodes.com/assets/Datasheets/ZXMHC3F381N8.pdf" (at 31.75 -194.92 0)
      (effects (font (size 1.27 1.27)) (justify left top) hide)
    )
    (property "Height" "1.75" (at 31.75 -394.92 0)
      (effects (font (size 1.27 1.27)) (justify left top) hide)
    )
    (property "Mouser Part Number" "522-ZXMHC3F381N8TC" (at 31.75 -494.92 0)
      (effects (font (size 1.27 1.27)) (justify left top) hide)
    )
    (property "Mouser Price/Stock" "https://www.mouser.co.uk/ProductDetail/Diodes-Incorporated/ZXMHC3F381N8TC?qs=7E5rbXJDVJoJr15tcLBfrA%3D%3D" (at 31.75 -594.92 0)
      (effects (font (size 1.27 1.27)) (justify left top) hide)
    )
    (property "Manufacturer_Name" "Diodes Incorporated" (at 31.75 -694.92 0)
      (effects (font (size 1.27 1.27)) (justify left top) hide)
    )
    (property "Manufacturer_Part_Number" "ZXMHC3F381N8TC" (at 31.75 -794.92 0)
      (effects (font (size 1.27 1.27)) (justify left top) hide)
    )
    (property "ki_description" "MOSFET Dual N/P-Ch 30V 4.98A/4.13A SOIC8 Diodes Inc ZXMHC3F381N8TC Quad N/P-channel MOSFET Transistor, 8-Pin SO" (at 0 0 0)
      (effects (font (size 1.27 1.27)) hide)
    )
    (symbol "ZXMHC3F381N8TC_1_1"
      (rectangle (start 5.08 2.54) (end 30.48 -10.16)
        (stroke (width 0.254) (type default))
        (fill (type background))
      )
      (pin passive line (at 0 0 0) (length 5.08)
        (name "N1G" (effects (font (size 1.27 1.27))))
        (number "1" (effects (font (size 1.27 1.27))))
      )
      (pin passive line (at 0 -2.54 0) (length 5.08)
        (name "N1D/P1D" (effects (font (size 1.27 1.27))))
        (number "2" (effects (font (size 1.27 1.27))))
      )
      (pin passive line (at 0 -5.08 0) (length 5.08)
        (name "N1S/N2S" (effects (font (size 1.27 1.27))))
        (number "3" (effects (font (size 1.27 1.27))))
      )
      (pin passive line (at 0 -7.62 0) (length 5.08)
        (name "N2G" (effects (font (size 1.27 1.27))))
        (number "4" (effects (font (size 1.27 1.27))))
      )
      (pin passive line (at 35.56 -7.62 180) (length 5.08)
        (name "P2G" (effects (font (size 1.27 1.27))))
        (number "5" (effects (font (size 1.27 1.27))))
      )
      (pin passive line (at 35.56 -5.08 180) (length 5.08)
        (name "N2D/P2D" (effects (font (size 1.27 1.27))))
        (number "6" (effects (font (size 1.27 1.27))))
      )
      (pin passive line (at 35.56 -2.54 180) (length 5.08)
        (name "P1S/P2S" (effects (font (size 1.27 1.27))))
        (number "7" (effects (font (size 1.27 1.27))))
      )
      (pin passive line (at 35.56 0 180) (length 5.08)
        (name "P1G" (effects (font (size 1.27 1.27))))
        (number "8" (effects (font (size 1.27 1.27))))
      )
    )
  )
)
