(footprint "pmoss" (version 20221018) (generator pcbnew)
  (layer "F.Cu")
  (descr "TSMT3")
  (tags "MOSFET (P-Channel)")
  (attr smd)
  (fp_text reference "Q**" (at 0 0) (layer "F.SilkS")
      (effects (font (size 1.27 1.27) (thickness 0.254)))
    (tstamp a2d78ecd-5738-4899-8d59-aa730c58bba1)
  )
  (fp_text value "SOT95P280X100-3N" (at 0 0) (layer "F.SilkS") hide
      (effects (font (size 1.27 1.27) (thickness 0.254)))
    (tstamp 96cec97f-6da7-4f2f-80ed-8a79d304f0f0)
  )
  (fp_text user "${REFERENCE}" (at 0 0) (layer "F.Fab")
      (effects (font (size 1.27 1.27) (thickness 0.254)))
    (tstamp d9222ea4-70c9-4f54-b44d-ba67a77a32aa)
  )
  (fp_line (start -1.85 -1.5) (end -0.55 -1.5)
    (stroke (width 0.2) (type solid)) (layer "F.SilkS") (tstamp 939d8622-20f7-4342-a34f-86a522a539af))
  (fp_line (start -0.2 -1.45) (end 0.2 -1.45)
    (stroke (width 0.2) (type solid)) (layer "F.SilkS") (tstamp b89d06e1-34fc-4a1e-8370-7247abe6d667))
  (fp_line (start -0.2 1.45) (end -0.2 -1.45)
    (stroke (width 0.2) (type solid)) (layer "F.SilkS") (tstamp 9a37aa06-e9e4-41f8-9ab8-31808dcf0585))
  (fp_line (start 0.2 -1.45) (end 0.2 1.45)
    (stroke (width 0.2) (type solid)) (layer "F.SilkS") (tstamp 8edd428e-273b-4f21-bfba-dc8baf92f6a1))
  (fp_line (start 0.2 1.45) (end -0.2 1.45)
    (stroke (width 0.2) (type solid)) (layer "F.SilkS") (tstamp 291304a6-b534-43b9-9a64-123990dcfbb6))
  (fp_line (start -2.1 -1.75) (end 2.1 -1.75)
    (stroke (width 0.05) (type solid)) (layer "F.CrtYd") (tstamp 6b893da3-de0d-4b22-82e4-2931771f8723))
  (fp_line (start -2.1 1.75) (end -2.1 -1.75)
    (stroke (width 0.05) (type solid)) (layer "F.CrtYd") (tstamp 36e55150-c9cc-49ca-ac49-d5ed6f941b02))
  (fp_line (start 2.1 -1.75) (end 2.1 1.75)
    (stroke (width 0.05) (type solid)) (layer "F.CrtYd") (tstamp e92fc26a-4b23-42e5-8732-0f4707f00b27))
  (fp_line (start 2.1 1.75) (end -2.1 1.75)
    (stroke (width 0.05) (type solid)) (layer "F.CrtYd") (tstamp 678d4a8d-981b-4d34-907a-5bc1397255bc))
  (fp_line (start -0.825 -1.45) (end 0.825 -1.45)
    (stroke (width 0.1) (type solid)) (layer "F.Fab") (tstamp f35dc49f-d24c-476b-956d-2395c93388e2))
  (fp_line (start -0.825 -0.5) (end 0.125 -1.45)
    (stroke (width 0.1) (type solid)) (layer "F.Fab") (tstamp cf881a5d-5d26-427f-95e6-0ce6cb77530b))
  (fp_line (start -0.825 1.45) (end -0.825 -1.45)
    (stroke (width 0.1) (type solid)) (layer "F.Fab") (tstamp ab91d3b7-681f-49b4-bc4f-e56cfb389b7c))
  (fp_line (start 0.825 -1.45) (end 0.825 1.45)
    (stroke (width 0.1) (type solid)) (layer "F.Fab") (tstamp f9825f98-ae2a-4fdf-84b1-30a1d1d4052b))
  (fp_line (start 0.825 1.45) (end -0.825 1.45)
    (stroke (width 0.1) (type solid)) (layer "F.Fab") (tstamp 260982fd-3ff0-4dbd-b119-4ac0d6c14c79))
  (pad "1" smd rect (at -1.2 -0.95 90) (size 0.6 1.3) (layers "F.Cu" "F.Paste" "F.Mask") (tstamp 9ecc3bde-87f2-424d-a9aa-97dd8c811932))
  (pad "2" smd rect (at -1.2 0.95 90) (size 0.6 1.3) (layers "F.Cu" "F.Paste" "F.Mask") (tstamp 75b60900-037f-431b-b5ed-c4342edd16db))
  (pad "3" smd rect (at 1.2 0 90) (size 0.6 1.3) (layers "F.Cu" "F.Paste" "F.Mask") (tstamp 4b3d935e-6222-41c2-8ac2-1b80a26a532f))
  (model "${KIPRJMOD}/3D/RQ5C060BCTCL.stp"
    (offset (xyz 0 0 0))
    (scale (xyz 1 1 1))
    (rotate (xyz 0 0 0))
  )
)
