(footprint "PCA9685-TSSOP"
	(version 20240108)
	(generator "pcbnew")
	(generator_version "8.0")
	(layer "F.Cu")
	(tags "PCA9685PW/Q900_118 ")
	(property "Reference" "REF**"
		(at 0 0 0)
		(unlocked yes)
		(layer "F.SilkS")
		(uuid "e151544b-6fa4-4e3c-ae82-c9e654791f2e")
		(effects
			(font
				(size 1 1)
				(thickness 0.15)
			)
		)
	)
	(property "Value" "PCA9685-TSSOP"
		(at 0 0 0)
		(unlocked yes)
		(layer "F.Fab")
		(uuid "1f937204-5ee3-4b61-ab2f-51f2c6e08d09")
		(effects
			(font
				(size 1 1)
				(thickness 0.15)
			)
		)
	)
	(property "Footprint" ""
		(at 0 0 0)
		(layer "F.Fab")
		(hide yes)
		(uuid "bb71420a-0991-406f-9c3a-9c587e15062d")
		(effects
			(font
				(size 1.27 1.27)
				(thickness 0.15)
			)
		)
	)
	(property "Datasheet" ""
		(at 0 0 0)
		(layer "F.Fab")
		(hide yes)
		(uuid "90a36640-cdfc-4b68-9828-8772f9bbfc0e")
		(effects
			(font
				(size 1.27 1.27)
				(thickness 0.15)
			)
		)
	)
	(property "Description" ""
		(at 0 0 0)
		(layer "F.Fab")
		(hide yes)
		(uuid "a9bdedaa-09d2-4f51-843a-5f29cf273d39")
		(effects
			(font
				(size 1.27 1.27)
				(thickness 0.15)
			)
		)
	)
	(attr smd)
	(fp_line
		(start -2.3749 -5.0292)
		(end -2.3749 -4.73554)
		(stroke
			(width 0.1524)
			(type solid)
		)
		(layer "F.SilkS")
		(uuid "350f3a4f-e3c7-4a11-b56a-db7479ffdd2f")
	)
	(fp_line
		(start -2.3749 4.735538)
		(end -2.3749 5.0292)
		(stroke
			(width 0.1524)
			(type solid)
		)
		(layer "F.SilkS")
		(uuid "e4e596df-13ba-4747-b59b-bf1b8f97e108")
	)
	(fp_line
		(start -2.3749 5.0292)
		(end 2.3749 5.0292)
		(stroke
			(width 0.1524)
			(type solid)
		)
		(layer "F.SilkS")
		(uuid "44535dfe-8df4-4165-a783-9063154dd8dd")
	)
	(fp_line
		(start 2.3749 -5.0292)
		(end -2.3749 -5.0292)
		(stroke
			(width 0.1524)
			(type solid)
		)
		(layer "F.SilkS")
		(uuid "57efa04d-f069-42f5-9f18-ff489febfde3")
	)
	(fp_line
		(start 2.3749 -4.73554)
		(end 2.3749 -5.0292)
		(stroke
			(width 0.1524)
			(type solid)
		)
		(layer "F.SilkS")
		(uuid "77e4519a-14c6-4635-8048-0cb9d0fc6110")
	)
	(fp_line
		(start 2.3749 5.0292)
		(end 2.3749 4.73554)
		(stroke
			(width 0.1524)
			(type solid)
		)
		(layer "F.SilkS")
		(uuid "1e0e8f84-560c-44b4-92f8-57dd2640a605")
	)
	(fp_poly
		(pts
			(xy -4.1656 1.434498) (xy -4.1656 1.815498) (xy -3.9116 1.815498) (xy -3.9116 1.434498)
		)
		(stroke
			(width 0)
			(type solid)
		)
		(fill solid)
		(layer "F.SilkS")
		(uuid "af99930d-5af9-4a3b-9686-b54369ea94b2")
	)
	(fp_poly
		(pts
			(xy 4.1656 0.784499) (xy 4.1656 1.165499) (xy 3.9116 1.165499) (xy 3.9116 0.784499)
		)
		(stroke
			(width 0)
			(type solid)
		)
		(fill solid)
		(layer "F.SilkS")
		(uuid "780f10ab-7910-4479-8706-47294a403b34")
	)
	(fp_line
		(start -3.9116 -4.6568)
		(end -2.5019 -4.6568)
		(stroke
			(width 0.1524)
			(type solid)
		)
		(layer "F.CrtYd")
		(uuid "aab27eca-0e84-461b-8dd8-8a2102b67ed4")
	)
	(fp_line
		(start -3.9116 4.6568)
		(end -3.9116 -4.6568)
		(stroke
			(width 0.1524)
			(type solid)
		)
		(layer "F.CrtYd")
		(uuid "c9b5cf3d-638d-4927-a244-4918877bcbd6")
	)
	(fp_line
		(start -3.9116 4.6568)
		(end -2.5019 4.6568)
		(stroke
			(width 0.1524)
			(type solid)
		)
		(layer "F.CrtYd")
		(uuid "e0bcee01-bea0-44f0-b99b-97833eed396c")
	)
	(fp_line
		(start -2.5019 -5.1562)
		(end 2.5019 -5.1562)
		(stroke
			(width 0.1524)
			(type solid)
		)
		(layer "F.CrtYd")
		(uuid "b308288f-c638-4728-ab16-df12ee03da96")
	)
	(fp_line
		(start -2.5019 -4.6568)
		(end -2.5019 -5.1562)
		(stroke
			(width 0.1524)
			(type solid)
		)
		(layer "F.CrtYd")
		(uuid "43eba174-b24a-45b6-a559-ad6ba5f4a6b4")
	)
	(fp_line
		(start -2.5019 5.1562)
		(end -2.5019 4.6568)
		(stroke
			(width 0.1524)
			(type solid)
		)
		(layer "F.CrtYd")
		(uuid "f86bd35a-23a8-410a-8195-1132bbd4413d")
	)
	(fp_line
		(start 2.5019 -5.1562)
		(end 2.5019 -4.6568)
		(stroke
			(width 0.1524)
			(type solid)
		)
		(layer "F.CrtYd")
		(uuid "bcf750bb-a6ea-4042-aa95-7386041ed8d2")
	)
	(fp_line
		(start 2.5019 4.6568)
		(end 2.5019 5.1562)
		(stroke
			(width 0.1524)
			(type solid)
		)
		(layer "F.CrtYd")
		(uuid "90e94e66-6d72-49f1-9785-f8551c7c9170")
	)
	(fp_line
		(start 2.5019 5.1562)
		(end -2.5019 5.1562)
		(stroke
			(width 0.1524)
			(type solid)
		)
		(layer "F.CrtYd")
		(uuid "9381578c-c216-45d5-ae25-9573965218d8")
	)
	(fp_line
		(start 3.9116 -4.6568)
		(end 2.5019 -4.6568)
		(stroke
			(width 0.1524)
			(type solid)
		)
		(layer "F.CrtYd")
		(uuid "f78ef26c-264c-406f-b5b9-8280325d6b0b")
	)
	(fp_line
		(start 3.9116 -4.6568)
		(end 3.9116 4.6568)
		(stroke
			(width 0.1524)
			(type solid)
		)
		(layer "F.CrtYd")
		(uuid "4aeaaeac-4cfe-4def-b213-7e31f2319f9a")
	)
	(fp_line
		(start 3.9116 4.6568)
		(end 2.5019 4.6568)
		(stroke
			(width 0.1524)
			(type solid)
		)
		(layer "F.CrtYd")
		(uuid "cc4e36b4-ff54-48f4-9721-c00ee9948c9b")
	)
	(fp_line
		(start -3.302 -4.3774)
		(end -3.302 -4.0726)
		(stroke
			(width 0.0254)
			(type solid)
		)
		(layer "F.Fab")
		(uuid "53ca49ad-5f47-42e5-8d56-3e9b413f7934")
	)
	(fp_line
		(start -3.302 -4.0726)
		(end -2.2479 -4.0726)
		(stroke
			(width 0.0254)
			(type solid)
		)
		(layer "F.Fab")
		(uuid "509c8113-7948-473f-ae98-56e5b28f7eea")
	)
	(fp_line
		(start -3.302 -3.7274)
		(end -3.302 -3.4226)
		(stroke
			(width 0.0254)
			(type solid)
		)
		(layer "F.Fab")
		(uuid "b6c88cc3-5edd-4da9-8bf0-48d576b1697a")
	)
	(fp_line
		(start -3.302 -3.4226)
		(end -2.2479 -3.4226)
		(stroke
			(width 0.0254)
			(type solid)
		)
		(layer "F.Fab")
		(uuid "56f4e8e3-9f5e-4971-b4b6-f689ea03195d")
	)
	(fp_line
		(start -3.302 -3.0774)
		(end -3.302 -2.7726)
		(stroke
			(width 0.0254)
			(type solid)
		)
		(layer "F.Fab")
		(uuid "8aa40cc8-71c6-4627-ab6c-3c423f685a92")
	)
	(fp_line
		(start -3.302 -2.7726)
		(end -2.2479 -2.7726)
		(stroke
			(width 0.0254)
			(type solid)
		)
		(layer "F.Fab")
		(uuid "9eb77432-7b71-4157-afcd-46be6490708f")
	)
	(fp_line
		(start -3.302 -2.4274)
		(end -3.302 -2.1226)
		(stroke
			(width 0.0254)
			(type solid)
		)
		(layer "F.Fab")
		(uuid "b1fe23a7-4aac-4d06-9c03-e0d1bafaf6be")
	)
	(fp_line
		(start -3.302 -2.1226)
		(end -2.2479 -2.1226)
		(stroke
			(width 0.0254)
			(type solid)
		)
		(layer "F.Fab")
		(uuid "f50d3ec3-83b6-451a-965e-161dd25a96ae")
	)
	(fp_line
		(start -3.302 -1.777401)
		(end -3.302 -1.472601)
		(stroke
			(width 0.0254)
			(type solid)
		)
		(layer "F.Fab")
		(uuid "56346ef7-4f36-49d1-8fe7-5190fa76e9e8")
	)
	(fp_line
		(start -3.302 -1.472601)
		(end -2.2479 -1.472601)
		(stroke
			(width 0.0254)
			(type solid)
		)
		(layer "F.Fab")
		(uuid "04095030-839f-479f-a987-a3169200990c")
	)
	(fp_line
		(start -3.302 -1.127401)
		(end -3.302 -0.822601)
		(stroke
			(width 0.0254)
			(type solid)
		)
		(layer "F.Fab")
		(uuid "4cfcb277-1025-479e-ae60-8205fb4daca3")
	)
	(fp_line
		(start -3.302 -0.822601)
		(end -2.2479 -0.822601)
		(stroke
			(width 0.0254)
			(type solid)
		)
		(layer "F.Fab")
		(uuid "66b44946-743b-428c-8656-b229d581efe3")
	)
	(fp_line
		(start -3.302 -0.477401)
		(end -3.302 -0.172601)
		(stroke
			(width 0.0254)
			(type solid)
		)
		(layer "F.Fab")
		(uuid "54074ea2-a251-409e-ab16-753a124b2338")
	)
	(fp_line
		(start -3.302 -0.172601)
		(end -2.2479 -0.172601)
		(stroke
			(width 0.0254)
			(type solid)
		)
		(layer "F.Fab")
		(uuid "e3a2f679-2623-465a-98fd-b14ad960e006")
	)
	(fp_line
		(start -3.302 0.172599)
		(end -3.302 0.477399)
		(stroke
			(width 0.0254)
			(type solid)
		)
		(layer "F.Fab")
		(uuid "b3de22ff-d058-45fb-b7da-182e79c4ba57")
	)
	(fp_line
		(start -3.302 0.477399)
		(end -2.2479 0.477399)
		(stroke
			(width 0.0254)
			(type solid)
		)
		(layer "F.Fab")
		(uuid "d7e0c389-a55a-440a-a04e-20a2e37248ad")
	)
	(fp_line
		(start -3.302 0.822599)
		(end -3.302 1.127399)
		(stroke
			(width 0.0254)
			(type solid)
		)
		(layer "F.Fab")
		(uuid "62631ce3-1df6-416e-895e-bf4d339240ee")
	)
	(fp_line
		(start -3.302 1.127399)
		(end -2.2479 1.127399)
		(stroke
			(width 0.0254)
			(type solid)
		)
		(layer "F.Fab")
		(uuid "0060e617-dabd-4d97-be9a-28dbaa5382cd")
	)
	(fp_line
		(start -3.302 1.472599)
		(end -3.302 1.777399)
		(stroke
			(width 0.0254)
			(type solid)
		)
		(layer "F.Fab")
		(uuid "8ac2c233-368e-42ce-a633-15de213487be")
	)
	(fp_line
		(start -3.302 1.777399)
		(end -2.2479 1.777399)
		(stroke
			(width 0.0254)
			(type solid)
		)
		(layer "F.Fab")
		(uuid "bc416717-b47e-4b15-9b1b-105b7b5d76d9")
	)
	(fp_line
		(start -3.302 2.122599)
		(end -3.302 2.427399)
		(stroke
			(width 0.0254)
			(type solid)
		)
		(layer "F.Fab")
		(uuid "7d9e22e3-f40b-4d8b-ad95-c44b2d72534c")
	)
	(fp_line
		(start -3.302 2.427399)
		(end -2.2479 2.427399)
		(stroke
			(width 0.0254)
			(type solid)
		)
		(layer "F.Fab")
		(uuid "16c97550-7328-4020-a7ef-62fcdc702480")
	)
	(fp_line
		(start -3.302 2.772599)
		(end -3.302 3.077399)
		(stroke
			(width 0.0254)
			(type solid)
		)
		(layer "F.Fab")
		(uuid "59db333a-81f4-4b2f-888f-7eeab2c7a51c")
	)
	(fp_line
		(start -3.302 3.077399)
		(end -2.2479 3.077399)
		(stroke
			(width 0.0254)
			(type solid)
		)
		(layer "F.Fab")
		(uuid "ec1c43a9-b679-47f8-992c-54e6708b512b")
	)
	(fp_line
		(start -3.302 3.422599)
		(end -3.302 3.727399)
		(stroke
			(width 0.0254)
			(type solid)
		)
		(layer "F.Fab")
		(uuid "1ab3d0c8-e529-47ab-8fa8-ce7143c54c45")
	)
	(fp_line
		(start -3.302 3.727399)
		(end -2.2479 3.727399)
		(stroke
			(width 0.0254)
			(type solid)
		)
		(layer "F.Fab")
		(uuid "d9530577-de3f-4da7-abb6-15315a6b7b3e")
	)
	(fp_line
		(start -3.302 4.072599)
		(end -3.302 4.377399)
		(stroke
			(width 0.0254)
			(type solid)
		)
		(layer "F.Fab")
		(uuid "8246f4d1-bbfe-4ae2-a038-7cb4e662bd53")
	)
	(fp_line
		(start -3.302 4.377399)
		(end -2.2479 4.377399)
		(stroke
			(width 0.0254)
			(type solid)
		)
		(layer "F.Fab")
		(uuid "26fe8fa3-9580-41c6-9472-9ac8003b81a9")
	)
	(fp_line
		(start -2.2479 -4.9022)
		(end -2.2479 4.9022)
		(stroke
			(width 0.0254)
			(type solid)
		)
		(layer "F.Fab")
		(uuid "06a35c20-4fa7-4c23-bd42-190e088a9235")
	)
	(fp_line
		(start -2.2479 -4.3774)
		(end -3.302 -4.3774)
		(stroke
			(width 0.0254)
			(type solid)
		)
		(layer "F.Fab")
		(uuid "b3ec2a1a-cd19-427f-b90a-4eaddadf6c67")
	)
	(fp_line
		(start -2.2479 -4.0726)
		(end -2.2479 -4.3774)
		(stroke
			(width 0.0254)
			(type solid)
		)
		(layer "F.Fab")
		(uuid "9bade19a-1146-4525-ae11-8634eaa6495a")
	)
	(fp_line
		(start -2.2479 -3.7274)
		(end -3.302 -3.7274)
		(stroke
			(width 0.0254)
			(type solid)
		)
		(layer "F.Fab")
		(uuid "53202c0b-3509-497e-8a78-419a66382014")
	)
	(fp_line
		(start -2.2479 -3.4226)
		(end -2.2479 -3.7274)
		(stroke
			(width 0.0254)
			(type solid)
		)
		(layer "F.Fab")
		(uuid "80db2ee6-187a-4895-83bb-c4d37f6c6757")
	)
	(fp_line
		(start -2.2479 -3.0774)
		(end -3.302 -3.0774)
		(stroke
			(width 0.0254)
			(type solid)
		)
		(layer "F.Fab")
		(uuid "d666bfda-ac2f-46f2-8509-d4b2803d2b85")
	)
	(fp_line
		(start -2.2479 -2.7726)
		(end -2.2479 -3.0774)
		(stroke
			(width 0.0254)
			(type solid)
		)
		(layer "F.Fab")
		(uuid "72a4784b-a00e-46fc-95ab-e807ee033dba")
	)
	(fp_line
		(start -2.2479 -2.4274)
		(end -3.302 -2.4274)
		(stroke
			(width 0.0254)
			(type solid)
		)
		(layer "F.Fab")
		(uuid "915ebf55-b712-4215-9235-a0719f1c0143")
	)
	(fp_line
		(start -2.2479 -2.1226)
		(end -2.2479 -2.4274)
		(stroke
			(width 0.0254)
			(type solid)
		)
		(layer "F.Fab")
		(uuid "3412b2cc-d804-4e43-bbb4-eecaa0430c9b")
	)
	(fp_line
		(start -2.2479 -1.777401)
		(end -3.302 -1.777401)
		(stroke
			(width 0.0254)
			(type solid)
		)
		(layer "F.Fab")
		(uuid "e5281aff-7a9b-40ed-b847-c78cc3d0fd62")
	)
	(fp_line
		(start -2.2479 -1.472601)
		(end -2.2479 -1.777401)
		(stroke
			(width 0.0254)
			(type solid)
		)
		(layer "F.Fab")
		(uuid "0f0ba0c2-c9b6-41d3-abcf-40dc2b0a23c3")
	)
	(fp_line
		(start -2.2479 -1.127401)
		(end -3.302 -1.127401)
		(stroke
			(width 0.0254)
			(type solid)
		)
		(layer "F.Fab")
		(uuid "65677fe7-80d9-484f-ab17-56f7fc00676a")
	)
	(fp_line
		(start -2.2479 -0.822601)
		(end -2.2479 -1.127401)
		(stroke
			(width 0.0254)
			(type solid)
		)
		(layer "F.Fab")
		(uuid "4b5930a0-4b27-45ae-8994-b540be4dba33")
	)
	(fp_line
		(start -2.2479 -0.477401)
		(end -3.302 -0.477401)
		(stroke
			(width 0.0254)
			(type solid)
		)
		(layer "F.Fab")
		(uuid "ce36824d-90e6-449d-b64e-643b673b506d")
	)
	(fp_line
		(start -2.2479 -0.172601)
		(end -2.2479 -0.477401)
		(stroke
			(width 0.0254)
			(type solid)
		)
		(layer "F.Fab")
		(uuid "6fcb1aeb-d8ec-4618-b75f-8581ceaf6949")
	)
	(fp_line
		(start -2.2479 0.172599)
		(end -3.302 0.172599)
		(stroke
			(width 0.0254)
			(type solid)
		)
		(layer "F.Fab")
		(uuid "527bb343-498e-4c8d-a546-577ffb1fa536")
	)
	(fp_line
		(start -2.2479 0.477399)
		(end -2.2479 0.172599)
		(stroke
			(width 0.0254)
			(type solid)
		)
		(layer "F.Fab")
		(uuid "6208bf6f-2705-4372-bc70-38135f5b5e68")
	)
	(fp_line
		(start -2.2479 0.822599)
		(end -3.302 0.822599)
		(stroke
			(width 0.0254)
			(type solid)
		)
		(layer "F.Fab")
		(uuid "5a6d43c7-3e11-4750-a942-d18b19d1a074")
	)
	(fp_line
		(start -2.2479 1.127399)
		(end -2.2479 0.822599)
		(stroke
			(width 0.0254)
			(type solid)
		)
		(layer "F.Fab")
		(uuid "18e6c6c7-c16c-4988-8d72-0491618a62b8")
	)
	(fp_line
		(start -2.2479 1.472599)
		(end -3.302 1.472599)
		(stroke
			(width 0.0254)
			(type solid)
		)
		(layer "F.Fab")
		(uuid "68619981-c34c-4b2b-952e-b28c7d50e5b7")
	)
	(fp_line
		(start -2.2479 1.777399)
		(end -2.2479 1.472599)
		(stroke
			(width 0.0254)
			(type solid)
		)
		(layer "F.Fab")
		(uuid "aeb92e5a-b43b-4a10-a5ec-8a923a3e6792")
	)
	(fp_line
		(start -2.2479 2.122599)
		(end -3.302 2.122599)
		(stroke
			(width 0.0254)
			(type solid)
		)
		(layer "F.Fab")
		(uuid "f8232659-6459-4ca0-8fc0-fbb893c0eb8f")
	)
	(fp_line
		(start -2.2479 2.427399)
		(end -2.2479 2.122599)
		(stroke
			(width 0.0254)
			(type solid)
		)
		(layer "F.Fab")
		(uuid "269d5287-e949-4f1f-90b5-8320430be3fa")
	)
	(fp_line
		(start -2.2479 2.772599)
		(end -3.302 2.772599)
		(stroke
			(width 0.0254)
			(type solid)
		)
		(layer "F.Fab")
		(uuid "57dd9d78-4e82-4afa-8414-37d8bd4c9fa8")
	)
	(fp_line
		(start -2.2479 3.077399)
		(end -2.2479 2.772599)
		(stroke
			(width 0.0254)
			(type solid)
		)
		(layer "F.Fab")
		(uuid "30594464-ba4d-4326-ad76-54661c3c4c3b")
	)
	(fp_line
		(start -2.2479 3.422599)
		(end -3.302 3.422599)
		(stroke
			(width 0.0254)
			(type solid)
		)
		(layer "F.Fab")
		(uuid "b002434c-2a20-4020-b5d0-bbed5a6df8cc")
	)
	(fp_line
		(start -2.2479 3.727399)
		(end -2.2479 3.422599)
		(stroke
			(width 0.0254)
			(type solid)
		)
		(layer "F.Fab")
		(uuid "9755837f-e30b-469e-896f-3208adf2e33c")
	)
	(fp_line
		(start -2.2479 4.072599)
		(end -3.302 4.072599)
		(stroke
			(width 0.0254)
			(type solid)
		)
		(layer "F.Fab")
		(uuid "313899f0-4f75-456f-beb0-cb397e33475e")
	)
	(fp_line
		(start -2.2479 4.377399)
		(end -2.2479 4.072599)
		(stroke
			(width 0.0254)
			(type solid)
		)
		(layer "F.Fab")
		(uuid "7166ff43-7b32-4948-935c-90d45edc3cd0")
	)
	(fp_line
		(start -2.2479 4.9022)
		(end 2.2479 4.9022)
		(stroke
			(width 0.0254)
			(type solid)
		)
		(layer "F.Fab")
		(uuid "b6723bbf-079c-4814-9cdc-a5e57bcb2d81")
	)
	(fp_line
		(start 2.2479 -4.9022)
		(end -2.2479 -4.9022)
		(stroke
			(width 0.0254)
			(type solid)
		)
		(layer "F.Fab")
		(uuid "1c6a8e34-8d8e-40a6-9013-a84b2040657d")
	)
	(fp_line
		(start 2.2479 -4.377399)
		(end 2.2479 -4.072599)
		(stroke
			(width 0.0254)
			(type solid)
		)
		(layer "F.Fab")
		(uuid "6ba9ad91-6edf-45f2-a95a-da022ec065c8")
	)
	(fp_line
		(start 2.2479 -4.072599)
		(end 3.302 -4.072599)
		(stroke
			(width 0.0254)
			(type solid)
		)
		(layer "F.Fab")
		(uuid "5eb951ac-71b8-4662-b7f7-3d7f0782be76")
	)
	(fp_line
		(start 2.2479 -3.727399)
		(end 2.2479 -3.422599)
		(stroke
			(width 0.0254)
			(type solid)
		)
		(layer "F.Fab")
		(uuid "76c9d6ef-8a88-4bbc-b238-582c0c53356e")
	)
	(fp_line
		(start 2.2479 -3.422599)
		(end 3.302 -3.422599)
		(stroke
			(width 0.0254)
			(type solid)
		)
		(layer "F.Fab")
		(uuid "6a302b98-abc8-4af4-9224-407ff180f2d8")
	)
	(fp_line
		(start 2.2479 -3.077399)
		(end 2.2479 -2.772599)
		(stroke
			(width 0.0254)
			(type solid)
		)
		(layer "F.Fab")
		(uuid "62a2a8d9-6a21-4500-9a94-692f0e16d6d4")
	)
	(fp_line
		(start 2.2479 -2.772599)
		(end 3.302 -2.772599)
		(stroke
			(width 0.0254)
			(type solid)
		)
		(layer "F.Fab")
		(uuid "b5f031b3-e690-4691-8d16-7ec3b67496ec")
	)
	(fp_line
		(start 2.2479 -2.427399)
		(end 2.2479 -2.122599)
		(stroke
			(width 0.0254)
			(type solid)
		)
		(layer "F.Fab")
		(uuid "88ba62aa-30c6-4537-960a-6cac6e1472a8")
	)
	(fp_line
		(start 2.2479 -2.122599)
		(end 3.302 -2.122599)
		(stroke
			(width 0.0254)
			(type solid)
		)
		(layer "F.Fab")
		(uuid "4e579205-8353-4285-9573-d403caae1c30")
	)
	(fp_line
		(start 2.2479 -1.777399)
		(end 2.2479 -1.472599)
		(stroke
			(width 0.0254)
			(type solid)
		)
		(layer "F.Fab")
		(uuid "e764c910-131b-4303-ab87-321d3a1b35d1")
	)
	(fp_line
		(start 2.2479 -1.472599)
		(end 3.302 -1.472599)
		(stroke
			(width 0.0254)
			(type solid)
		)
		(layer "F.Fab")
		(uuid "5e23d535-a10b-4d37-9405-e27531c2bcd1")
	)
	(fp_line
		(start 2.2479 -1.127399)
		(end 2.2479 -0.822599)
		(stroke
			(width 0.0254)
			(type solid)
		)
		(layer "F.Fab")
		(uuid "497b5e3a-012e-4e17-b924-b3d9923bb00a")
	)
	(fp_line
		(start 2.2479 -0.822599)
		(end 3.302 -0.822599)
		(stroke
			(width 0.0254)
			(type solid)
		)
		(layer "F.Fab")
		(uuid "5b69e78b-1d08-4f44-8fbe-44086342facb")
	)
	(fp_line
		(start 2.2479 -0.477399)
		(end 2.2479 -0.172599)
		(stroke
			(width 0.0254)
			(type solid)
		)
		(layer "F.Fab")
		(uuid "f0166082-fa53-4c70-9a3f-3d381abfa7d2")
	)
	(fp_line
		(start 2.2479 -0.172599)
		(end 3.302 -0.172599)
		(stroke
			(width 0.0254)
			(type solid)
		)
		(layer "F.Fab")
		(uuid "bfcfb8d1-dfe0-44ac-99c0-175391fe0943")
	)
	(fp_line
		(start 2.2479 0.172601)
		(end 2.2479 0.477401)
		(stroke
			(width 0.0254)
			(type solid)
		)
		(layer "F.Fab")
		(uuid "8c9aa80f-0b0b-4a53-96b2-4038c8e229c1")
	)
	(fp_line
		(start 2.2479 0.477401)
		(end 3.302 0.477401)
		(stroke
			(width 0.0254)
			(type solid)
		)
		(layer "F.Fab")
		(uuid "33da7c24-ddfc-449e-b446-ce388a8aa16f")
	)
	(fp_line
		(start 2.2479 0.8226)
		(end 2.2479 1.1274)
		(stroke
			(width 0.0254)
			(type solid)
		)
		(layer "F.Fab")
		(uuid "ec1d657d-38cf-4b8e-aecc-850d38d179a8")
	)
	(fp_line
		(start 2.2479 1.1274)
		(end 3.302 1.1274)
		(stroke
			(width 0.0254)
			(type solid)
		)
		(layer "F.Fab")
		(uuid "57b800af-d843-4cc4-8638-9e81f6d25fca")
	)
	(fp_line
		(start 2.2479 1.4726)
		(end 2.2479 1.7774)
		(stroke
			(width 0.0254)
			(type solid)
		)
		(layer "F.Fab")
		(uuid "ea3fe771-4a1e-4d90-9673-1232ec11377c")
	)
	(fp_line
		(start 2.2479 1.7774)
		(end 3.302 1.7774)
		(stroke
			(width 0.0254)
			(type solid)
		)
		(layer "F.Fab")
		(uuid "c1850f50-cd7c-4d58-8a80-e04528e7d83e")
	)
	(fp_line
		(start 2.2479 2.1226)
		(end 2.2479 2.4274)
		(stroke
			(width 0.0254)
			(type solid)
		)
		(layer "F.Fab")
		(uuid "0fa8ee6f-ef72-46ef-a377-c92b93c1bebe")
	)
	(fp_line
		(start 2.2479 2.4274)
		(end 3.302 2.4274)
		(stroke
			(width 0.0254)
			(type solid)
		)
		(layer "F.Fab")
		(uuid "f4bff9ff-64cc-4631-9e68-7ae7d6a60578")
	)
	(fp_line
		(start 2.2479 2.7726)
		(end 2.2479 3.0774)
		(stroke
			(width 0.0254)
			(type solid)
		)
		(layer "F.Fab")
		(uuid "fbe2cf54-16bf-4627-b245-25ea223df59f")
	)
	(fp_line
		(start 2.2479 3.0774)
		(end 3.302 3.0774)
		(stroke
			(width 0.0254)
			(type solid)
		)
		(layer "F.Fab")
		(uuid "4d744586-62e7-4b36-872f-c340c7b73747")
	)
	(fp_line
		(start 2.2479 3.4226)
		(end 2.2479 3.7274)
		(stroke
			(width 0.0254)
			(type solid)
		)
		(layer "F.Fab")
		(uuid "bc578d20-4ba2-4799-a4da-1479678840a2")
	)
	(fp_line
		(start 2.2479 3.7274)
		(end 3.302 3.7274)
		(stroke
			(width 0.0254)
			(type solid)
		)
		(layer "F.Fab")
		(uuid "0baa9a8f-99d1-4d30-a443-7c7f3d35645b")
	)
	(fp_line
		(start 2.2479 4.0726)
		(end 2.2479 4.3774)
		(stroke
			(width 0.0254)
			(type solid)
		)
		(layer "F.Fab")
		(uuid "b831de22-70dc-4c41-ae75-c840ae71a656")
	)
	(fp_line
		(start 2.2479 4.3774)
		(end 3.302 4.3774)
		(stroke
			(width 0.0254)
			(type solid)
		)
		(layer "F.Fab")
		(uuid "b4900522-bc88-465a-b0a2-0f3bf2a4bb6b")
	)
	(fp_line
		(start 2.2479 4.9022)
		(end 2.2479 -4.9022)
		(stroke
			(width 0.0254)
			(type solid)
		)
		(layer "F.Fab")
		(uuid "307bfbf1-0335-4183-a31f-a1b4d6f69518")
	)
	(fp_line
		(start 3.302 -4.377399)
		(end 2.2479 -4.377399)
		(stroke
			(width 0.0254)
			(type solid)
		)
		(layer "F.Fab")
		(uuid "045a35dd-cbcc-49c3-b647-23274472a44d")
	)
	(fp_line
		(start 3.302 -4.072599)
		(end 3.302 -4.377399)
		(stroke
			(width 0.0254)
			(type solid)
		)
		(layer "F.Fab")
		(uuid "eb3cb3ff-b956-428f-aaf5-7fdd37b3946c")
	)
	(fp_line
		(start 3.302 -3.727399)
		(end 2.2479 -3.727399)
		(stroke
			(width 0.0254)
			(type solid)
		)
		(layer "F.Fab")
		(uuid "c31279e4-e3af-4bb5-b764-b191a5663743")
	)
	(fp_line
		(start 3.302 -3.422599)
		(end 3.302 -3.727399)
		(stroke
			(width 0.0254)
			(type solid)
		)
		(layer "F.Fab")
		(uuid "3d1a7b09-338a-42f3-aecb-1f63fe407d3e")
	)
	(fp_line
		(start 3.302 -3.077399)
		(end 2.2479 -3.077399)
		(stroke
			(width 0.0254)
			(type solid)
		)
		(layer "F.Fab")
		(uuid "3b4fcc27-37da-47a2-bff1-32076b42a91f")
	)
	(fp_line
		(start 3.302 -2.772599)
		(end 3.302 -3.077399)
		(stroke
			(width 0.0254)
			(type solid)
		)
		(layer "F.Fab")
		(uuid "d6953e3a-ec2d-46e9-b23e-4665afa2c270")
	)
	(fp_line
		(start 3.302 -2.427399)
		(end 2.2479 -2.427399)
		(stroke
			(width 0.0254)
			(type solid)
		)
		(layer "F.Fab")
		(uuid "bd8b3bcc-8b7b-4707-865f-c9607e05c19c")
	)
	(fp_line
		(start 3.302 -2.122599)
		(end 3.302 -2.427399)
		(stroke
			(width 0.0254)
			(type solid)
		)
		(layer "F.Fab")
		(uuid "9f7f1020-7ff0-41eb-a9b7-189c1a55d274")
	)
	(fp_line
		(start 3.302 -1.777399)
		(end 2.2479 -1.777399)
		(stroke
			(width 0.0254)
			(type solid)
		)
		(layer "F.Fab")
		(uuid "4870c805-b4bf-4339-b494-85d0fe027089")
	)
	(fp_line
		(start 3.302 -1.472599)
		(end 3.302 -1.777399)
		(stroke
			(width 0.0254)
			(type solid)
		)
		(layer "F.Fab")
		(uuid "e8d845d7-7e74-452a-9bd3-ce914c84bc15")
	)
	(fp_line
		(start 3.302 -1.127399)
		(end 2.2479 -1.127399)
		(stroke
			(width 0.0254)
			(type solid)
		)
		(layer "F.Fab")
		(uuid "91cad982-09d7-4f43-a92d-9e4704e414f6")
	)
	(fp_line
		(start 3.302 -0.822599)
		(end 3.302 -1.127399)
		(stroke
			(width 0.0254)
			(type solid)
		)
		(layer "F.Fab")
		(uuid "4fe86a30-350e-4d9e-9716-51fef11f330d")
	)
	(fp_line
		(start 3.302 -0.477399)
		(end 2.2479 -0.477399)
		(stroke
			(width 0.0254)
			(type solid)
		)
		(layer "F.Fab")
		(uuid "fc3b188a-917b-4745-b4e1-4b8fd5e6e694")
	)
	(fp_line
		(start 3.302 -0.172599)
		(end 3.302 -0.477399)
		(stroke
			(width 0.0254)
			(type solid)
		)
		(layer "F.Fab")
		(uuid "f92cfa3c-cb88-4a1f-8d1f-f4cbd0c94ea7")
	)
	(fp_line
		(start 3.302 0.172601)
		(end 2.2479 0.172601)
		(stroke
			(width 0.0254)
			(type solid)
		)
		(layer "F.Fab")
		(uuid "abac8fe1-822b-4f06-a906-90c886861532")
	)
	(fp_line
		(start 3.302 0.477401)
		(end 3.302 0.172601)
		(stroke
			(width 0.0254)
			(type solid)
		)
		(layer "F.Fab")
		(uuid "d3ea5bae-acd8-4313-a3be-87d0f2c07fe8")
	)
	(fp_line
		(start 3.302 0.8226)
		(end 2.2479 0.8226)
		(stroke
			(width 0.0254)
			(type solid)
		)
		(layer "F.Fab")
		(uuid "e603bdf0-2b62-47a6-89b8-2cc4268a06d3")
	)
	(fp_line
		(start 3.302 1.1274)
		(end 3.302 0.8226)
		(stroke
			(width 0.0254)
			(type solid)
		)
		(layer "F.Fab")
		(uuid "63f7ed24-666d-4404-b0a6-a05d9b72d109")
	)
	(fp_line
		(start 3.302 1.4726)
		(end 2.2479 1.4726)
		(stroke
			(width 0.0254)
			(type solid)
		)
		(layer "F.Fab")
		(uuid "4b75dbea-5ebf-43d0-88d2-b555da0e1bc7")
	)
	(fp_line
		(start 3.302 1.7774)
		(end 3.302 1.4726)
		(stroke
			(width 0.0254)
			(type solid)
		)
		(layer "F.Fab")
		(uuid "e16554a1-bbda-4ab0-9f11-d0a940cf42ba")
	)
	(fp_line
		(start 3.302 2.1226)
		(end 2.2479 2.1226)
		(stroke
			(width 0.0254)
			(type solid)
		)
		(layer "F.Fab")
		(uuid "82559d87-7497-4672-a6a3-887322052232")
	)
	(fp_line
		(start 3.302 2.4274)
		(end 3.302 2.1226)
		(stroke
			(width 0.0254)
			(type solid)
		)
		(layer "F.Fab")
		(uuid "83584c83-1a6a-4323-9c86-bbb368d515fd")
	)
	(fp_line
		(start 3.302 2.7726)
		(end 2.2479 2.7726)
		(stroke
			(width 0.0254)
			(type solid)
		)
		(layer "F.Fab")
		(uuid "8b5a8d85-0cb3-446e-a497-372162960504")
	)
	(fp_line
		(start 3.302 3.0774)
		(end 3.302 2.7726)
		(stroke
			(width 0.0254)
			(type solid)
		)
		(layer "F.Fab")
		(uuid "0ae04d7c-7e36-4f30-8b01-fb3561112da5")
	)
	(fp_line
		(start 3.302 3.4226)
		(end 2.2479 3.4226)
		(stroke
			(width 0.0254)
			(type solid)
		)
		(layer "F.Fab")
		(uuid "490db6e7-a5dc-4078-9ad4-38e887ac0390")
	)
	(fp_line
		(start 3.302 3.7274)
		(end 3.302 3.4226)
		(stroke
			(width 0.0254)
			(type solid)
		)
		(layer "F.Fab")
		(uuid "8ce79a97-d9f0-4cc2-a83f-2a194242290a")
	)
	(fp_line
		(start 3.302 4.0726)
		(end 2.2479 4.0726)
		(stroke
			(width 0.0254)
			(type solid)
		)
		(layer "F.Fab")
		(uuid "493a3601-b24e-408d-8f2d-904af9d973d1")
	)
	(fp_line
		(start 3.302 4.3774)
		(end 3.302 4.0726)
		(stroke
			(width 0.0254)
			(type solid)
		)
		(layer "F.Fab")
		(uuid "273e93d2-b2bc-4bd6-a982-10b6b59785ce")
	)
	(fp_arc
		(start 0.3048 -4.9022)
		(mid 0 -4.5974)
		(end -0.3048 -4.9022)
		(stroke
			(width 0.0254)
			(type solid)
		)
		(layer "F.Fab")
		(uuid "022b7f0c-41e8-439a-a606-2dd9a68259e1")
	)
	(fp_text user "*"
		(at -3.20675 -5.7236 0)
		(layer "F.SilkS")
		(uuid "4d4c28c0-5f1b-41fc-a6c8-9fc4eb8b6708")
		(effects
			(font
				(size 1 1)
				(thickness 0.15)
			)
		)
	)
	(fp_text user "*"
		(at -3.20675 -5.7236 0)
		(unlocked yes)
		(layer "F.SilkS")
		(uuid "c3aacccb-4dac-4a9f-ba0f-e13419ad22c7")
		(effects
			(font
				(size 1 1)
				(thickness 0.15)
			)
		)
	)
	(fp_text user "${REFERENCE}"
		(at 0 0 0)
		(unlocked yes)
		(layer "F.Fab")
		(uuid "82f64b7d-bd8e-422f-aff2-4a9d4b313755")
		(effects
			(font
				(size 1 1)
				(thickness 0.15)
			)
		)
	)
	(fp_text user "*"
		(at -1.8669 -4.826 0)
		(unlocked yes)
		(layer "F.Fab")
		(uuid "99c3839f-b485-4137-bb1d-0e32138b7f2b")
		(effects
			(font
				(size 1 1)
				(thickness 0.15)
			)
		)
	)
	(fp_text user "*"
		(at -1.8669 -4.826 0)
		(layer "F.Fab")
		(uuid "cc792dac-72e7-46ce-aefe-ee9ea3b19dae")
		(effects
			(font
				(size 1 1)
				(thickness 0.15)
			)
		)
	)
	(pad "1" smd rect
		(at -2.95275 -4.225)
		(size 1.4097 0.3556)
		(layers "F.Cu" "F.Paste" "F.Mask")
		(uuid "763abc79-f5b0-4516-bd93-4ffcf4a2a2e4")
	)
	(pad "2" smd rect
		(at -2.95275 -3.574999)
		(size 1.4097 0.3556)
		(layers "F.Cu" "F.Paste" "F.Mask")
		(uuid "f0c0e63e-63bf-4ab8-a1f1-feba45c01f74")
	)
	(pad "3" smd rect
		(at -2.95275 -2.925)
		(size 1.4097 0.3556)
		(layers "F.Cu" "F.Paste" "F.Mask")
		(uuid "65f6dbee-1917-4cff-a3f0-0a15d49e36bd")
	)
	(pad "4" smd rect
		(at -2.95275 -2.274999)
		(size 1.4097 0.3556)
		(layers "F.Cu" "F.Paste" "F.Mask")
		(uuid "26c5caf4-8ec0-4ba8-8c7e-6195b7474e60")
	)
	(pad "5" smd rect
		(at -2.95275 -1.625001)
		(size 1.4097 0.3556)
		(layers "F.Cu" "F.Paste" "F.Mask")
		(uuid "027a6fa6-0e9a-422f-8be1-5c8284cd8535")
	)
	(pad "6" smd rect
		(at -2.95275 -0.974999)
		(size 1.4097 0.3556)
		(layers "F.Cu" "F.Paste" "F.Mask")
		(uuid "c5efa768-4a6d-4697-8ccd-11824d1a8650")
	)
	(pad "7" smd rect
		(at -2.95275 -0.325001)
		(size 1.4097 0.3556)
		(layers "F.Cu" "F.Paste" "F.Mask")
		(uuid "62ad960f-e8ec-4722-b92d-e07e8741fea3")
	)
	(pad "8" smd rect
		(at -2.95275 0.324998)
		(size 1.4097 0.3556)
		(layers "F.Cu" "F.Paste" "F.Mask")
		(uuid "d3965fd4-162f-4803-837e-4be990326e77")
	)
	(pad "9" smd rect
		(at -2.95275 0.974999)
		(size 1.4097 0.3556)
		(layers "F.Cu" "F.Paste" "F.Mask")
		(uuid "50ba32f9-0895-4bf2-9e4a-7e9434320ea3")
	)
	(pad "10" smd rect
		(at -2.95275 1.624998)
		(size 1.4097 0.3556)
		(layers "F.Cu" "F.Paste" "F.Mask")
		(uuid "b5959a13-3662-4345-a944-ae5a89394644")
	)
	(pad "11" smd rect
		(at -2.95275 2.274999)
		(size 1.4097 0.3556)
		(layers "F.Cu" "F.Paste" "F.Mask")
		(uuid "a5d8916e-d077-49f7-9556-2e1ef0a65c5a")
	)
	(pad "12" smd rect
		(at -2.95275 2.924998)
		(size 1.4097 0.3556)
		(layers "F.Cu" "F.Paste" "F.Mask")
		(uuid "9cea121a-3cb2-4dc8-af18-b8d4bce3e9ea")
	)
	(pad "13" smd rect
		(at -2.95275 3.574999)
		(size 1.4097 0.3556)
		(layers "F.Cu" "F.Paste" "F.Mask")
		(uuid "4f00eb6c-15d2-46fe-ada2-ce81af7f14e1")
	)
	(pad "14" smd rect
		(at -2.95275 4.224998)
		(size 1.4097 0.3556)
		(layers "F.Cu" "F.Paste" "F.Mask")
		(uuid "8d634904-b43c-48d5-9408-63182480f1e2")
	)
	(pad "15" smd rect
		(at 2.95275 4.225)
		(size 1.4097 0.3556)
		(layers "F.Cu" "F.Paste" "F.Mask")
		(uuid "ce7594c7-8522-49dc-9b2f-eef6fc739734")
	)
	(pad "16" smd rect
		(at 2.95275 3.574999)
		(size 1.4097 0.3556)
		(layers "F.Cu" "F.Paste" "F.Mask")
		(uuid "60c5503c-cfe3-4fe8-907b-0adbf2350575")
	)
	(pad "17" smd rect
		(at 2.95275 2.925)
		(size 1.4097 0.3556)
		(layers "F.Cu" "F.Paste" "F.Mask")
		(uuid "feba431a-64c0-4bb7-9936-804505570e27")
	)
	(pad "18" smd rect
		(at 2.95275 2.274999)
		(size 1.4097 0.3556)
		(layers "F.Cu" "F.Paste" "F.Mask")
		(uuid "21aa454d-2d74-4596-9222-c01fa2168564")
	)
	(pad "19" smd rect
		(at 2.95275 1.625001)
		(size 1.4097 0.3556)
		(layers "F.Cu" "F.Paste" "F.Mask")
		(uuid "9ceab33f-4abe-4805-8a44-45760dc7889b")
	)
	(pad "20" smd rect
		(at 2.95275 0.974999)
		(size 1.4097 0.3556)
		(layers "F.Cu" "F.Paste" "F.Mask")
		(uuid "e5bc20c6-e61a-4ed6-995b-5fe8832c2ca1")
	)
	(pad "21" smd rect
		(at 2.95275 0.325001)
		(size 1.4097 0.3556)
		(layers "F.Cu" "F.Paste" "F.Mask")
		(uuid "dbe28800-0ab9-4e7b-b998-b75d5a36ef29")
	)
	(pad "22" smd rect
		(at 2.95275 -0.325001)
		(size 1.4097 0.3556)
		(layers "F.Cu" "F.Paste" "F.Mask")
		(uuid "304144fd-c5c5-4eeb-8155-10a7803456ad")
	)
	(pad "23" smd rect
		(at 2.95275 -0.974999)
		(size 1.4097 0.3556)
		(layers "F.Cu" "F.Paste" "F.Mask")
		(uuid "764a518f-88ef-4d9a-84b9-051df1b7f144")
	)
	(pad "24" smd rect
		(at 2.95275 -1.625001)
		(size 1.4097 0.3556)
		(layers "F.Cu" "F.Paste" "F.Mask")
		(uuid "1b8dada1-0f97-43e4-a6f4-658fe69c3f9c")
	)
	(pad "25" smd rect
		(at 2.95275 -2.274999)
		(size 1.4097 0.3556)
		(layers "F.Cu" "F.Paste" "F.Mask")
		(uuid "6f1dd480-7cc3-470d-9f20-854dadac4b83")
	)
	(pad "26" smd rect
		(at 2.95275 -2.925)
		(size 1.4097 0.3556)
		(layers "F.Cu" "F.Paste" "F.Mask")
		(uuid "e97112c5-4487-4ccf-a4c7-d81fc252dee3")
	)
	(pad "27" smd rect
		(at 2.95275 -3.574999)
		(size 1.4097 0.3556)
		(layers "F.Cu" "F.Paste" "F.Mask")
		(uuid "09cb70b1-9658-47ca-8da1-710327713d6f")
	)
	(pad "28" smd rect
		(at 2.95275 -4.225)
		(size 1.4097 0.3556)
		(layers "F.Cu" "F.Paste" "F.Mask")
		(uuid "fd330717-9a15-47ed-9bdf-585d6ecfab25")
	)
	(model "${KIPRJMOD}/3D/PCA96585-TSSOP.step"
		(offset
			(xyz 0 0 0)
		)
		(scale
			(xyz 1 1 1)
		)
		(rotate
			(xyz 0 0 0)
		)
	)
)
