(footprint "RTC-Crystal"
	(version 20240108)
	(generator "pcbnew")
	(generator_version "8.0")
	(layer "F.Cu")
	(descr "FC-135 32.7680KA-AG3-3")
	(tags "Crystal or Oscillator")
	(property "Reference" "Y**"
		(at 0 0 0)
		(layer "F.SilkS")
		(uuid "0011b285-173b-4d29-8b50-4527cbb3ad57")
		(effects
			(font
				(size 1.27 1.27)
				(thickness 0.254)
			)
		)
	)
	(property "Value" "FC135327680KAAG3"
		(at 0 0 0)
		(layer "F.SilkS")
		(hide yes)
		(uuid "219336cd-84d3-438a-ba78-98e1728555fa")
		(effects
			(font
				(size 1.27 1.27)
				(thickness 0.254)
			)
		)
	)
	(property "Footprint" ""
		(at 0 0 0)
		(layer "F.Fab")
		(hide yes)
		(uuid "c7cc7f9e-54a0-4d87-a149-7b1faf613d0f")
		(effects
			(font
				(size 1.27 1.27)
				(thickness 0.15)
			)
		)
	)
	(property "Datasheet" ""
		(at 0 0 0)
		(layer "F.Fab")
		(hide yes)
		(uuid "2374fce5-d1c5-4ecb-b6e9-bc6e941a42d9")
		(effects
			(font
				(size 1.27 1.27)
				(thickness 0.15)
			)
		)
	)
	(property "Description" ""
		(at 0 0 0)
		(layer "F.Fab")
		(hide yes)
		(uuid "bc4bde8e-c570-4e8f-a51d-67e328c75989")
		(effects
			(font
				(size 1.27 1.27)
				(thickness 0.15)
			)
		)
	)
	(attr smd)
	(fp_line
		(start -2.2 0)
		(end -2.2 0)
		(stroke
			(width 0.1)
			(type solid)
		)
		(layer "F.SilkS")
		(uuid "062055e2-048e-4a13-84d7-99980e5cd635")
	)
	(fp_line
		(start -2.2 0.1)
		(end -2.2 0.1)
		(stroke
			(width 0.1)
			(type solid)
		)
		(layer "F.SilkS")
		(uuid "9dfe6861-bd8b-4954-8024-ffcc4473cdb1")
	)
	(fp_line
		(start -0.4 -0.75)
		(end 0.4 -0.75)
		(stroke
			(width 0.1)
			(type solid)
		)
		(layer "F.SilkS")
		(uuid "2aabed0a-db6c-4b2f-a148-6e9c18dc1f13")
	)
	(fp_line
		(start -0.4 0.75)
		(end 0.4 0.75)
		(stroke
			(width 0.1)
			(type solid)
		)
		(layer "F.SilkS")
		(uuid "328df20b-eebf-48af-860f-765928e9335b")
	)
	(fp_arc
		(start -2.2 0)
		(mid -2.15 0.05)
		(end -2.2 0.1)
		(stroke
			(width 0.1)
			(type solid)
		)
		(layer "F.SilkS")
		(uuid "6cfa98e1-988b-45c9-ae55-82ef394e1f5e")
	)
	(fp_arc
		(start -2.2 0.1)
		(mid -2.25 0.05)
		(end -2.2 0)
		(stroke
			(width 0.1)
			(type solid)
		)
		(layer "F.SilkS")
		(uuid "6a92fa90-5fbf-43b0-9d4e-6b7225ab8f5f")
	)
	(fp_line
		(start -2.75 -1.9)
		(end 2.75 -1.9)
		(stroke
			(width 0.1)
			(type solid)
		)
		(layer "F.CrtYd")
		(uuid "3a9e0778-97af-4d39-a105-8c61a83e851a")
	)
	(fp_line
		(start -2.75 1.9)
		(end -2.75 -1.9)
		(stroke
			(width 0.1)
			(type solid)
		)
		(layer "F.CrtYd")
		(uuid "3a916584-bc45-4251-b245-4d95c716aaaf")
	)
	(fp_line
		(start 2.75 -1.9)
		(end 2.75 1.9)
		(stroke
			(width 0.1)
			(type solid)
		)
		(layer "F.CrtYd")
		(uuid "2d7c3d7a-bf69-4755-a9cb-3dfd80b29212")
	)
	(fp_line
		(start 2.75 1.9)
		(end -2.75 1.9)
		(stroke
			(width 0.1)
			(type solid)
		)
		(layer "F.CrtYd")
		(uuid "ede50de7-0103-44a4-90a7-935fdf3abe68")
	)
	(fp_line
		(start -1.6 -0.75)
		(end 1.6 -0.75)
		(stroke
			(width 0.2)
			(type solid)
		)
		(layer "F.Fab")
		(uuid "6c4e565f-a1f7-4fba-8b07-ced4d70f3b53")
	)
	(fp_line
		(start -1.6 0.75)
		(end -1.6 -0.75)
		(stroke
			(width 0.2)
			(type solid)
		)
		(layer "F.Fab")
		(uuid "0e43f568-867a-4643-85c0-7f8fa542dd0e")
	)
	(fp_line
		(start 1.6 -0.75)
		(end 1.6 0.75)
		(stroke
			(width 0.2)
			(type solid)
		)
		(layer "F.Fab")
		(uuid "31e9174a-b62f-4aa7-9fe2-7a9b94e4858e")
	)
	(fp_line
		(start 1.6 0.75)
		(end -1.6 0.75)
		(stroke
			(width 0.2)
			(type solid)
		)
		(layer "F.Fab")
		(uuid "2b867838-5470-4e8d-9274-5f65910886a4")
	)
	(fp_text user "${REFERENCE}"
		(at 0 0 0)
		(layer "F.Fab")
		(uuid "8cf049ea-4428-4bcd-bc5b-406a3d2aaf57")
		(effects
			(font
				(size 1.27 1.27)
				(thickness 0.254)
			)
		)
	)
	(pad "1" smd rect
		(at -1.25 0)
		(size 1 1.8)
		(layers "F.Cu" "F.Paste" "F.Mask")
		(uuid "3a6784bf-eefa-44eb-98d0-5cc95d0535f1")
	)
	(pad "2" smd rect
		(at 1.25 0)
		(size 1 1.8)
		(layers "F.Cu" "F.Paste" "F.Mask")
		(uuid "d906b301-ac40-4afe-8130-167f4de1a2a9")
	)
	(model "${KIPRJMOD}/3D/RTC-Crystal.stp"
		(offset
			(xyz 0 0 0)
		)
		(scale
			(xyz 1 1 1)
		)
		(rotate
			(xyz -90 0 0)
		)
	)
)
