(footprint "Gecko-16-Pos-G125-MS11605L3P"
	(version 20240108)
	(generator "pcbnew")
	(generator_version "8.0")
	(layer "F.Cu")
	(descr "G125-MS11605L3P")
	(tags "Connector")
	(property "Reference" "J**"
		(at 0 0 0)
		(layer "F.SilkS")
		(uuid "1c7ee9b2-4a70-4222-b67e-23ec7497e69e")
		(effects
			(font
				(size 1.27 1.27)
				(thickness 0.254)
			)
		)
	)
	(property "Value" "G125-MS11605L3P"
		(at 0 0 0)
		(layer "F.SilkS")
		(hide yes)
		(uuid "1313da88-7a5f-4746-93a4-4d2e5a76d9ad")
		(effects
			(font
				(size 1.27 1.27)
				(thickness 0.254)
			)
		)
	)
	(property "Footprint" ""
		(at 0 0 0)
		(layer "F.Fab")
		(hide yes)
		(uuid "c84ee0bc-1257-4884-b6ab-96ac16ea7a6d")
		(effects
			(font
				(size 1.27 1.27)
				(thickness 0.15)
			)
		)
	)
	(property "Datasheet" ""
		(at 0 0 0)
		(layer "F.Fab")
		(hide yes)
		(uuid "b4feb5ec-ce48-4765-b72c-2df31cf2b0e7")
		(effects
			(font
				(size 1.27 1.27)
				(thickness 0.15)
			)
		)
	)
	(property "Description" ""
		(at 0 0 0)
		(layer "F.Fab")
		(hide yes)
		(uuid "8e0b6204-2724-4fc2-9913-91b4edb79a84")
		(effects
			(font
				(size 1.27 1.27)
				(thickness 0.15)
			)
		)
	)
	(attr smd)
	(fp_line
		(start -6.275 2.45)
		(end -6.275 -2.45)
		(stroke
			(width 0.1)
			(type solid)
		)
		(layer "F.SilkS")
		(uuid "57527a0f-1e52-4855-abd5-7e6993d39670")
	)
	(fp_line
		(start 6.275 -2.45)
		(end 6.275 2.45)
		(stroke
			(width 0.1)
			(type solid)
		)
		(layer "F.SilkS")
		(uuid "aa109ecf-a7ce-4d90-9893-53713cf25bf5")
	)
	(fp_circle
		(center -4.975 3.35)
		(end -4.975 3.4)
		(stroke
			(width 0.2)
			(type solid)
		)
		(fill none)
		(layer "F.SilkS")
		(uuid "b47fa335-e0ce-4c91-9ae3-4d154ce55614")
	)
	(fp_line
		(start -8.275 -4.1)
		(end 8.275 -4.1)
		(stroke
			(width 0.05)
			(type solid)
		)
		(layer "F.CrtYd")
		(uuid "7d80aef7-8fe9-42f1-8c06-1d0e1e5c1e1b")
	)
	(fp_line
		(start -8.275 4.45)
		(end -8.275 -4.1)
		(stroke
			(width 0.05)
			(type solid)
		)
		(layer "F.CrtYd")
		(uuid "156af8f5-ff6c-46bd-9e92-33c854072b71")
	)
	(fp_line
		(start 8.275 -4.1)
		(end 8.275 4.45)
		(stroke
			(width 0.05)
			(type solid)
		)
		(layer "F.CrtYd")
		(uuid "640036c1-0802-4e9f-a8ef-6f00a26231dd")
	)
	(fp_line
		(start 8.275 4.45)
		(end -8.275 4.45)
		(stroke
			(width 0.05)
			(type solid)
		)
		(layer "F.CrtYd")
		(uuid "c346c603-be16-4b1d-ae43-2d6205f7239e")
	)
	(fp_line
		(start -6.275 -2.45)
		(end 6.275 -2.45)
		(stroke
			(width 0.2)
			(type solid)
		)
		(layer "F.Fab")
		(uuid "b760640d-aa21-485a-bb36-c193e1a132b7")
	)
	(fp_line
		(start -6.275 2.45)
		(end -6.275 -2.45)
		(stroke
			(width 0.2)
			(type solid)
		)
		(layer "F.Fab")
		(uuid "037025b9-297c-46ad-8352-d61c34a0159a")
	)
	(fp_line
		(start 6.275 -2.45)
		(end 6.275 2.45)
		(stroke
			(width 0.2)
			(type solid)
		)
		(layer "F.Fab")
		(uuid "624902f8-3d3b-4f1b-b06e-5a08de83b945")
	)
	(fp_line
		(start 6.275 2.45)
		(end -6.275 2.45)
		(stroke
			(width 0.2)
			(type solid)
		)
		(layer "F.Fab")
		(uuid "dc758130-d2bb-4d3c-a854-28ae98dbbe3f")
	)
	(fp_text user "${REFERENCE}"
		(at 0 0 0)
		(layer "F.Fab")
		(uuid "579505ea-d045-4b0a-b4df-4a49d7470023")
		(effects
			(font
				(size 1.27 1.27)
				(thickness 0.254)
			)
		)
	)
	(pad "1" smd rect
		(at -4.375 1.85)
		(size 0.7 2.5)
		(layers "F.Cu" "F.Paste" "F.Mask")
		(uuid "7c3eeae9-a40b-44c7-9860-6495315b65db")
	)
	(pad "2" smd rect
		(at -3.125 1.85)
		(size 0.7 2.5)
		(layers "F.Cu" "F.Paste" "F.Mask")
		(uuid "2067513b-35f1-4f10-93c2-f1252ebd9380")
	)
	(pad "3" smd rect
		(at -1.875 1.85)
		(size 0.7 2.5)
		(layers "F.Cu" "F.Paste" "F.Mask")
		(uuid "aec038b6-4628-43da-a739-585844b6d1b0")
	)
	(pad "4" smd rect
		(at -0.625 1.85)
		(size 0.7 2.5)
		(layers "F.Cu" "F.Paste" "F.Mask")
		(uuid "322045ef-1f5f-4ac5-909b-e31ffcb49146")
	)
	(pad "5" smd rect
		(at 0.625 1.85)
		(size 0.7 2.5)
		(layers "F.Cu" "F.Paste" "F.Mask")
		(uuid "76d23f9a-04aa-4f35-a2c6-3c8591a4e60b")
	)
	(pad "6" smd rect
		(at 1.875 1.85)
		(size 0.7 2.5)
		(layers "F.Cu" "F.Paste" "F.Mask")
		(uuid "c3bd2dd0-b116-42a7-9043-5e38f6613310")
	)
	(pad "7" smd rect
		(at 3.125 1.85)
		(size 0.7 2.5)
		(layers "F.Cu" "F.Paste" "F.Mask")
		(uuid "80a42796-b657-4448-8bf9-57787e15c2c8")
	)
	(pad "8" smd rect
		(at 4.375 1.85)
		(size 0.7 2.5)
		(layers "F.Cu" "F.Paste" "F.Mask")
		(uuid "ea484809-44df-4ac9-a413-156d9f46061e")
	)
	(pad "9" smd rect
		(at -4.375 -1.85)
		(size 0.7 2.5)
		(layers "F.Cu" "F.Paste" "F.Mask")
		(uuid "d534f6d5-5468-49be-ba38-3d470db3b3d0")
	)
	(pad "10" smd rect
		(at -3.125 -1.85)
		(size 0.7 2.5)
		(layers "F.Cu" "F.Paste" "F.Mask")
		(uuid "fea24e53-b47b-42b2-9cf2-7294e2827f40")
	)
	(pad "11" smd rect
		(at -1.875 -1.85)
		(size 0.7 2.5)
		(layers "F.Cu" "F.Paste" "F.Mask")
		(uuid "31f787b1-5ec2-45ee-bc66-904614e4a331")
	)
	(pad "12" smd rect
		(at -0.625 -1.85)
		(size 0.7 2.5)
		(layers "F.Cu" "F.Paste" "F.Mask")
		(uuid "173b3366-3efd-4247-8bfb-1cb17e0e6f32")
	)
	(pad "13" smd rect
		(at 0.625 -1.85)
		(size 0.7 2.5)
		(layers "F.Cu" "F.Paste" "F.Mask")
		(uuid "d982302f-e92e-491b-af66-61b3931385e6")
	)
	(pad "14" smd rect
		(at 1.875 -1.85)
		(size 0.7 2.5)
		(layers "F.Cu" "F.Paste" "F.Mask")
		(uuid "9baca55a-2b78-47c0-879a-d79a54128096")
	)
	(pad "15" smd rect
		(at 3.125 -1.85)
		(size 0.7 2.5)
		(layers "F.Cu" "F.Paste" "F.Mask")
		(uuid "430abc8c-baf0-49b8-9ea6-c5d041cfa3aa")
	)
	(pad "16" smd rect
		(at 4.375 -1.85)
		(size 0.7 2.5)
		(layers "F.Cu" "F.Paste" "F.Mask")
		(uuid "927f5451-bfff-4f32-b0cb-c6e873048bf7")
	)
	(pad "17" smd rect
		(at -6.525 0)
		(size 1.5 1.85)
		(layers "F.Cu" "F.Paste" "F.Mask")
		(uuid "e6366f46-f95a-4d16-b30d-4f52e69a77e0")
	)
	(pad "18" smd rect
		(at 6.525 0)
		(size 1.5 1.85)
		(layers "F.Cu" "F.Paste" "F.Mask")
		(uuid "d20307ea-4ee9-4f12-873f-219f5728be3c")
	)
	(model "${KIPRJMOD}/3D/Gecko-16-Pos-G125-MS11605L3P.stp"
		(offset
			(xyz 0 0 1.99999997)
		)
		(scale
			(xyz 1 1 1)
		)
		(rotate
			(xyz -90 0 0)
		)
	)
)
