(footprint "FGDOS-TCXO-32k768Hz"
	(version 20240108)
	(generator "pcbnew")
	(generator_version "8.0")
	(layer "F.Cu")
	(descr "2.15 x 1.35 x 1.1 mm")
	(tags "Crystal or Oscillator")
	(property "Reference" "Y**"
		(at 0 0 0)
		(layer "F.SilkS")
		(uuid "54424a36-8719-4cbb-9ce0-cdecda3d3823")
		(effects
			(font
				(size 1.27 1.27)
				(thickness 0.254)
			)
		)
	)
	(property "Value" "FGDOS-TCXO-32k768Hz"
		(at 0 0 0)
		(layer "F.SilkS")
		(hide yes)
		(uuid "e99f15d5-5ddb-4401-abf8-eb94de5264b9")
		(effects
			(font
				(size 1.27 1.27)
				(thickness 0.254)
			)
		)
	)
	(property "Footprint" ""
		(at 0 0 0)
		(layer "F.Fab")
		(hide yes)
		(uuid "c675a6e4-a567-4574-8cc3-6ccdd091263b")
		(effects
			(font
				(size 1.27 1.27)
				(thickness 0.15)
			)
		)
	)
	(property "Datasheet" ""
		(at 0 0 0)
		(layer "F.Fab")
		(hide yes)
		(uuid "c1cf9f51-150f-4cf0-b936-7dca087321ad")
		(effects
			(font
				(size 1.27 1.27)
				(thickness 0.15)
			)
		)
	)
	(property "Description" ""
		(at 0 0 0)
		(layer "F.Fab")
		(hide yes)
		(uuid "cd482f1b-2478-4b15-870d-7614f41eb43c")
		(effects
			(font
				(size 1.27 1.27)
				(thickness 0.15)
			)
		)
	)
	(attr smd)
	(fp_line
		(start -0.725 1.3)
		(end -0.725 1.3)
		(stroke
			(width 0.1)
			(type solid)
		)
		(layer "F.SilkS")
		(uuid "2bb16160-d6f2-43d6-99db-9dc06ef8d3cb")
	)
	(fp_line
		(start -0.725 1.4)
		(end -0.725 1.4)
		(stroke
			(width 0.1)
			(type solid)
		)
		(layer "F.SilkS")
		(uuid "3747e00f-6fc9-4e5d-b302-95519de18dd9")
	)
	(fp_arc
		(start -0.725 1.3)
		(mid -0.675 1.35)
		(end -0.725 1.4)
		(stroke
			(width 0.1)
			(type solid)
		)
		(layer "F.SilkS")
		(uuid "590dc6ea-a88e-4592-bc53-a301121184ac")
	)
	(fp_arc
		(start -0.725 1.4)
		(mid -0.775 1.35)
		(end -0.725 1.3)
		(stroke
			(width 0.1)
			(type solid)
		)
		(layer "F.SilkS")
		(uuid "aa3bd02f-fd49-4efd-8c64-b12b1bbdc12b")
	)
	(fp_line
		(start -2.15 -1.85)
		(end 2.15 -1.85)
		(stroke
			(width 0.1)
			(type solid)
		)
		(layer "F.CrtYd")
		(uuid "5d52ae9d-a5b6-4cdf-8922-acf36cd4d9bc")
	)
	(fp_line
		(start -2.15 1.85)
		(end -2.15 -1.85)
		(stroke
			(width 0.1)
			(type solid)
		)
		(layer "F.CrtYd")
		(uuid "c5596c12-bad5-4afd-8404-776306e103c9")
	)
	(fp_line
		(start 2.15 -1.85)
		(end 2.15 1.85)
		(stroke
			(width 0.1)
			(type solid)
		)
		(layer "F.CrtYd")
		(uuid "47a5ddd8-516d-45b5-a80f-b93530d12e6e")
	)
	(fp_line
		(start 2.15 1.85)
		(end -2.15 1.85)
		(stroke
			(width 0.1)
			(type solid)
		)
		(layer "F.CrtYd")
		(uuid "2d0d2fbb-ebfd-4173-abf3-cd9cd75789b6")
	)
	(fp_line
		(start -1.075 -0.675)
		(end 1.075 -0.675)
		(stroke
			(width 0.1)
			(type solid)
		)
		(layer "F.Fab")
		(uuid "4c1e139e-af2c-4ae0-9ab8-386c9ea21432")
	)
	(fp_line
		(start -1.075 0.675)
		(end -1.075 -0.675)
		(stroke
			(width 0.1)
			(type solid)
		)
		(layer "F.Fab")
		(uuid "7be165a6-5b30-42af-94fc-6184303a56e8")
	)
	(fp_line
		(start 1.075 -0.675)
		(end 1.075 0.675)
		(stroke
			(width 0.1)
			(type solid)
		)
		(layer "F.Fab")
		(uuid "d58cda4b-2f76-42d9-8588-e342b2802556")
	)
	(fp_line
		(start 1.075 0.675)
		(end -1.075 0.675)
		(stroke
			(width 0.1)
			(type solid)
		)
		(layer "F.Fab")
		(uuid "31c37c8f-60cf-41b8-8011-fc673708095b")
	)
	(fp_text user "${REFERENCE}"
		(at 0 0 0)
		(layer "F.Fab")
		(uuid "7a591d69-34ed-4bb7-b06c-7b1b2be57c27")
		(effects
			(font
				(size 1.27 1.27)
				(thickness 0.254)
			)
		)
	)
	(pad "1" smd rect
		(at -0.725 0.5 90)
		(size 0.7 0.85)
		(layers "F.Cu" "F.Paste" "F.Mask")
		(uuid "85be39e6-8476-411e-83d4-1b6eb7ba20de")
	)
	(pad "2" smd rect
		(at 0.725 0.5 90)
		(size 0.7 0.85)
		(layers "F.Cu" "F.Paste" "F.Mask")
		(uuid "29137850-7e84-49b1-8a9d-ab09d562c3e5")
	)
	(pad "3" smd rect
		(at 0.725 -0.5 90)
		(size 0.7 0.85)
		(layers "F.Cu" "F.Paste" "F.Mask")
		(uuid "567ce749-a9cd-4b76-9e63-39e102fbadf1")
	)
	(pad "4" smd rect
		(at -0.725 -0.5 90)
		(size 0.7 0.85)
		(layers "F.Cu" "F.Paste" "F.Mask")
		(uuid "17c63db0-d47d-4772-a5d3-f0b11abf4ae4")
	)
	(model "${KIPRJMOD}/3D/FGDOS-TCXO-32k768.STEP"
		(offset
			(xyz 0 0 0)
		)
		(scale
			(xyz 1 1 1)
		)
		(rotate
			(xyz -90 0 0)
		)
	)
)
