(footprint "SOIC127P600X175-8N" (version 20221018) (generator pcbnew)
  (layer "F.Cu")
  (descr "AD590KRZ")
  (tags "Integrated Circuit")
  (attr smd)
  (fp_text reference "IC**" (at 0 0) (layer "F.SilkS")
      (effects (font (size 1.27 1.27) (thickness 0.254)))
    (tstamp d37f7d87-4228-402b-9169-f0b46ec95bd4)
  )
  (fp_text value "SOIC127P600X175-8N" (at 0 0) (layer "F.SilkS") hide
      (effects (font (size 1.27 1.27) (thickness 0.254)))
    (tstamp 09538809-b9ec-42cd-8a9b-cc1910545645)
  )
  (fp_text user "${REFERENCE}" (at 0 0) (layer "F.Fab")
      (effects (font (size 1.27 1.27) (thickness 0.254)))
    (tstamp ceea307c-505f-4dbd-9d11-8f844b9614ab)
  )
  (fp_line (start -3.475 -2.58) (end -1.95 -2.58)
    (stroke (width 0.2) (type solid)) (layer "F.SilkS") (tstamp 1fdeccee-770d-4596-9463-6ed6d84eb22a))
  (fp_line (start -1.6 -2.45) (end 1.6 -2.45)
    (stroke (width 0.2) (type solid)) (layer "F.SilkS") (tstamp 8bf15242-4e99-4cc6-ba76-fabcc7a9a94f))
  (fp_line (start -1.6 2.45) (end -1.6 -2.45)
    (stroke (width 0.2) (type solid)) (layer "F.SilkS") (tstamp e3aa30e0-5203-43de-a3af-eedab5646147))
  (fp_line (start 1.6 -2.45) (end 1.6 2.45)
    (stroke (width 0.2) (type solid)) (layer "F.SilkS") (tstamp a08a902c-3d75-4228-9a2a-d510b887fc3c))
  (fp_line (start 1.6 2.45) (end -1.6 2.45)
    (stroke (width 0.2) (type solid)) (layer "F.SilkS") (tstamp acd4f422-ece3-4c86-8138-3a75b4858796))
  (fp_line (start -3.725 -2.75) (end 3.725 -2.75)
    (stroke (width 0.05) (type solid)) (layer "F.CrtYd") (tstamp 0f876313-3612-4faa-829a-bf05c4207c8d))
  (fp_line (start -3.725 2.75) (end -3.725 -2.75)
    (stroke (width 0.05) (type solid)) (layer "F.CrtYd") (tstamp 378754ea-f8a8-4110-bc5e-cbb83f750ccb))
  (fp_line (start 3.725 -2.75) (end 3.725 2.75)
    (stroke (width 0.05) (type solid)) (layer "F.CrtYd") (tstamp b0e7b087-688f-4bca-9142-1a8cf93ee5d8))
  (fp_line (start 3.725 2.75) (end -3.725 2.75)
    (stroke (width 0.05) (type solid)) (layer "F.CrtYd") (tstamp a7d56d13-b5ed-4c97-a1cd-be00db791034))
  (fp_line (start -1.95 -2.45) (end 1.95 -2.45)
    (stroke (width 0.1) (type solid)) (layer "F.Fab") (tstamp e8bcdeeb-2a5f-4dd4-9ee6-ffb4a991bc90))
  (fp_line (start -1.95 -1.18) (end -0.68 -2.45)
    (stroke (width 0.1) (type solid)) (layer "F.Fab") (tstamp eaee6ecf-3dd6-45c3-b468-d45914b838ee))
  (fp_line (start -1.95 2.45) (end -1.95 -2.45)
    (stroke (width 0.1) (type solid)) (layer "F.Fab") (tstamp 19d653ad-e5f4-4569-bfa0-2284dc80859a))
  (fp_line (start 1.95 -2.45) (end 1.95 2.45)
    (stroke (width 0.1) (type solid)) (layer "F.Fab") (tstamp a8fabd5a-8197-4545-bb3d-986780253a6a))
  (fp_line (start 1.95 2.45) (end -1.95 2.45)
    (stroke (width 0.1) (type solid)) (layer "F.Fab") (tstamp da39265b-b8c9-4685-87ab-2b186c00d4f3))
  (pad "1" smd rect (at -2.712 -1.905 90) (size 0.65 1.525) (layers "F.Cu" "F.Paste" "F.Mask") (tstamp 23c79caa-71eb-47ff-be8b-77e01cd2e439))
  (pad "2" smd rect (at -2.712 -0.635 90) (size 0.65 1.525) (layers "F.Cu" "F.Paste" "F.Mask") (tstamp 0bba7f35-eb11-49e1-b082-2767a753fe28))
  (pad "3" smd rect (at -2.712 0.635 90) (size 0.65 1.525) (layers "F.Cu" "F.Paste" "F.Mask") (tstamp 1a7d263a-8653-4380-bb5a-0e7604c9f561))
  (pad "4" smd rect (at -2.712 1.905 90) (size 0.65 1.525) (layers "F.Cu" "F.Paste" "F.Mask") (tstamp e1c6a5af-dfa8-41f4-9c1b-79c3f987cffa))
  (pad "5" smd rect (at 2.712 1.905 90) (size 0.65 1.525) (layers "F.Cu" "F.Paste" "F.Mask") (tstamp 80e587fc-2366-4119-a3df-28020f4887fd))
  (pad "6" smd rect (at 2.712 0.635 90) (size 0.65 1.525) (layers "F.Cu" "F.Paste" "F.Mask") (tstamp b90312cd-4ace-423d-87a5-eb73fad7fad0))
  (pad "7" smd rect (at 2.712 -0.635 90) (size 0.65 1.525) (layers "F.Cu" "F.Paste" "F.Mask") (tstamp b527673c-af1a-497c-aeda-bf9e87d41b15))
  (pad "8" smd rect (at 2.712 -1.905 90) (size 0.65 1.525) (layers "F.Cu" "F.Paste" "F.Mask") (tstamp 4a498592-e637-41d4-bb68-d00f4d7c9a49))
  (model "AD590KRZ.stp"
    (offset (xyz 0 0 0))
    (scale (xyz 1 1 1))
    (rotate (xyz 0 0 0))
  )
)
