(footprint "SOP65P640X110-28N" (version 20221018) (generator pcbnew)
  (layer "F.Cu")
  (descr "28-LEAD TSSOP")
  (tags "Integrated Circuit")
  (attr smd)
  (fp_text reference "IC**" (at 0 0) (layer "F.SilkS")
      (effects (font (size 1.27 1.27) (thickness 0.254)))
    (tstamp 9cb9f0e4-5725-4b39-b9a7-170aa10d45f7)
  )
  (fp_text value "SOP65P640X110-28N" (at 0 0) (layer "F.SilkS") hide
      (effects (font (size 1.27 1.27) (thickness 0.254)))
    (tstamp 92169d79-1d32-4c99-8de6-f2adce2b80c1)
  )
  (fp_text user "${REFERENCE}" (at 0 0) (layer "F.Fab")
      (effects (font (size 1.27 1.27) (thickness 0.254)))
    (tstamp f3980ac0-c56d-47a3-bdea-cb04902a0475)
  )
  (fp_line (start -3.675 -4.8) (end -2.2 -4.8)
    (stroke (width 0.2) (type solid)) (layer "F.SilkS") (tstamp dd88b8df-34ef-44d6-ba31-a91a4fa5ebef))
  (fp_line (start -1.85 -4.85) (end 1.85 -4.85)
    (stroke (width 0.2) (type solid)) (layer "F.SilkS") (tstamp 02a2a4f6-0da9-41f9-9242-ef2895963df1))
  (fp_line (start -1.85 4.85) (end -1.85 -4.85)
    (stroke (width 0.2) (type solid)) (layer "F.SilkS") (tstamp b44babbc-ec13-45f0-ab68-a81c4db4781e))
  (fp_line (start 1.85 -4.85) (end 1.85 4.85)
    (stroke (width 0.2) (type solid)) (layer "F.SilkS") (tstamp 11cfc7b0-a38b-4a53-9d84-098be9a2fa9d))
  (fp_line (start 1.85 4.85) (end -1.85 4.85)
    (stroke (width 0.2) (type solid)) (layer "F.SilkS") (tstamp a5f282b3-6867-4176-8d85-998c61add98c))
  (fp_line (start -3.925 -5.15) (end 3.925 -5.15)
    (stroke (width 0.05) (type solid)) (layer "F.CrtYd") (tstamp 77306ae8-1790-43ba-8e83-f6854a83f02b))
  (fp_line (start -3.925 5.15) (end -3.925 -5.15)
    (stroke (width 0.05) (type solid)) (layer "F.CrtYd") (tstamp bbc6f571-edc7-48da-8465-00a747220ca6))
  (fp_line (start 3.925 -5.15) (end 3.925 5.15)
    (stroke (width 0.05) (type solid)) (layer "F.CrtYd") (tstamp b6f35639-97ed-43f3-8e1c-57ce47d5786d))
  (fp_line (start 3.925 5.15) (end -3.925 5.15)
    (stroke (width 0.05) (type solid)) (layer "F.CrtYd") (tstamp 53774af4-7d1b-4da4-b149-5ecbf2cf8437))
  (fp_line (start -2.2 -4.85) (end 2.2 -4.85)
    (stroke (width 0.1) (type solid)) (layer "F.Fab") (tstamp 8f5fa602-9e83-47f3-a334-9b42018c4153))
  (fp_line (start -2.2 -4.2) (end -1.55 -4.85)
    (stroke (width 0.1) (type solid)) (layer "F.Fab") (tstamp dba22f77-dcbd-4bd1-8ab8-df2d371c84de))
  (fp_line (start -2.2 4.85) (end -2.2 -4.85)
    (stroke (width 0.1) (type solid)) (layer "F.Fab") (tstamp d8af3bca-249a-411c-ab1a-7937f092fcc9))
  (fp_line (start 2.2 -4.85) (end 2.2 4.85)
    (stroke (width 0.1) (type solid)) (layer "F.Fab") (tstamp 4110ae2e-2e74-4f29-a339-0cc9e46a8251))
  (fp_line (start 2.2 4.85) (end -2.2 4.85)
    (stroke (width 0.1) (type solid)) (layer "F.Fab") (tstamp 229131a9-d4e5-40f1-ae86-64359bb34378))
  (pad "1" smd rect (at -2.938 -4.225 90) (size 0.45 1.475) (layers "F.Cu" "F.Paste" "F.Mask") (tstamp 02c770d5-ccbd-4206-a4a3-34e895a0fa2c))
  (pad "2" smd rect (at -2.938 -3.575 90) (size 0.45 1.475) (layers "F.Cu" "F.Paste" "F.Mask") (tstamp 80c7a60e-22bf-4dce-8eae-157802a17964))
  (pad "3" smd rect (at -2.938 -2.925 90) (size 0.45 1.475) (layers "F.Cu" "F.Paste" "F.Mask") (tstamp 16656388-ec7c-49b9-801c-54820c179e4b))
  (pad "4" smd rect (at -2.938 -2.275 90) (size 0.45 1.475) (layers "F.Cu" "F.Paste" "F.Mask") (tstamp daa7460d-0fb6-400d-b9fe-7458eea84d53))
  (pad "5" smd rect (at -2.938 -1.625 90) (size 0.45 1.475) (layers "F.Cu" "F.Paste" "F.Mask") (tstamp 1f26f0db-d8d3-4616-8338-2505b13fb826))
  (pad "6" smd rect (at -2.938 -0.975 90) (size 0.45 1.475) (layers "F.Cu" "F.Paste" "F.Mask") (tstamp e102aa28-0ca5-48fc-8185-95353ae93d1b))
  (pad "7" smd rect (at -2.938 -0.325 90) (size 0.45 1.475) (layers "F.Cu" "F.Paste" "F.Mask") (tstamp 99e1e228-ff47-488a-8947-0bb3fd8956cb))
  (pad "8" smd rect (at -2.938 0.325 90) (size 0.45 1.475) (layers "F.Cu" "F.Paste" "F.Mask") (tstamp 4810f3d2-0e5c-4b26-93fc-ffe36550788c))
  (pad "9" smd rect (at -2.938 0.975 90) (size 0.45 1.475) (layers "F.Cu" "F.Paste" "F.Mask") (tstamp 1b40e13f-580a-4339-be2a-5810f550d34c))
  (pad "10" smd rect (at -2.938 1.625 90) (size 0.45 1.475) (layers "F.Cu" "F.Paste" "F.Mask") (tstamp 5e3eb4ae-6c2f-4ea7-9502-5c3b9bf0fd3d))
  (pad "11" smd rect (at -2.938 2.275 90) (size 0.45 1.475) (layers "F.Cu" "F.Paste" "F.Mask") (tstamp 3a420e79-e736-4573-8f23-4ab5a5332b89))
  (pad "12" smd rect (at -2.938 2.925 90) (size 0.45 1.475) (layers "F.Cu" "F.Paste" "F.Mask") (tstamp dd12d00d-8cc3-49d9-8087-8e7a814a813f))
  (pad "13" smd rect (at -2.938 3.575 90) (size 0.45 1.475) (layers "F.Cu" "F.Paste" "F.Mask") (tstamp 39de31fc-3dbf-4844-9317-9599e7e7caac))
  (pad "14" smd rect (at -2.938 4.225 90) (size 0.45 1.475) (layers "F.Cu" "F.Paste" "F.Mask") (tstamp 914bb111-76b5-45f9-ba4a-ce940d525483))
  (pad "15" smd rect (at 2.938 4.225 90) (size 0.45 1.475) (layers "F.Cu" "F.Paste" "F.Mask") (tstamp b9e30f7e-12b8-484d-a219-5fb10beb7c75))
  (pad "16" smd rect (at 2.938 3.575 90) (size 0.45 1.475) (layers "F.Cu" "F.Paste" "F.Mask") (tstamp 9fb53429-34e0-4b5d-a3ac-407205954d92))
  (pad "17" smd rect (at 2.938 2.925 90) (size 0.45 1.475) (layers "F.Cu" "F.Paste" "F.Mask") (tstamp 7a589963-c7b7-4bc3-a40f-9a38f65497b3))
  (pad "18" smd rect (at 2.938 2.275 90) (size 0.45 1.475) (layers "F.Cu" "F.Paste" "F.Mask") (tstamp 80b7a053-00f4-41f8-b4b4-a7e2294b0763))
  (pad "19" smd rect (at 2.938 1.625 90) (size 0.45 1.475) (layers "F.Cu" "F.Paste" "F.Mask") (tstamp 6e4bcfb2-b0a2-4030-9af3-bd6ebfd98b5c))
  (pad "20" smd rect (at 2.938 0.975 90) (size 0.45 1.475) (layers "F.Cu" "F.Paste" "F.Mask") (tstamp f7693ac6-3f07-4a9a-9e36-777f8e7725c3))
  (pad "21" smd rect (at 2.938 0.325 90) (size 0.45 1.475) (layers "F.Cu" "F.Paste" "F.Mask") (tstamp a85328de-7d5e-4bda-89f1-f776a2318249))
  (pad "22" smd rect (at 2.938 -0.325 90) (size 0.45 1.475) (layers "F.Cu" "F.Paste" "F.Mask") (tstamp 3431c4f3-9be4-4e8f-982e-5df5a8e43004))
  (pad "23" smd rect (at 2.938 -0.975 90) (size 0.45 1.475) (layers "F.Cu" "F.Paste" "F.Mask") (tstamp 36f25062-9fbc-403c-84a6-32ea27aacf22))
  (pad "24" smd rect (at 2.938 -1.625 90) (size 0.45 1.475) (layers "F.Cu" "F.Paste" "F.Mask") (tstamp f51b1a60-66c2-41ea-9383-020424d12bac))
  (pad "25" smd rect (at 2.938 -2.275 90) (size 0.45 1.475) (layers "F.Cu" "F.Paste" "F.Mask") (tstamp 009067ee-e266-4113-90a8-462d3b1d9733))
  (pad "26" smd rect (at 2.938 -2.925 90) (size 0.45 1.475) (layers "F.Cu" "F.Paste" "F.Mask") (tstamp 6f3d3917-a977-4e6c-940b-f9f53e34bad7))
  (pad "27" smd rect (at 2.938 -3.575 90) (size 0.45 1.475) (layers "F.Cu" "F.Paste" "F.Mask") (tstamp dda992a2-ab3d-4658-9774-5822d558839c))
  (pad "28" smd rect (at 2.938 -4.225 90) (size 0.45 1.475) (layers "F.Cu" "F.Paste" "F.Mask") (tstamp fe963a86-8641-46a8-a341-9d9a1bf10196))
  (model "${KIPRJMOD}/3D/PCA9685PW,118.stp"
    (offset (xyz 0 0 0))
    (scale (xyz 1 1 1))
    (rotate (xyz 0 0 0))
  )
)
