(kicad_sch
	(version 20231120)
	(generator "eeschema")
	(generator_version "8.0")
	(uuid "15bc01bf-e767-405a-884f-97444f7360ae")
	(paper "A4")
	(title_block
		(title "Payload PCB")
		(date "2024-08-06")
		(rev "1")
		(company "AcubeSAT")
	)
	(lib_symbols
		(symbol "Device:R"
			(pin_numbers hide)
			(pin_names
				(offset 0)
			)
			(exclude_from_sim no)
			(in_bom yes)
			(on_board yes)
			(property "Reference" "R"
				(at 2.032 0 90)
				(effects
					(font
						(size 1.27 1.27)
					)
				)
			)
			(property "Value" "R"
				(at 0 0 90)
				(effects
					(font
						(size 1.27 1.27)
					)
				)
			)
			(property "Footprint" ""
				(at -1.778 0 90)
				(effects
					(font
						(size 1.27 1.27)
					)
					(hide yes)
				)
			)
			(property "Datasheet" "~"
				(at 0 0 0)
				(effects
					(font
						(size 1.27 1.27)
					)
					(hide yes)
				)
			)
			(property "Description" "Resistor"
				(at 0 0 0)
				(effects
					(font
						(size 1.27 1.27)
					)
					(hide yes)
				)
			)
			(property "ki_keywords" "R res resistor"
				(at 0 0 0)
				(effects
					(font
						(size 1.27 1.27)
					)
					(hide yes)
				)
			)
			(property "ki_fp_filters" "R_*"
				(at 0 0 0)
				(effects
					(font
						(size 1.27 1.27)
					)
					(hide yes)
				)
			)
			(symbol "R_0_1"
				(rectangle
					(start -1.016 -2.54)
					(end 1.016 2.54)
					(stroke
						(width 0.254)
						(type default)
					)
					(fill
						(type none)
					)
				)
			)
			(symbol "R_1_1"
				(pin passive line
					(at 0 3.81 270)
					(length 1.27)
					(name "~"
						(effects
							(font
								(size 1.27 1.27)
							)
						)
					)
					(number "1"
						(effects
							(font
								(size 1.27 1.27)
							)
						)
					)
				)
				(pin passive line
					(at 0 -3.81 90)
					(length 1.27)
					(name "~"
						(effects
							(font
								(size 1.27 1.27)
							)
						)
					)
					(number "2"
						(effects
							(font
								(size 1.27 1.27)
							)
						)
					)
				)
			)
		)
		(symbol "SU-PCB-Connectors:MicroLockPlus-4P"
			(exclude_from_sim no)
			(in_bom yes)
			(on_board yes)
			(property "Reference" "J"
				(at 19.05 7.62 0)
				(effects
					(font
						(size 1.27 1.27)
					)
					(justify left top)
				)
			)
			(property "Value" "MicroLockPlus-4P"
				(at 19.05 5.08 0)
				(effects
					(font
						(size 1.27 1.27)
					)
					(justify left top)
				)
			)
			(property "Footprint" "SU-PCB-Connectors:MicroLockPlus-4P"
				(at 19.05 -94.92 0)
				(effects
					(font
						(size 1.27 1.27)
					)
					(justify left top)
					(hide yes)
				)
			)
			(property "Datasheet" "https://www.molex.com/pdm_docs/sd/5055680431_sd.pdf"
				(at 19.05 -194.92 0)
				(effects
					(font
						(size 1.27 1.27)
					)
					(justify left top)
					(hide yes)
				)
			)
			(property "Description" "Headers & Wire Housings 1.25WB SGL S 4CKT BK G038 W/KAP"
				(at 0 0 0)
				(effects
					(font
						(size 1.27 1.27)
					)
					(hide yes)
				)
			)
			(property "Height" "4.4"
				(at 19.05 -394.92 0)
				(effects
					(font
						(size 1.27 1.27)
					)
					(justify left top)
					(hide yes)
				)
			)
			(property "Mouser Part Number" "538-505568-0431"
				(at 19.05 -494.92 0)
				(effects
					(font
						(size 1.27 1.27)
					)
					(justify left top)
					(hide yes)
				)
			)
			(property "Mouser Price/Stock" "https://www.mouser.co.uk/ProductDetail/Molex/505568-0431?qs=vmHwEFxEFR%252Bihet2koJzMA%3D%3D"
				(at 19.05 -594.92 0)
				(effects
					(font
						(size 1.27 1.27)
					)
					(justify left top)
					(hide yes)
				)
			)
			(property "Manufacturer_Name" "Molex"
				(at 19.05 -694.92 0)
				(effects
					(font
						(size 1.27 1.27)
					)
					(justify left top)
					(hide yes)
				)
			)
			(property "Manufacturer_Part_Number" "505568-0431"
				(at 19.05 -794.92 0)
				(effects
					(font
						(size 1.27 1.27)
					)
					(justify left top)
					(hide yes)
				)
			)
			(property "MPN" "505568-0431"
				(at 0 0 0)
				(effects
					(font
						(size 1.27 1.27)
					)
				)
			)
			(symbol "MicroLockPlus-4P_1_1"
				(rectangle
					(start 5.08 2.54)
					(end 17.78 -10.16)
					(stroke
						(width 0.254)
						(type default)
					)
					(fill
						(type background)
					)
				)
				(pin passive line
					(at 0 0 0)
					(length 5.08)
					(name "1"
						(effects
							(font
								(size 1.27 1.27)
							)
						)
					)
					(number "1"
						(effects
							(font
								(size 1.27 1.27)
							)
						)
					)
				)
				(pin passive line
					(at 0 -2.54 0)
					(length 5.08)
					(name "2"
						(effects
							(font
								(size 1.27 1.27)
							)
						)
					)
					(number "2"
						(effects
							(font
								(size 1.27 1.27)
							)
						)
					)
				)
				(pin passive line
					(at 0 -5.08 0)
					(length 5.08)
					(name "3"
						(effects
							(font
								(size 1.27 1.27)
							)
						)
					)
					(number "3"
						(effects
							(font
								(size 1.27 1.27)
							)
						)
					)
				)
				(pin passive line
					(at 0 -7.62 0)
					(length 5.08)
					(name "4"
						(effects
							(font
								(size 1.27 1.27)
							)
						)
					)
					(number "4"
						(effects
							(font
								(size 1.27 1.27)
							)
						)
					)
				)
				(pin passive line
					(at 22.86 0 180)
					(length 5.08)
					(name "MP1"
						(effects
							(font
								(size 1.27 1.27)
							)
						)
					)
					(number "MP1"
						(effects
							(font
								(size 1.27 1.27)
							)
						)
					)
				)
				(pin passive line
					(at 22.86 -2.54 180)
					(length 5.08)
					(name "MP2"
						(effects
							(font
								(size 1.27 1.27)
							)
						)
					)
					(number "MP2"
						(effects
							(font
								(size 1.27 1.27)
							)
						)
					)
				)
			)
		)
		(symbol "SU-PCB-Connectors:MicroLockPlus-6P"
			(pin_names
				(offset 0.254)
			)
			(exclude_from_sim no)
			(in_bom yes)
			(on_board yes)
			(property "Reference" "J"
				(at 8.89 6.35 0)
				(effects
					(font
						(size 1.524 1.524)
					)
				)
			)
			(property "Value" "MicroLockPlus-6P"
				(at 0 0 0)
				(effects
					(font
						(size 1.524 1.524)
					)
				)
			)
			(property "Footprint" "SU-PCB-Connectors:MicroLockPlus-6P"
				(at 0 0 0)
				(effects
					(font
						(size 1.27 1.27)
						(italic yes)
					)
					(hide yes)
				)
			)
			(property "Datasheet" "5055680631"
				(at 0 0 0)
				(effects
					(font
						(size 1.27 1.27)
						(italic yes)
					)
					(hide yes)
				)
			)
			(property "Description" ""
				(at 0 0 0)
				(effects
					(font
						(size 1.27 1.27)
					)
					(hide yes)
				)
			)
			(property "MPN" "5055680631"
				(at 0 0 0)
				(effects
					(font
						(size 1.27 1.27)
					)
				)
			)
			(property "ki_keywords" "5055680631"
				(at 0 0 0)
				(effects
					(font
						(size 1.27 1.27)
					)
					(hide yes)
				)
			)
			(property "ki_fp_filters" "CON_5055680631"
				(at 0 0 0)
				(effects
					(font
						(size 1.27 1.27)
					)
					(hide yes)
				)
			)
			(symbol "MicroLockPlus-6P_1_1"
				(polyline
					(pts
						(xy 5.08 -20.32) (xy 12.7 -20.32)
					)
					(stroke
						(width 0.127)
						(type default)
					)
					(fill
						(type none)
					)
				)
				(polyline
					(pts
						(xy 5.08 2.54) (xy 5.08 -20.32)
					)
					(stroke
						(width 0.127)
						(type default)
					)
					(fill
						(type none)
					)
				)
				(polyline
					(pts
						(xy 10.16 -17.78) (xy 5.08 -17.78)
					)
					(stroke
						(width 0.127)
						(type default)
					)
					(fill
						(type none)
					)
				)
				(polyline
					(pts
						(xy 10.16 -17.78) (xy 8.89 -18.6267)
					)
					(stroke
						(width 0.127)
						(type default)
					)
					(fill
						(type none)
					)
				)
				(polyline
					(pts
						(xy 10.16 -17.78) (xy 8.89 -16.9333)
					)
					(stroke
						(width 0.127)
						(type default)
					)
					(fill
						(type none)
					)
				)
				(polyline
					(pts
						(xy 10.16 -15.24) (xy 5.08 -15.24)
					)
					(stroke
						(width 0.127)
						(type default)
					)
					(fill
						(type none)
					)
				)
				(polyline
					(pts
						(xy 10.16 -15.24) (xy 8.89 -16.0867)
					)
					(stroke
						(width 0.127)
						(type default)
					)
					(fill
						(type none)
					)
				)
				(polyline
					(pts
						(xy 10.16 -15.24) (xy 8.89 -14.3933)
					)
					(stroke
						(width 0.127)
						(type default)
					)
					(fill
						(type none)
					)
				)
				(polyline
					(pts
						(xy 10.16 -12.7) (xy 5.08 -12.7)
					)
					(stroke
						(width 0.127)
						(type default)
					)
					(fill
						(type none)
					)
				)
				(polyline
					(pts
						(xy 10.16 -12.7) (xy 8.89 -13.5467)
					)
					(stroke
						(width 0.127)
						(type default)
					)
					(fill
						(type none)
					)
				)
				(polyline
					(pts
						(xy 10.16 -12.7) (xy 8.89 -11.8533)
					)
					(stroke
						(width 0.127)
						(type default)
					)
					(fill
						(type none)
					)
				)
				(polyline
					(pts
						(xy 10.16 -10.16) (xy 5.08 -10.16)
					)
					(stroke
						(width 0.127)
						(type default)
					)
					(fill
						(type none)
					)
				)
				(polyline
					(pts
						(xy 10.16 -10.16) (xy 8.89 -11.0067)
					)
					(stroke
						(width 0.127)
						(type default)
					)
					(fill
						(type none)
					)
				)
				(polyline
					(pts
						(xy 10.16 -10.16) (xy 8.89 -9.3133)
					)
					(stroke
						(width 0.127)
						(type default)
					)
					(fill
						(type none)
					)
				)
				(polyline
					(pts
						(xy 10.16 -7.62) (xy 5.08 -7.62)
					)
					(stroke
						(width 0.127)
						(type default)
					)
					(fill
						(type none)
					)
				)
				(polyline
					(pts
						(xy 10.16 -7.62) (xy 8.89 -8.4667)
					)
					(stroke
						(width 0.127)
						(type default)
					)
					(fill
						(type none)
					)
				)
				(polyline
					(pts
						(xy 10.16 -7.62) (xy 8.89 -6.7733)
					)
					(stroke
						(width 0.127)
						(type default)
					)
					(fill
						(type none)
					)
				)
				(polyline
					(pts
						(xy 10.16 -5.08) (xy 5.08 -5.08)
					)
					(stroke
						(width 0.127)
						(type default)
					)
					(fill
						(type none)
					)
				)
				(polyline
					(pts
						(xy 10.16 -5.08) (xy 8.89 -5.9267)
					)
					(stroke
						(width 0.127)
						(type default)
					)
					(fill
						(type none)
					)
				)
				(polyline
					(pts
						(xy 10.16 -5.08) (xy 8.89 -4.2333)
					)
					(stroke
						(width 0.127)
						(type default)
					)
					(fill
						(type none)
					)
				)
				(polyline
					(pts
						(xy 10.16 -2.54) (xy 5.08 -2.54)
					)
					(stroke
						(width 0.127)
						(type default)
					)
					(fill
						(type none)
					)
				)
				(polyline
					(pts
						(xy 10.16 -2.54) (xy 8.89 -3.3867)
					)
					(stroke
						(width 0.127)
						(type default)
					)
					(fill
						(type none)
					)
				)
				(polyline
					(pts
						(xy 10.16 -2.54) (xy 8.89 -1.6933)
					)
					(stroke
						(width 0.127)
						(type default)
					)
					(fill
						(type none)
					)
				)
				(polyline
					(pts
						(xy 10.16 0) (xy 5.08 0)
					)
					(stroke
						(width 0.127)
						(type default)
					)
					(fill
						(type none)
					)
				)
				(polyline
					(pts
						(xy 10.16 0) (xy 8.89 -0.8467)
					)
					(stroke
						(width 0.127)
						(type default)
					)
					(fill
						(type none)
					)
				)
				(polyline
					(pts
						(xy 10.16 0) (xy 8.89 0.8467)
					)
					(stroke
						(width 0.127)
						(type default)
					)
					(fill
						(type none)
					)
				)
				(polyline
					(pts
						(xy 12.7 -20.32) (xy 12.7 2.54)
					)
					(stroke
						(width 0.127)
						(type default)
					)
					(fill
						(type none)
					)
				)
				(polyline
					(pts
						(xy 12.7 2.54) (xy 5.08 2.54)
					)
					(stroke
						(width 0.127)
						(type default)
					)
					(fill
						(type none)
					)
				)
				(pin unspecified line
					(at 0 0 0)
					(length 5.08)
					(name "1"
						(effects
							(font
								(size 1.27 1.27)
							)
						)
					)
					(number "1"
						(effects
							(font
								(size 1.27 1.27)
							)
						)
					)
				)
				(pin unspecified line
					(at 0 -2.54 0)
					(length 5.08)
					(name "2"
						(effects
							(font
								(size 1.27 1.27)
							)
						)
					)
					(number "2"
						(effects
							(font
								(size 1.27 1.27)
							)
						)
					)
				)
				(pin unspecified line
					(at 0 -5.08 0)
					(length 5.08)
					(name "3"
						(effects
							(font
								(size 1.27 1.27)
							)
						)
					)
					(number "3"
						(effects
							(font
								(size 1.27 1.27)
							)
						)
					)
				)
				(pin unspecified line
					(at 0 -7.62 0)
					(length 5.08)
					(name "4"
						(effects
							(font
								(size 1.27 1.27)
							)
						)
					)
					(number "4"
						(effects
							(font
								(size 1.27 1.27)
							)
						)
					)
				)
				(pin unspecified line
					(at 0 -10.16 0)
					(length 5.08)
					(name "5"
						(effects
							(font
								(size 1.27 1.27)
							)
						)
					)
					(number "5"
						(effects
							(font
								(size 1.27 1.27)
							)
						)
					)
				)
				(pin unspecified line
					(at 0 -12.7 0)
					(length 5.08)
					(name "6"
						(effects
							(font
								(size 1.27 1.27)
							)
						)
					)
					(number "6"
						(effects
							(font
								(size 1.27 1.27)
							)
						)
					)
				)
				(pin unspecified line
					(at 0 -15.24 0)
					(length 5.08)
					(name "7"
						(effects
							(font
								(size 1.27 1.27)
							)
						)
					)
					(number "7"
						(effects
							(font
								(size 1.27 1.27)
							)
						)
					)
				)
				(pin unspecified line
					(at 0 -17.78 0)
					(length 5.08)
					(name "8"
						(effects
							(font
								(size 1.27 1.27)
							)
						)
					)
					(number "8"
						(effects
							(font
								(size 1.27 1.27)
							)
						)
					)
				)
			)
			(symbol "MicroLockPlus-6P_1_2"
				(polyline
					(pts
						(xy 5.08 -20.32) (xy 12.7 -20.32)
					)
					(stroke
						(width 0.127)
						(type default)
					)
					(fill
						(type none)
					)
				)
				(polyline
					(pts
						(xy 5.08 2.54) (xy 5.08 -20.32)
					)
					(stroke
						(width 0.127)
						(type default)
					)
					(fill
						(type none)
					)
				)
				(polyline
					(pts
						(xy 7.62 -17.78) (xy 5.08 -17.78)
					)
					(stroke
						(width 0.127)
						(type default)
					)
					(fill
						(type none)
					)
				)
				(polyline
					(pts
						(xy 7.62 -17.78) (xy 8.89 -18.6267)
					)
					(stroke
						(width 0.127)
						(type default)
					)
					(fill
						(type none)
					)
				)
				(polyline
					(pts
						(xy 7.62 -17.78) (xy 8.89 -16.9333)
					)
					(stroke
						(width 0.127)
						(type default)
					)
					(fill
						(type none)
					)
				)
				(polyline
					(pts
						(xy 7.62 -15.24) (xy 5.08 -15.24)
					)
					(stroke
						(width 0.127)
						(type default)
					)
					(fill
						(type none)
					)
				)
				(polyline
					(pts
						(xy 7.62 -15.24) (xy 8.89 -16.0867)
					)
					(stroke
						(width 0.127)
						(type default)
					)
					(fill
						(type none)
					)
				)
				(polyline
					(pts
						(xy 7.62 -15.24) (xy 8.89 -14.3933)
					)
					(stroke
						(width 0.127)
						(type default)
					)
					(fill
						(type none)
					)
				)
				(polyline
					(pts
						(xy 7.62 -12.7) (xy 5.08 -12.7)
					)
					(stroke
						(width 0.127)
						(type default)
					)
					(fill
						(type none)
					)
				)
				(polyline
					(pts
						(xy 7.62 -12.7) (xy 8.89 -13.5467)
					)
					(stroke
						(width 0.127)
						(type default)
					)
					(fill
						(type none)
					)
				)
				(polyline
					(pts
						(xy 7.62 -12.7) (xy 8.89 -11.8533)
					)
					(stroke
						(width 0.127)
						(type default)
					)
					(fill
						(type none)
					)
				)
				(polyline
					(pts
						(xy 7.62 -10.16) (xy 5.08 -10.16)
					)
					(stroke
						(width 0.127)
						(type default)
					)
					(fill
						(type none)
					)
				)
				(polyline
					(pts
						(xy 7.62 -10.16) (xy 8.89 -11.0067)
					)
					(stroke
						(width 0.127)
						(type default)
					)
					(fill
						(type none)
					)
				)
				(polyline
					(pts
						(xy 7.62 -10.16) (xy 8.89 -9.3133)
					)
					(stroke
						(width 0.127)
						(type default)
					)
					(fill
						(type none)
					)
				)
				(polyline
					(pts
						(xy 7.62 -7.62) (xy 5.08 -7.62)
					)
					(stroke
						(width 0.127)
						(type default)
					)
					(fill
						(type none)
					)
				)
				(polyline
					(pts
						(xy 7.62 -7.62) (xy 8.89 -8.4667)
					)
					(stroke
						(width 0.127)
						(type default)
					)
					(fill
						(type none)
					)
				)
				(polyline
					(pts
						(xy 7.62 -7.62) (xy 8.89 -6.7733)
					)
					(stroke
						(width 0.127)
						(type default)
					)
					(fill
						(type none)
					)
				)
				(polyline
					(pts
						(xy 7.62 -5.08) (xy 5.08 -5.08)
					)
					(stroke
						(width 0.127)
						(type default)
					)
					(fill
						(type none)
					)
				)
				(polyline
					(pts
						(xy 7.62 -5.08) (xy 8.89 -5.9267)
					)
					(stroke
						(width 0.127)
						(type default)
					)
					(fill
						(type none)
					)
				)
				(polyline
					(pts
						(xy 7.62 -5.08) (xy 8.89 -4.2333)
					)
					(stroke
						(width 0.127)
						(type default)
					)
					(fill
						(type none)
					)
				)
				(polyline
					(pts
						(xy 7.62 -2.54) (xy 5.08 -2.54)
					)
					(stroke
						(width 0.127)
						(type default)
					)
					(fill
						(type none)
					)
				)
				(polyline
					(pts
						(xy 7.62 -2.54) (xy 8.89 -3.3867)
					)
					(stroke
						(width 0.127)
						(type default)
					)
					(fill
						(type none)
					)
				)
				(polyline
					(pts
						(xy 7.62 -2.54) (xy 8.89 -1.6933)
					)
					(stroke
						(width 0.127)
						(type default)
					)
					(fill
						(type none)
					)
				)
				(polyline
					(pts
						(xy 7.62 0) (xy 5.08 0)
					)
					(stroke
						(width 0.127)
						(type default)
					)
					(fill
						(type none)
					)
				)
				(polyline
					(pts
						(xy 7.62 0) (xy 8.89 -0.8467)
					)
					(stroke
						(width 0.127)
						(type default)
					)
					(fill
						(type none)
					)
				)
				(polyline
					(pts
						(xy 7.62 0) (xy 8.89 0.8467)
					)
					(stroke
						(width 0.127)
						(type default)
					)
					(fill
						(type none)
					)
				)
				(polyline
					(pts
						(xy 12.7 -20.32) (xy 12.7 2.54)
					)
					(stroke
						(width 0.127)
						(type default)
					)
					(fill
						(type none)
					)
				)
				(polyline
					(pts
						(xy 12.7 2.54) (xy 5.08 2.54)
					)
					(stroke
						(width 0.127)
						(type default)
					)
					(fill
						(type none)
					)
				)
				(pin unspecified line
					(at 0 0 0)
					(length 5.08)
					(name "1"
						(effects
							(font
								(size 1.27 1.27)
							)
						)
					)
					(number "1"
						(effects
							(font
								(size 1.27 1.27)
							)
						)
					)
				)
				(pin unspecified line
					(at 0 -2.54 0)
					(length 5.08)
					(name "2"
						(effects
							(font
								(size 1.27 1.27)
							)
						)
					)
					(number "2"
						(effects
							(font
								(size 1.27 1.27)
							)
						)
					)
				)
				(pin unspecified line
					(at 0 -5.08 0)
					(length 5.08)
					(name "3"
						(effects
							(font
								(size 1.27 1.27)
							)
						)
					)
					(number "3"
						(effects
							(font
								(size 1.27 1.27)
							)
						)
					)
				)
				(pin unspecified line
					(at 0 -7.62 0)
					(length 5.08)
					(name "4"
						(effects
							(font
								(size 1.27 1.27)
							)
						)
					)
					(number "4"
						(effects
							(font
								(size 1.27 1.27)
							)
						)
					)
				)
				(pin unspecified line
					(at 0 -10.16 0)
					(length 5.08)
					(name "5"
						(effects
							(font
								(size 1.27 1.27)
							)
						)
					)
					(number "5"
						(effects
							(font
								(size 1.27 1.27)
							)
						)
					)
				)
				(pin unspecified line
					(at 0 -12.7 0)
					(length 5.08)
					(name "6"
						(effects
							(font
								(size 1.27 1.27)
							)
						)
					)
					(number "6"
						(effects
							(font
								(size 1.27 1.27)
							)
						)
					)
				)
				(pin unspecified line
					(at 0 -15.24 0)
					(length 5.08)
					(name "7"
						(effects
							(font
								(size 1.27 1.27)
							)
						)
					)
					(number "7"
						(effects
							(font
								(size 1.27 1.27)
							)
						)
					)
				)
				(pin unspecified line
					(at 0 -17.78 0)
					(length 5.08)
					(name "8"
						(effects
							(font
								(size 1.27 1.27)
							)
						)
					)
					(number "8"
						(effects
							(font
								(size 1.27 1.27)
							)
						)
					)
				)
			)
		)
		(symbol "SU-PCB-IC:RU1J002YNTCL"
			(pin_names
				(offset 0.254)
			)
			(exclude_from_sim no)
			(in_bom yes)
			(on_board yes)
			(property "Reference" "R"
				(at 11.43 1.905 0)
				(effects
					(font
						(size 1.524 1.524)
					)
				)
			)
			(property "Value" "RU1J002YNTCL"
				(at 11.43 -2.54 0)
				(effects
					(font
						(size 1.524 1.524)
					)
				)
			)
			(property "Footprint" "SU-PCB-IC:RU1J002YNTCL"
				(at 0 0 0)
				(effects
					(font
						(size 1.27 1.27)
						(italic yes)
					)
					(hide yes)
				)
			)
			(property "Datasheet" "RU1J002YNTCL"
				(at 0 0 0)
				(effects
					(font
						(size 1.27 1.27)
						(italic yes)
					)
					(hide yes)
				)
			)
			(property "Description" ""
				(at 0 0 0)
				(effects
					(font
						(size 1.27 1.27)
					)
					(hide yes)
				)
			)
			(property "MPN" "RU1J002YNTCL"
				(at 0 0 0)
				(effects
					(font
						(size 1.27 1.27)
					)
					(hide yes)
				)
			)
			(property "ki_keywords" "RU1J002YNTCL"
				(at 0 0 0)
				(effects
					(font
						(size 1.27 1.27)
					)
					(hide yes)
				)
			)
			(property "ki_fp_filters" "TRANS_RU1C001_ROM TRANS_RU1C001_ROM-M TRANS_RU1C001_ROM-L"
				(at 0 0 0)
				(effects
					(font
						(size 1.27 1.27)
					)
					(hide yes)
				)
			)
			(symbol "RU1J002YNTCL_0_1"
				(polyline
					(pts
						(xy 2.54 0) (xy 4.445 0)
					)
					(stroke
						(width 0.2032)
						(type default)
					)
					(fill
						(type none)
					)
				)
				(polyline
					(pts
						(xy 4.445 -2.54) (xy 4.445 2.54)
					)
					(stroke
						(width 0.2032)
						(type default)
					)
					(fill
						(type none)
					)
				)
				(polyline
					(pts
						(xy 5.08 -2.54) (xy 5.08 -1.27)
					)
					(stroke
						(width 0.2032)
						(type default)
					)
					(fill
						(type none)
					)
				)
				(polyline
					(pts
						(xy 5.08 -1.905) (xy 6.985 -1.905)
					)
					(stroke
						(width 0.2032)
						(type default)
					)
					(fill
						(type none)
					)
				)
				(polyline
					(pts
						(xy 5.08 -0.635) (xy 5.08 0.635)
					)
					(stroke
						(width 0.2032)
						(type default)
					)
					(fill
						(type none)
					)
				)
				(polyline
					(pts
						(xy 5.08 1.27) (xy 5.08 2.54)
					)
					(stroke
						(width 0.2032)
						(type default)
					)
					(fill
						(type none)
					)
				)
				(polyline
					(pts
						(xy 5.08 1.905) (xy 6.985 1.905)
					)
					(stroke
						(width 0.2032)
						(type default)
					)
					(fill
						(type none)
					)
				)
				(polyline
					(pts
						(xy 6.35 0) (xy 6.985 0)
					)
					(stroke
						(width 0.2032)
						(type default)
					)
					(fill
						(type none)
					)
				)
				(polyline
					(pts
						(xy 6.985 -2.54) (xy 6.985 0)
					)
					(stroke
						(width 0.2032)
						(type default)
					)
					(fill
						(type none)
					)
				)
				(polyline
					(pts
						(xy 6.985 -2.54) (xy 8.255 -2.54)
					)
					(stroke
						(width 0.2032)
						(type default)
					)
					(fill
						(type none)
					)
				)
				(polyline
					(pts
						(xy 6.985 1.905) (xy 6.985 2.54)
					)
					(stroke
						(width 0.2032)
						(type default)
					)
					(fill
						(type none)
					)
				)
				(polyline
					(pts
						(xy 6.985 2.54) (xy 8.255 2.54)
					)
					(stroke
						(width 0.2032)
						(type default)
					)
					(fill
						(type none)
					)
				)
				(polyline
					(pts
						(xy 8.255 -2.54) (xy 8.255 -0.635)
					)
					(stroke
						(width 0.2032)
						(type default)
					)
					(fill
						(type none)
					)
				)
				(polyline
					(pts
						(xy 8.255 0.635) (xy 8.255 2.54)
					)
					(stroke
						(width 0.2032)
						(type default)
					)
					(fill
						(type none)
					)
				)
				(polyline
					(pts
						(xy 8.89 0.635) (xy 7.62 0.635)
					)
					(stroke
						(width 0.2032)
						(type default)
					)
					(fill
						(type none)
					)
				)
				(polyline
					(pts
						(xy 6.35 0.635) (xy 5.08 0) (xy 6.35 -0.635)
					)
					(stroke
						(width 0)
						(type default)
					)
					(fill
						(type outline)
					)
				)
				(polyline
					(pts
						(xy 8.89 -0.635) (xy 7.62 -0.635) (xy 8.255 0.635)
					)
					(stroke
						(width 0)
						(type default)
					)
					(fill
						(type outline)
					)
				)
				(circle
					(center 6.35 0)
					(radius 3.81)
					(stroke
						(width 0.254)
						(type default)
					)
					(fill
						(type none)
					)
				)
				(circle
					(center 6.985 -1.27)
					(radius 0.0254)
					(stroke
						(width 0.508)
						(type default)
					)
					(fill
						(type none)
					)
				)
				(circle
					(center 7.62 -2.54)
					(radius 0.0254)
					(stroke
						(width 0.508)
						(type default)
					)
					(fill
						(type none)
					)
				)
				(circle
					(center 7.62 2.54)
					(radius 0.0254)
					(stroke
						(width 0.508)
						(type default)
					)
					(fill
						(type none)
					)
				)
				(pin unspecified line
					(at 0 0 0)
					(length 2.54)
					(name "G"
						(effects
							(font
								(size 1.27 1.27)
							)
						)
					)
					(number "1"
						(effects
							(font
								(size 1.27 1.27)
							)
						)
					)
				)
				(pin unspecified line
					(at 7.62 -5.08 90)
					(length 2.54)
					(name "S"
						(effects
							(font
								(size 1.27 1.27)
							)
						)
					)
					(number "2"
						(effects
							(font
								(size 1.27 1.27)
							)
						)
					)
				)
				(pin unspecified line
					(at 7.62 5.08 270)
					(length 2.54)
					(name "D"
						(effects
							(font
								(size 1.27 1.27)
							)
						)
					)
					(number "3"
						(effects
							(font
								(size 1.27 1.27)
							)
						)
					)
				)
			)
		)
		(symbol "power:GND"
			(power)
			(pin_numbers hide)
			(pin_names
				(offset 0) hide)
			(exclude_from_sim no)
			(in_bom yes)
			(on_board yes)
			(property "Reference" "#PWR"
				(at 0 -6.35 0)
				(effects
					(font
						(size 1.27 1.27)
					)
					(hide yes)
				)
			)
			(property "Value" "GND"
				(at 0 -3.81 0)
				(effects
					(font
						(size 1.27 1.27)
					)
				)
			)
			(property "Footprint" ""
				(at 0 0 0)
				(effects
					(font
						(size 1.27 1.27)
					)
					(hide yes)
				)
			)
			(property "Datasheet" ""
				(at 0 0 0)
				(effects
					(font
						(size 1.27 1.27)
					)
					(hide yes)
				)
			)
			(property "Description" "Power symbol creates a global label with name \"GND\" , ground"
				(at 0 0 0)
				(effects
					(font
						(size 1.27 1.27)
					)
					(hide yes)
				)
			)
			(property "ki_keywords" "global power"
				(at 0 0 0)
				(effects
					(font
						(size 1.27 1.27)
					)
					(hide yes)
				)
			)
			(symbol "GND_0_1"
				(polyline
					(pts
						(xy 0 0) (xy 0 -1.27) (xy 1.27 -1.27) (xy 0 -2.54) (xy -1.27 -1.27) (xy 0 -1.27)
					)
					(stroke
						(width 0)
						(type default)
					)
					(fill
						(type none)
					)
				)
			)
			(symbol "GND_1_1"
				(pin power_in line
					(at 0 0 270)
					(length 0)
					(name "~"
						(effects
							(font
								(size 1.27 1.27)
							)
						)
					)
					(number "1"
						(effects
							(font
								(size 1.27 1.27)
							)
						)
					)
				)
			)
		)
	)
	(junction
		(at 76.2 69.85)
		(diameter 0)
		(color 0 0 0 0)
		(uuid "3bda43b6-96ea-424e-b6dc-a23d1ec7bcc8")
	)
	(junction
		(at 76.2 105.41)
		(diameter 0)
		(color 0 0 0 0)
		(uuid "70cbfd53-2eed-475d-845a-ce1f750a7e55")
	)
	(junction
		(at 140.97 69.85)
		(diameter 0)
		(color 0 0 0 0)
		(uuid "8080abbe-8b21-4d67-ba0c-e161695a5b27")
	)
	(junction
		(at 140.97 105.41)
		(diameter 0)
		(color 0 0 0 0)
		(uuid "e6e1c96a-cc3b-43f1-ba72-7c06f6a121a3")
	)
	(no_connect
		(at 247.65 92.71)
		(uuid "0cf92f76-f9fb-4a77-98c7-6130db4f0094")
	)
	(no_connect
		(at 242.57 63.5)
		(uuid "18de622b-41db-4d43-8fae-4799fc504a44")
	)
	(no_connect
		(at 265.43 39.37)
		(uuid "277062db-343f-4fdd-83d5-dba5ee8a13f7")
	)
	(no_connect
		(at 265.43 60.96)
		(uuid "2f7595b0-3d8c-4dc8-abd0-9b1c319d9a10")
	)
	(no_connect
		(at 242.57 68.58)
		(uuid "4398cfb6-3f58-4369-9668-19f068b2b134")
	)
	(no_connect
		(at 222.25 76.2)
		(uuid "4aa99036-43a0-48c9-9a35-a02982f45daf")
	)
	(no_connect
		(at 222.25 100.33)
		(uuid "4b3b54ab-cd0d-485a-917e-0b00f48db2d5")
	)
	(no_connect
		(at 247.65 80.01)
		(uuid "4e97f345-1240-4f90-8130-6feff65df9e1")
	)
	(no_connect
		(at 247.65 82.55)
		(uuid "4fe07386-bdbe-4e89-9da4-ab5cee2023ae")
	)
	(no_connect
		(at 222.25 78.74)
		(uuid "51e477ff-8c40-4672-b1af-557bec4c916d")
	)
	(no_connect
		(at 247.65 85.09)
		(uuid "678de756-b2fb-4510-8709-5e6198c7a63d")
	)
	(no_connect
		(at 242.57 39.37)
		(uuid "691b87f7-6a46-4bf0-9ffa-f698411c16a3")
	)
	(no_connect
		(at 247.65 77.47)
		(uuid "6b2090e2-7793-4acd-8917-f8132924f1b1")
	)
	(no_connect
		(at 242.57 60.96)
		(uuid "7db7561d-2a7b-4313-8623-241dfac5ebe6")
	)
	(no_connect
		(at 242.57 44.45)
		(uuid "7ddf190b-a62b-46a2-96b1-99dee1787a0e")
	)
	(no_connect
		(at 222.25 97.79)
		(uuid "7fd23cd9-2138-4dfb-ba21-4a1eef45ab26")
	)
	(no_connect
		(at 247.65 87.63)
		(uuid "8e07b592-e2c6-4b33-a0cc-81c4f8f2e964")
	)
	(no_connect
		(at 265.43 63.5)
		(uuid "9bde06a4-730a-4989-8449-96ae7c3e0198")
	)
	(no_connect
		(at 247.65 90.17)
		(uuid "9e425f73-d26a-4c71-921e-cd9926a0a96c")
	)
	(no_connect
		(at 242.57 41.91)
		(uuid "ae4a8cf8-45ed-4b78-a0ff-6fe16e96077d")
	)
	(no_connect
		(at 242.57 66.04)
		(uuid "b2d9e8af-0e53-4da6-bcce-337c00982966")
	)
	(no_connect
		(at 265.43 36.83)
		(uuid "ba1867a6-2ac7-4ed0-b6df-a3892f4e22f3")
	)
	(no_connect
		(at 247.65 95.25)
		(uuid "d3684678-6e68-49ef-ab0b-503d9b5e8b69")
	)
	(no_connect
		(at 242.57 36.83)
		(uuid "ffc96249-374b-4880-95a5-bae018aeb170")
	)
	(wire
		(pts
			(xy 140.97 105.41) (xy 140.97 106.68)
		)
		(stroke
			(width 0)
			(type default)
		)
		(uuid "03826b50-778a-4764-9b2a-6cb8ecc23495")
	)
	(wire
		(pts
			(xy 151.13 58.42) (xy 151.13 64.77)
		)
		(stroke
			(width 0)
			(type default)
		)
		(uuid "10e8881d-9a03-44c9-bd53-9e7f2c4468f3")
	)
	(wire
		(pts
			(xy 76.2 114.3) (xy 76.2 115.57)
		)
		(stroke
			(width 0)
			(type default)
		)
		(uuid "1486271b-27f0-433b-b797-0603986382ca")
	)
	(wire
		(pts
			(xy 140.97 114.3) (xy 140.97 115.57)
		)
		(stroke
			(width 0)
			(type default)
		)
		(uuid "14ab7ad0-b200-464e-bf20-3b56c733c2bb")
	)
	(wire
		(pts
			(xy 140.97 69.85) (xy 143.51 69.85)
		)
		(stroke
			(width 0)
			(type default)
		)
		(uuid "3a743c8d-0287-4d2c-81fb-8a1f8ab8a3cc")
	)
	(wire
		(pts
			(xy 151.13 113.03) (xy 151.13 110.49)
		)
		(stroke
			(width 0)
			(type default)
		)
		(uuid "4efa974e-15b6-4655-b112-195b7ac046af")
	)
	(wire
		(pts
			(xy 87.63 58.42) (xy 86.36 58.42)
		)
		(stroke
			(width 0)
			(type default)
		)
		(uuid "4fcd2497-f8c9-4d92-9a0a-8761d420a25e")
	)
	(wire
		(pts
			(xy 152.4 58.42) (xy 151.13 58.42)
		)
		(stroke
			(width 0)
			(type default)
		)
		(uuid "56fcd504-2557-47cf-be7d-8f21abab9adc")
	)
	(wire
		(pts
			(xy 151.13 95.25) (xy 151.13 100.33)
		)
		(stroke
			(width 0)
			(type default)
		)
		(uuid "72adb5a5-5842-4c81-8336-89eeb5d2c5f9")
	)
	(wire
		(pts
			(xy 86.36 95.25) (xy 86.36 100.33)
		)
		(stroke
			(width 0)
			(type default)
		)
		(uuid "7ca14beb-51e2-490a-ac05-37f25d77f1de")
	)
	(wire
		(pts
			(xy 86.36 113.03) (xy 86.36 110.49)
		)
		(stroke
			(width 0)
			(type default)
		)
		(uuid "80349e22-acf7-461f-aed0-81095ae12eda")
	)
	(wire
		(pts
			(xy 140.97 105.41) (xy 143.51 105.41)
		)
		(stroke
			(width 0)
			(type default)
		)
		(uuid "888a330f-eee9-4cb0-af5b-3550c88cfb88")
	)
	(wire
		(pts
			(xy 76.2 69.85) (xy 78.74 69.85)
		)
		(stroke
			(width 0)
			(type default)
		)
		(uuid "90f429d0-6b92-4031-a78b-da7539d5f2da")
	)
	(wire
		(pts
			(xy 138.43 105.41) (xy 140.97 105.41)
		)
		(stroke
			(width 0)
			(type default)
		)
		(uuid "9378c69d-7006-4a09-bf09-80926c372844")
	)
	(wire
		(pts
			(xy 86.36 77.47) (xy 86.36 74.93)
		)
		(stroke
			(width 0)
			(type default)
		)
		(uuid "9506cce5-b43e-4629-8a08-85918432d7f2")
	)
	(wire
		(pts
			(xy 140.97 78.74) (xy 140.97 80.01)
		)
		(stroke
			(width 0)
			(type default)
		)
		(uuid "9bf03296-06a9-485b-bb8e-a67c6c283217")
	)
	(wire
		(pts
			(xy 73.66 105.41) (xy 76.2 105.41)
		)
		(stroke
			(width 0)
			(type default)
		)
		(uuid "a54f640b-1b7e-4dae-841c-5dea355215ba")
	)
	(wire
		(pts
			(xy 76.2 105.41) (xy 78.74 105.41)
		)
		(stroke
			(width 0)
			(type default)
		)
		(uuid "a9ade5bb-c1fa-4fb9-84f4-cda32d107ddb")
	)
	(wire
		(pts
			(xy 151.13 77.47) (xy 151.13 74.93)
		)
		(stroke
			(width 0)
			(type default)
		)
		(uuid "aa598f5f-2d3d-4e2d-8ddb-01ff46c16df9")
	)
	(wire
		(pts
			(xy 87.63 95.25) (xy 86.36 95.25)
		)
		(stroke
			(width 0)
			(type default)
		)
		(uuid "c4aba950-e66f-4e70-afb5-9445943317b1")
	)
	(wire
		(pts
			(xy 73.66 69.85) (xy 76.2 69.85)
		)
		(stroke
			(width 0)
			(type default)
		)
		(uuid "d0df2c8b-3493-48e9-8637-9b79e1f484d3")
	)
	(wire
		(pts
			(xy 140.97 69.85) (xy 140.97 71.12)
		)
		(stroke
			(width 0)
			(type default)
		)
		(uuid "e10957d5-6410-405f-9b58-3e9fb9a20b5c")
	)
	(wire
		(pts
			(xy 86.36 58.42) (xy 86.36 64.77)
		)
		(stroke
			(width 0)
			(type default)
		)
		(uuid "e3ae05f5-22e0-4c1d-81dd-9d7bb080e522")
	)
	(wire
		(pts
			(xy 76.2 78.74) (xy 76.2 80.01)
		)
		(stroke
			(width 0)
			(type default)
		)
		(uuid "eba932d9-c69c-49ac-88c5-d66eb3ecb761")
	)
	(wire
		(pts
			(xy 152.4 95.25) (xy 151.13 95.25)
		)
		(stroke
			(width 0)
			(type default)
		)
		(uuid "ec771fe5-9713-4546-baa6-ab80657fcfc9")
	)
	(wire
		(pts
			(xy 76.2 69.85) (xy 76.2 71.12)
		)
		(stroke
			(width 0)
			(type default)
		)
		(uuid "ef95db32-ea51-48b3-8065-aaa0d40d8a15")
	)
	(wire
		(pts
			(xy 138.43 69.85) (xy 140.97 69.85)
		)
		(stroke
			(width 0)
			(type default)
		)
		(uuid "f6257bb8-cff9-4281-a8fb-09aa0dc71f65")
	)
	(wire
		(pts
			(xy 76.2 105.41) (xy 76.2 106.68)
		)
		(stroke
			(width 0)
			(type default)
		)
		(uuid "fe528169-ee58-450e-bb52-87157aac0bd4")
	)
	(text "TODO: REPLACE HEATER CIRCUIT, ADD THERMISTORS READINGS OP-AMP BRIDGES\nVERIFY ON BREAKOUT FIRST"
		(exclude_from_sim no)
		(at 151.13 137.414 0)
		(effects
			(font
				(size 4 4)
				(thickness 1.2)
				(bold yes)
				(italic yes)
			)
		)
		(uuid "efe8e753-92e4-4dc6-9eef-91d4732f9518")
	)
	(hierarchical_label "HEATER_CHIPS"
		(shape input)
		(at 199.39 81.28 180)
		(fields_autoplaced yes)
		(effects
			(font
				(size 1.27 1.27)
			)
			(justify right)
		)
		(uuid "3c36b7a6-fcae-4e70-ae3b-11864b31c794")
	)
	(hierarchical_label "HEATERS_VCC"
		(shape input)
		(at 199.39 83.82 180)
		(fields_autoplaced yes)
		(effects
			(font
				(size 1.27 1.27)
			)
			(justify right)
		)
		(uuid "462ded81-b7c4-4fa2-a58a-5bbcd63f0a83")
	)
	(hierarchical_label "HEATER_CHIPS"
		(shape input)
		(at 152.4 58.42 0)
		(fields_autoplaced yes)
		(effects
			(font
				(size 1.27 1.27)
			)
			(justify left)
		)
		(uuid "5157daee-8e6e-4239-a2ee-52c1ed7f37c7")
	)
	(hierarchical_label "HEATERS_VCC"
		(shape input)
		(at 199.39 76.2 180)
		(fields_autoplaced yes)
		(effects
			(font
				(size 1.27 1.27)
			)
			(justify right)
		)
		(uuid "56d0a0bd-c010-4fb2-957d-522fd0705de5")
	)
	(hierarchical_label "HEATER1_PWM_CTRL_SIG"
		(shape input)
		(at 73.66 69.85 180)
		(fields_autoplaced yes)
		(effects
			(font
				(size 1.27 1.27)
			)
			(justify right)
		)
		(uuid "61685652-8948-4d18-95cd-1ea7cbf1c127")
	)
	(hierarchical_label "HEATERS_VCC"
		(shape input)
		(at 199.39 105.41 180)
		(fields_autoplaced yes)
		(effects
			(font
				(size 1.27 1.27)
			)
			(justify right)
		)
		(uuid "99f05ea3-5cd4-4fab-a461-8d9a069fa409")
	)
	(hierarchical_label "HEATER2_PWM_CTRL_SIG"
		(shape input)
		(at 138.43 69.85 180)
		(fields_autoplaced yes)
		(effects
			(font
				(size 1.27 1.27)
			)
			(justify right)
		)
		(uuid "af9b9d1a-93b5-4c70-9c65-78568b644fc8")
	)
	(hierarchical_label "HEATERS_PFVHM"
		(shape input)
		(at 199.39 102.87 180)
		(fields_autoplaced yes)
		(effects
			(font
				(size 1.27 1.27)
			)
			(justify right)
		)
		(uuid "b1887124-d4e9-4560-9b7a-e6c1b9d8f853")
	)
	(hierarchical_label "HEATERS_VCC"
		(shape input)
		(at 199.39 97.79 180)
		(fields_autoplaced yes)
		(effects
			(font
				(size 1.27 1.27)
			)
			(justify right)
		)
		(uuid "ba752564-191e-41d6-9b65-8a768ecadeb5")
	)
	(hierarchical_label "HEATER_BAGS"
		(shape input)
		(at 199.39 78.74 180)
		(fields_autoplaced yes)
		(effects
			(font
				(size 1.27 1.27)
			)
			(justify right)
		)
		(uuid "bb8c1f07-dff4-430c-8258-569547d4879f")
	)
	(hierarchical_label "HEATER_PUMP"
		(shape input)
		(at 87.63 95.25 0)
		(fields_autoplaced yes)
		(effects
			(font
				(size 1.27 1.27)
			)
			(justify left)
		)
		(uuid "c08880b9-d6cb-460c-8a98-156a9425994c")
	)
	(hierarchical_label "HEATER4_PWM_CTRL_SIG"
		(shape input)
		(at 138.43 105.41 180)
		(fields_autoplaced yes)
		(effects
			(font
				(size 1.27 1.27)
			)
			(justify right)
		)
		(uuid "cb5450a3-4aaa-449e-a2b5-89bd4d5fd2dd")
	)
	(hierarchical_label "HEATER_PUMP"
		(shape input)
		(at 199.39 100.33 180)
		(fields_autoplaced yes)
		(effects
			(font
				(size 1.27 1.27)
			)
			(justify right)
		)
		(uuid "cdc7aa66-ae41-41cf-bff7-bc24e82a1b22")
	)
	(hierarchical_label "HEATERS_PFVHM"
		(shape input)
		(at 152.4 95.25 0)
		(fields_autoplaced yes)
		(effects
			(font
				(size 1.27 1.27)
			)
			(justify left)
		)
		(uuid "e5588901-4a1a-4875-9aa7-601ab24da4d7")
	)
	(hierarchical_label "HEATER3_PWM_CTRL_SIG"
		(shape input)
		(at 73.66 105.41 180)
		(fields_autoplaced yes)
		(effects
			(font
				(size 1.27 1.27)
			)
			(justify right)
		)
		(uuid "f36db5ef-2852-490d-9b60-cf0b58bd8aed")
	)
	(hierarchical_label "HEATER_BAGS"
		(shape input)
		(at 87.63 58.42 0)
		(fields_autoplaced yes)
		(effects
			(font
				(size 1.27 1.27)
			)
			(justify left)
		)
		(uuid "ff260c8b-1b64-4430-8611-98156badbd2a")
	)
	(symbol
		(lib_id "SU-PCB-IC:RU1J002YNTCL")
		(at 143.51 105.41 0)
		(unit 1)
		(exclude_from_sim no)
		(in_bom yes)
		(on_board yes)
		(dnp no)
		(fields_autoplaced yes)
		(uuid "27e6302b-b919-4664-a432-9260cb9ab1f2")
		(property "Reference" "R105"
			(at 154.94 104.1399 0)
			(effects
				(font
					(size 1.524 1.524)
				)
				(justify left)
			)
		)
		(property "Value" "RU1J002YNTCL"
			(at 154.94 106.6799 0)
			(effects
				(font
					(size 1.524 1.524)
				)
				(justify left)
			)
		)
		(property "Footprint" "SU-PCB-IC:RU1J002YNTCL"
			(at 143.51 105.41 0)
			(effects
				(font
					(size 1.27 1.27)
					(italic yes)
				)
				(hide yes)
			)
		)
		(property "Datasheet" "RU1J002YNTCL"
			(at 143.51 105.41 0)
			(effects
				(font
					(size 1.27 1.27)
					(italic yes)
				)
				(hide yes)
			)
		)
		(property "Description" ""
			(at 143.51 105.41 0)
			(effects
				(font
					(size 1.27 1.27)
				)
				(hide yes)
			)
		)
		(property "MPN" "RU1J002YNTCL"
			(at 143.51 105.41 0)
			(effects
				(font
					(size 1.27 1.27)
				)
				(hide yes)
			)
		)
		(pin "3"
			(uuid "850503c4-fe57-4b3f-9a18-06b50c90021f")
		)
		(pin "2"
			(uuid "26bad4f0-f483-4c0b-a690-84d9093ef29f")
		)
		(pin "1"
			(uuid "27ec1142-1262-4d4f-b89d-6eee80823e32")
		)
		(instances
			(project "Draft-SU-PCB"
				(path "/ab60d743-7d21-44ca-af12-9d3ffcf1b44a/11793565-cc15-4654-afa6-19e8131d926c"
					(reference "R105")
					(unit 1)
				)
			)
		)
	)
	(symbol
		(lib_id "power:GND")
		(at 140.97 80.01 0)
		(unit 1)
		(exclude_from_sim no)
		(in_bom yes)
		(on_board yes)
		(dnp no)
		(fields_autoplaced yes)
		(uuid "405bac6f-e8ca-42c9-9de7-3a7821e8efad")
		(property "Reference" "#PWR0147"
			(at 140.97 86.36 0)
			(effects
				(font
					(size 1.27 1.27)
				)
				(hide yes)
			)
		)
		(property "Value" "GND"
			(at 140.97 85.09 0)
			(effects
				(font
					(size 1.27 1.27)
				)
			)
		)
		(property "Footprint" ""
			(at 140.97 80.01 0)
			(effects
				(font
					(size 1.27 1.27)
				)
				(hide yes)
			)
		)
		(property "Datasheet" ""
			(at 140.97 80.01 0)
			(effects
				(font
					(size 1.27 1.27)
				)
				(hide yes)
			)
		)
		(property "Description" "Power symbol creates a global label with name \"GND\" , ground"
			(at 140.97 80.01 0)
			(effects
				(font
					(size 1.27 1.27)
				)
				(hide yes)
			)
		)
		(pin "1"
			(uuid "2fb07b6e-2396-474f-ba30-90f08c82b924")
		)
		(instances
			(project "Draft-SU-PCB"
				(path "/ab60d743-7d21-44ca-af12-9d3ffcf1b44a/11793565-cc15-4654-afa6-19e8131d926c"
					(reference "#PWR0147")
					(unit 1)
				)
			)
		)
	)
	(symbol
		(lib_id "Device:R")
		(at 140.97 110.49 180)
		(unit 1)
		(exclude_from_sim no)
		(in_bom yes)
		(on_board yes)
		(dnp no)
		(uuid "4ad2c34c-7286-46ce-bcc6-992728069a98")
		(property "Reference" "R103"
			(at 138.43 110.49 90)
			(effects
				(font
					(size 1.27 1.27)
				)
			)
		)
		(property "Value" "10k"
			(at 140.97 110.49 90)
			(effects
				(font
					(size 1.27 1.27)
				)
			)
		)
		(property "Footprint" "Passives:Resistor-SMD-0402"
			(at 142.748 110.49 90)
			(effects
				(font
					(size 1.27 1.27)
				)
				(hide yes)
			)
		)
		(property "Datasheet" "~"
			(at 140.97 110.49 0)
			(effects
				(font
					(size 1.27 1.27)
				)
				(hide yes)
			)
		)
		(property "Description" "Resistor"
			(at 140.97 110.49 0)
			(effects
				(font
					(size 1.27 1.27)
				)
				(hide yes)
			)
		)
		(property "MPN" "RCS040210K0FKED"
			(at 140.97 110.49 90)
			(effects
				(font
					(size 1.27 1.27)
				)
				(hide yes)
			)
		)
		(pin "2"
			(uuid "d66bb4d2-7db3-4fb5-8c63-a4fe82a88c67")
		)
		(pin "1"
			(uuid "5880806f-182d-40a7-8a6b-43896f7eb8a0")
		)
		(instances
			(project "Draft-SU-PCB"
				(path "/ab60d743-7d21-44ca-af12-9d3ffcf1b44a/11793565-cc15-4654-afa6-19e8131d926c"
					(reference "R103")
					(unit 1)
				)
			)
		)
	)
	(symbol
		(lib_id "Device:R")
		(at 140.97 74.93 180)
		(unit 1)
		(exclude_from_sim no)
		(in_bom yes)
		(on_board yes)
		(dnp no)
		(uuid "55bf9b18-0abe-4dda-9ec1-c8b28c9bdb2d")
		(property "Reference" "R102"
			(at 138.43 74.93 90)
			(effects
				(font
					(size 1.27 1.27)
				)
			)
		)
		(property "Value" "10k"
			(at 140.97 74.93 90)
			(effects
				(font
					(size 1.27 1.27)
				)
			)
		)
		(property "Footprint" "Passives:Resistor-SMD-0402"
			(at 142.748 74.93 90)
			(effects
				(font
					(size 1.27 1.27)
				)
				(hide yes)
			)
		)
		(property "Datasheet" "~"
			(at 140.97 74.93 0)
			(effects
				(font
					(size 1.27 1.27)
				)
				(hide yes)
			)
		)
		(property "Description" "Resistor"
			(at 140.97 74.93 0)
			(effects
				(font
					(size 1.27 1.27)
				)
				(hide yes)
			)
		)
		(property "MPN" "RCS040210K0FKED"
			(at 140.97 74.93 90)
			(effects
				(font
					(size 1.27 1.27)
				)
				(hide yes)
			)
		)
		(pin "2"
			(uuid "914b958d-07e2-4f77-9fb1-4249f3574673")
		)
		(pin "1"
			(uuid "ba4fac4a-9156-4412-98f7-f2eee8b453c5")
		)
		(instances
			(project "Draft-SU-PCB"
				(path "/ab60d743-7d21-44ca-af12-9d3ffcf1b44a/11793565-cc15-4654-afa6-19e8131d926c"
					(reference "R102")
					(unit 1)
				)
			)
		)
	)
	(symbol
		(lib_id "SU-PCB-Connectors:MicroLockPlus-4P")
		(at 199.39 76.2 0)
		(unit 1)
		(exclude_from_sim no)
		(in_bom yes)
		(on_board yes)
		(dnp no)
		(fields_autoplaced yes)
		(uuid "5dd82c00-d251-4b37-8ef8-e458f8a813b1")
		(property "Reference" "J12"
			(at 210.82 68.58 0)
			(effects
				(font
					(size 1.27 1.27)
				)
			)
		)
		(property "Value" "MicroLockPlus-4P"
			(at 210.82 71.12 0)
			(effects
				(font
					(size 1.27 1.27)
				)
			)
		)
		(property "Footprint" "SU-PCB-Connectors:MicroLockPlus-4P"
			(at 218.44 171.12 0)
			(effects
				(font
					(size 1.27 1.27)
				)
				(justify left top)
				(hide yes)
			)
		)
		(property "Datasheet" "https://www.molex.com/pdm_docs/sd/5055680431_sd.pdf"
			(at 218.44 271.12 0)
			(effects
				(font
					(size 1.27 1.27)
				)
				(justify left top)
				(hide yes)
			)
		)
		(property "Description" "Headers & Wire Housings 1.25WB SGL S 4CKT BK G038 W/KAP"
			(at 199.39 76.2 0)
			(effects
				(font
					(size 1.27 1.27)
				)
				(hide yes)
			)
		)
		(property "Height" "4.4"
			(at 218.44 471.12 0)
			(effects
				(font
					(size 1.27 1.27)
				)
				(justify left top)
				(hide yes)
			)
		)
		(property "Mouser Part Number" "538-505568-0431"
			(at 218.44 571.12 0)
			(effects
				(font
					(size 1.27 1.27)
				)
				(justify left top)
				(hide yes)
			)
		)
		(property "Mouser Price/Stock" "https://www.mouser.co.uk/ProductDetail/Molex/505568-0431?qs=vmHwEFxEFR%252Bihet2koJzMA%3D%3D"
			(at 218.44 671.12 0)
			(effects
				(font
					(size 1.27 1.27)
				)
				(justify left top)
				(hide yes)
			)
		)
		(property "Manufacturer_Name" "Molex"
			(at 218.44 771.12 0)
			(effects
				(font
					(size 1.27 1.27)
				)
				(justify left top)
				(hide yes)
			)
		)
		(property "Manufacturer_Part_Number" "505568-0431"
			(at 218.44 871.12 0)
			(effects
				(font
					(size 1.27 1.27)
				)
				(justify left top)
				(hide yes)
			)
		)
		(property "MPN" "505568-0431"
			(at 199.39 76.2 0)
			(effects
				(font
					(size 1.27 1.27)
				)
			)
		)
		(pin "3"
			(uuid "ad9c209d-8f9f-47a3-9f8f-b3893f042a1f")
		)
		(pin "MP2"
			(uuid "dc4b4f11-9a1f-481e-ade2-998e8d4346fa")
		)
		(pin "4"
			(uuid "faf1bad2-ffca-48ed-878e-3fb351e862e3")
		)
		(pin "2"
			(uuid "850d2a4f-af68-4b83-897b-3d499346f7a2")
		)
		(pin "MP1"
			(uuid "b60bc495-5a95-44bf-9088-b33089696e5d")
		)
		(pin "1"
			(uuid "5000ff9e-8b3c-40f5-a0f3-1f21c5a643dc")
		)
		(instances
			(project "Draft-SU-PCB"
				(path "/ab60d743-7d21-44ca-af12-9d3ffcf1b44a/11793565-cc15-4654-afa6-19e8131d926c"
					(reference "J12")
					(unit 1)
				)
			)
		)
	)
	(symbol
		(lib_id "SU-PCB-Connectors:MicroLockPlus-4P")
		(at 242.57 60.96 0)
		(unit 1)
		(exclude_from_sim no)
		(in_bom yes)
		(on_board yes)
		(dnp no)
		(fields_autoplaced yes)
		(uuid "621d8839-62fd-4d5a-aca4-f061bfe59542")
		(property "Reference" "J18"
			(at 254 53.34 0)
			(effects
				(font
					(size 1.27 1.27)
				)
			)
		)
		(property "Value" "MicroLockPlus-4P"
			(at 254 55.88 0)
			(effects
				(font
					(size 1.27 1.27)
				)
			)
		)
		(property "Footprint" "SU-PCB-Connectors:MicroLockPlus-4P"
			(at 261.62 155.88 0)
			(effects
				(font
					(size 1.27 1.27)
				)
				(justify left top)
				(hide yes)
			)
		)
		(property "Datasheet" "https://www.molex.com/pdm_docs/sd/5055680431_sd.pdf"
			(at 261.62 255.88 0)
			(effects
				(font
					(size 1.27 1.27)
				)
				(justify left top)
				(hide yes)
			)
		)
		(property "Description" "Headers & Wire Housings 1.25WB SGL S 4CKT BK G038 W/KAP"
			(at 242.57 60.96 0)
			(effects
				(font
					(size 1.27 1.27)
				)
				(hide yes)
			)
		)
		(property "Height" "4.4"
			(at 261.62 455.88 0)
			(effects
				(font
					(size 1.27 1.27)
				)
				(justify left top)
				(hide yes)
			)
		)
		(property "Mouser Part Number" "538-505568-0431"
			(at 261.62 555.88 0)
			(effects
				(font
					(size 1.27 1.27)
				)
				(justify left top)
				(hide yes)
			)
		)
		(property "Mouser Price/Stock" "https://www.mouser.co.uk/ProductDetail/Molex/505568-0431?qs=vmHwEFxEFR%252Bihet2koJzMA%3D%3D"
			(at 261.62 655.88 0)
			(effects
				(font
					(size 1.27 1.27)
				)
				(justify left top)
				(hide yes)
			)
		)
		(property "Manufacturer_Name" "Molex"
			(at 261.62 755.88 0)
			(effects
				(font
					(size 1.27 1.27)
				)
				(justify left top)
				(hide yes)
			)
		)
		(property "Manufacturer_Part_Number" "505568-0431"
			(at 261.62 855.88 0)
			(effects
				(font
					(size 1.27 1.27)
				)
				(justify left top)
				(hide yes)
			)
		)
		(property "MPN" "505568-0431"
			(at 242.57 60.96 0)
			(effects
				(font
					(size 1.27 1.27)
				)
			)
		)
		(pin "3"
			(uuid "17a8a9e4-6010-41eb-8b00-12e1b4e143f7")
		)
		(pin "MP2"
			(uuid "011389e5-f2a5-45ca-8b8e-a91e3c157bb8")
		)
		(pin "4"
			(uuid "511170bc-157e-405f-b0b6-4633af589bfc")
		)
		(pin "2"
			(uuid "ec3a1f63-5ce8-4234-81b1-697f67fcfae8")
		)
		(pin "MP1"
			(uuid "24a5bb4a-4a21-4bd3-9cf5-62a4d61877de")
		)
		(pin "1"
			(uuid "509788e9-23e4-4ef7-9bfb-acc4f315a7f0")
		)
		(instances
			(project "Draft-SU-PCB"
				(path "/ab60d743-7d21-44ca-af12-9d3ffcf1b44a/11793565-cc15-4654-afa6-19e8131d926c"
					(reference "J18")
					(unit 1)
				)
			)
		)
	)
	(symbol
		(lib_id "power:GND")
		(at 151.13 77.47 0)
		(unit 1)
		(exclude_from_sim no)
		(in_bom yes)
		(on_board yes)
		(dnp no)
		(fields_autoplaced yes)
		(uuid "62d654cb-71e2-4aff-ba2b-cc98d752687d")
		(property "Reference" "#PWR0149"
			(at 151.13 83.82 0)
			(effects
				(font
					(size 1.27 1.27)
				)
				(hide yes)
			)
		)
		(property "Value" "GND"
			(at 151.13 82.55 0)
			(effects
				(font
					(size 1.27 1.27)
				)
			)
		)
		(property "Footprint" ""
			(at 151.13 77.47 0)
			(effects
				(font
					(size 1.27 1.27)
				)
				(hide yes)
			)
		)
		(property "Datasheet" ""
			(at 151.13 77.47 0)
			(effects
				(font
					(size 1.27 1.27)
				)
				(hide yes)
			)
		)
		(property "Description" "Power symbol creates a global label with name \"GND\" , ground"
			(at 151.13 77.47 0)
			(effects
				(font
					(size 1.27 1.27)
				)
				(hide yes)
			)
		)
		(pin "1"
			(uuid "d6d0d246-9aa8-4813-b221-5f16ac9c0616")
		)
		(instances
			(project "Draft-SU-PCB"
				(path "/ab60d743-7d21-44ca-af12-9d3ffcf1b44a/11793565-cc15-4654-afa6-19e8131d926c"
					(reference "#PWR0149")
					(unit 1)
				)
			)
		)
	)
	(symbol
		(lib_id "power:GND")
		(at 86.36 113.03 0)
		(unit 1)
		(exclude_from_sim no)
		(in_bom yes)
		(on_board yes)
		(dnp no)
		(fields_autoplaced yes)
		(uuid "651a48fe-fcd1-4b42-bc86-cf494b8ff73b")
		(property "Reference" "#PWR0146"
			(at 86.36 119.38 0)
			(effects
				(font
					(size 1.27 1.27)
				)
				(hide yes)
			)
		)
		(property "Value" "GND"
			(at 86.36 118.11 0)
			(effects
				(font
					(size 1.27 1.27)
				)
			)
		)
		(property "Footprint" ""
			(at 86.36 113.03 0)
			(effects
				(font
					(size 1.27 1.27)
				)
				(hide yes)
			)
		)
		(property "Datasheet" ""
			(at 86.36 113.03 0)
			(effects
				(font
					(size 1.27 1.27)
				)
				(hide yes)
			)
		)
		(property "Description" "Power symbol creates a global label with name \"GND\" , ground"
			(at 86.36 113.03 0)
			(effects
				(font
					(size 1.27 1.27)
				)
				(hide yes)
			)
		)
		(pin "1"
			(uuid "8e61b495-7319-40ff-ab7a-003259047640")
		)
		(instances
			(project "Draft-SU-PCB"
				(path "/ab60d743-7d21-44ca-af12-9d3ffcf1b44a/11793565-cc15-4654-afa6-19e8131d926c"
					(reference "#PWR0146")
					(unit 1)
				)
			)
		)
	)
	(symbol
		(lib_id "SU-PCB-IC:RU1J002YNTCL")
		(at 143.51 69.85 0)
		(unit 1)
		(exclude_from_sim no)
		(in_bom yes)
		(on_board yes)
		(dnp no)
		(fields_autoplaced yes)
		(uuid "6cd08be4-44c9-44b4-9867-c8d1c8b60edb")
		(property "Reference" "R104"
			(at 154.94 68.5799 0)
			(effects
				(font
					(size 1.524 1.524)
				)
				(justify left)
			)
		)
		(property "Value" "RU1J002YNTCL"
			(at 154.94 71.1199 0)
			(effects
				(font
					(size 1.524 1.524)
				)
				(justify left)
			)
		)
		(property "Footprint" "SU-PCB-IC:RU1J002YNTCL"
			(at 143.51 69.85 0)
			(effects
				(font
					(size 1.27 1.27)
					(italic yes)
				)
				(hide yes)
			)
		)
		(property "Datasheet" "RU1J002YNTCL"
			(at 143.51 69.85 0)
			(effects
				(font
					(size 1.27 1.27)
					(italic yes)
				)
				(hide yes)
			)
		)
		(property "Description" ""
			(at 143.51 69.85 0)
			(effects
				(font
					(size 1.27 1.27)
				)
				(hide yes)
			)
		)
		(property "MPN" "RU1J002YNTCL"
			(at 143.51 69.85 0)
			(effects
				(font
					(size 1.27 1.27)
				)
				(hide yes)
			)
		)
		(pin "3"
			(uuid "ac6e1b06-e19b-4d3b-a644-d3ea3c8bb073")
		)
		(pin "2"
			(uuid "6c12392e-9084-4ca1-9b96-df9ddb105db6")
		)
		(pin "1"
			(uuid "44c56ccf-1c38-485f-8b37-853bb7fde358")
		)
		(instances
			(project "Draft-SU-PCB"
				(path "/ab60d743-7d21-44ca-af12-9d3ffcf1b44a/11793565-cc15-4654-afa6-19e8131d926c"
					(reference "R104")
					(unit 1)
				)
			)
		)
	)
	(symbol
		(lib_id "SU-PCB-Connectors:MicroLockPlus-4P")
		(at 242.57 36.83 0)
		(unit 1)
		(exclude_from_sim no)
		(in_bom yes)
		(on_board yes)
		(dnp no)
		(fields_autoplaced yes)
		(uuid "70cae4c6-2517-48eb-9fcd-44bee244b5fc")
		(property "Reference" "J17"
			(at 254 29.21 0)
			(effects
				(font
					(size 1.27 1.27)
				)
			)
		)
		(property "Value" "MicroLockPlus-4P"
			(at 254 31.75 0)
			(effects
				(font
					(size 1.27 1.27)
				)
			)
		)
		(property "Footprint" "SU-PCB-Connectors:MicroLockPlus-4P"
			(at 261.62 131.75 0)
			(effects
				(font
					(size 1.27 1.27)
				)
				(justify left top)
				(hide yes)
			)
		)
		(property "Datasheet" "https://www.molex.com/pdm_docs/sd/5055680431_sd.pdf"
			(at 261.62 231.75 0)
			(effects
				(font
					(size 1.27 1.27)
				)
				(justify left top)
				(hide yes)
			)
		)
		(property "Description" "Headers & Wire Housings 1.25WB SGL S 4CKT BK G038 W/KAP"
			(at 242.57 36.83 0)
			(effects
				(font
					(size 1.27 1.27)
				)
				(hide yes)
			)
		)
		(property "Height" "4.4"
			(at 261.62 431.75 0)
			(effects
				(font
					(size 1.27 1.27)
				)
				(justify left top)
				(hide yes)
			)
		)
		(property "Mouser Part Number" "538-505568-0431"
			(at 261.62 531.75 0)
			(effects
				(font
					(size 1.27 1.27)
				)
				(justify left top)
				(hide yes)
			)
		)
		(property "Mouser Price/Stock" "https://www.mouser.co.uk/ProductDetail/Molex/505568-0431?qs=vmHwEFxEFR%252Bihet2koJzMA%3D%3D"
			(at 261.62 631.75 0)
			(effects
				(font
					(size 1.27 1.27)
				)
				(justify left top)
				(hide yes)
			)
		)
		(property "Manufacturer_Name" "Molex"
			(at 261.62 731.75 0)
			(effects
				(font
					(size 1.27 1.27)
				)
				(justify left top)
				(hide yes)
			)
		)
		(property "Manufacturer_Part_Number" "505568-0431"
			(at 261.62 831.75 0)
			(effects
				(font
					(size 1.27 1.27)
				)
				(justify left top)
				(hide yes)
			)
		)
		(property "MPN" "505568-0431"
			(at 242.57 36.83 0)
			(effects
				(font
					(size 1.27 1.27)
				)
			)
		)
		(pin "3"
			(uuid "28c845a8-099c-4af6-bdf8-72eead66ceb8")
		)
		(pin "MP2"
			(uuid "479cea9a-0d82-4d35-b657-c87f3ccd3b7c")
		)
		(pin "4"
			(uuid "f304d66c-4b61-4266-af03-a0eb4acd46a8")
		)
		(pin "2"
			(uuid "f8ee8e5e-87bf-4647-ba2e-dcedb5b4d655")
		)
		(pin "MP1"
			(uuid "6a224473-9864-4a85-82af-1f4ba206cb62")
		)
		(pin "1"
			(uuid "282e74cc-db07-4704-95e2-77819eabb469")
		)
		(instances
			(project "Draft-SU-PCB"
				(path "/ab60d743-7d21-44ca-af12-9d3ffcf1b44a/11793565-cc15-4654-afa6-19e8131d926c"
					(reference "J17")
					(unit 1)
				)
			)
		)
	)
	(symbol
		(lib_id "power:GND")
		(at 140.97 115.57 0)
		(unit 1)
		(exclude_from_sim no)
		(in_bom yes)
		(on_board yes)
		(dnp no)
		(fields_autoplaced yes)
		(uuid "800bad14-0da2-4df3-b445-7ed3f17a2b9b")
		(property "Reference" "#PWR0148"
			(at 140.97 121.92 0)
			(effects
				(font
					(size 1.27 1.27)
				)
				(hide yes)
			)
		)
		(property "Value" "GND"
			(at 140.97 120.65 0)
			(effects
				(font
					(size 1.27 1.27)
				)
			)
		)
		(property "Footprint" ""
			(at 140.97 115.57 0)
			(effects
				(font
					(size 1.27 1.27)
				)
				(hide yes)
			)
		)
		(property "Datasheet" ""
			(at 140.97 115.57 0)
			(effects
				(font
					(size 1.27 1.27)
				)
				(hide yes)
			)
		)
		(property "Description" "Power symbol creates a global label with name \"GND\" , ground"
			(at 140.97 115.57 0)
			(effects
				(font
					(size 1.27 1.27)
				)
				(hide yes)
			)
		)
		(pin "1"
			(uuid "5ee935bf-7702-4393-a629-422cab56a8c9")
		)
		(instances
			(project "Draft-SU-PCB"
				(path "/ab60d743-7d21-44ca-af12-9d3ffcf1b44a/11793565-cc15-4654-afa6-19e8131d926c"
					(reference "#PWR0148")
					(unit 1)
				)
			)
		)
	)
	(symbol
		(lib_id "power:GND")
		(at 76.2 115.57 0)
		(unit 1)
		(exclude_from_sim no)
		(in_bom yes)
		(on_board yes)
		(dnp no)
		(fields_autoplaced yes)
		(uuid "963d9eb4-ed6d-407d-b05d-5d73c61c6727")
		(property "Reference" "#PWR0144"
			(at 76.2 121.92 0)
			(effects
				(font
					(size 1.27 1.27)
				)
				(hide yes)
			)
		)
		(property "Value" "GND"
			(at 76.2 120.65 0)
			(effects
				(font
					(size 1.27 1.27)
				)
			)
		)
		(property "Footprint" ""
			(at 76.2 115.57 0)
			(effects
				(font
					(size 1.27 1.27)
				)
				(hide yes)
			)
		)
		(property "Datasheet" ""
			(at 76.2 115.57 0)
			(effects
				(font
					(size 1.27 1.27)
				)
				(hide yes)
			)
		)
		(property "Description" "Power symbol creates a global label with name \"GND\" , ground"
			(at 76.2 115.57 0)
			(effects
				(font
					(size 1.27 1.27)
				)
				(hide yes)
			)
		)
		(pin "1"
			(uuid "8aec7387-8f29-4940-85ac-1955760faee4")
		)
		(instances
			(project "Draft-SU-PCB"
				(path "/ab60d743-7d21-44ca-af12-9d3ffcf1b44a/11793565-cc15-4654-afa6-19e8131d926c"
					(reference "#PWR0144")
					(unit 1)
				)
			)
		)
	)
	(symbol
		(lib_id "Device:R")
		(at 76.2 110.49 180)
		(unit 1)
		(exclude_from_sim no)
		(in_bom yes)
		(on_board yes)
		(dnp no)
		(uuid "a34a8ec8-f83a-4a66-86a6-b62e9638891a")
		(property "Reference" "R99"
			(at 73.66 110.49 90)
			(effects
				(font
					(size 1.27 1.27)
				)
			)
		)
		(property "Value" "10k"
			(at 76.2 110.49 90)
			(effects
				(font
					(size 1.27 1.27)
				)
			)
		)
		(property "Footprint" "Passives:Resistor-SMD-0402"
			(at 77.978 110.49 90)
			(effects
				(font
					(size 1.27 1.27)
				)
				(hide yes)
			)
		)
		(property "Datasheet" "~"
			(at 76.2 110.49 0)
			(effects
				(font
					(size 1.27 1.27)
				)
				(hide yes)
			)
		)
		(property "Description" "Resistor"
			(at 76.2 110.49 0)
			(effects
				(font
					(size 1.27 1.27)
				)
				(hide yes)
			)
		)
		(property "MPN" "RCS040210K0FKED"
			(at 76.2 110.49 90)
			(effects
				(font
					(size 1.27 1.27)
				)
				(hide yes)
			)
		)
		(pin "2"
			(uuid "909c0276-4590-4582-9a4a-d479b06fc3a6")
		)
		(pin "1"
			(uuid "8d34cf69-3338-40b3-9c75-62cd69f09f26")
		)
		(instances
			(project "Draft-SU-PCB"
				(path "/ab60d743-7d21-44ca-af12-9d3ffcf1b44a/11793565-cc15-4654-afa6-19e8131d926c"
					(reference "R99")
					(unit 1)
				)
			)
		)
	)
	(symbol
		(lib_id "power:GND")
		(at 76.2 80.01 0)
		(unit 1)
		(exclude_from_sim no)
		(in_bom yes)
		(on_board yes)
		(dnp no)
		(fields_autoplaced yes)
		(uuid "ac7659d6-eea7-4d4d-ace3-6ccf12e20414")
		(property "Reference" "#PWR0143"
			(at 76.2 86.36 0)
			(effects
				(font
					(size 1.27 1.27)
				)
				(hide yes)
			)
		)
		(property "Value" "GND"
			(at 76.2 85.09 0)
			(effects
				(font
					(size 1.27 1.27)
				)
			)
		)
		(property "Footprint" ""
			(at 76.2 80.01 0)
			(effects
				(font
					(size 1.27 1.27)
				)
				(hide yes)
			)
		)
		(property "Datasheet" ""
			(at 76.2 80.01 0)
			(effects
				(font
					(size 1.27 1.27)
				)
				(hide yes)
			)
		)
		(property "Description" "Power symbol creates a global label with name \"GND\" , ground"
			(at 76.2 80.01 0)
			(effects
				(font
					(size 1.27 1.27)
				)
				(hide yes)
			)
		)
		(pin "1"
			(uuid "cd3bbee1-893a-4647-8ba5-3b04aff91333")
		)
		(instances
			(project "Draft-SU-PCB"
				(path "/ab60d743-7d21-44ca-af12-9d3ffcf1b44a/11793565-cc15-4654-afa6-19e8131d926c"
					(reference "#PWR0143")
					(unit 1)
				)
			)
		)
	)
	(symbol
		(lib_id "Device:R")
		(at 76.2 74.93 180)
		(unit 1)
		(exclude_from_sim no)
		(in_bom yes)
		(on_board yes)
		(dnp no)
		(uuid "bec55420-45d5-406e-832d-578d6d19563f")
		(property "Reference" "R98"
			(at 73.66 74.93 90)
			(effects
				(font
					(size 1.27 1.27)
				)
			)
		)
		(property "Value" "10k"
			(at 76.2 74.93 90)
			(effects
				(font
					(size 1.27 1.27)
				)
			)
		)
		(property "Footprint" "Passives:Resistor-SMD-0402"
			(at 77.978 74.93 90)
			(effects
				(font
					(size 1.27 1.27)
				)
				(hide yes)
			)
		)
		(property "Datasheet" "~"
			(at 76.2 74.93 0)
			(effects
				(font
					(size 1.27 1.27)
				)
				(hide yes)
			)
		)
		(property "Description" "Resistor"
			(at 76.2 74.93 0)
			(effects
				(font
					(size 1.27 1.27)
				)
				(hide yes)
			)
		)
		(property "MPN" "RCS040210K0FKED"
			(at 76.2 74.93 90)
			(effects
				(font
					(size 1.27 1.27)
				)
				(hide yes)
			)
		)
		(pin "2"
			(uuid "a7fae0cc-6899-4667-9198-78c788bf15cb")
		)
		(pin "1"
			(uuid "805f977c-ea13-4e24-8594-0bc938b9ffe4")
		)
		(instances
			(project "Draft-SU-PCB"
				(path "/ab60d743-7d21-44ca-af12-9d3ffcf1b44a/11793565-cc15-4654-afa6-19e8131d926c"
					(reference "R98")
					(unit 1)
				)
			)
		)
	)
	(symbol
		(lib_id "SU-PCB-Connectors:MicroLockPlus-4P")
		(at 199.39 97.79 0)
		(unit 1)
		(exclude_from_sim no)
		(in_bom yes)
		(on_board yes)
		(dnp no)
		(fields_autoplaced yes)
		(uuid "c59dc25e-9c05-4fd8-b63d-bc29a4922f04")
		(property "Reference" "J13"
			(at 210.82 90.17 0)
			(effects
				(font
					(size 1.27 1.27)
				)
			)
		)
		(property "Value" "MicroLockPlus-4P"
			(at 210.82 92.71 0)
			(effects
				(font
					(size 1.27 1.27)
				)
			)
		)
		(property "Footprint" "SU-PCB-Connectors:MicroLockPlus-4P"
			(at 218.44 192.71 0)
			(effects
				(font
					(size 1.27 1.27)
				)
				(justify left top)
				(hide yes)
			)
		)
		(property "Datasheet" "https://www.molex.com/pdm_docs/sd/5055680431_sd.pdf"
			(at 218.44 292.71 0)
			(effects
				(font
					(size 1.27 1.27)
				)
				(justify left top)
				(hide yes)
			)
		)
		(property "Description" "Headers & Wire Housings 1.25WB SGL S 4CKT BK G038 W/KAP"
			(at 199.39 97.79 0)
			(effects
				(font
					(size 1.27 1.27)
				)
				(hide yes)
			)
		)
		(property "Height" "4.4"
			(at 218.44 492.71 0)
			(effects
				(font
					(size 1.27 1.27)
				)
				(justify left top)
				(hide yes)
			)
		)
		(property "Mouser Part Number" "538-505568-0431"
			(at 218.44 592.71 0)
			(effects
				(font
					(size 1.27 1.27)
				)
				(justify left top)
				(hide yes)
			)
		)
		(property "Mouser Price/Stock" "https://www.mouser.co.uk/ProductDetail/Molex/505568-0431?qs=vmHwEFxEFR%252Bihet2koJzMA%3D%3D"
			(at 218.44 692.71 0)
			(effects
				(font
					(size 1.27 1.27)
				)
				(justify left top)
				(hide yes)
			)
		)
		(property "Manufacturer_Name" "Molex"
			(at 218.44 792.71 0)
			(effects
				(font
					(size 1.27 1.27)
				)
				(justify left top)
				(hide yes)
			)
		)
		(property "Manufacturer_Part_Number" "505568-0431"
			(at 218.44 892.71 0)
			(effects
				(font
					(size 1.27 1.27)
				)
				(justify left top)
				(hide yes)
			)
		)
		(property "MPN" "505568-0431"
			(at 199.39 97.79 0)
			(effects
				(font
					(size 1.27 1.27)
				)
			)
		)
		(pin "3"
			(uuid "6ad33ffb-3c38-4651-be67-43dd1e916f53")
		)
		(pin "MP2"
			(uuid "77b33357-c635-4c38-8b5e-e55f949ee64a")
		)
		(pin "4"
			(uuid "5db70673-64d7-4d5b-9e06-81f01223ad12")
		)
		(pin "2"
			(uuid "45c18469-1448-4e5c-bfec-eb1db236f696")
		)
		(pin "MP1"
			(uuid "5b63b1cc-97ad-4a6e-9a54-261807fcaff4")
		)
		(pin "1"
			(uuid "27943fb0-8244-4e82-93c5-47ea14dc635a")
		)
		(instances
			(project "Draft-SU-PCB"
				(path "/ab60d743-7d21-44ca-af12-9d3ffcf1b44a/11793565-cc15-4654-afa6-19e8131d926c"
					(reference "J13")
					(unit 1)
				)
			)
		)
	)
	(symbol
		(lib_id "SU-PCB-Connectors:MicroLockPlus-6P")
		(at 247.65 77.47 0)
		(unit 1)
		(exclude_from_sim no)
		(in_bom yes)
		(on_board yes)
		(dnp no)
		(fields_autoplaced yes)
		(uuid "cfa7e0c6-5f4d-46e0-a66f-937afc163be9")
		(property "Reference" "J19"
			(at 261.62 85.0899 0)
			(effects
				(font
					(size 1.524 1.524)
				)
				(justify left)
			)
		)
		(property "Value" "MicroLockPlus-6P"
			(at 261.62 87.6299 0)
			(effects
				(font
					(size 1.524 1.524)
				)
				(justify left)
			)
		)
		(property "Footprint" "SU-PCB-Connectors:MicroLockPlus-6P"
			(at 247.65 77.47 0)
			(effects
				(font
					(size 1.27 1.27)
					(italic yes)
				)
				(hide yes)
			)
		)
		(property "Datasheet" "5055680631"
			(at 247.65 77.47 0)
			(effects
				(font
					(size 1.27 1.27)
					(italic yes)
				)
				(hide yes)
			)
		)
		(property "Description" ""
			(at 247.65 77.47 0)
			(effects
				(font
					(size 1.27 1.27)
				)
				(hide yes)
			)
		)
		(property "MPN" "5055680631"
			(at 247.65 77.47 0)
			(effects
				(font
					(size 1.27 1.27)
				)
				(hide yes)
			)
		)
		(pin "3"
			(uuid "d59160ec-b46b-45fe-9ffd-2823a80805bb")
		)
		(pin "2"
			(uuid "ea53c2f7-8d9d-48d7-959a-d9668c20a9b0")
		)
		(pin "1"
			(uuid "4e96747f-f5f0-4c33-bbcf-3e15d58e2ae6")
		)
		(pin "4"
			(uuid "5728bd44-4c50-471c-80de-55249c4929bb")
		)
		(pin "5"
			(uuid "a7552010-9b91-4b8c-bc8b-a4d1c6995f62")
		)
		(pin "6"
			(uuid "a0edb9a9-dfe6-4478-88e2-46e7b23ab160")
		)
		(pin "7"
			(uuid "6cf6470f-09a6-4c55-b539-ef2a5cf2b961")
		)
		(pin "8"
			(uuid "97da3d7c-dc73-48f6-aaf4-4ef5a5ced2cd")
		)
		(instances
			(project ""
				(path "/ab60d743-7d21-44ca-af12-9d3ffcf1b44a/11793565-cc15-4654-afa6-19e8131d926c"
					(reference "J19")
					(unit 1)
				)
			)
		)
	)
	(symbol
		(lib_id "SU-PCB-IC:RU1J002YNTCL")
		(at 78.74 69.85 0)
		(unit 1)
		(exclude_from_sim no)
		(in_bom yes)
		(on_board yes)
		(dnp no)
		(fields_autoplaced yes)
		(uuid "d1c12491-adc1-429d-ac6d-06395d6e7524")
		(property "Reference" "R100"
			(at 90.17 68.5799 0)
			(effects
				(font
					(size 1.524 1.524)
				)
				(justify left)
			)
		)
		(property "Value" "RU1J002YNTCL"
			(at 90.17 71.1199 0)
			(effects
				(font
					(size 1.524 1.524)
				)
				(justify left)
			)
		)
		(property "Footprint" "SU-PCB-IC:RU1J002YNTCL"
			(at 78.74 69.85 0)
			(effects
				(font
					(size 1.27 1.27)
					(italic yes)
				)
				(hide yes)
			)
		)
		(property "Datasheet" "RU1J002YNTCL"
			(at 78.74 69.85 0)
			(effects
				(font
					(size 1.27 1.27)
					(italic yes)
				)
				(hide yes)
			)
		)
		(property "Description" ""
			(at 78.74 69.85 0)
			(effects
				(font
					(size 1.27 1.27)
				)
				(hide yes)
			)
		)
		(property "MPN" "RU1J002YNTCL"
			(at 78.74 69.85 0)
			(effects
				(font
					(size 1.27 1.27)
				)
				(hide yes)
			)
		)
		(pin "3"
			(uuid "95b356db-9ce2-417d-a57e-0bec69775f3a")
		)
		(pin "2"
			(uuid "eedd0171-4381-4591-a9c5-c8fcaffdcb72")
		)
		(pin "1"
			(uuid "aecb11a9-12d2-49b9-9b52-620e84952ead")
		)
		(instances
			(project "Draft-SU-PCB"
				(path "/ab60d743-7d21-44ca-af12-9d3ffcf1b44a/11793565-cc15-4654-afa6-19e8131d926c"
					(reference "R100")
					(unit 1)
				)
			)
		)
	)
	(symbol
		(lib_id "SU-PCB-IC:RU1J002YNTCL")
		(at 78.74 105.41 0)
		(unit 1)
		(exclude_from_sim no)
		(in_bom yes)
		(on_board yes)
		(dnp no)
		(fields_autoplaced yes)
		(uuid "d374e87f-8e15-44f7-a858-e8664c7ff9c8")
		(property "Reference" "R101"
			(at 90.17 104.1399 0)
			(effects
				(font
					(size 1.524 1.524)
				)
				(justify left)
			)
		)
		(property "Value" "RU1J002YNTCL"
			(at 90.17 106.6799 0)
			(effects
				(font
					(size 1.524 1.524)
				)
				(justify left)
			)
		)
		(property "Footprint" "SU-PCB-IC:RU1J002YNTCL"
			(at 78.74 105.41 0)
			(effects
				(font
					(size 1.27 1.27)
					(italic yes)
				)
				(hide yes)
			)
		)
		(property "Datasheet" "RU1J002YNTCL"
			(at 78.74 105.41 0)
			(effects
				(font
					(size 1.27 1.27)
					(italic yes)
				)
				(hide yes)
			)
		)
		(property "Description" ""
			(at 78.74 105.41 0)
			(effects
				(font
					(size 1.27 1.27)
				)
				(hide yes)
			)
		)
		(property "MPN" "RU1J002YNTCL"
			(at 78.74 105.41 0)
			(effects
				(font
					(size 1.27 1.27)
				)
				(hide yes)
			)
		)
		(pin "3"
			(uuid "26a81f39-ddfb-46b4-8ed7-047eba38a2f6")
		)
		(pin "2"
			(uuid "37cff71f-39a5-4b82-b49e-eb9b33e22238")
		)
		(pin "1"
			(uuid "924ab341-a375-43a8-b526-948b933b8e81")
		)
		(instances
			(project "Draft-SU-PCB"
				(path "/ab60d743-7d21-44ca-af12-9d3ffcf1b44a/11793565-cc15-4654-afa6-19e8131d926c"
					(reference "R101")
					(unit 1)
				)
			)
		)
	)
	(symbol
		(lib_id "power:GND")
		(at 86.36 77.47 0)
		(unit 1)
		(exclude_from_sim no)
		(in_bom yes)
		(on_board yes)
		(dnp no)
		(fields_autoplaced yes)
		(uuid "f0557ef0-4a4f-45bb-92a8-575a850e8abd")
		(property "Reference" "#PWR0145"
			(at 86.36 83.82 0)
			(effects
				(font
					(size 1.27 1.27)
				)
				(hide yes)
			)
		)
		(property "Value" "GND"
			(at 86.36 82.55 0)
			(effects
				(font
					(size 1.27 1.27)
				)
			)
		)
		(property "Footprint" ""
			(at 86.36 77.47 0)
			(effects
				(font
					(size 1.27 1.27)
				)
				(hide yes)
			)
		)
		(property "Datasheet" ""
			(at 86.36 77.47 0)
			(effects
				(font
					(size 1.27 1.27)
				)
				(hide yes)
			)
		)
		(property "Description" "Power symbol creates a global label with name \"GND\" , ground"
			(at 86.36 77.47 0)
			(effects
				(font
					(size 1.27 1.27)
				)
				(hide yes)
			)
		)
		(pin "1"
			(uuid "e9f991a7-8f93-4341-a0da-6e2331536fb4")
		)
		(instances
			(project "Draft-SU-PCB"
				(path "/ab60d743-7d21-44ca-af12-9d3ffcf1b44a/11793565-cc15-4654-afa6-19e8131d926c"
					(reference "#PWR0145")
					(unit 1)
				)
			)
		)
	)
	(symbol
		(lib_id "power:GND")
		(at 151.13 113.03 0)
		(unit 1)
		(exclude_from_sim no)
		(in_bom yes)
		(on_board yes)
		(dnp no)
		(fields_autoplaced yes)
		(uuid "f26de25b-bbb0-4564-8793-55452c342b87")
		(property "Reference" "#PWR0150"
			(at 151.13 119.38 0)
			(effects
				(font
					(size 1.27 1.27)
				)
				(hide yes)
			)
		)
		(property "Value" "GND"
			(at 151.13 118.11 0)
			(effects
				(font
					(size 1.27 1.27)
				)
			)
		)
		(property "Footprint" ""
			(at 151.13 113.03 0)
			(effects
				(font
					(size 1.27 1.27)
				)
				(hide yes)
			)
		)
		(property "Datasheet" ""
			(at 151.13 113.03 0)
			(effects
				(font
					(size 1.27 1.27)
				)
				(hide yes)
			)
		)
		(property "Description" "Power symbol creates a global label with name \"GND\" , ground"
			(at 151.13 113.03 0)
			(effects
				(font
					(size 1.27 1.27)
				)
				(hide yes)
			)
		)
		(pin "1"
			(uuid "79aa6790-0243-437c-9316-c708fa6d9524")
		)
		(instances
			(project "Draft-SU-PCB"
				(path "/ab60d743-7d21-44ca-af12-9d3ffcf1b44a/11793565-cc15-4654-afa6-19e8131d926c"
					(reference "#PWR0150")
					(unit 1)
				)
			)
		)
	)
)
