(kicad_sch (version 20230121) (generator eeschema)

  (uuid 8d8672bf-d156-4806-9539-e2797e9fef33)

  (paper "A4")

  (lib_symbols
    (symbol "Device:NetTie_2" (pin_numbers hide) (pin_names (offset 0) hide) (in_bom no) (on_board yes)
      (property "Reference" "NT" (at 0 1.27 0)
        (effects (font (size 1.27 1.27)))
      )
      (property "Value" "NetTie_2" (at 0 -1.27 0)
        (effects (font (size 1.27 1.27)))
      )
      (property "Footprint" "" (at 0 0 0)
        (effects (font (size 1.27 1.27)) hide)
      )
      (property "Datasheet" "~" (at 0 0 0)
        (effects (font (size 1.27 1.27)) hide)
      )
      (property "ki_keywords" "net tie short" (at 0 0 0)
        (effects (font (size 1.27 1.27)) hide)
      )
      (property "ki_description" "Net tie, 2 pins" (at 0 0 0)
        (effects (font (size 1.27 1.27)) hide)
      )
      (property "ki_fp_filters" "Net*Tie*" (at 0 0 0)
        (effects (font (size 1.27 1.27)) hide)
      )
      (symbol "NetTie_2_0_1"
        (polyline
          (pts
            (xy -1.27 0)
            (xy 1.27 0)
          )
          (stroke (width 0.254) (type default))
          (fill (type none))
        )
      )
      (symbol "NetTie_2_1_1"
        (pin passive line (at -2.54 0 0) (length 2.54)
          (name "1" (effects (font (size 1.27 1.27))))
          (number "1" (effects (font (size 1.27 1.27))))
        )
        (pin passive line (at 2.54 0 180) (length 2.54)
          (name "2" (effects (font (size 1.27 1.27))))
          (number "2" (effects (font (size 1.27 1.27))))
        )
      )
    )
  )


  (wire (pts (xy 131.445 69.596) (xy 133.477 69.596))
    (stroke (width 0) (type default))
    (uuid 7b96ec05-2df4-4790-93e0-1de5685a7381)
  )
  (wire (pts (xy 138.557 69.596) (xy 140.462 69.596))
    (stroke (width 0) (type default))
    (uuid 94478ef2-9b14-4057-8b08-d5e717f7ffa9)
  )

  (global_label "Vin-" (shape input) (at 140.462 69.596 0) (fields_autoplaced)
    (effects (font (size 1.27 1.27)) (justify left))
    (uuid 8feb1f24-795f-4491-be0f-2bbe4f2e3dc0)
    (property "Intersheetrefs" "${INTERSHEET_REFS}" (at 147.7826 69.596 0)
      (effects (font (size 1.27 1.27)) (justify left) hide)
    )
  )
  (global_label "Vin+" (shape input) (at 131.445 69.596 180) (fields_autoplaced)
    (effects (font (size 1.27 1.27)) (justify right))
    (uuid ecf541eb-5937-4789-8883-6544374a8e7c)
    (property "Intersheetrefs" "${INTERSHEET_REFS}" (at 124.1244 69.596 0)
      (effects (font (size 1.27 1.27)) (justify right) hide)
    )
  )

  (symbol (lib_id "Device:NetTie_2") (at 136.017 69.596 0) (unit 1)
    (in_bom no) (on_board yes) (dnp no) (fields_autoplaced)
    (uuid b35180df-3fc9-4b9a-a680-e06b2c740ba2)
    (property "Reference" "NT1" (at 136.017 64.77 0)
      (effects (font (size 1.27 1.27)))
    )
    (property "Value" "NetTie_2" (at 136.017 67.31 0)
      (effects (font (size 1.27 1.27)))
    )
    (property "Footprint" "NetTie:NetTie-2_SMD_Pad0.5mm" (at 136.017 69.596 0)
      (effects (font (size 1.27 1.27)) hide)
    )
    (property "Datasheet" "~" (at 136.017 69.596 0)
      (effects (font (size 1.27 1.27)) hide)
    )
    (pin "1" (uuid fa65dc02-710e-49a2-aeb5-5fb23afa17a8))
    (pin "2" (uuid 3577d701-8adc-4be0-824b-1fc056e55c66))
    (instances
      (project "flex-heater"
        (path "/8d8672bf-d156-4806-9539-e2797e9fef33"
          (reference "NT1") (unit 1)
        )
      )
    )
  )

  (sheet_instances
    (path "/" (page "1"))
  )
)
