(footprint "FC135327680KAAG3" (version 20221018) (generator pcbnew)
  (layer "F.Cu")
  (descr "FC-135 32.7680KA-AG3-3")
  (tags "Crystal or Oscillator")
  (attr smd)
  (fp_text reference "Y**" (at 0 0) (layer "F.SilkS")
      (effects (font (size 1.27 1.27) (thickness 0.254)))
    (tstamp fd18ab60-63bd-4e39-871b-7339ef49d77a)
  )
  (fp_text value "FC135327680KAAG3" (at 0 0) (layer "F.SilkS") hide
      (effects (font (size 1.27 1.27) (thickness 0.254)))
    (tstamp 82616b27-8fe1-47fb-9bee-fcdc99c29be5)
  )
  (fp_text user "${REFERENCE}" (at 0 0) (layer "F.Fab")
      (effects (font (size 1.27 1.27) (thickness 0.254)))
    (tstamp 4fa9f589-06e4-4774-a942-3d5a8edec154)
  )
  (fp_line (start -2.2 0) (end -2.2 0)
    (stroke (width 0.1) (type solid)) (layer "F.SilkS") (tstamp 942775f3-11e8-4adc-b56d-3d63c6058440))
  (fp_line (start -2.2 0.1) (end -2.2 0.1)
    (stroke (width 0.1) (type solid)) (layer "F.SilkS") (tstamp c8971a5d-e64e-4586-a9b0-89c1a77be477))
  (fp_line (start -0.4 -0.75) (end 0.4 -0.75)
    (stroke (width 0.1) (type solid)) (layer "F.SilkS") (tstamp 12c3f078-115b-45a2-bf78-a7025e13d802))
  (fp_line (start -0.4 0.75) (end 0.4 0.75)
    (stroke (width 0.1) (type solid)) (layer "F.SilkS") (tstamp c460528b-b72e-4107-8d37-8ce286e3057a))
  (fp_arc (start -2.2 0) (mid -2.15 0.05) (end -2.2 0.1)
    (stroke (width 0.1) (type solid)) (layer "F.SilkS") (tstamp b0f18809-8461-4a69-97c0-3d2690e404be))
  (fp_arc (start -2.2 0.1) (mid -2.25 0.05) (end -2.2 0)
    (stroke (width 0.1) (type solid)) (layer "F.SilkS") (tstamp e8417011-ef27-4fa4-bb74-3110dbcb2a6a))
  (fp_line (start -2.75 -1.9) (end 2.75 -1.9)
    (stroke (width 0.1) (type solid)) (layer "F.CrtYd") (tstamp 9c6d0e55-09ec-4e3c-8b62-30f9b937ca68))
  (fp_line (start -2.75 1.9) (end -2.75 -1.9)
    (stroke (width 0.1) (type solid)) (layer "F.CrtYd") (tstamp b7f34613-b735-4175-85eb-fef20c982d2a))
  (fp_line (start 2.75 -1.9) (end 2.75 1.9)
    (stroke (width 0.1) (type solid)) (layer "F.CrtYd") (tstamp 7f797fb3-fcc6-4547-aeb7-33fcaa69ec4a))
  (fp_line (start 2.75 1.9) (end -2.75 1.9)
    (stroke (width 0.1) (type solid)) (layer "F.CrtYd") (tstamp 0912a9ae-056d-4ea7-bf5b-4c03a5700121))
  (fp_line (start -1.6 -0.75) (end 1.6 -0.75)
    (stroke (width 0.2) (type solid)) (layer "F.Fab") (tstamp 1e14eae1-a444-4066-a2f6-ba7595e4d8ce))
  (fp_line (start -1.6 0.75) (end -1.6 -0.75)
    (stroke (width 0.2) (type solid)) (layer "F.Fab") (tstamp 4820fd2f-618d-4f60-bc75-450689847995))
  (fp_line (start 1.6 -0.75) (end 1.6 0.75)
    (stroke (width 0.2) (type solid)) (layer "F.Fab") (tstamp 9e63ae0c-aabf-419a-bf11-7bc04c95b9c4))
  (fp_line (start 1.6 0.75) (end -1.6 0.75)
    (stroke (width 0.2) (type solid)) (layer "F.Fab") (tstamp 1e3e6f57-b37c-40d3-9bfe-3a6dab7d3917))
  (pad "1" smd rect (at -1.25 0) (size 1 1.8) (layers "F.Cu" "F.Paste" "F.Mask") (tstamp 12b84229-1268-4961-ac26-20885d353700))
  (pad "2" smd rect (at 1.25 0) (size 1 1.8) (layers "F.Cu" "F.Paste" "F.Mask") (tstamp 615c1022-35d6-4f7b-84a6-7e0c5a467c8d))
  (model "../3D/FC-135_32.7680KA-AG3.stp"
    (offset (xyz 0 0 0))
    (scale (xyz 1 1 1))
    (rotate (xyz -90 0 0))
  )
)
