(kicad_sch (version 20230121) (generator eeschema)

  (uuid 0ee520f3-5556-41f8-afe3-2c653838ec03)

  (paper "A4")

  (lib_symbols
    (symbol "Connector:Conn_01x02_Pin" (pin_names (offset 1.016) hide) (in_bom yes) (on_board yes)
      (property "Reference" "J" (at 0 2.54 0)
        (effects (font (size 1.27 1.27)))
      )
      (property "Value" "Conn_01x02_Pin" (at 0 -5.08 0)
        (effects (font (size 1.27 1.27)))
      )
      (property "Footprint" "" (at 0 0 0)
        (effects (font (size 1.27 1.27)) hide)
      )
      (property "Datasheet" "~" (at 0 0 0)
        (effects (font (size 1.27 1.27)) hide)
      )
      (property "ki_locked" "" (at 0 0 0)
        (effects (font (size 1.27 1.27)))
      )
      (property "ki_keywords" "connector" (at 0 0 0)
        (effects (font (size 1.27 1.27)) hide)
      )
      (property "ki_description" "Generic connector, single row, 01x02, script generated" (at 0 0 0)
        (effects (font (size 1.27 1.27)) hide)
      )
      (property "ki_fp_filters" "Connector*:*_1x??_*" (at 0 0 0)
        (effects (font (size 1.27 1.27)) hide)
      )
      (symbol "Conn_01x02_Pin_1_1"
        (polyline
          (pts
            (xy 1.27 -2.54)
            (xy 0.8636 -2.54)
          )
          (stroke (width 0.1524) (type default))
          (fill (type none))
        )
        (polyline
          (pts
            (xy 1.27 0)
            (xy 0.8636 0)
          )
          (stroke (width 0.1524) (type default))
          (fill (type none))
        )
        (rectangle (start 0.8636 -2.413) (end 0 -2.667)
          (stroke (width 0.1524) (type default))
          (fill (type outline))
        )
        (rectangle (start 0.8636 0.127) (end 0 -0.127)
          (stroke (width 0.1524) (type default))
          (fill (type outline))
        )
        (pin passive line (at 5.08 0 180) (length 3.81)
          (name "Pin_1" (effects (font (size 1.27 1.27))))
          (number "1" (effects (font (size 1.27 1.27))))
        )
        (pin passive line (at 5.08 -2.54 180) (length 3.81)
          (name "Pin_2" (effects (font (size 1.27 1.27))))
          (number "2" (effects (font (size 1.27 1.27))))
        )
      )
    )
    (symbol "Connector:Conn_01x03_Pin" (pin_names (offset 1.016) hide) (in_bom yes) (on_board yes)
      (property "Reference" "J" (at 0 5.08 0)
        (effects (font (size 1.27 1.27)))
      )
      (property "Value" "Conn_01x03_Pin" (at 0 -5.08 0)
        (effects (font (size 1.27 1.27)))
      )
      (property "Footprint" "" (at 0 0 0)
        (effects (font (size 1.27 1.27)) hide)
      )
      (property "Datasheet" "~" (at 0 0 0)
        (effects (font (size 1.27 1.27)) hide)
      )
      (property "ki_locked" "" (at 0 0 0)
        (effects (font (size 1.27 1.27)))
      )
      (property "ki_keywords" "connector" (at 0 0 0)
        (effects (font (size 1.27 1.27)) hide)
      )
      (property "ki_description" "Generic connector, single row, 01x03, script generated" (at 0 0 0)
        (effects (font (size 1.27 1.27)) hide)
      )
      (property "ki_fp_filters" "Connector*:*_1x??_*" (at 0 0 0)
        (effects (font (size 1.27 1.27)) hide)
      )
      (symbol "Conn_01x03_Pin_1_1"
        (polyline
          (pts
            (xy 1.27 -2.54)
            (xy 0.8636 -2.54)
          )
          (stroke (width 0.1524) (type default))
          (fill (type none))
        )
        (polyline
          (pts
            (xy 1.27 0)
            (xy 0.8636 0)
          )
          (stroke (width 0.1524) (type default))
          (fill (type none))
        )
        (polyline
          (pts
            (xy 1.27 2.54)
            (xy 0.8636 2.54)
          )
          (stroke (width 0.1524) (type default))
          (fill (type none))
        )
        (rectangle (start 0.8636 -2.413) (end 0 -2.667)
          (stroke (width 0.1524) (type default))
          (fill (type outline))
        )
        (rectangle (start 0.8636 0.127) (end 0 -0.127)
          (stroke (width 0.1524) (type default))
          (fill (type outline))
        )
        (rectangle (start 0.8636 2.667) (end 0 2.413)
          (stroke (width 0.1524) (type default))
          (fill (type outline))
        )
        (pin passive line (at 5.08 2.54 180) (length 3.81)
          (name "Pin_1" (effects (font (size 1.27 1.27))))
          (number "1" (effects (font (size 1.27 1.27))))
        )
        (pin passive line (at 5.08 0 180) (length 3.81)
          (name "Pin_2" (effects (font (size 1.27 1.27))))
          (number "2" (effects (font (size 1.27 1.27))))
        )
        (pin passive line (at 5.08 -2.54 180) (length 3.81)
          (name "Pin_3" (effects (font (size 1.27 1.27))))
          (number "3" (effects (font (size 1.27 1.27))))
        )
      )
    )
    (symbol "Connector:Conn_01x04_Pin" (pin_names (offset 1.016) hide) (in_bom yes) (on_board yes)
      (property "Reference" "J" (at 0 5.08 0)
        (effects (font (size 1.27 1.27)))
      )
      (property "Value" "Conn_01x04_Pin" (at 0 -7.62 0)
        (effects (font (size 1.27 1.27)))
      )
      (property "Footprint" "" (at 0 0 0)
        (effects (font (size 1.27 1.27)) hide)
      )
      (property "Datasheet" "~" (at 0 0 0)
        (effects (font (size 1.27 1.27)) hide)
      )
      (property "ki_locked" "" (at 0 0 0)
        (effects (font (size 1.27 1.27)))
      )
      (property "ki_keywords" "connector" (at 0 0 0)
        (effects (font (size 1.27 1.27)) hide)
      )
      (property "ki_description" "Generic connector, single row, 01x04, script generated" (at 0 0 0)
        (effects (font (size 1.27 1.27)) hide)
      )
      (property "ki_fp_filters" "Connector*:*_1x??_*" (at 0 0 0)
        (effects (font (size 1.27 1.27)) hide)
      )
      (symbol "Conn_01x04_Pin_1_1"
        (polyline
          (pts
            (xy 1.27 -5.08)
            (xy 0.8636 -5.08)
          )
          (stroke (width 0.1524) (type default))
          (fill (type none))
        )
        (polyline
          (pts
            (xy 1.27 -2.54)
            (xy 0.8636 -2.54)
          )
          (stroke (width 0.1524) (type default))
          (fill (type none))
        )
        (polyline
          (pts
            (xy 1.27 0)
            (xy 0.8636 0)
          )
          (stroke (width 0.1524) (type default))
          (fill (type none))
        )
        (polyline
          (pts
            (xy 1.27 2.54)
            (xy 0.8636 2.54)
          )
          (stroke (width 0.1524) (type default))
          (fill (type none))
        )
        (rectangle (start 0.8636 -4.953) (end 0 -5.207)
          (stroke (width 0.1524) (type default))
          (fill (type outline))
        )
        (rectangle (start 0.8636 -2.413) (end 0 -2.667)
          (stroke (width 0.1524) (type default))
          (fill (type outline))
        )
        (rectangle (start 0.8636 0.127) (end 0 -0.127)
          (stroke (width 0.1524) (type default))
          (fill (type outline))
        )
        (rectangle (start 0.8636 2.667) (end 0 2.413)
          (stroke (width 0.1524) (type default))
          (fill (type outline))
        )
        (pin passive line (at 5.08 2.54 180) (length 3.81)
          (name "Pin_1" (effects (font (size 1.27 1.27))))
          (number "1" (effects (font (size 1.27 1.27))))
        )
        (pin passive line (at 5.08 0 180) (length 3.81)
          (name "Pin_2" (effects (font (size 1.27 1.27))))
          (number "2" (effects (font (size 1.27 1.27))))
        )
        (pin passive line (at 5.08 -2.54 180) (length 3.81)
          (name "Pin_3" (effects (font (size 1.27 1.27))))
          (number "3" (effects (font (size 1.27 1.27))))
        )
        (pin passive line (at 5.08 -5.08 180) (length 3.81)
          (name "Pin_4" (effects (font (size 1.27 1.27))))
          (number "4" (effects (font (size 1.27 1.27))))
        )
      )
    )
    (symbol "Device:R_US" (pin_numbers hide) (pin_names (offset 0)) (in_bom yes) (on_board yes)
      (property "Reference" "R" (at 2.54 0 90)
        (effects (font (size 1.27 1.27)))
      )
      (property "Value" "R_US" (at -2.54 0 90)
        (effects (font (size 1.27 1.27)))
      )
      (property "Footprint" "" (at 1.016 -0.254 90)
        (effects (font (size 1.27 1.27)) hide)
      )
      (property "Datasheet" "~" (at 0 0 0)
        (effects (font (size 1.27 1.27)) hide)
      )
      (property "ki_keywords" "R res resistor" (at 0 0 0)
        (effects (font (size 1.27 1.27)) hide)
      )
      (property "ki_description" "Resistor, US symbol" (at 0 0 0)
        (effects (font (size 1.27 1.27)) hide)
      )
      (property "ki_fp_filters" "R_*" (at 0 0 0)
        (effects (font (size 1.27 1.27)) hide)
      )
      (symbol "R_US_0_1"
        (polyline
          (pts
            (xy 0 -2.286)
            (xy 0 -2.54)
          )
          (stroke (width 0) (type default))
          (fill (type none))
        )
        (polyline
          (pts
            (xy 0 2.286)
            (xy 0 2.54)
          )
          (stroke (width 0) (type default))
          (fill (type none))
        )
        (polyline
          (pts
            (xy 0 -0.762)
            (xy 1.016 -1.143)
            (xy 0 -1.524)
            (xy -1.016 -1.905)
            (xy 0 -2.286)
          )
          (stroke (width 0) (type default))
          (fill (type none))
        )
        (polyline
          (pts
            (xy 0 0.762)
            (xy 1.016 0.381)
            (xy 0 0)
            (xy -1.016 -0.381)
            (xy 0 -0.762)
          )
          (stroke (width 0) (type default))
          (fill (type none))
        )
        (polyline
          (pts
            (xy 0 2.286)
            (xy 1.016 1.905)
            (xy 0 1.524)
            (xy -1.016 1.143)
            (xy 0 0.762)
          )
          (stroke (width 0) (type default))
          (fill (type none))
        )
      )
      (symbol "R_US_1_1"
        (pin passive line (at 0 3.81 270) (length 1.27)
          (name "~" (effects (font (size 1.27 1.27))))
          (number "1" (effects (font (size 1.27 1.27))))
        )
        (pin passive line (at 0 -3.81 90) (length 1.27)
          (name "~" (effects (font (size 1.27 1.27))))
          (number "2" (effects (font (size 1.27 1.27))))
        )
      )
    )
    (symbol "Fluidics:PMV19XNEAR" (pin_names hide) (in_bom yes) (on_board yes)
      (property "Reference" "Q" (at 11.43 3.81 0)
        (effects (font (size 1.27 1.27)) (justify left top))
      )
      (property "Value" "PMV19XNEAR" (at 11.43 1.27 0)
        (effects (font (size 1.27 1.27)) (justify left top))
      )
      (property "Footprint" "SOT95P230X110-3N" (at 11.43 -98.73 0)
        (effects (font (size 1.27 1.27)) (justify left top) hide)
      )
      (property "Datasheet" "https://ms.componentsearchengine.com/Datasheets/2/PMV19XNEAR.pdf" (at 11.43 -198.73 0)
        (effects (font (size 1.27 1.27)) (justify left top) hide)
      )
      (property "Height" "1.1" (at 11.43 -398.73 0)
        (effects (font (size 1.27 1.27)) (justify left top) hide)
      )
      (property "Mouser Part Number" "771-PMV19XNEAR" (at 11.43 -498.73 0)
        (effects (font (size 1.27 1.27)) (justify left top) hide)
      )
      (property "Mouser Price/Stock" "https://www.mouser.co.uk/ProductDetail/Nexperia/PMV19XNEAR?qs=Cb2nCFKsA8o02et6mse8sg%3D%3D" (at 11.43 -598.73 0)
        (effects (font (size 1.27 1.27)) (justify left top) hide)
      )
      (property "Manufacturer_Name" "Nexperia" (at 11.43 -698.73 0)
        (effects (font (size 1.27 1.27)) (justify left top) hide)
      )
      (property "Manufacturer_Part_Number" "PMV19XNEAR" (at 11.43 -798.73 0)
        (effects (font (size 1.27 1.27)) (justify left top) hide)
      )
      (property "ki_description" "NEXPERIA - PMV19XNEAR - Power MOSFET, N Channel, 30 V, 6 A, 0.019 ohm, TO-236AB, Surface Mount" (at 0 0 0)
        (effects (font (size 1.27 1.27)) hide)
      )
      (symbol "PMV19XNEAR_1_1"
        (polyline
          (pts
            (xy 2.54 0)
            (xy 5.08 0)
          )
          (stroke (width 0.254) (type default))
          (fill (type none))
        )
        (polyline
          (pts
            (xy 5.08 5.08)
            (xy 5.08 0)
          )
          (stroke (width 0.254) (type default))
          (fill (type none))
        )
        (polyline
          (pts
            (xy 5.842 -0.508)
            (xy 5.842 0.508)
          )
          (stroke (width 0.254) (type default))
          (fill (type none))
        )
        (polyline
          (pts
            (xy 5.842 0)
            (xy 7.62 0)
          )
          (stroke (width 0.254) (type default))
          (fill (type none))
        )
        (polyline
          (pts
            (xy 5.842 2.032)
            (xy 5.842 3.048)
          )
          (stroke (width 0.254) (type default))
          (fill (type none))
        )
        (polyline
          (pts
            (xy 5.842 5.588)
            (xy 5.842 4.572)
          )
          (stroke (width 0.254) (type default))
          (fill (type none))
        )
        (polyline
          (pts
            (xy 7.62 2.54)
            (xy 5.842 2.54)
          )
          (stroke (width 0.254) (type default))
          (fill (type none))
        )
        (polyline
          (pts
            (xy 7.62 2.54)
            (xy 7.62 -2.54)
          )
          (stroke (width 0.254) (type default))
          (fill (type none))
        )
        (polyline
          (pts
            (xy 7.62 5.08)
            (xy 5.842 5.08)
          )
          (stroke (width 0.254) (type default))
          (fill (type none))
        )
        (polyline
          (pts
            (xy 7.62 5.08)
            (xy 7.62 7.62)
          )
          (stroke (width 0.254) (type default))
          (fill (type none))
        )
        (polyline
          (pts
            (xy 5.842 2.54)
            (xy 6.858 3.048)
            (xy 6.858 2.032)
            (xy 5.842 2.54)
          )
          (stroke (width 0.254) (type default))
          (fill (type outline))
        )
        (circle (center 6.35 2.54) (radius 3.81)
          (stroke (width 0.254) (type default))
          (fill (type none))
        )
        (pin passive line (at 0 0 0) (length 2.54)
          (name "G" (effects (font (size 1.27 1.27))))
          (number "1" (effects (font (size 1.27 1.27))))
        )
        (pin passive line (at 7.62 -5.08 90) (length 2.54)
          (name "S" (effects (font (size 1.27 1.27))))
          (number "2" (effects (font (size 1.27 1.27))))
        )
        (pin passive line (at 7.62 10.16 270) (length 2.54)
          (name "D" (effects (font (size 1.27 1.27))))
          (number "3" (effects (font (size 1.27 1.27))))
        )
      )
    )
    (symbol "power:GND" (power) (pin_names (offset 0)) (in_bom yes) (on_board yes)
      (property "Reference" "#PWR" (at 0 -6.35 0)
        (effects (font (size 1.27 1.27)) hide)
      )
      (property "Value" "GND" (at 0 -3.81 0)
        (effects (font (size 1.27 1.27)))
      )
      (property "Footprint" "" (at 0 0 0)
        (effects (font (size 1.27 1.27)) hide)
      )
      (property "Datasheet" "" (at 0 0 0)
        (effects (font (size 1.27 1.27)) hide)
      )
      (property "ki_keywords" "global power" (at 0 0 0)
        (effects (font (size 1.27 1.27)) hide)
      )
      (property "ki_description" "Power symbol creates a global label with name \"GND\" , ground" (at 0 0 0)
        (effects (font (size 1.27 1.27)) hide)
      )
      (symbol "GND_0_1"
        (polyline
          (pts
            (xy 0 0)
            (xy 0 -1.27)
            (xy 1.27 -1.27)
            (xy 0 -2.54)
            (xy -1.27 -1.27)
            (xy 0 -1.27)
          )
          (stroke (width 0) (type default))
          (fill (type none))
        )
      )
      (symbol "GND_1_1"
        (pin power_in line (at 0 0 270) (length 0) hide
          (name "GND" (effects (font (size 1.27 1.27))))
          (number "1" (effects (font (size 1.27 1.27))))
        )
      )
    )
  )


  (wire (pts (xy 143.51 93.98) (xy 143.51 97.79))
    (stroke (width 0) (type default))
    (uuid 34f73546-4f57-4355-871a-249fc74b39fb)
  )
  (wire (pts (xy 82.55 93.98) (xy 82.55 96.52))
    (stroke (width 0) (type default))
    (uuid 79e55e22-12f1-4715-bc8c-68ee225f0427)
  )
  (wire (pts (xy 113.03 93.98) (xy 113.03 96.52))
    (stroke (width 0) (type default))
    (uuid 9155f621-3104-44e8-ac22-a81bdef46ae3)
  )
  (wire (pts (xy 171.45 93.98) (xy 171.45 97.79))
    (stroke (width 0) (type default))
    (uuid 99eaf1f4-fb59-4b83-b69e-c698576ab2c3)
  )

  (label "Vg4+" (at 170.18 121.92 0) (fields_autoplaced)
    (effects (font (size 1.27 1.27)) (justify left bottom))
    (uuid 071dc9e7-7d46-4d23-b9d8-571ededa9992)
  )
  (label "Vcc" (at 113.03 86.36 0) (fields_autoplaced)
    (effects (font (size 1.27 1.27)) (justify left bottom))
    (uuid 27569d1c-de3a-4a6c-84c5-f75fddfb046c)
    (property "Vcc" "" (at 113.03 87.63 0)
      (effects (font (size 1.27 1.27) italic) (justify left))
    )
  )
  (label "Vg1+" (at 78.74 115.57 0) (fields_autoplaced)
    (effects (font (size 1.27 1.27)) (justify left bottom))
    (uuid 2ebca28d-7f07-4f67-b9e6-c1675c3a61af)
  )
  (label "Vg2-" (at 113.03 93.98 180) (fields_autoplaced)
    (effects (font (size 1.27 1.27)) (justify right bottom))
    (uuid 304476e7-3106-4e2d-841e-88dbfd3d3429)
  )
  (label "Vg1-" (at 78.74 118.11 0) (fields_autoplaced)
    (effects (font (size 1.27 1.27)) (justify left bottom))
    (uuid 32c32d15-684d-423f-968b-b2a2981427a5)
  )
  (label "D" (at 129.54 137.16 0) (fields_autoplaced)
    (effects (font (size 1.27 1.27)) (justify left bottom))
    (uuid 3670fa76-b866-42d1-8018-fce03a8b6f68)
  )
  (label "Vcc" (at 190.5 96.52 0) (fields_autoplaced)
    (effects (font (size 1.27 1.27)) (justify left bottom))
    (uuid 36d8cd87-8a55-4cd2-96fc-34d45c47097c)
    (property "Vcc" "" (at 190.5 97.79 0)
      (effects (font (size 1.27 1.27) italic) (justify left))
    )
  )
  (label "G" (at 129.54 134.62 0) (fields_autoplaced)
    (effects (font (size 1.27 1.27)) (justify left bottom))
    (uuid 37087472-8806-4021-b7af-3d8df4202c6f)
  )
  (label "Vg1+" (at 78.74 120.65 0) (fields_autoplaced)
    (effects (font (size 1.27 1.27)) (justify left bottom))
    (uuid 390d0dc1-8bc8-4e32-9ffa-b4e63eaebc5f)
  )
  (label "Vcc" (at 161.29 86.36 0) (fields_autoplaced)
    (effects (font (size 1.27 1.27)) (justify left bottom))
    (uuid 3f72a6b9-b302-4a98-a27c-8fbd4c22e3fe)
    (property "Vcc" "" (at 161.29 87.63 0)
      (effects (font (size 1.27 1.27) italic) (justify left))
    )
  )
  (label "S" (at 99.06 140.97 0) (fields_autoplaced)
    (effects (font (size 1.27 1.27)) (justify left bottom))
    (uuid 481a9b1f-b922-4755-b8f1-d3bdcd977fac)
  )
  (label "Vcc" (at 143.51 86.36 0) (fields_autoplaced)
    (effects (font (size 1.27 1.27)) (justify left bottom))
    (uuid 5633fd93-b3f4-4c5a-90ae-8bd4814f53d1)
    (property "Vcc" "" (at 143.51 87.63 0)
      (effects (font (size 1.27 1.27) italic) (justify left))
    )
  )
  (label "Vg3-" (at 140.97 119.38 0) (fields_autoplaced)
    (effects (font (size 1.27 1.27)) (justify left bottom))
    (uuid 5df81ba9-a590-4b9d-9a2d-f2e91aece667)
  )
  (label "Vg3+" (at 140.97 121.92 0) (fields_autoplaced)
    (effects (font (size 1.27 1.27)) (justify left bottom))
    (uuid 65564247-6074-4959-bae4-8a7442391196)
  )
  (label "Vcc" (at 72.39 86.36 0) (fields_autoplaced)
    (effects (font (size 1.27 1.27)) (justify left bottom))
    (uuid 667a68e7-5d15-48a8-8622-44a92ad16d3d)
    (property "Vcc" "" (at 72.39 87.63 0)
      (effects (font (size 1.27 1.27) italic) (justify left))
    )
  )
  (label "Vg2-" (at 110.49 118.11 0) (fields_autoplaced)
    (effects (font (size 1.27 1.27)) (justify left bottom))
    (uuid 693a6b7c-2062-4c93-9815-f0b3f6ab1065)
  )
  (label "Vcc" (at 133.35 86.36 0) (fields_autoplaced)
    (effects (font (size 1.27 1.27)) (justify left bottom))
    (uuid 6c305f66-e626-4e7a-8d1f-d24c8461a2cf)
    (property "Vcc" "" (at 133.35 87.63 0)
      (effects (font (size 1.27 1.27) italic) (justify left))
    )
  )
  (label "Vg3-" (at 143.51 93.98 180) (fields_autoplaced)
    (effects (font (size 1.27 1.27)) (justify right bottom))
    (uuid 70ecf1e2-5ef2-43e1-a725-6a5b4f079000)
  )
  (label "S" (at 129.54 139.7 0) (fields_autoplaced)
    (effects (font (size 1.27 1.27)) (justify left bottom))
    (uuid 7261d22d-c2bd-412d-95b1-1acc485ea972)
  )
  (label "Vcc" (at 82.55 86.36 0) (fields_autoplaced)
    (effects (font (size 1.27 1.27)) (justify left bottom))
    (uuid 794f5506-627c-4a0a-8f0a-19476cf1cf5b)
    (property "Vcc" "" (at 82.55 87.63 0)
      (effects (font (size 1.27 1.27) italic) (justify left))
    )
  )
  (label "Vg4-" (at 170.18 119.38 0) (fields_autoplaced)
    (effects (font (size 1.27 1.27)) (justify left bottom))
    (uuid 83486073-c1a1-4094-b006-2307ce75e487)
  )
  (label "Vcc" (at 171.45 86.36 0) (fields_autoplaced)
    (effects (font (size 1.27 1.27)) (justify left bottom))
    (uuid 84f44e8d-d7af-43ce-8a48-d55a8fe07dfe)
    (property "Vcc" "" (at 171.45 87.63 0)
      (effects (font (size 1.27 1.27) italic) (justify left))
    )
  )
  (label "D" (at 99.06 125.73 0) (fields_autoplaced)
    (effects (font (size 1.27 1.27)) (justify left bottom))
    (uuid 8b7cac01-14ca-4168-9d2e-458f92b09824)
  )
  (label "Vg4+" (at 161.29 93.98 180) (fields_autoplaced)
    (effects (font (size 1.27 1.27)) (justify right bottom))
    (uuid 9c1cb4ec-21dd-47a9-87ee-efd980e21b85)
  )
  (label "Vg4-" (at 171.45 93.98 180) (fields_autoplaced)
    (effects (font (size 1.27 1.27)) (justify right bottom))
    (uuid a2c2b760-17c7-4978-af00-f4518b6f2f31)
  )
  (label "Vg2+" (at 110.49 120.65 0) (fields_autoplaced)
    (effects (font (size 1.27 1.27)) (justify left bottom))
    (uuid ac2878f2-c987-46d0-98e3-32c925cc7041)
  )
  (label "Vg1+" (at 72.39 93.98 180) (fields_autoplaced)
    (effects (font (size 1.27 1.27)) (justify right bottom))
    (uuid b8b81b57-affc-4ee7-ab2b-a2ec910dda3e)
  )
  (label "Vg2+" (at 110.49 115.57 0) (fields_autoplaced)
    (effects (font (size 1.27 1.27)) (justify left bottom))
    (uuid be72a2aa-e27a-462e-be27-8f032563eaab)
  )
  (label "Vg2+" (at 101.6 93.98 180) (fields_autoplaced)
    (effects (font (size 1.27 1.27)) (justify right bottom))
    (uuid bf7d275e-9131-44ae-a7ec-f8b882521c5e)
  )
  (label "Vg4+" (at 170.18 116.84 0) (fields_autoplaced)
    (effects (font (size 1.27 1.27)) (justify left bottom))
    (uuid d09831a9-1f6d-4046-b752-e93631c2a9dd)
  )
  (label "Vcc" (at 101.6 86.36 0) (fields_autoplaced)
    (effects (font (size 1.27 1.27)) (justify left bottom))
    (uuid df415573-399a-4175-b5f7-6ff395d1f54d)
    (property "Vcc" "" (at 101.6 87.63 0)
      (effects (font (size 1.27 1.27) italic) (justify left))
    )
  )
  (label "Vg3+" (at 140.97 116.84 0) (fields_autoplaced)
    (effects (font (size 1.27 1.27)) (justify left bottom))
    (uuid e1df101a-f42e-4bc6-9a30-c9b36e54ffae)
  )
  (label "Vg1-" (at 82.55 93.98 0) (fields_autoplaced)
    (effects (font (size 1.27 1.27)) (justify left bottom))
    (uuid f05042a3-0bf6-4ba3-9cf2-3151be58dbda)
  )
  (label "G" (at 91.44 135.89 180) (fields_autoplaced)
    (effects (font (size 1.27 1.27)) (justify right bottom))
    (uuid f4dc0528-e580-448c-afb9-26426c1bf135)
  )
  (label "Vg3+" (at 133.35 93.98 180) (fields_autoplaced)
    (effects (font (size 1.27 1.27)) (justify right bottom))
    (uuid f7941bd9-31bb-49f2-ac46-0dbbff76f3a5)
  )

  (symbol (lib_id "power:GND") (at 190.5 99.06 0) (unit 1)
    (in_bom yes) (on_board yes) (dnp no) (fields_autoplaced)
    (uuid 0ab0bcf7-4cbf-469a-9648-0a3d31579874)
    (property "Reference" "#PWR09" (at 190.5 105.41 0)
      (effects (font (size 1.27 1.27)) hide)
    )
    (property "Value" "GND" (at 190.5 104.14 0)
      (effects (font (size 1.27 1.27)))
    )
    (property "Footprint" "" (at 190.5 99.06 0)
      (effects (font (size 1.27 1.27)) hide)
    )
    (property "Datasheet" "" (at 190.5 99.06 0)
      (effects (font (size 1.27 1.27)) hide)
    )
    (pin "1" (uuid 9f537eea-e599-4ed2-b4a5-3d26475db4e2))
    (instances
      (project "rtd_berakout"
        (path "/0ee520f3-5556-41f8-afe3-2c653838ec03"
          (reference "#PWR09") (unit 1)
        )
      )
    )
  )

  (symbol (lib_id "Connector:Conn_01x04_Pin") (at 73.66 118.11 0) (unit 1)
    (in_bom yes) (on_board yes) (dnp no) (fields_autoplaced)
    (uuid 100f92f6-ee40-4520-b567-ec79fc60898f)
    (property "Reference" "RTD1" (at 74.295 110.49 0)
      (effects (font (size 1.27 1.27)))
    )
    (property "Value" "Conn_01x04_Pin" (at 74.295 113.03 0)
      (effects (font (size 1.27 1.27)))
    )
    (property "Footprint" "Connector_PinHeader_2.54mm:PinHeader_1x04_P2.54mm_Vertical" (at 73.66 118.11 0)
      (effects (font (size 1.27 1.27)) hide)
    )
    (property "Datasheet" "~" (at 73.66 118.11 0)
      (effects (font (size 1.27 1.27)) hide)
    )
    (pin "2" (uuid 5d17ca54-9b11-4e47-85f7-da033a680dba))
    (pin "1" (uuid cbb811db-c634-466c-af98-7c0efd5aa1c4))
    (pin "3" (uuid 0e598e9f-77e6-4ada-a910-5c75472d3757))
    (pin "4" (uuid dfef2f8d-8f29-4ad0-9af6-fdf6fdd7f9b7))
    (instances
      (project "rtd_berakout"
        (path "/0ee520f3-5556-41f8-afe3-2c653838ec03"
          (reference "RTD1") (unit 1)
        )
      )
    )
  )

  (symbol (lib_id "Device:R_US") (at 72.39 90.17 180) (unit 1)
    (in_bom yes) (on_board yes) (dnp no) (fields_autoplaced)
    (uuid 227beefd-57d7-4831-b62b-9258181fb58a)
    (property "Reference" "R11" (at 74.93 90.17 0)
      (effects (font (size 1.27 1.27)) (justify right))
    )
    (property "Value" "R_US" (at 69.85 88.9 0)
      (effects (font (size 1.27 1.27)) (justify left) hide)
    )
    (property "Footprint" "Resistor_SMD:R_0402_1005Metric" (at 71.374 89.916 90)
      (effects (font (size 1.27 1.27)) hide)
    )
    (property "Datasheet" "~" (at 72.39 90.17 0)
      (effects (font (size 1.27 1.27)) hide)
    )
    (pin "2" (uuid 5f0a5fe0-fa9e-4e22-b401-8cedbb31b24b))
    (pin "1" (uuid 478faca5-b65a-4cb9-905e-9a56ed8db5f9))
    (instances
      (project "rtd_berakout"
        (path "/0ee520f3-5556-41f8-afe3-2c653838ec03"
          (reference "R11") (unit 1)
        )
      )
    )
  )

  (symbol (lib_id "Device:R_US") (at 113.03 90.17 180) (unit 1)
    (in_bom yes) (on_board yes) (dnp no) (fields_autoplaced)
    (uuid 36fb638a-98b8-4c17-a947-e7054e523f9f)
    (property "Reference" "R22" (at 115.57 90.17 0)
      (effects (font (size 1.27 1.27)) (justify right))
    )
    (property "Value" "R_US" (at 110.49 88.9 0)
      (effects (font (size 1.27 1.27)) (justify left) hide)
    )
    (property "Footprint" "Resistor_SMD:R_0402_1005Metric" (at 112.014 89.916 90)
      (effects (font (size 1.27 1.27)) hide)
    )
    (property "Datasheet" "~" (at 113.03 90.17 0)
      (effects (font (size 1.27 1.27)) hide)
    )
    (pin "2" (uuid de772409-1ffb-4687-9979-cbe8a0629cfe))
    (pin "1" (uuid 4bf0370a-10d6-4638-9e98-ed182c18189d))
    (instances
      (project "rtd_berakout"
        (path "/0ee520f3-5556-41f8-afe3-2c653838ec03"
          (reference "R22") (unit 1)
        )
      )
    )
  )

  (symbol (lib_id "Fluidics:PMV19XNEAR") (at 91.44 135.89 0) (unit 1)
    (in_bom yes) (on_board yes) (dnp no) (fields_autoplaced)
    (uuid 3948f935-272d-4950-9d29-ba9887294444)
    (property "Reference" "Q1" (at 102.87 132.08 0)
      (effects (font (size 1.27 1.27)) (justify left))
    )
    (property "Value" "PMV19XNEAR" (at 102.87 134.62 0)
      (effects (font (size 1.27 1.27)) (justify left))
    )
    (property "Footprint" "pmv19:PMV19" (at 102.87 234.62 0)
      (effects (font (size 1.27 1.27)) (justify left top))
    )
    (property "Datasheet" "https://ms.componentsearchengine.com/Datasheets/2/PMV19XNEAR.pdf" (at 102.87 334.62 0)
      (effects (font (size 1.27 1.27)) (justify left top) hide)
    )
    (property "Height" "1.1" (at 102.87 534.62 0)
      (effects (font (size 1.27 1.27)) (justify left top) hide)
    )
    (property "Mouser Part Number" "771-PMV19XNEAR" (at 102.87 634.62 0)
      (effects (font (size 1.27 1.27)) (justify left top) hide)
    )
    (property "Mouser Price/Stock" "https://www.mouser.co.uk/ProductDetail/Nexperia/PMV19XNEAR?qs=Cb2nCFKsA8o02et6mse8sg%3D%3D" (at 102.87 734.62 0)
      (effects (font (size 1.27 1.27)) (justify left top) hide)
    )
    (property "Manufacturer_Name" "Nexperia" (at 102.87 834.62 0)
      (effects (font (size 1.27 1.27)) (justify left top) hide)
    )
    (property "Manufacturer_Part_Number" "PMV19XNEAR" (at 102.87 934.62 0)
      (effects (font (size 1.27 1.27)) (justify left top) hide)
    )
    (pin "1" (uuid a20263f0-a90f-4218-8371-b703582f0379))
    (pin "2" (uuid c3b36fbf-d509-42ea-b1e7-9a6cb19a177f))
    (pin "3" (uuid b6c001e5-e5e7-4609-b0f9-05025deb5d96))
    (instances
      (project "rtd_berakout"
        (path "/0ee520f3-5556-41f8-afe3-2c653838ec03"
          (reference "Q1") (unit 1)
        )
      )
      (project "FluidicsV1.0"
        (path "/c471afb6-0da2-42e8-a1d4-d6270ddb8f88/d6255f2a-57d1-4e7c-a20c-a3f0c181d0b4"
          (reference "Q2") (unit 1)
        )
      )
    )
  )

  (symbol (lib_id "Device:R_US") (at 171.45 101.6 180) (unit 1)
    (in_bom yes) (on_board yes) (dnp no)
    (uuid 450eef27-b772-4747-8962-206535ceb4a3)
    (property "Reference" "R44" (at 177.8 101.6 0)
      (effects (font (size 1.27 1.27)) (justify left))
    )
    (property "Value" "R_US" (at 168.91 100.33 0)
      (effects (font (size 1.27 1.27)) (justify left) hide)
    )
    (property "Footprint" "Resistor_SMD:R_0402_1005Metric" (at 170.434 101.346 90)
      (effects (font (size 1.27 1.27)) hide)
    )
    (property "Datasheet" "~" (at 171.45 101.6 0)
      (effects (font (size 1.27 1.27)) hide)
    )
    (pin "2" (uuid 6d91a3fc-4d32-4a05-914e-1ade413b477e))
    (pin "1" (uuid 468f2f41-c3b3-492f-bb5a-eab8a1435cea))
    (instances
      (project "rtd_berakout"
        (path "/0ee520f3-5556-41f8-afe3-2c653838ec03"
          (reference "R44") (unit 1)
        )
      )
    )
  )

  (symbol (lib_id "Device:R_US") (at 171.45 90.17 180) (unit 1)
    (in_bom yes) (on_board yes) (dnp no)
    (uuid 58839027-140d-475e-8fb0-0237756e5a25)
    (property "Reference" "R42" (at 177.8 90.17 0)
      (effects (font (size 1.27 1.27)) (justify left))
    )
    (property "Value" "R_US" (at 168.91 88.9 0)
      (effects (font (size 1.27 1.27)) (justify left) hide)
    )
    (property "Footprint" "Resistor_SMD:R_0402_1005Metric" (at 170.434 89.916 90)
      (effects (font (size 1.27 1.27)) hide)
    )
    (property "Datasheet" "~" (at 171.45 90.17 0)
      (effects (font (size 1.27 1.27)) hide)
    )
    (pin "2" (uuid 411bd296-9014-481a-b39a-64ed1f5998de))
    (pin "1" (uuid d7dec8a3-ef36-47c9-893f-e00114022237))
    (instances
      (project "rtd_berakout"
        (path "/0ee520f3-5556-41f8-afe3-2c653838ec03"
          (reference "R42") (unit 1)
        )
      )
    )
  )

  (symbol (lib_id "Connector:Conn_01x03_Pin") (at 124.46 137.16 0) (unit 1)
    (in_bom yes) (on_board yes) (dnp no) (fields_autoplaced)
    (uuid 5e8fdd67-4904-4236-980e-d475def14247)
    (property "Reference" "J1" (at 125.095 129.54 0)
      (effects (font (size 1.27 1.27)))
    )
    (property "Value" "Conn_01x03_Pin" (at 125.095 132.08 0)
      (effects (font (size 1.27 1.27)))
    )
    (property "Footprint" "Connector_PinHeader_2.54mm:PinHeader_1x03_P2.54mm_Vertical" (at 124.46 137.16 0)
      (effects (font (size 1.27 1.27)) hide)
    )
    (property "Datasheet" "~" (at 124.46 137.16 0)
      (effects (font (size 1.27 1.27)) hide)
    )
    (pin "2" (uuid e30a267b-a0b4-4d5a-ac05-76035c2e3e91))
    (pin "3" (uuid 1493e6b8-d0a2-42d9-a39e-ed7c4e581c08))
    (pin "1" (uuid 3e3b54b5-aad0-44db-85b5-6433dc8f6bf1))
    (instances
      (project "rtd_berakout"
        (path "/0ee520f3-5556-41f8-afe3-2c653838ec03"
          (reference "J1") (unit 1)
        )
      )
    )
  )

  (symbol (lib_id "Device:R_US") (at 82.55 100.33 180) (unit 1)
    (in_bom yes) (on_board yes) (dnp no) (fields_autoplaced)
    (uuid 6ebbb628-f56c-43b3-b05a-35fefa1913cc)
    (property "Reference" "R14" (at 85.09 100.33 0)
      (effects (font (size 1.27 1.27)) (justify right))
    )
    (property "Value" "R_US" (at 80.01 99.06 0)
      (effects (font (size 1.27 1.27)) (justify left) hide)
    )
    (property "Footprint" "Resistor_SMD:R_0402_1005Metric" (at 81.534 100.076 90)
      (effects (font (size 1.27 1.27)) hide)
    )
    (property "Datasheet" "~" (at 82.55 100.33 0)
      (effects (font (size 1.27 1.27)) hide)
    )
    (pin "2" (uuid 6ce436dd-c7ee-4dbe-ab6c-fc0bdd71ffeb))
    (pin "1" (uuid e9d15c87-20de-4fde-a01f-b9ac622c8bd4))
    (instances
      (project "rtd_berakout"
        (path "/0ee520f3-5556-41f8-afe3-2c653838ec03"
          (reference "R14") (unit 1)
        )
      )
    )
  )

  (symbol (lib_id "power:GND") (at 82.55 104.14 0) (unit 1)
    (in_bom yes) (on_board yes) (dnp no) (fields_autoplaced)
    (uuid 711f01b2-c605-4e1d-9e87-91deb7eec7c0)
    (property "Reference" "#PWR04" (at 82.55 110.49 0)
      (effects (font (size 1.27 1.27)) hide)
    )
    (property "Value" "GND" (at 82.55 109.22 0)
      (effects (font (size 1.27 1.27)))
    )
    (property "Footprint" "" (at 82.55 104.14 0)
      (effects (font (size 1.27 1.27)) hide)
    )
    (property "Datasheet" "" (at 82.55 104.14 0)
      (effects (font (size 1.27 1.27)) hide)
    )
    (pin "1" (uuid cbed2664-cda2-4777-aca0-66eb89768e5f))
    (instances
      (project "rtd_berakout"
        (path "/0ee520f3-5556-41f8-afe3-2c653838ec03"
          (reference "#PWR04") (unit 1)
        )
      )
    )
  )

  (symbol (lib_id "Device:R_US") (at 161.29 90.17 180) (unit 1)
    (in_bom yes) (on_board yes) (dnp no)
    (uuid 741d51fe-b55a-488f-a17f-918863a5fa44)
    (property "Reference" "R41" (at 167.64 90.17 0)
      (effects (font (size 1.27 1.27)) (justify left))
    )
    (property "Value" "R_US" (at 158.75 88.9 0)
      (effects (font (size 1.27 1.27)) (justify left) hide)
    )
    (property "Footprint" "Resistor_SMD:R_0402_1005Metric" (at 160.274 89.916 90)
      (effects (font (size 1.27 1.27)) hide)
    )
    (property "Datasheet" "~" (at 161.29 90.17 0)
      (effects (font (size 1.27 1.27)) hide)
    )
    (pin "2" (uuid f9f24e7e-b1a5-42b9-9bf6-f589f549d18c))
    (pin "1" (uuid 6b6b9732-c5d8-4b7b-8281-aa6efd23608a))
    (instances
      (project "rtd_berakout"
        (path "/0ee520f3-5556-41f8-afe3-2c653838ec03"
          (reference "R41") (unit 1)
        )
      )
    )
  )

  (symbol (lib_id "Device:R_US") (at 133.35 90.17 180) (unit 1)
    (in_bom yes) (on_board yes) (dnp no) (fields_autoplaced)
    (uuid 749d9276-5a36-4b92-8ecc-72bcb3cc391b)
    (property "Reference" "R31" (at 135.89 90.17 0)
      (effects (font (size 1.27 1.27)) (justify right))
    )
    (property "Value" "R_US" (at 130.81 88.9 0)
      (effects (font (size 1.27 1.27)) (justify left) hide)
    )
    (property "Footprint" "Resistor_SMD:R_0402_1005Metric" (at 132.334 89.916 90)
      (effects (font (size 1.27 1.27)) hide)
    )
    (property "Datasheet" "~" (at 133.35 90.17 0)
      (effects (font (size 1.27 1.27)) hide)
    )
    (pin "2" (uuid 31fa2b95-23a8-4c96-b1ac-9fa9130d724b))
    (pin "1" (uuid 4b143efd-2eb1-483d-af2c-cb9e912ee682))
    (instances
      (project "rtd_berakout"
        (path "/0ee520f3-5556-41f8-afe3-2c653838ec03"
          (reference "R31") (unit 1)
        )
      )
    )
  )

  (symbol (lib_id "Device:R_US") (at 143.51 101.6 180) (unit 1)
    (in_bom yes) (on_board yes) (dnp no) (fields_autoplaced)
    (uuid 7ae0d593-c572-40f3-9b51-a42920801ddb)
    (property "Reference" "R34" (at 146.05 101.6 0)
      (effects (font (size 1.27 1.27)) (justify right))
    )
    (property "Value" "R_US" (at 140.97 100.33 0)
      (effects (font (size 1.27 1.27)) (justify left) hide)
    )
    (property "Footprint" "Resistor_SMD:R_0402_1005Metric" (at 142.494 101.346 90)
      (effects (font (size 1.27 1.27)) hide)
    )
    (property "Datasheet" "~" (at 143.51 101.6 0)
      (effects (font (size 1.27 1.27)) hide)
    )
    (pin "2" (uuid fe3dbeae-ddab-4a87-8d73-b62f118c8b74))
    (pin "1" (uuid 1501cf20-7531-4c36-8f74-9605c20a3c56))
    (instances
      (project "rtd_berakout"
        (path "/0ee520f3-5556-41f8-afe3-2c653838ec03"
          (reference "R34") (unit 1)
        )
      )
    )
  )

  (symbol (lib_id "Device:R_US") (at 82.55 90.17 180) (unit 1)
    (in_bom yes) (on_board yes) (dnp no) (fields_autoplaced)
    (uuid 81a8629d-e978-4ce9-aeaa-22fb2f4df948)
    (property "Reference" "R12" (at 85.09 90.17 0)
      (effects (font (size 1.27 1.27)) (justify right))
    )
    (property "Value" "R_US" (at 80.01 88.9 0)
      (effects (font (size 1.27 1.27)) (justify left) hide)
    )
    (property "Footprint" "Resistor_SMD:R_0402_1005Metric" (at 81.534 89.916 90)
      (effects (font (size 1.27 1.27)) hide)
    )
    (property "Datasheet" "~" (at 82.55 90.17 0)
      (effects (font (size 1.27 1.27)) hide)
    )
    (pin "2" (uuid eb143706-aae8-4a38-a84a-d98ccafac9d9))
    (pin "1" (uuid 2bc9323d-53a7-4c5d-8225-7c5ec152c688))
    (instances
      (project "rtd_berakout"
        (path "/0ee520f3-5556-41f8-afe3-2c653838ec03"
          (reference "R12") (unit 1)
        )
      )
    )
  )

  (symbol (lib_id "power:GND") (at 140.97 124.46 0) (unit 1)
    (in_bom yes) (on_board yes) (dnp no) (fields_autoplaced)
    (uuid 87f18c5d-6b90-4bd4-b83e-56e4cb104155)
    (property "Reference" "#PWR07" (at 140.97 130.81 0)
      (effects (font (size 1.27 1.27)) hide)
    )
    (property "Value" "GND" (at 140.97 129.54 0)
      (effects (font (size 1.27 1.27)))
    )
    (property "Footprint" "" (at 140.97 124.46 0)
      (effects (font (size 1.27 1.27)) hide)
    )
    (property "Datasheet" "" (at 140.97 124.46 0)
      (effects (font (size 1.27 1.27)) hide)
    )
    (pin "1" (uuid e4dee988-1667-48c0-a6da-91de50e25186))
    (instances
      (project "rtd_berakout"
        (path "/0ee520f3-5556-41f8-afe3-2c653838ec03"
          (reference "#PWR07") (unit 1)
        )
      )
    )
  )

  (symbol (lib_id "power:GND") (at 113.03 104.14 0) (unit 1)
    (in_bom yes) (on_board yes) (dnp no) (fields_autoplaced)
    (uuid 8c760e6e-818b-4169-91f7-d0521692d557)
    (property "Reference" "#PWR03" (at 113.03 110.49 0)
      (effects (font (size 1.27 1.27)) hide)
    )
    (property "Value" "GND" (at 113.03 109.22 0)
      (effects (font (size 1.27 1.27)))
    )
    (property "Footprint" "" (at 113.03 104.14 0)
      (effects (font (size 1.27 1.27)) hide)
    )
    (property "Datasheet" "" (at 113.03 104.14 0)
      (effects (font (size 1.27 1.27)) hide)
    )
    (pin "1" (uuid 85ba92a7-c798-4ab1-83d1-04bd01985e00))
    (instances
      (project "rtd_berakout"
        (path "/0ee520f3-5556-41f8-afe3-2c653838ec03"
          (reference "#PWR03") (unit 1)
        )
      )
    )
  )

  (symbol (lib_id "power:GND") (at 170.18 124.46 0) (unit 1)
    (in_bom yes) (on_board yes) (dnp no) (fields_autoplaced)
    (uuid 92b09e86-a174-4d2a-a08f-dfb0ade8f528)
    (property "Reference" "#PWR08" (at 170.18 130.81 0)
      (effects (font (size 1.27 1.27)) hide)
    )
    (property "Value" "GND" (at 170.18 129.54 0)
      (effects (font (size 1.27 1.27)))
    )
    (property "Footprint" "" (at 170.18 124.46 0)
      (effects (font (size 1.27 1.27)) hide)
    )
    (property "Datasheet" "" (at 170.18 124.46 0)
      (effects (font (size 1.27 1.27)) hide)
    )
    (pin "1" (uuid bb177463-0756-462c-a0cb-da0e264a93c0))
    (instances
      (project "rtd_berakout"
        (path "/0ee520f3-5556-41f8-afe3-2c653838ec03"
          (reference "#PWR08") (unit 1)
        )
      )
    )
  )

  (symbol (lib_id "Device:R_US") (at 113.03 100.33 180) (unit 1)
    (in_bom yes) (on_board yes) (dnp no) (fields_autoplaced)
    (uuid 99461ac7-6d2f-4f10-b923-8a5ddcc6026f)
    (property "Reference" "R24" (at 115.57 100.33 0)
      (effects (font (size 1.27 1.27)) (justify right))
    )
    (property "Value" "R_US" (at 110.49 99.06 0)
      (effects (font (size 1.27 1.27)) (justify left) hide)
    )
    (property "Footprint" "Resistor_SMD:R_0402_1005Metric" (at 112.014 100.076 90)
      (effects (font (size 1.27 1.27)) hide)
    )
    (property "Datasheet" "~" (at 113.03 100.33 0)
      (effects (font (size 1.27 1.27)) hide)
    )
    (pin "2" (uuid 3e2b50da-715d-4e6c-9bf1-8be4cdc0b63a))
    (pin "1" (uuid ce1d3bdb-e406-41af-8e2a-b1e6f719b8f4))
    (instances
      (project "rtd_berakout"
        (path "/0ee520f3-5556-41f8-afe3-2c653838ec03"
          (reference "R24") (unit 1)
        )
      )
    )
  )

  (symbol (lib_id "Connector:Conn_01x02_Pin") (at 185.42 96.52 0) (unit 1)
    (in_bom yes) (on_board yes) (dnp no) (fields_autoplaced)
    (uuid 9dd81126-3404-4d1f-9740-afa88066650f)
    (property "Reference" "Power1" (at 186.055 91.44 0)
      (effects (font (size 1.27 1.27)))
    )
    (property "Value" "Conn_01x02_Pin" (at 186.055 93.98 0)
      (effects (font (size 1.27 1.27)))
    )
    (property "Footprint" "Connector_PinHeader_2.54mm:PinHeader_1x02_P2.54mm_Vertical" (at 185.42 96.52 0)
      (effects (font (size 1.27 1.27)) hide)
    )
    (property "Datasheet" "~" (at 185.42 96.52 0)
      (effects (font (size 1.27 1.27)) hide)
    )
    (pin "2" (uuid b95275b4-5fcb-4ea5-9eb4-f11749d0662a))
    (pin "1" (uuid 19cc39f8-c7f9-4e9e-b835-4acea81d686a))
    (instances
      (project "rtd_berakout"
        (path "/0ee520f3-5556-41f8-afe3-2c653838ec03"
          (reference "Power1") (unit 1)
        )
      )
    )
  )

  (symbol (lib_id "power:GND") (at 171.45 105.41 0) (unit 1)
    (in_bom yes) (on_board yes) (dnp no) (fields_autoplaced)
    (uuid a3872d1f-8a17-4019-947a-495a9f6ace2e)
    (property "Reference" "#PWR02" (at 171.45 111.76 0)
      (effects (font (size 1.27 1.27)) hide)
    )
    (property "Value" "GND" (at 171.45 110.49 0)
      (effects (font (size 1.27 1.27)))
    )
    (property "Footprint" "" (at 171.45 105.41 0)
      (effects (font (size 1.27 1.27)) hide)
    )
    (property "Datasheet" "" (at 171.45 105.41 0)
      (effects (font (size 1.27 1.27)) hide)
    )
    (pin "1" (uuid 1c0c8baa-b8f8-4a24-8ce9-425943bc5e44))
    (instances
      (project "rtd_berakout"
        (path "/0ee520f3-5556-41f8-afe3-2c653838ec03"
          (reference "#PWR02") (unit 1)
        )
      )
    )
  )

  (symbol (lib_id "power:GND") (at 143.51 105.41 0) (unit 1)
    (in_bom yes) (on_board yes) (dnp no) (fields_autoplaced)
    (uuid a638e887-0c9d-4789-92b3-47400d65baaa)
    (property "Reference" "#PWR01" (at 143.51 111.76 0)
      (effects (font (size 1.27 1.27)) hide)
    )
    (property "Value" "GND" (at 143.51 110.49 0)
      (effects (font (size 1.27 1.27)))
    )
    (property "Footprint" "" (at 143.51 105.41 0)
      (effects (font (size 1.27 1.27)) hide)
    )
    (property "Datasheet" "" (at 143.51 105.41 0)
      (effects (font (size 1.27 1.27)) hide)
    )
    (pin "1" (uuid 194175a7-0875-485e-80ee-d6e1c659bdb9))
    (instances
      (project "rtd_berakout"
        (path "/0ee520f3-5556-41f8-afe3-2c653838ec03"
          (reference "#PWR01") (unit 1)
        )
      )
    )
  )

  (symbol (lib_id "Connector:Conn_01x04_Pin") (at 105.41 118.11 0) (unit 1)
    (in_bom yes) (on_board yes) (dnp no) (fields_autoplaced)
    (uuid a6aac5e5-0072-44d9-949c-2c6d4cda01e6)
    (property "Reference" "RTD2" (at 106.045 110.49 0)
      (effects (font (size 1.27 1.27)))
    )
    (property "Value" "Conn_01x04_Pin" (at 106.045 113.03 0)
      (effects (font (size 1.27 1.27)))
    )
    (property "Footprint" "Connector_PinHeader_2.54mm:PinHeader_1x04_P2.54mm_Vertical" (at 105.41 118.11 0)
      (effects (font (size 1.27 1.27)) hide)
    )
    (property "Datasheet" "~" (at 105.41 118.11 0)
      (effects (font (size 1.27 1.27)) hide)
    )
    (pin "2" (uuid b3cfdbec-79e8-4557-90e6-416fcbd98a74))
    (pin "1" (uuid 0d540268-35da-4f5a-a82f-0552de5fa160))
    (pin "3" (uuid 96c08147-6b35-4bd6-888b-534999f0c97d))
    (pin "4" (uuid 4ce1fba5-56a4-40fc-96c9-979800ff462a))
    (instances
      (project "rtd_berakout"
        (path "/0ee520f3-5556-41f8-afe3-2c653838ec03"
          (reference "RTD2") (unit 1)
        )
      )
    )
  )

  (symbol (lib_id "power:GND") (at 110.49 123.19 0) (unit 1)
    (in_bom yes) (on_board yes) (dnp no) (fields_autoplaced)
    (uuid c54a2dce-683d-42e0-b55a-65789fed94ff)
    (property "Reference" "#PWR06" (at 110.49 129.54 0)
      (effects (font (size 1.27 1.27)) hide)
    )
    (property "Value" "GND" (at 110.49 128.27 0)
      (effects (font (size 1.27 1.27)))
    )
    (property "Footprint" "" (at 110.49 123.19 0)
      (effects (font (size 1.27 1.27)) hide)
    )
    (property "Datasheet" "" (at 110.49 123.19 0)
      (effects (font (size 1.27 1.27)) hide)
    )
    (pin "1" (uuid f8463846-5adc-4dec-86b1-57dc4796f75c))
    (instances
      (project "rtd_berakout"
        (path "/0ee520f3-5556-41f8-afe3-2c653838ec03"
          (reference "#PWR06") (unit 1)
        )
      )
    )
  )

  (symbol (lib_id "Connector:Conn_01x04_Pin") (at 135.89 119.38 0) (unit 1)
    (in_bom yes) (on_board yes) (dnp no) (fields_autoplaced)
    (uuid cdb0b345-8f36-4777-b429-d026b5a3e448)
    (property "Reference" "RTD3" (at 136.525 111.76 0)
      (effects (font (size 1.27 1.27)))
    )
    (property "Value" "Conn_01x04_Pin" (at 136.525 114.3 0)
      (effects (font (size 1.27 1.27)))
    )
    (property "Footprint" "Connector_PinHeader_2.54mm:PinHeader_1x04_P2.54mm_Vertical" (at 135.89 119.38 0)
      (effects (font (size 1.27 1.27)) hide)
    )
    (property "Datasheet" "~" (at 135.89 119.38 0)
      (effects (font (size 1.27 1.27)) hide)
    )
    (pin "2" (uuid c5725a74-e058-4559-b20f-113921cc9860))
    (pin "1" (uuid 261f7715-e0ee-4e1e-855f-dfcaf5734435))
    (pin "3" (uuid a871ea02-bc99-408a-ac2e-57c5a9bd558e))
    (pin "4" (uuid 44e7caf6-3dd9-4e8f-b9af-632c2fa862d7))
    (instances
      (project "rtd_berakout"
        (path "/0ee520f3-5556-41f8-afe3-2c653838ec03"
          (reference "RTD3") (unit 1)
        )
      )
    )
  )

  (symbol (lib_id "power:GND") (at 78.74 123.19 0) (unit 1)
    (in_bom yes) (on_board yes) (dnp no) (fields_autoplaced)
    (uuid d67a0063-1754-48d9-96f7-5d9e9ee1cd98)
    (property "Reference" "#PWR05" (at 78.74 129.54 0)
      (effects (font (size 1.27 1.27)) hide)
    )
    (property "Value" "GND" (at 78.74 128.27 0)
      (effects (font (size 1.27 1.27)))
    )
    (property "Footprint" "" (at 78.74 123.19 0)
      (effects (font (size 1.27 1.27)) hide)
    )
    (property "Datasheet" "" (at 78.74 123.19 0)
      (effects (font (size 1.27 1.27)) hide)
    )
    (pin "1" (uuid 6d32623c-6fc6-41cc-9bb7-b08c8631ba2f))
    (instances
      (project "rtd_berakout"
        (path "/0ee520f3-5556-41f8-afe3-2c653838ec03"
          (reference "#PWR05") (unit 1)
        )
      )
    )
  )

  (symbol (lib_id "Device:R_US") (at 101.6 90.17 180) (unit 1)
    (in_bom yes) (on_board yes) (dnp no) (fields_autoplaced)
    (uuid eaa5dba7-e4cb-4a9b-9b54-dbed4b85566b)
    (property "Reference" "R21" (at 104.14 90.17 0)
      (effects (font (size 1.27 1.27)) (justify right))
    )
    (property "Value" "R_US" (at 99.06 88.9 0)
      (effects (font (size 1.27 1.27)) (justify left) hide)
    )
    (property "Footprint" "Resistor_SMD:R_0402_1005Metric" (at 100.584 89.916 90)
      (effects (font (size 1.27 1.27)) hide)
    )
    (property "Datasheet" "~" (at 101.6 90.17 0)
      (effects (font (size 1.27 1.27)) hide)
    )
    (pin "2" (uuid f74604bd-3571-4909-8a69-5de0db2491d0))
    (pin "1" (uuid c5507a09-8b78-488e-a2c6-75a4fc835899))
    (instances
      (project "rtd_berakout"
        (path "/0ee520f3-5556-41f8-afe3-2c653838ec03"
          (reference "R21") (unit 1)
        )
      )
    )
  )

  (symbol (lib_id "Device:R_US") (at 143.51 90.17 180) (unit 1)
    (in_bom yes) (on_board yes) (dnp no) (fields_autoplaced)
    (uuid ef404fdf-c578-4a92-a66f-4cca28323ded)
    (property "Reference" "R32" (at 146.05 90.17 0)
      (effects (font (size 1.27 1.27)) (justify right))
    )
    (property "Value" "R_US" (at 140.97 88.9 0)
      (effects (font (size 1.27 1.27)) (justify left) hide)
    )
    (property "Footprint" "Resistor_SMD:R_0402_1005Metric" (at 142.494 89.916 90)
      (effects (font (size 1.27 1.27)) hide)
    )
    (property "Datasheet" "~" (at 143.51 90.17 0)
      (effects (font (size 1.27 1.27)) hide)
    )
    (pin "2" (uuid 6c8a1b81-e5b8-4730-8a53-7551f6513bce))
    (pin "1" (uuid bc699cb4-1c26-40b7-93b9-b3adc0687d25))
    (instances
      (project "rtd_berakout"
        (path "/0ee520f3-5556-41f8-afe3-2c653838ec03"
          (reference "R32") (unit 1)
        )
      )
    )
  )

  (symbol (lib_id "Connector:Conn_01x04_Pin") (at 165.1 119.38 0) (unit 1)
    (in_bom yes) (on_board yes) (dnp no) (fields_autoplaced)
    (uuid fa08b609-9a14-4fdb-b2c7-ad1f459c5a13)
    (property "Reference" "RTD4" (at 165.735 111.76 0)
      (effects (font (size 1.27 1.27)))
    )
    (property "Value" "Conn_01x04_Pin" (at 165.735 114.3 0)
      (effects (font (size 1.27 1.27)))
    )
    (property "Footprint" "Connector_PinHeader_2.54mm:PinHeader_1x04_P2.54mm_Vertical" (at 165.1 119.38 0)
      (effects (font (size 1.27 1.27)) hide)
    )
    (property "Datasheet" "~" (at 165.1 119.38 0)
      (effects (font (size 1.27 1.27)) hide)
    )
    (pin "2" (uuid 9b65982d-1a18-4fe0-ac6e-bb1bc5e060d7))
    (pin "1" (uuid b31293e5-a360-4208-b334-67ce7f9fe56e))
    (pin "3" (uuid 3fbbfe1f-e07d-4970-bc93-71dd058bd255))
    (pin "4" (uuid a9947ad7-1768-4021-89dd-0e944c4d2d75))
    (instances
      (project "rtd_berakout"
        (path "/0ee520f3-5556-41f8-afe3-2c653838ec03"
          (reference "RTD4") (unit 1)
        )
      )
    )
  )

  (sheet_instances
    (path "/" (page "1"))
  )
)
