(footprint "74663025R"
	(version 20240108)
	(generator "pcbnew")
	(generator_version "8.0")
	(layer "F.Cu")
	(descr "74663025R-3")
	(tags "Connector")
	(property "Reference" "J**"
		(at 0 0 0)
		(layer "F.SilkS")
		(hide yes)
		(uuid "9b5e084b-1115-40fa-b7e7-c0de5b20b27c")
		(effects
			(font
				(size 1.27 1.27)
				(thickness 0.254)
			)
		)
	)
	(property "Value" "74663025R"
		(at 0 0 0)
		(layer "F.SilkS")
		(hide yes)
		(uuid "8f96fd3e-eaec-4d75-ad8c-20af4c12cd0b")
		(effects
			(font
				(size 1.27 1.27)
				(thickness 0.254)
			)
		)
	)
	(property "Footprint" ""
		(at 0 0 0)
		(layer "F.Fab")
		(hide yes)
		(uuid "2c553293-2e4f-4d8f-b19d-4fd6d5e28fdd")
		(effects
			(font
				(size 1.27 1.27)
				(thickness 0.15)
			)
		)
	)
	(property "Datasheet" ""
		(at 0 0 0)
		(layer "F.Fab")
		(hide yes)
		(uuid "08a3fef7-ac4b-4b5c-b33e-7c42313b9ce0")
		(effects
			(font
				(size 1.27 1.27)
				(thickness 0.15)
			)
		)
	)
	(property "Description" ""
		(at 0 0 0)
		(layer "F.Fab")
		(hide yes)
		(uuid "005225f0-ea4e-4109-b17d-4bc0e323a63a")
		(effects
			(font
				(size 1.27 1.27)
				(thickness 0.15)
			)
		)
	)
	(attr smd)
	(fp_line
		(start -3.5 -2.5)
		(end -3.5 2.5)
		(stroke
			(width 0.2)
			(type solid)
		)
		(layer "F.SilkS")
		(uuid "2c50511a-46e2-4fe2-b9b4-09db4190b361")
	)
	(fp_line
		(start -1.6 3)
		(end -1.6 3)
		(stroke
			(width 0.1)
			(type solid)
		)
		(layer "F.SilkS")
		(uuid "50ce618c-0543-43e1-bf6c-092b8a6a924b")
	)
	(fp_line
		(start -1.6 3.1)
		(end -1.6 3.1)
		(stroke
			(width 0.1)
			(type solid)
		)
		(layer "F.SilkS")
		(uuid "a2e0d938-af3e-4274-ac9a-9246ca6f4dba")
	)
	(fp_line
		(start 3.5 -2.5)
		(end 3.5 2.5)
		(stroke
			(width 0.2)
			(type solid)
		)
		(layer "F.SilkS")
		(uuid "b3163466-7c84-4218-8d84-eaa2ff1955fb")
	)
	(fp_arc
		(start -1.6 3)
		(mid -1.55 3.05)
		(end -1.6 3.1)
		(stroke
			(width 0.1)
			(type solid)
		)
		(layer "F.SilkS")
		(uuid "43794a8c-10e9-4253-bea1-47bbcb6660b3")
	)
	(fp_arc
		(start -1.6 3.1)
		(mid -1.65 3.05)
		(end -1.6 3)
		(stroke
			(width 0.1)
			(type solid)
		)
		(layer "F.SilkS")
		(uuid "902c954c-ec04-4336-ac1c-f284ae632f7e")
	)
	(fp_line
		(start -4.5 -3.575)
		(end 4.5 -3.575)
		(stroke
			(width 0.1)
			(type solid)
		)
		(layer "F.CrtYd")
		(uuid "8b09ffd4-319b-44d2-99e1-c28299546e14")
	)
	(fp_line
		(start -4.5 3.575)
		(end -4.5 -3.575)
		(stroke
			(width 0.1)
			(type solid)
		)
		(layer "F.CrtYd")
		(uuid "81719aba-0f71-4ac8-b317-c0583afe9d5f")
	)
	(fp_line
		(start 4.5 -3.575)
		(end 4.5 3.575)
		(stroke
			(width 0.1)
			(type solid)
		)
		(layer "F.CrtYd")
		(uuid "df2b9011-6135-4fff-9944-0c636f17b819")
	)
	(fp_line
		(start 4.5 3.575)
		(end -4.5 3.575)
		(stroke
			(width 0.1)
			(type solid)
		)
		(layer "F.CrtYd")
		(uuid "100c9038-cdde-478b-a60d-677d450ec548")
	)
	(fp_line
		(start -3.5 -2.5)
		(end 3.5 -2.5)
		(stroke
			(width 0.1)
			(type solid)
		)
		(layer "F.Fab")
		(uuid "767e6ea4-6601-4917-904c-d028bae00b1d")
	)
	(fp_line
		(start -3.5 2.5)
		(end -3.5 -2.5)
		(stroke
			(width 0.1)
			(type solid)
		)
		(layer "F.Fab")
		(uuid "00979722-06ad-4a2f-b6f4-5d87b5430ed3")
	)
	(fp_line
		(start 3.5 -2.5)
		(end 3.5 2.5)
		(stroke
			(width 0.1)
			(type solid)
		)
		(layer "F.Fab")
		(uuid "b2b8fc7d-bfd8-43b6-a7dc-005750e36de3")
	)
	(fp_line
		(start 3.5 2.5)
		(end -3.5 2.5)
		(stroke
			(width 0.1)
			(type solid)
		)
		(layer "F.Fab")
		(uuid "1ed4aacb-ad29-4e59-9bb5-adfd8717f5e6")
	)
	(pad "1" smd rect
		(at -1.6 1.35 90)
		(size 2.45 2.95)
		(layers "F.Cu" "F.Paste" "F.Mask")
		(uuid "460feae9-6fb2-4f13-a908-1d21058b0feb")
	)
	(pad "2" smd rect
		(at 1.6 1.35 90)
		(size 2.45 2.95)
		(layers "F.Cu" "F.Paste" "F.Mask")
		(uuid "4f695f88-bb6a-4209-92f1-a27f0e5e4dc6")
	)
	(pad "3" smd rect
		(at 1.6 -1.35 90)
		(size 2.45 2.95)
		(layers "F.Cu" "F.Paste" "F.Mask")
		(uuid "680f6e29-70d6-4dd6-9d3b-c5cb960b66a7")
	)
	(pad "4" smd rect
		(at -1.6 -1.35 90)
		(size 2.45 2.95)
		(layers "F.Cu" "F.Paste" "F.Mask")
		(uuid "72eaf436-2bb9-4dd4-a9fd-d0a8ff8ceebf")
	)
	(model "${KIPRJMOD}/3D/74663025R.stp"
		(offset
			(xyz 0 0 5)
		)
		(scale
			(xyz 1 1 1)
		)
		(rotate
			(xyz 0 -180 -90)
		)
	)
)
