G21
G90
G83
G17 G01 X0 Y0 Z50 F600
G01 Z41 F400
G01 X140 Y130 Z41 F600
G01 Z26 F600
G04 S10
G01 Z41 F400
G01 X93 Y130 Z41 F600
G01 Z26 F600
M106
G04 S4
M107
G04 S2
G01 Z41 F400
G01 X131 Y130 Z41 F600
G01 Z26 F600
G04 S2
G01 Z41 F400
G01 X148 Y147 Z41 F600 ;first spot 
G01 Z26 F600
G04 S2
G01 Z41 F400
G01 X148 Y147.42 Z41 F600 ; .42 increase
G01 Z26 F600
G04 S2
G01 Z41 F400
G01 X148 Y147.84 Z41 F600
G01 Z26 F600
G04 S2
G01 Z41 F400
G01 X148 Y148.26 Z41 F600
G01 Z26 F600
G04 S2
G01 Z41 F400
G01 X148 Y148.68 Z41 F600 ;until here
G01 Z26 F600
G04 S2
G01 Z41 F400
G01 X140 Y130 Z41 F600
G01 Z26 F600
G04 S10
G01 Z41 F400
G01 X93 Y130 Z41 F600
G01 Z26 F600
M106
G04 S4
M107
G04 S2
G01 Z41 F400
G01 X131 Y130 Z41 F600
G01 Z26 F600
G04 S2
G01 Z41 F400
G01 X148 Y157 Z41 F600 ;second spot 
G01 Z26 F600
G04 S2
G01 Z41 F400
G01 X148 Y157.42 Z41 F600
G01 Z26 F600
G04 S2
G01 Z41 F400
G01 X148 Y157.84 Z41 F600
G01 Z26 F600
G04 S2
G01 Z41 F400
G01 X148 Y158.26 Z41 F600
G01 Z26 F600
G04 S2
G01 Z41 F400
G01 X148 Y158.68 Z41 F600 ;unitl here
G01 Z26 F600
G04 S2
G01 Z41 F400
G01 X140 Y130 Z41 F600
G01 Z26 F600
G04 S10
G01 Z41 F400
G01 X93 Y130 Z41 F600
G01 Z26 F600
M106
G04 S4
M107
G04 S2
G01 Z41 F400
G01 X131 Y130 Z41 F600
G01 Z26 F600
G04 S2
G01 Z41 F400
G01 X148 Y166 Z41 F600 ;third spot 
G01 Z26 F600
G04 S2
G01 Z41 F400
G01 X148 Y166.42 Z41 F600
G01 Z26 F600
G04 S2
G01 Z41 F400
G01 X148 Y166.84 Z41 F600
G01 Z26 F600
G04 S2
G01 Z41 F400
G01 X148 Y167.26 Z41 F600
G01 Z26 F600
G04 S2
G01 Z41 F400
G01 X148 Y167.68 Z41 F600
G01 Z26 F600
G04 S2
G01 Z41 F400
G01 X140 Y130 Z41 F600
G01 Z26 F600
G04 S10
G01 Z41 F400
G01 X93 Y130 Z41 F600
G01 Z26 F600
M106
G04 S4
M107
G04 S2
G01 Z41 F400
G01 X149 Y130 Z41 F600
G01 Z26 F600
G04 S2
G01 Z41 F400
G01 X157 Y147 Z41 F600 ;fourth spot 
G01 Z26 F600
G04 S2
G01 Z41 F400
G01 X157 Y147.42 Z41 F600
G01 Z26 F600
G04 S2
G01 Z41 F400
G01 X157 Y147.84 Z41 F600
G01 Z26 F600
G04 S2
G01 Z41 F400
G01 X157 Y148.26 Z41 F600
G01 Z26 F600
G04 S2
G01 Z41 F400
G01 X1 Y148.68 Z41 F600
G01 Z26 F600
G04 S2
G01 Z41 F400
G01 X140 Y130 Z41 F600
G01 Z26 F600
G04 S10
G01 Z41 F400
G01 X93 Y130 Z41 F600
G01 Z26 F600
M106
G04 S4
M107
G04 S2
G01 Z41 F400
G01 X149 Y130 Z41 F600
G01 Z26 F600
G04 S2
G01 Z41 F400
G01 X157 Y157 Z41 F600 ;fifth spot
G01 Z26 F600
G04 S2
G01 Z41 F400
G01 X157 Y157.42 Z41 F600
G01 Z26 F600
G04 S2
G01 Z41 F400
G01 X157 Y157.84 Z41 F600
G01 Z26 F600
G04 S2
G01 Z41 F400
G01 X157 Y158.26 Z41 F600
G01 Z26 F600
G04 S2
G01 Z41 F400
G01 X157 Y158.68 Z41 F600
G01 Z26 F600
G04 S2
G01 Z41 F400
G01 X140 Y130 Z41 F600
G01 Z26 F600
G04 S10
G01 Z41 F400
G01 X93 Y130 Z41 F600
G01 Z26 F600
M106
G04 S4
M107
G04 S2
G01 Z41 F400
G01 X149 Y130 Z41 F600
G01 Z26 F600
G04 S2
G01 Z41 F400
G01 X157 Y166 Z41 F600 ;sixth time 
G01 Z26 F600
G04 S2
G01 Z41 F400
G01 X157 Y166.42 Z41 F600
G01 Z26 F600
G04 S2
G01 Z41 F400
G01 X157 Y166.84 Z41 F600
G01 Z26 F600
G04 S2
G01 Z41 F400
G01 X157 Y167.26 Z41 F600
G01 Z26 F600
G04 S2
G01 Z41 F400
G01 X157 Y167.68 Z41 F600
G01 Z26 F600
G04 S2
G01 Z41 F400
G01 X140 Y130 Z41 F600
G01 Z26 F600
G04 S10
G01 Z41 F400
G01 X93 Y130 Z41 F600
G01 Z26 F600
M106
G04 S4
M107
G04 S2
G01 Z41 F400
G01 X159 Y130 Z41 F600
G01 Z26 F600
G04 S2
G01 Z41 F400
G01 X166 Y147 Z41 F600 ; seventh time
G01 Z26 F600
G04 S2
G01 Z41 F400
G01 X166 Y147.75 Z41 F600 ; 0.75 increase 
G01 Z26 F600
G04 S2
G01 Z41 F400
G01 X166 Y148.5 Z41 F600
G01 Z26 F600
G04 S2
G01 Z41 F400
G01 X166 Y149.25 Z41 F600
G01 Z26 F600
G04 S2
G01 Z41 F400
G01 X166 Y150 Z41 F600 ;until here
G01 Z26 F600
G04 S2
G01 Z41 F400
G01 X140 Y130 Z41 F600
G01 Z26 F600
G04 S10
G01 Z41 F400
G01 X93 Y130 Z41 F600
G01 Z26 F600
M106
G04 S4
M107
G04 S2
G01 Z41 F400
G01 X159 Y130 Z41 F600
G01 Z26 F600
G04 S2
G01 Z41 F400
G01 X166 Y157 Z41 F600 ;eigth time
G01 Z26 F600
G04 S2
G01 Z41 F400
G01 X166 Y157.75 Z41 F600
G01 Z26 F600
G04 S2
G01 Z41 F400
G01 X166 Y158.5 Z41 F600
G01 Z26 F600
G04 S2
G01 Z41 F400
G01 X166 Y159.25 Z41 F600
G01 Z26 F600
G04 S2
G01 Z41 F400
G01 X166 Y160 Z41 F600
G01 Z26 F600
G04 S2
G01 Z41 F400
G01 X140 Y130 Z41 F600
G01 Z26 F600
G04 S10
G01 Z41 F400
G01 X93 Y130 Z41 F600
G01 Z26 F600
M106
G04 S4
M107
G04 S2
G01 Z41 F400
G01 X159 Y130 Z41 F600
G01 Z26 F600
G04 S2
G01 Z41 F400
G01 X166 Y166 Z41 F600 ;ninth time
G01 Z26 F600
G04 S2
G01 Z41 F400
G01 X166 Y166.75 Z41 F600
G01 Z26 F600
G04 S2
G01 Z41 F400
G01 X166 Y167.5 Z41 F600
G01 Z26 F600
G04 S2
G01 Z41 F400
G01 X166 Y168.25 Z41 F600
G01 Z26 F600
G04 S2
G01 Z41 F400
G01 X166 Y169 Z41 F600
G01 Z26 F600
G04 S2
G01 Z41 F400
G01 X140 Y130 Z41 F600
G01 Z26 F600
G04 S10
G01 Z41 F400
G01 X93 Y130 Z41 F600
G01 Z26 F600
M106
G04 S4
M107
G04 S2
G01 Z41 F400
G01 X168 Y130 Z41 F600 ;different spores 
G01 Z26 F600
G04 S2
G01 Z41 F400
G01 X175 Y147 Z41 F600 ;tenth time
G01 Z26 F600
G04 S2
G01 Z41 F400
G01 X175 Y147.75 Z41 F600
G01 Z26 F600
G04 S2
G01 Z41 F400
G01 X175 Y148.5 Z41 F600
G01 Z26 F600
G04 S2
G01 Z41 F400
G01 X175 Y149.25 Z41 F600
G01 Z26 F600
G04 S2
G01 Z41 F400
G01 X175 Y150 Z41 F600
G01 Z26 F600
G04 S2
G01 Z41 F400
G01 X140 Y130 Z41 F600
G01 Z26 F600
G04 S10
G01 Z41 F400
G01 X93 Y130 Z41 F600
G01 Z26 F600
M106
G04 S4
M107
G04 S2
G01 Z41 F400
G01 X168 Y130 Z41 F600
G01 Z26 F600
G04 S2
G01 Z41 F400
G01 X175 Y157 Z41 F600 ;eleventh time 
G01 Z26 F600
G04 S2
G01 Z41 F400
G01 X175 Y157.75 Z41 F600
G01 Z26 F600
G04 S2
G01 Z41 F400
G01 X175 Y158.5 Z41 F600
G01 Z26 F600
G04 S2
G01 Z41 F400
G01 X175 Y159.25 Z41 F600
G01 Z26 F600
G04 S2
G01 Z41 F400
G01 X175 Y160 Z41 F600
G01 Z26 F600
G04 S2
G01 Z41 F400
G01 X140 Y130 Z41 F600
G01 Z26 F600
G04 S10
G01 Z41 F400
G01 X93 Y130 Z41 F600
G01 Z26 F600
M106
G04 S4
M107
G04 S2
G01 Z41 F400
G01 X168 Y130 Z41 F600
G01 Z26 F600
G04 S2
G01 Z41 F400
G01 X175 Y166 Z41 F600 ;twelveth time 
G01 Z26 F600
G04 S2
G01 Z41 F400
G01 X175 Y166.75 Z41 F600
G01 Z26 F600
G04 S2
G01 Z41 F400
G01 X175 Y167.5 Z41 F600
G01 Z26 F600
G04 S2
G01 Z41 F400
G01 X175 Y168.25 Z41 F600
G01 Z26 F600
G04 S2
G01 Z41 F400
G01 X175 Y169 Z41 F600
G01 Z26 F600
G04 S2
G01 Z41 F400
G01 X140 Y130 Z41 F600
G01 Z26 F600
G04 S10
G01 Z41 F400
G01 X93 Y130 Z41 F600
G01 Z26 F600
M106
G04 S4
M107
G04 S2
M84
G04 S12 ; wait
; Raise nozzle and present bed