<mxfile host="app.diagrams.net" agent="Mozilla/5.0 (Windows NT 10.0; Win64; x64) AppleWebKit/537.36 (KHTML, like Gecko) Chrome/131.0.0.0 Safari/537.36" version="24.9.1" pages="4">
  <diagram name="High Level" id="rQKEPA-Vb0nXp6f6QqjB">
    <mxGraphModel dx="1855" dy="1166" grid="1" gridSize="10" guides="1" tooltips="1" connect="1" arrows="1" fold="1" page="1" pageScale="1" pageWidth="850" pageHeight="1100" math="0" shadow="0">
      <root>
        <mxCell id="LPJ5j1Jv97eh4PM9W-Fj-0" />
        <mxCell id="LPJ5j1Jv97eh4PM9W-Fj-1" parent="LPJ5j1Jv97eh4PM9W-Fj-0" />
        <mxCell id="LPJ5j1Jv97eh4PM9W-Fj-2" style="edgeStyle=orthogonalEdgeStyle;rounded=0;orthogonalLoop=1;jettySize=auto;html=1;exitX=1;exitY=0.5;exitDx=0;exitDy=0;strokeColor=#000000;" edge="1" parent="LPJ5j1Jv97eh4PM9W-Fj-1" target="LPJ5j1Jv97eh4PM9W-Fj-15">
          <mxGeometry relative="1" as="geometry">
            <mxPoint x="179" y="70" as="sourcePoint" />
          </mxGeometry>
        </mxCell>
        <mxCell id="LPJ5j1Jv97eh4PM9W-Fj-3" style="edgeStyle=orthogonalEdgeStyle;rounded=0;orthogonalLoop=1;jettySize=auto;html=1;exitX=1;exitY=0.5;exitDx=0;exitDy=0;strokeColor=#000000;" edge="1" parent="LPJ5j1Jv97eh4PM9W-Fj-1" target="LPJ5j1Jv97eh4PM9W-Fj-5">
          <mxGeometry relative="1" as="geometry">
            <mxPoint x="319.0000000000002" y="70" as="sourcePoint" />
          </mxGeometry>
        </mxCell>
        <mxCell id="LPJ5j1Jv97eh4PM9W-Fj-4" style="edgeStyle=orthogonalEdgeStyle;rounded=0;orthogonalLoop=1;jettySize=auto;html=1;exitX=1;exitY=0.5;exitDx=0;exitDy=0;strokeColor=#000000;" edge="1" parent="LPJ5j1Jv97eh4PM9W-Fj-1" source="LPJ5j1Jv97eh4PM9W-Fj-5" target="LPJ5j1Jv97eh4PM9W-Fj-7">
          <mxGeometry relative="1" as="geometry" />
        </mxCell>
        <mxCell id="LPJ5j1Jv97eh4PM9W-Fj-5" value="Leak Test" style="rounded=0;whiteSpace=wrap;html=1;labelBackgroundColor=none;fontStyle=1;fontSize=13;fillColor=#fff2cc;strokeColor=#d6b656;fontColor=#000000;" vertex="1" parent="LPJ5j1Jv97eh4PM9W-Fj-1">
          <mxGeometry x="379" y="40" width="120" height="60" as="geometry" />
        </mxCell>
        <mxCell id="LPJ5j1Jv97eh4PM9W-Fj-6" style="edgeStyle=orthogonalEdgeStyle;rounded=0;orthogonalLoop=1;jettySize=auto;html=1;exitX=1;exitY=0.5;exitDx=0;exitDy=0;strokeColor=#000000;" edge="1" parent="LPJ5j1Jv97eh4PM9W-Fj-1" source="LPJ5j1Jv97eh4PM9W-Fj-7" target="LPJ5j1Jv97eh4PM9W-Fj-9">
          <mxGeometry relative="1" as="geometry" />
        </mxCell>
        <mxCell id="LPJ5j1Jv97eh4PM9W-Fj-7" value="Functional Test&lt;br&gt;Test Line" style="rounded=0;whiteSpace=wrap;html=1;labelBackgroundColor=none;fontStyle=1;fontSize=13;fillColor=#e1d5e7;strokeColor=#9673a6;fontColor=#000000;" vertex="1" parent="LPJ5j1Jv97eh4PM9W-Fj-1">
          <mxGeometry x="539" y="40" width="120" height="60" as="geometry" />
        </mxCell>
        <mxCell id="LPJ5j1Jv97eh4PM9W-Fj-8" style="edgeStyle=orthogonalEdgeStyle;rounded=0;orthogonalLoop=1;jettySize=auto;html=1;exitX=1;exitY=0.5;exitDx=0;exitDy=0;strokeColor=#000000;entryX=0;entryY=0.5;entryDx=0;entryDy=0;" edge="1" parent="LPJ5j1Jv97eh4PM9W-Fj-1" source="LPJ5j1Jv97eh4PM9W-Fj-9" target="LPJ5j1Jv97eh4PM9W-Fj-17">
          <mxGeometry relative="1" as="geometry">
            <mxPoint x="29" y="160" as="targetPoint" />
            <Array as="points">
              <mxPoint x="839" y="70" />
              <mxPoint x="839" y="130" />
              <mxPoint x="39" y="130" />
              <mxPoint x="39" y="180" />
            </Array>
          </mxGeometry>
        </mxCell>
        <mxCell id="LPJ5j1Jv97eh4PM9W-Fj-9" value="Inspection" style="rounded=0;whiteSpace=wrap;html=1;labelBackgroundColor=none;fontStyle=1;fontSize=13;fillColor=#dae8fc;strokeColor=#6c8ebf;fontColor=#000000;" vertex="1" parent="LPJ5j1Jv97eh4PM9W-Fj-1">
          <mxGeometry x="699" y="40" width="120" height="60" as="geometry" />
        </mxCell>
        <mxCell id="LPJ5j1Jv97eh4PM9W-Fj-10" style="edgeStyle=orthogonalEdgeStyle;rounded=0;orthogonalLoop=1;jettySize=auto;html=1;exitX=1;exitY=0.5;exitDx=0;exitDy=0;entryX=0;entryY=0.5;entryDx=0;entryDy=0;strokeColor=#000000;" edge="1" parent="LPJ5j1Jv97eh4PM9W-Fj-1" target="LPJ5j1Jv97eh4PM9W-Fj-12">
          <mxGeometry relative="1" as="geometry">
            <mxPoint x="179" y="180.0000000000001" as="sourcePoint" />
          </mxGeometry>
        </mxCell>
        <mxCell id="LPJ5j1Jv97eh4PM9W-Fj-11" style="edgeStyle=orthogonalEdgeStyle;rounded=0;orthogonalLoop=1;jettySize=auto;html=1;exitX=1;exitY=0.5;exitDx=0;exitDy=0;strokeColor=#000000;" edge="1" parent="LPJ5j1Jv97eh4PM9W-Fj-1" source="LPJ5j1Jv97eh4PM9W-Fj-12">
          <mxGeometry relative="1" as="geometry">
            <mxPoint x="378.9999999999998" y="180.0000000000001" as="targetPoint" />
          </mxGeometry>
        </mxCell>
        <mxCell id="LPJ5j1Jv97eh4PM9W-Fj-12" value="Functional Test&lt;br&gt;Subexperiment" style="rounded=0;whiteSpace=wrap;html=1;labelBackgroundColor=none;fontStyle=1;fontSize=13;fillColor=#e1d5e7;strokeColor=#9673a6;fontColor=#000000;" vertex="1" parent="LPJ5j1Jv97eh4PM9W-Fj-1">
          <mxGeometry x="219" y="150" width="120" height="60" as="geometry" />
        </mxCell>
        <mxCell id="LPJ5j1Jv97eh4PM9W-Fj-13" style="edgeStyle=orthogonalEdgeStyle;rounded=0;orthogonalLoop=1;jettySize=auto;html=1;exitX=1;exitY=0.5;exitDx=0;exitDy=0;strokeColor=#000000;" edge="1" parent="LPJ5j1Jv97eh4PM9W-Fj-1" target="LPJ5j1Jv97eh4PM9W-Fj-14">
          <mxGeometry relative="1" as="geometry">
            <mxPoint x="498.9999999999998" y="180.0000000000001" as="sourcePoint" />
          </mxGeometry>
        </mxCell>
        <mxCell id="LPJ5j1Jv97eh4PM9W-Fj-14" value="Inspection" style="rounded=0;whiteSpace=wrap;html=1;labelBackgroundColor=none;fontStyle=1;fontSize=13;fillColor=#dae8fc;strokeColor=#6c8ebf;fontColor=#000000;" vertex="1" parent="LPJ5j1Jv97eh4PM9W-Fj-1">
          <mxGeometry x="539" y="150" width="120" height="60" as="geometry" />
        </mxCell>
        <mxCell id="LPJ5j1Jv97eh4PM9W-Fj-15" value="Vibration Test" style="rounded=0;whiteSpace=wrap;html=1;labelBackgroundColor=none;fontStyle=1;fontSize=13;fillColor=#d5e8d4;strokeColor=#82b366;fontColor=#000000;" vertex="1" parent="LPJ5j1Jv97eh4PM9W-Fj-1">
          <mxGeometry x="219" y="40" width="120" height="60" as="geometry" />
        </mxCell>
        <mxCell id="LPJ5j1Jv97eh4PM9W-Fj-16" value="&lt;font&gt;Leak Test&lt;/font&gt;" style="rounded=0;whiteSpace=wrap;html=1;labelBackgroundColor=none;fontStyle=1;fontSize=13;fillColor=#fff2cc;strokeColor=#d6b656;fontColor=#000000;" vertex="1" parent="LPJ5j1Jv97eh4PM9W-Fj-1">
          <mxGeometry x="59" y="40" width="120" height="60" as="geometry" />
        </mxCell>
        <mxCell id="LPJ5j1Jv97eh4PM9W-Fj-17" value="TVAC Test" style="rounded=0;whiteSpace=wrap;html=1;labelBackgroundColor=none;fontStyle=1;fontSize=13;fillColor=#f8cecc;strokeColor=#b85450;fontColor=#000000;" vertex="1" parent="LPJ5j1Jv97eh4PM9W-Fj-1">
          <mxGeometry x="59" y="150" width="120" height="60" as="geometry" />
        </mxCell>
        <mxCell id="LPJ5j1Jv97eh4PM9W-Fj-18" value="Leak Test" style="rounded=0;whiteSpace=wrap;html=1;labelBackgroundColor=none;fontStyle=1;fontSize=13;fillColor=#fff2cc;strokeColor=#d6b656;fontColor=#000000;" vertex="1" parent="LPJ5j1Jv97eh4PM9W-Fj-1">
          <mxGeometry x="379" y="150" width="120" height="60" as="geometry" />
        </mxCell>
      </root>
    </mxGraphModel>
  </diagram>
  <diagram name="VIBE" id="Rs7FeW96WrhPVqkvoeI5">
    <mxGraphModel dx="1434" dy="744" grid="1" gridSize="10" guides="1" tooltips="1" connect="1" arrows="1" fold="1" page="1" pageScale="1" pageWidth="850" pageHeight="1100" background="none" math="0" shadow="1">
      <root>
        <mxCell id="0" />
        <mxCell id="1" parent="0" />
        <mxCell id="aLJMN6NSXlQwOqcoom5k-1" style="edgeStyle=orthogonalEdgeStyle;rounded=0;orthogonalLoop=1;jettySize=auto;html=1;exitX=1;exitY=0.5;exitDx=0;exitDy=0;" parent="1" source="aLJMN6NSXlQwOqcoom5k-2" target="aLJMN6NSXlQwOqcoom5k-9" edge="1">
          <mxGeometry relative="1" as="geometry" />
        </mxCell>
        <mxCell id="aLJMN6NSXlQwOqcoom5k-2" value="Safety Briefing" style="rounded=0;whiteSpace=wrap;html=1;labelBackgroundColor=none;fontStyle=1;fontSize=13;" parent="1" vertex="1">
          <mxGeometry x="230" y="130" width="120" height="60" as="geometry" />
        </mxCell>
        <mxCell id="aLJMN6NSXlQwOqcoom5k-16" style="edgeStyle=orthogonalEdgeStyle;rounded=0;orthogonalLoop=1;jettySize=auto;html=1;exitX=1;exitY=0.5;exitDx=0;exitDy=0;entryX=0;entryY=0.5;entryDx=0;entryDy=0;" parent="1" source="aLJMN6NSXlQwOqcoom5k-5" target="aLJMN6NSXlQwOqcoom5k-11" edge="1">
          <mxGeometry relative="1" as="geometry" />
        </mxCell>
        <mxCell id="aLJMN6NSXlQwOqcoom5k-5" value="Reduced Functional Tests" style="rounded=0;whiteSpace=wrap;html=1;labelBackgroundColor=none;fontStyle=1;fontSize=13;fillColor=#dae8fc;strokeColor=#6c8ebf;" parent="1" vertex="1">
          <mxGeometry x="550" y="130" width="120" height="60" as="geometry" />
        </mxCell>
        <mxCell id="VjdcVN09ghPlEmNwnlH1-11" style="edgeStyle=orthogonalEdgeStyle;rounded=0;orthogonalLoop=1;jettySize=auto;html=1;exitX=1;exitY=0.5;exitDx=0;exitDy=0;entryX=0;entryY=0.5;entryDx=0;entryDy=0;" parent="1" source="aLJMN6NSXlQwOqcoom5k-7" target="VjdcVN09ghPlEmNwnlH1-2" edge="1">
          <mxGeometry relative="1" as="geometry" />
        </mxCell>
        <mxCell id="aLJMN6NSXlQwOqcoom5k-7" value="&lt;div style=&quot;font-size: 13px;&quot;&gt;Test Readiness&lt;/div&gt;&lt;div style=&quot;font-size: 13px;&quot;&gt;Review (TRR)&lt;br style=&quot;font-size: 13px;&quot;&gt;&lt;/div&gt;" style="rounded=0;whiteSpace=wrap;html=1;labelBackgroundColor=none;fontStyle=1;fontSize=13;fillColor=#f8cecc;strokeColor=#b85450;" parent="1" vertex="1">
          <mxGeometry x="870" y="130" width="120" height="60" as="geometry" />
        </mxCell>
        <mxCell id="aLJMN6NSXlQwOqcoom5k-10" style="edgeStyle=orthogonalEdgeStyle;rounded=0;orthogonalLoop=1;jettySize=auto;html=1;exitX=1;exitY=0.5;exitDx=0;exitDy=0;entryX=0;entryY=0.5;entryDx=0;entryDy=0;" parent="1" source="aLJMN6NSXlQwOqcoom5k-9" target="aLJMN6NSXlQwOqcoom5k-5" edge="1">
          <mxGeometry relative="1" as="geometry" />
        </mxCell>
        <mxCell id="aLJMN6NSXlQwOqcoom5k-9" value="Unpacking and Cleaning" style="rounded=0;whiteSpace=wrap;html=1;labelBackgroundColor=none;fontStyle=1;fontSize=13;fillColor=#d5e8d4;strokeColor=#82b366;" parent="1" vertex="1">
          <mxGeometry x="390" y="130" width="120" height="60" as="geometry" />
        </mxCell>
        <mxCell id="aLJMN6NSXlQwOqcoom5k-17" style="edgeStyle=orthogonalEdgeStyle;rounded=0;orthogonalLoop=1;jettySize=auto;html=1;exitX=1;exitY=0.5;exitDx=0;exitDy=0;" parent="1" source="aLJMN6NSXlQwOqcoom5k-11" target="aLJMN6NSXlQwOqcoom5k-7" edge="1">
          <mxGeometry relative="1" as="geometry" />
        </mxCell>
        <mxCell id="aLJMN6NSXlQwOqcoom5k-11" value="VIBE Test Setup" style="rounded=0;whiteSpace=wrap;html=1;labelBackgroundColor=none;fontStyle=1;fontSize=13;fillColor=#d5e8d4;strokeColor=#82b366;" parent="1" vertex="1">
          <mxGeometry x="710" y="130" width="120" height="60" as="geometry" />
        </mxCell>
        <mxCell id="VjdcVN09ghPlEmNwnlH1-10" style="edgeStyle=orthogonalEdgeStyle;rounded=0;orthogonalLoop=1;jettySize=auto;html=1;exitX=1;exitY=0.5;exitDx=0;exitDy=0;entryX=0;entryY=0.5;entryDx=0;entryDy=0;" parent="1" source="VjdcVN09ghPlEmNwnlH1-2" target="VjdcVN09ghPlEmNwnlH1-7" edge="1">
          <mxGeometry relative="1" as="geometry" />
        </mxCell>
        <mxCell id="VjdcVN09ghPlEmNwnlH1-2" value="&lt;div&gt;Modal Search&lt;/div&gt;&lt;div&gt;&lt;br&gt;&lt;/div&gt;" style="rounded=0;whiteSpace=wrap;html=1;labelBackgroundColor=none;fontStyle=1;fontSize=13;fillColor=#ffe6cc;strokeColor=#d79b00;" parent="1" vertex="1">
          <mxGeometry x="70" y="240" width="120" height="60" as="geometry" />
        </mxCell>
        <mxCell id="VjdcVN09ghPlEmNwnlH1-3" style="edgeStyle=orthogonalEdgeStyle;rounded=0;orthogonalLoop=1;jettySize=auto;html=1;exitX=1;exitY=0.5;exitDx=0;exitDy=0;entryX=0;entryY=0.5;entryDx=0;entryDy=0;" parent="1" source="VjdcVN09ghPlEmNwnlH1-4" target="VjdcVN09ghPlEmNwnlH1-9" edge="1">
          <mxGeometry relative="1" as="geometry" />
        </mxCell>
        <mxCell id="VjdcVN09ghPlEmNwnlH1-4" value="&lt;div&gt;Random Vibrations at X-axis -9 dB&lt;/div&gt;" style="rounded=0;whiteSpace=wrap;html=1;labelBackgroundColor=none;fontStyle=1;fontSize=13;fillColor=#fff2cc;strokeColor=#d6b656;" parent="1" vertex="1">
          <mxGeometry x="390" y="240" width="120" height="60" as="geometry" />
        </mxCell>
        <mxCell id="VjdcVN09ghPlEmNwnlH1-5" value="&lt;div&gt;Random Vibrations at X-axis -3 dB&lt;/div&gt;" style="rounded=0;whiteSpace=wrap;html=1;labelBackgroundColor=none;fontStyle=1;fontSize=13;fillColor=#fff2cc;strokeColor=#d6b656;" parent="1" vertex="1">
          <mxGeometry x="710" y="240" width="120" height="60" as="geometry" />
        </mxCell>
        <mxCell id="VjdcVN09ghPlEmNwnlH1-6" style="edgeStyle=orthogonalEdgeStyle;rounded=0;orthogonalLoop=1;jettySize=auto;html=1;exitX=1;exitY=0.5;exitDx=0;exitDy=0;entryX=0;entryY=0.5;entryDx=0;entryDy=0;" parent="1" source="VjdcVN09ghPlEmNwnlH1-7" target="VjdcVN09ghPlEmNwnlH1-4" edge="1">
          <mxGeometry relative="1" as="geometry" />
        </mxCell>
        <mxCell id="VjdcVN09ghPlEmNwnlH1-7" value="Random Vibrations at X-axis -12 dB" style="rounded=0;whiteSpace=wrap;html=1;labelBackgroundColor=none;fontStyle=1;fontSize=13;fillColor=#fff2cc;strokeColor=#d6b656;" parent="1" vertex="1">
          <mxGeometry x="230" y="240" width="120" height="60" as="geometry" />
        </mxCell>
        <mxCell id="VjdcVN09ghPlEmNwnlH1-8" style="edgeStyle=orthogonalEdgeStyle;rounded=0;orthogonalLoop=1;jettySize=auto;html=1;exitX=1;exitY=0.5;exitDx=0;exitDy=0;" parent="1" source="VjdcVN09ghPlEmNwnlH1-9" target="VjdcVN09ghPlEmNwnlH1-5" edge="1">
          <mxGeometry relative="1" as="geometry" />
        </mxCell>
        <mxCell id="VjdcVN09ghPlEmNwnlH1-9" value="&lt;div&gt;Random Vibrations at X-axis -6 dB&lt;/div&gt;" style="rounded=0;whiteSpace=wrap;html=1;labelBackgroundColor=none;fontStyle=1;fontSize=13;fillColor=#fff2cc;strokeColor=#d6b656;" parent="1" vertex="1">
          <mxGeometry x="550" y="240" width="120" height="60" as="geometry" />
        </mxCell>
        <mxCell id="VjdcVN09ghPlEmNwnlH1-19" style="edgeStyle=orthogonalEdgeStyle;rounded=0;orthogonalLoop=1;jettySize=auto;html=1;exitX=1;exitY=0.5;exitDx=0;exitDy=0;entryX=0;entryY=0.5;entryDx=0;entryDy=0;" parent="1" source="VjdcVN09ghPlEmNwnlH1-15" target="VjdcVN09ghPlEmNwnlH1-17" edge="1">
          <mxGeometry relative="1" as="geometry" />
        </mxCell>
        <mxCell id="VjdcVN09ghPlEmNwnlH1-15" value="&lt;div&gt;Random Vibrations at X-axis Full Spectrum Level&lt;/div&gt;" style="rounded=0;whiteSpace=wrap;html=1;labelBackgroundColor=none;fontStyle=1;fontSize=13;fillColor=#fff2cc;strokeColor=#d6b656;" parent="1" vertex="1">
          <mxGeometry x="870" y="240" width="120" height="60" as="geometry" />
        </mxCell>
        <mxCell id="VjdcVN09ghPlEmNwnlH1-16" style="edgeStyle=orthogonalEdgeStyle;rounded=0;orthogonalLoop=1;jettySize=auto;html=1;exitX=1;exitY=0.5;exitDx=0;exitDy=0;" parent="1" target="VjdcVN09ghPlEmNwnlH1-15" edge="1">
          <mxGeometry relative="1" as="geometry">
            <mxPoint x="830" y="270" as="sourcePoint" />
          </mxGeometry>
        </mxCell>
        <mxCell id="sAlOG05tEf4mqYsU4R6_-5" style="edgeStyle=orthogonalEdgeStyle;rounded=0;orthogonalLoop=1;jettySize=auto;html=1;exitX=1;exitY=0.5;exitDx=0;exitDy=0;entryX=0;entryY=0.5;entryDx=0;entryDy=0;" parent="1" source="VjdcVN09ghPlEmNwnlH1-17" target="Ead7QLFVNlUWDFu6x_A1-5" edge="1">
          <mxGeometry relative="1" as="geometry" />
        </mxCell>
        <mxCell id="VjdcVN09ghPlEmNwnlH1-17" value="&lt;div&gt;Modal Search&lt;/div&gt;&lt;div&gt;&lt;br&gt;&lt;/div&gt;" style="rounded=0;whiteSpace=wrap;html=1;labelBackgroundColor=none;fontStyle=1;fontSize=13;fillColor=#ffe6cc;strokeColor=#d79b00;" parent="1" vertex="1">
          <mxGeometry x="1030" y="240" width="120" height="60" as="geometry" />
        </mxCell>
        <mxCell id="VjdcVN09ghPlEmNwnlH1-22" style="edgeStyle=orthogonalEdgeStyle;rounded=0;orthogonalLoop=1;jettySize=auto;html=1;exitX=1;exitY=0.5;exitDx=0;exitDy=0;entryX=0;entryY=0.5;entryDx=0;entryDy=0;" parent="1" source="VjdcVN09ghPlEmNwnlH1-23" target="VjdcVN09ghPlEmNwnlH1-28" edge="1">
          <mxGeometry relative="1" as="geometry" />
        </mxCell>
        <mxCell id="VjdcVN09ghPlEmNwnlH1-23" value="&lt;div&gt;Random Vibrations at Y-axis -9 dB&lt;/div&gt;" style="rounded=0;whiteSpace=wrap;html=1;labelBackgroundColor=none;fontStyle=1;fontSize=13;fillColor=#fff2cc;strokeColor=#d6b656;" parent="1" vertex="1">
          <mxGeometry x="390" y="350" width="120" height="60" as="geometry" />
        </mxCell>
        <mxCell id="VjdcVN09ghPlEmNwnlH1-24" value="&lt;div&gt;Random Vibrations at Y-axis -3 dB&lt;/div&gt;" style="rounded=0;whiteSpace=wrap;html=1;labelBackgroundColor=none;fontStyle=1;fontSize=13;fillColor=#fff2cc;strokeColor=#d6b656;" parent="1" vertex="1">
          <mxGeometry x="710" y="350" width="120" height="60" as="geometry" />
        </mxCell>
        <mxCell id="VjdcVN09ghPlEmNwnlH1-25" style="edgeStyle=orthogonalEdgeStyle;rounded=0;orthogonalLoop=1;jettySize=auto;html=1;exitX=1;exitY=0.5;exitDx=0;exitDy=0;entryX=0;entryY=0.5;entryDx=0;entryDy=0;" parent="1" source="VjdcVN09ghPlEmNwnlH1-26" target="VjdcVN09ghPlEmNwnlH1-23" edge="1">
          <mxGeometry relative="1" as="geometry" />
        </mxCell>
        <mxCell id="VjdcVN09ghPlEmNwnlH1-26" value="&lt;div&gt;Random Vibrations at Y-axis -12 dB&lt;/div&gt;" style="rounded=0;whiteSpace=wrap;html=1;labelBackgroundColor=none;fontStyle=1;fontSize=13;fillColor=#fff2cc;strokeColor=#d6b656;" parent="1" vertex="1">
          <mxGeometry x="230" y="350" width="120" height="60" as="geometry" />
        </mxCell>
        <mxCell id="VjdcVN09ghPlEmNwnlH1-27" style="edgeStyle=orthogonalEdgeStyle;rounded=0;orthogonalLoop=1;jettySize=auto;html=1;exitX=1;exitY=0.5;exitDx=0;exitDy=0;" parent="1" source="VjdcVN09ghPlEmNwnlH1-28" target="VjdcVN09ghPlEmNwnlH1-24" edge="1">
          <mxGeometry relative="1" as="geometry" />
        </mxCell>
        <mxCell id="VjdcVN09ghPlEmNwnlH1-28" value="&lt;div&gt;Random Vibrations at Y-axis -6 dB&lt;/div&gt;" style="rounded=0;whiteSpace=wrap;html=1;labelBackgroundColor=none;fontStyle=1;fontSize=13;fillColor=#fff2cc;strokeColor=#d6b656;" parent="1" vertex="1">
          <mxGeometry x="550" y="350" width="120" height="60" as="geometry" />
        </mxCell>
        <mxCell id="VjdcVN09ghPlEmNwnlH1-29" style="edgeStyle=orthogonalEdgeStyle;rounded=0;orthogonalLoop=1;jettySize=auto;html=1;exitX=1;exitY=0.5;exitDx=0;exitDy=0;entryX=0;entryY=0.5;entryDx=0;entryDy=0;" parent="1" target="VjdcVN09ghPlEmNwnlH1-32" edge="1">
          <mxGeometry relative="1" as="geometry">
            <mxPoint x="990" y="380" as="sourcePoint" />
          </mxGeometry>
        </mxCell>
        <mxCell id="VjdcVN09ghPlEmNwnlH1-31" style="edgeStyle=orthogonalEdgeStyle;rounded=0;orthogonalLoop=1;jettySize=auto;html=1;exitX=1;exitY=0.5;exitDx=0;exitDy=0;" parent="1" edge="1">
          <mxGeometry relative="1" as="geometry">
            <mxPoint x="830" y="380" as="sourcePoint" />
            <mxPoint x="870" y="380" as="targetPoint" />
          </mxGeometry>
        </mxCell>
        <mxCell id="sAlOG05tEf4mqYsU4R6_-8" style="edgeStyle=orthogonalEdgeStyle;rounded=0;orthogonalLoop=1;jettySize=auto;html=1;exitX=1;exitY=0.5;exitDx=0;exitDy=0;entryX=0;entryY=0.5;entryDx=0;entryDy=0;" parent="1" source="VjdcVN09ghPlEmNwnlH1-32" target="VjdcVN09ghPlEmNwnlH1-55" edge="1">
          <mxGeometry relative="1" as="geometry" />
        </mxCell>
        <mxCell id="VjdcVN09ghPlEmNwnlH1-32" value="&lt;div&gt;Modal Search&lt;/div&gt;&lt;div&gt;&lt;br&gt;&lt;/div&gt;" style="rounded=0;whiteSpace=wrap;html=1;labelBackgroundColor=none;fontStyle=1;fontSize=13;fillColor=#ffe6cc;strokeColor=#d79b00;" parent="1" vertex="1">
          <mxGeometry x="1030" y="350" width="120" height="60" as="geometry" />
        </mxCell>
        <mxCell id="VjdcVN09ghPlEmNwnlH1-36" style="edgeStyle=orthogonalEdgeStyle;rounded=0;orthogonalLoop=1;jettySize=auto;html=1;exitX=1;exitY=0.5;exitDx=0;exitDy=0;entryX=0;entryY=0.5;entryDx=0;entryDy=0;" parent="1" edge="1">
          <mxGeometry relative="1" as="geometry">
            <mxPoint x="1030" y="380" as="targetPoint" />
            <mxPoint x="990" y="380" as="sourcePoint" />
          </mxGeometry>
        </mxCell>
        <mxCell id="VjdcVN09ghPlEmNwnlH1-38" value="&lt;div&gt;Random Vibrations at Y-axis Full Spectrum Level&lt;/div&gt;" style="rounded=0;whiteSpace=wrap;html=1;labelBackgroundColor=none;fontStyle=1;fontSize=13;fillColor=#fff2cc;strokeColor=#d6b656;" parent="1" vertex="1">
          <mxGeometry x="870" y="350" width="120" height="60" as="geometry" />
        </mxCell>
        <mxCell id="VjdcVN09ghPlEmNwnlH1-42" style="edgeStyle=orthogonalEdgeStyle;rounded=0;orthogonalLoop=1;jettySize=auto;html=1;exitX=1;exitY=0.5;exitDx=0;exitDy=0;entryX=0;entryY=0.5;entryDx=0;entryDy=0;" parent="1" source="VjdcVN09ghPlEmNwnlH1-43" target="VjdcVN09ghPlEmNwnlH1-48" edge="1">
          <mxGeometry relative="1" as="geometry" />
        </mxCell>
        <mxCell id="VjdcVN09ghPlEmNwnlH1-43" value="&lt;div&gt;Random Vibrations at Z-axis -9 dB&lt;/div&gt;" style="rounded=0;whiteSpace=wrap;html=1;labelBackgroundColor=none;fontStyle=1;fontSize=13;fillColor=#fff2cc;strokeColor=#d6b656;" parent="1" vertex="1">
          <mxGeometry x="390" y="460" width="120" height="60" as="geometry" />
        </mxCell>
        <mxCell id="VjdcVN09ghPlEmNwnlH1-44" value="&lt;div&gt;Random Vibrations at Z-axis -3 dB&lt;/div&gt;" style="rounded=0;whiteSpace=wrap;html=1;labelBackgroundColor=none;fontStyle=1;fontSize=13;fillColor=#fff2cc;strokeColor=#d6b656;" parent="1" vertex="1">
          <mxGeometry x="710" y="460" width="120" height="60" as="geometry" />
        </mxCell>
        <mxCell id="VjdcVN09ghPlEmNwnlH1-45" style="edgeStyle=orthogonalEdgeStyle;rounded=0;orthogonalLoop=1;jettySize=auto;html=1;exitX=1;exitY=0.5;exitDx=0;exitDy=0;entryX=0;entryY=0.5;entryDx=0;entryDy=0;" parent="1" source="VjdcVN09ghPlEmNwnlH1-46" target="VjdcVN09ghPlEmNwnlH1-43" edge="1">
          <mxGeometry relative="1" as="geometry" />
        </mxCell>
        <mxCell id="VjdcVN09ghPlEmNwnlH1-46" value="&lt;div&gt;Random Vibrations at Z-axis -12 dB&lt;/div&gt;" style="rounded=0;whiteSpace=wrap;html=1;labelBackgroundColor=none;fontStyle=1;fontSize=13;fillColor=#fff2cc;strokeColor=#d6b656;" parent="1" vertex="1">
          <mxGeometry x="230" y="460" width="120" height="60" as="geometry" />
        </mxCell>
        <mxCell id="VjdcVN09ghPlEmNwnlH1-47" style="edgeStyle=orthogonalEdgeStyle;rounded=0;orthogonalLoop=1;jettySize=auto;html=1;exitX=1;exitY=0.5;exitDx=0;exitDy=0;" parent="1" source="VjdcVN09ghPlEmNwnlH1-48" target="VjdcVN09ghPlEmNwnlH1-44" edge="1">
          <mxGeometry relative="1" as="geometry" />
        </mxCell>
        <mxCell id="VjdcVN09ghPlEmNwnlH1-48" value="&lt;div&gt;Random Vibrations at Z-axis -6 dB&lt;/div&gt;" style="rounded=0;whiteSpace=wrap;html=1;labelBackgroundColor=none;fontStyle=1;fontSize=13;fillColor=#fff2cc;strokeColor=#d6b656;" parent="1" vertex="1">
          <mxGeometry x="550" y="460" width="120" height="60" as="geometry" />
        </mxCell>
        <mxCell id="VjdcVN09ghPlEmNwnlH1-49" style="edgeStyle=orthogonalEdgeStyle;rounded=0;orthogonalLoop=1;jettySize=auto;html=1;exitX=1;exitY=0.5;exitDx=0;exitDy=0;entryX=0;entryY=0.5;entryDx=0;entryDy=0;" parent="1" target="VjdcVN09ghPlEmNwnlH1-51" edge="1">
          <mxGeometry relative="1" as="geometry">
            <mxPoint x="990" y="490" as="sourcePoint" />
          </mxGeometry>
        </mxCell>
        <mxCell id="VjdcVN09ghPlEmNwnlH1-50" style="edgeStyle=orthogonalEdgeStyle;rounded=0;orthogonalLoop=1;jettySize=auto;html=1;exitX=1;exitY=0.5;exitDx=0;exitDy=0;" parent="1" edge="1">
          <mxGeometry relative="1" as="geometry">
            <mxPoint x="830" y="490" as="sourcePoint" />
            <mxPoint x="870" y="490" as="targetPoint" />
          </mxGeometry>
        </mxCell>
        <mxCell id="Ead7QLFVNlUWDFu6x_A1-1" style="edgeStyle=orthogonalEdgeStyle;rounded=0;orthogonalLoop=1;jettySize=auto;html=1;exitX=1;exitY=0.5;exitDx=0;exitDy=0;entryX=0;entryY=0.5;entryDx=0;entryDy=0;" parent="1" source="VjdcVN09ghPlEmNwnlH1-51" target="VjdcVN09ghPlEmNwnlH1-71" edge="1">
          <mxGeometry relative="1" as="geometry" />
        </mxCell>
        <mxCell id="VjdcVN09ghPlEmNwnlH1-51" value="&lt;div&gt;Modal Search&lt;/div&gt;&lt;div&gt;&lt;br&gt;&lt;/div&gt;" style="rounded=0;whiteSpace=wrap;html=1;labelBackgroundColor=none;fontStyle=1;fontSize=13;fillColor=#ffe6cc;strokeColor=#d79b00;" parent="1" vertex="1">
          <mxGeometry x="1030" y="460" width="120" height="60" as="geometry" />
        </mxCell>
        <mxCell id="VjdcVN09ghPlEmNwnlH1-52" style="edgeStyle=orthogonalEdgeStyle;rounded=0;orthogonalLoop=1;jettySize=auto;html=1;exitX=1;exitY=0.5;exitDx=0;exitDy=0;entryX=0;entryY=0.5;entryDx=0;entryDy=0;" parent="1" edge="1">
          <mxGeometry relative="1" as="geometry">
            <mxPoint x="1030" y="490" as="targetPoint" />
            <mxPoint x="990" y="490" as="sourcePoint" />
          </mxGeometry>
        </mxCell>
        <mxCell id="VjdcVN09ghPlEmNwnlH1-53" value="&lt;div&gt;Random Vibrations at Z-axis Full Spectrum Level&lt;/div&gt;" style="rounded=0;whiteSpace=wrap;html=1;labelBackgroundColor=none;fontStyle=1;fontSize=13;fillColor=#fff2cc;strokeColor=#d6b656;" parent="1" vertex="1">
          <mxGeometry x="870" y="460" width="120" height="60" as="geometry" />
        </mxCell>
        <mxCell id="sAlOG05tEf4mqYsU4R6_-7" style="edgeStyle=orthogonalEdgeStyle;rounded=0;orthogonalLoop=1;jettySize=auto;html=1;exitX=1;exitY=0.5;exitDx=0;exitDy=0;entryX=0;entryY=0.5;entryDx=0;entryDy=0;" parent="1" source="VjdcVN09ghPlEmNwnlH1-55" target="VjdcVN09ghPlEmNwnlH1-46" edge="1">
          <mxGeometry relative="1" as="geometry" />
        </mxCell>
        <mxCell id="VjdcVN09ghPlEmNwnlH1-55" value="&lt;div&gt;Z-axis Test Setup&lt;/div&gt;" style="rounded=0;whiteSpace=wrap;html=1;labelBackgroundColor=none;fontStyle=1;fontSize=13;fillColor=#d5e8d4;strokeColor=#82b366;" parent="1" vertex="1">
          <mxGeometry x="70" y="460" width="120" height="60" as="geometry" />
        </mxCell>
        <mxCell id="VjdcVN09ghPlEmNwnlH1-61" value="VIBE Test Setup Dismantling" style="rounded=0;whiteSpace=wrap;html=1;labelBackgroundColor=none;fontStyle=1;fontSize=13;fillColor=#d5e8d4;strokeColor=#82b366;" parent="1" vertex="1">
          <mxGeometry x="480" y="570" width="120" height="60" as="geometry" />
        </mxCell>
        <mxCell id="VjdcVN09ghPlEmNwnlH1-70" style="edgeStyle=orthogonalEdgeStyle;rounded=0;orthogonalLoop=1;jettySize=auto;html=1;exitX=1;exitY=0.5;exitDx=0;exitDy=0;" parent="1" source="VjdcVN09ghPlEmNwnlH1-71" edge="1">
          <mxGeometry relative="1" as="geometry">
            <mxPoint x="480" y="600" as="targetPoint" />
          </mxGeometry>
        </mxCell>
        <mxCell id="VjdcVN09ghPlEmNwnlH1-71" value="Post-Test Review (PTR) Part 1" style="rounded=0;whiteSpace=wrap;html=1;labelBackgroundColor=none;fontStyle=1;fontSize=13;fillColor=#f8cecc;strokeColor=#b85450;" parent="1" vertex="1">
          <mxGeometry x="320" y="570" width="120" height="60" as="geometry" />
        </mxCell>
        <mxCell id="VjdcVN09ghPlEmNwnlH1-72" style="edgeStyle=orthogonalEdgeStyle;rounded=0;orthogonalLoop=1;jettySize=auto;html=1;exitX=1;exitY=0.5;exitDx=0;exitDy=0;entryX=0;entryY=0.5;entryDx=0;entryDy=0;" parent="1" target="VjdcVN09ghPlEmNwnlH1-74" edge="1">
          <mxGeometry relative="1" as="geometry">
            <mxPoint x="760" y="600" as="sourcePoint" />
          </mxGeometry>
        </mxCell>
        <mxCell id="VjdcVN09ghPlEmNwnlH1-73" style="edgeStyle=orthogonalEdgeStyle;rounded=0;orthogonalLoop=1;jettySize=auto;html=1;exitX=1;exitY=0.5;exitDx=0;exitDy=0;" parent="1" edge="1">
          <mxGeometry relative="1" as="geometry">
            <mxPoint x="600" y="600" as="sourcePoint" />
            <mxPoint x="640" y="600" as="targetPoint" />
          </mxGeometry>
        </mxCell>
        <mxCell id="VjdcVN09ghPlEmNwnlH1-74" value="PTR Part 2" style="rounded=0;whiteSpace=wrap;html=1;labelBackgroundColor=none;fontStyle=1;fontSize=13;fillColor=#f8cecc;strokeColor=#b85450;" parent="1" vertex="1">
          <mxGeometry x="800" y="570" width="120" height="60" as="geometry" />
        </mxCell>
        <mxCell id="VjdcVN09ghPlEmNwnlH1-75" style="edgeStyle=orthogonalEdgeStyle;rounded=0;orthogonalLoop=1;jettySize=auto;html=1;exitX=1;exitY=0.5;exitDx=0;exitDy=0;entryX=0;entryY=0.5;entryDx=0;entryDy=0;" parent="1" edge="1">
          <mxGeometry relative="1" as="geometry">
            <mxPoint x="800" y="600" as="targetPoint" />
            <mxPoint x="760" y="600" as="sourcePoint" />
          </mxGeometry>
        </mxCell>
        <mxCell id="VjdcVN09ghPlEmNwnlH1-76" value="Full Functional Tests" style="rounded=0;whiteSpace=wrap;html=1;labelBackgroundColor=none;fontStyle=1;fontSize=13;fillColor=#dae8fc;strokeColor=#6c8ebf;" parent="1" vertex="1">
          <mxGeometry x="640" y="570" width="120" height="60" as="geometry" />
        </mxCell>
        <mxCell id="sAlOG05tEf4mqYsU4R6_-6" style="edgeStyle=orthogonalEdgeStyle;rounded=0;orthogonalLoop=1;jettySize=auto;html=1;exitX=1;exitY=0.5;exitDx=0;exitDy=0;entryX=0;entryY=0.5;entryDx=0;entryDy=0;" parent="1" source="Ead7QLFVNlUWDFu6x_A1-5" target="VjdcVN09ghPlEmNwnlH1-26" edge="1">
          <mxGeometry relative="1" as="geometry" />
        </mxCell>
        <mxCell id="Ead7QLFVNlUWDFu6x_A1-5" value="&lt;div&gt;Y-axis Test Setup&lt;/div&gt;" style="rounded=0;whiteSpace=wrap;html=1;labelBackgroundColor=none;fontStyle=1;fontSize=13;fillColor=#d5e8d4;strokeColor=#82b366;" parent="1" vertex="1">
          <mxGeometry x="70" y="350" width="120" height="60" as="geometry" />
        </mxCell>
      </root>
    </mxGraphModel>
  </diagram>
  <diagram id="A51xH4rfQFU_OYvLZJ8J" name="FUNCTIONAL">
    <mxGraphModel dx="1855" dy="1166" grid="1" gridSize="10" guides="1" tooltips="1" connect="1" arrows="1" fold="1" page="1" pageScale="1" pageWidth="850" pageHeight="1100" math="0" shadow="0">
      <root>
        <mxCell id="0" />
        <mxCell id="1" parent="0" />
        <mxCell id="L036Lrs4o9vSsCxOo9B4-1" style="edgeStyle=orthogonalEdgeStyle;rounded=0;orthogonalLoop=1;jettySize=auto;html=1;exitX=1;exitY=0.5;exitDx=0;exitDy=0;" parent="1" source="L036Lrs4o9vSsCxOo9B4-2" target="L036Lrs4o9vSsCxOo9B4-6" edge="1">
          <mxGeometry relative="1" as="geometry" />
        </mxCell>
        <mxCell id="L036Lrs4o9vSsCxOo9B4-2" value="Safety Briefing" style="rounded=0;whiteSpace=wrap;html=1;labelBackgroundColor=none;fontStyle=1;fontSize=13;" parent="1" vertex="1">
          <mxGeometry x="230" y="130" width="120" height="60" as="geometry" />
        </mxCell>
        <mxCell id="L036Lrs4o9vSsCxOo9B4-3" style="edgeStyle=orthogonalEdgeStyle;rounded=0;orthogonalLoop=1;jettySize=auto;html=1;exitX=1;exitY=0.5;exitDx=0;exitDy=0;entryX=0;entryY=0.5;entryDx=0;entryDy=0;" parent="1" source="L036Lrs4o9vSsCxOo9B4-4" target="L036Lrs4o9vSsCxOo9B4-23" edge="1">
          <mxGeometry relative="1" as="geometry">
            <mxPoint x="70" y="270" as="targetPoint" />
          </mxGeometry>
        </mxCell>
        <mxCell id="L036Lrs4o9vSsCxOo9B4-4" value="&lt;div style=&quot;font-size: 13px;&quot;&gt;Test Readiness&lt;/div&gt;&lt;div style=&quot;font-size: 13px;&quot;&gt;Review (TRR)&lt;br style=&quot;font-size: 13px;&quot;&gt;&lt;/div&gt;" style="rounded=0;whiteSpace=wrap;html=1;labelBackgroundColor=none;fontStyle=1;fontSize=13;fillColor=#f8cecc;strokeColor=#b85450;" parent="1" vertex="1">
          <mxGeometry x="710" y="130" width="120" height="60" as="geometry" />
        </mxCell>
        <mxCell id="L036Lrs4o9vSsCxOo9B4-5" style="edgeStyle=orthogonalEdgeStyle;rounded=0;orthogonalLoop=1;jettySize=auto;html=1;exitX=1;exitY=0.5;exitDx=0;exitDy=0;entryX=0;entryY=0.5;entryDx=0;entryDy=0;" parent="1" source="L036Lrs4o9vSsCxOo9B4-6" target="L036Lrs4o9vSsCxOo9B4-8" edge="1">
          <mxGeometry relative="1" as="geometry">
            <mxPoint x="550" y="160" as="targetPoint" />
          </mxGeometry>
        </mxCell>
        <mxCell id="L036Lrs4o9vSsCxOo9B4-6" value="Cleaning" style="rounded=0;whiteSpace=wrap;html=1;labelBackgroundColor=none;fontStyle=1;fontSize=13;fillColor=#d5e8d4;strokeColor=#82b366;" parent="1" vertex="1">
          <mxGeometry x="390" y="130" width="120" height="60" as="geometry" />
        </mxCell>
        <mxCell id="L036Lrs4o9vSsCxOo9B4-7" style="edgeStyle=orthogonalEdgeStyle;rounded=0;orthogonalLoop=1;jettySize=auto;html=1;exitX=1;exitY=0.5;exitDx=0;exitDy=0;" parent="1" source="L036Lrs4o9vSsCxOo9B4-8" target="L036Lrs4o9vSsCxOo9B4-4" edge="1">
          <mxGeometry relative="1" as="geometry" />
        </mxCell>
        <mxCell id="L036Lrs4o9vSsCxOo9B4-8" value="GEN Test Setup" style="rounded=0;whiteSpace=wrap;html=1;labelBackgroundColor=none;fontStyle=1;fontSize=13;fillColor=#d5e8d4;strokeColor=#82b366;" parent="1" vertex="1">
          <mxGeometry x="550" y="130" width="120" height="60" as="geometry" />
        </mxCell>
        <mxCell id="L036Lrs4o9vSsCxOo9B4-9" style="edgeStyle=orthogonalEdgeStyle;rounded=0;orthogonalLoop=1;jettySize=auto;html=1;exitX=1;exitY=0.5;exitDx=0;exitDy=0;entryX=0;entryY=0.5;entryDx=0;entryDy=0;" parent="1" source="L036Lrs4o9vSsCxOo9B4-10" target="L036Lrs4o9vSsCxOo9B4-15" edge="1">
          <mxGeometry relative="1" as="geometry" />
        </mxCell>
        <mxCell id="L036Lrs4o9vSsCxOo9B4-10" value="Image&lt;br&gt;generation" style="rounded=0;whiteSpace=wrap;html=1;labelBackgroundColor=none;fontStyle=1;fontSize=13;fillColor=#ffe6cc;strokeColor=#d79b00;" parent="1" vertex="1">
          <mxGeometry x="230" y="240" width="120" height="60" as="geometry" />
        </mxCell>
        <mxCell id="L036Lrs4o9vSsCxOo9B4-11" value="Pump &amp;amp; valves&lt;br&gt;health check" style="rounded=0;whiteSpace=wrap;html=1;labelBackgroundColor=none;fontStyle=1;fontSize=13;fillColor=#fff2cc;strokeColor=#d6b656;" parent="1" vertex="1">
          <mxGeometry x="550" y="240" width="120" height="60" as="geometry" />
        </mxCell>
        <mxCell id="L036Lrs4o9vSsCxOo9B4-12" style="edgeStyle=orthogonalEdgeStyle;rounded=0;orthogonalLoop=1;jettySize=auto;html=1;exitX=1;exitY=0.5;exitDx=0;exitDy=0;entryX=0;entryY=0.5;entryDx=0;entryDy=0;" parent="1" source="L036Lrs4o9vSsCxOo9B4-13" target="L036Lrs4o9vSsCxOo9B4-10" edge="1">
          <mxGeometry relative="1" as="geometry" />
        </mxCell>
        <mxCell id="L036Lrs4o9vSsCxOo9B4-13" value="Camera &amp;amp; LEDs health check" style="rounded=0;whiteSpace=wrap;html=1;labelBackgroundColor=none;fontStyle=1;fontSize=13;fillColor=#fff2cc;strokeColor=#d6b656;" parent="1" vertex="1">
          <mxGeometry x="1030" y="130" width="120" height="60" as="geometry" />
        </mxCell>
        <mxCell id="L036Lrs4o9vSsCxOo9B4-14" style="edgeStyle=orthogonalEdgeStyle;rounded=0;orthogonalLoop=1;jettySize=auto;html=1;exitX=1;exitY=0.5;exitDx=0;exitDy=0;" parent="1" source="L036Lrs4o9vSsCxOo9B4-15" target="L036Lrs4o9vSsCxOo9B4-11" edge="1">
          <mxGeometry relative="1" as="geometry" />
        </mxCell>
        <mxCell id="L036Lrs4o9vSsCxOo9B4-15" value="&lt;div&gt;Image&lt;/div&gt;&lt;div&gt;downlink&lt;br&gt;&lt;/div&gt;" style="rounded=0;whiteSpace=wrap;html=1;labelBackgroundColor=none;fontStyle=1;fontSize=13;fillColor=#fff2cc;strokeColor=#d6b656;" parent="1" vertex="1">
          <mxGeometry x="390" y="240" width="120" height="60" as="geometry" />
        </mxCell>
        <mxCell id="L036Lrs4o9vSsCxOo9B4-16" style="edgeStyle=orthogonalEdgeStyle;rounded=0;orthogonalLoop=1;jettySize=auto;html=1;exitX=1;exitY=0.5;exitDx=0;exitDy=0;entryX=0;entryY=0.5;entryDx=0;entryDy=0;" parent="1" source="L036Lrs4o9vSsCxOo9B4-17" target="L036Lrs4o9vSsCxOo9B4-20" edge="1">
          <mxGeometry relative="1" as="geometry" />
        </mxCell>
        <mxCell id="L036Lrs4o9vSsCxOo9B4-17" value="Chip priming" style="rounded=0;whiteSpace=wrap;html=1;labelBackgroundColor=none;fontStyle=1;fontSize=13;fillColor=#dae8fc;strokeColor=#6c8ebf;" parent="1" vertex="1">
          <mxGeometry x="710" y="240" width="120" height="60" as="geometry" />
        </mxCell>
        <mxCell id="L036Lrs4o9vSsCxOo9B4-18" style="edgeStyle=orthogonalEdgeStyle;rounded=0;orthogonalLoop=1;jettySize=auto;html=1;exitX=1;exitY=0.5;exitDx=0;exitDy=0;" parent="1" source="L036Lrs4o9vSsCxOo9B4-11" target="L036Lrs4o9vSsCxOo9B4-17" edge="1">
          <mxGeometry relative="1" as="geometry">
            <mxPoint x="830" y="270" as="sourcePoint" />
          </mxGeometry>
        </mxCell>
        <mxCell id="L036Lrs4o9vSsCxOo9B4-19" style="edgeStyle=orthogonalEdgeStyle;rounded=0;orthogonalLoop=1;jettySize=auto;html=1;exitX=1;exitY=0.5;exitDx=0;exitDy=0;entryX=0;entryY=0.5;entryDx=0;entryDy=0;" parent="1" source="L036Lrs4o9vSsCxOo9B4-20" target="L036Lrs4o9vSsCxOo9B4-22" edge="1">
          <mxGeometry relative="1" as="geometry">
            <mxPoint x="70" y="380" as="targetPoint" />
          </mxGeometry>
        </mxCell>
        <mxCell id="L036Lrs4o9vSsCxOo9B4-20" value="&lt;div&gt;Image&lt;/div&gt;&lt;div&gt;generation&lt;br&gt;&lt;/div&gt;" style="rounded=0;whiteSpace=wrap;html=1;labelBackgroundColor=none;fontStyle=1;fontSize=13;fillColor=#ffe6cc;strokeColor=#d79b00;" parent="1" vertex="1">
          <mxGeometry x="870" y="240" width="120" height="60" as="geometry" />
        </mxCell>
        <mxCell id="L036Lrs4o9vSsCxOo9B4-21" style="edgeStyle=orthogonalEdgeStyle;rounded=0;orthogonalLoop=1;jettySize=auto;html=1;exitX=1;exitY=0.5;exitDx=0;exitDy=0;entryX=0;entryY=0.5;entryDx=0;entryDy=0;" parent="1" source="L036Lrs4o9vSsCxOo9B4-22" target="L036Lrs4o9vSsCxOo9B4-25" edge="1">
          <mxGeometry relative="1" as="geometry">
            <mxPoint x="170" y="340" as="targetPoint" />
          </mxGeometry>
        </mxCell>
        <mxCell id="L036Lrs4o9vSsCxOo9B4-22" value="&lt;div&gt;Image&lt;/div&gt;&lt;div&gt;downlink&lt;br&gt;&lt;/div&gt;" style="rounded=0;whiteSpace=wrap;html=1;labelBackgroundColor=none;fontStyle=1;fontSize=13;fillColor=#fff2cc;strokeColor=#d6b656;" parent="1" vertex="1">
          <mxGeometry x="1030" y="240" width="120" height="60" as="geometry" />
        </mxCell>
        <mxCell id="L036Lrs4o9vSsCxOo9B4-23" value="Temperature check" style="rounded=0;whiteSpace=wrap;html=1;labelBackgroundColor=none;fontStyle=1;fontSize=13;fillColor=#fff2cc;strokeColor=#d6b656;" parent="1" vertex="1">
          <mxGeometry x="870" y="130" width="120" height="60" as="geometry" />
        </mxCell>
        <mxCell id="L036Lrs4o9vSsCxOo9B4-24" style="edgeStyle=orthogonalEdgeStyle;rounded=0;orthogonalLoop=1;jettySize=auto;html=1;exitX=1;exitY=0.5;exitDx=0;exitDy=0;entryX=0;entryY=0.5;entryDx=0;entryDy=0;" parent="1" source="L036Lrs4o9vSsCxOo9B4-23" target="L036Lrs4o9vSsCxOo9B4-13" edge="1">
          <mxGeometry relative="1" as="geometry">
            <mxPoint x="1170" y="170" as="sourcePoint" />
            <mxPoint x="1210" y="170" as="targetPoint" />
          </mxGeometry>
        </mxCell>
        <mxCell id="L036Lrs4o9vSsCxOo9B4-25" value="Post-Test Review" style="rounded=0;whiteSpace=wrap;html=1;labelBackgroundColor=none;fontStyle=1;fontSize=13;fillColor=#f8cecc;strokeColor=#b85450;" parent="1" vertex="1">
          <mxGeometry x="230" y="340" width="120" height="60" as="geometry" />
        </mxCell>
        <mxCell id="L036Lrs4o9vSsCxOo9B4-26" value="GEN Test Setup Dismantling" style="rounded=0;whiteSpace=wrap;html=1;labelBackgroundColor=none;fontStyle=1;fontSize=13;fillColor=#d5e8d4;strokeColor=#82b366;" parent="1" vertex="1">
          <mxGeometry x="390" y="340" width="120" height="60" as="geometry" />
        </mxCell>
        <mxCell id="L036Lrs4o9vSsCxOo9B4-27" style="edgeStyle=orthogonalEdgeStyle;rounded=0;orthogonalLoop=1;jettySize=auto;html=1;exitX=1;exitY=0.5;exitDx=0;exitDy=0;" parent="1" edge="1">
          <mxGeometry relative="1" as="geometry">
            <mxPoint x="350" y="369.5" as="sourcePoint" />
            <mxPoint x="390" y="369.5" as="targetPoint" />
          </mxGeometry>
        </mxCell>
        <mxCell id="L036Lrs4o9vSsCxOo9B4-28" value="Reduced Functional Test" style="rounded=0;whiteSpace=wrap;html=1;labelBackgroundColor=none;fontStyle=1;fontSize=18;fillColor=#F0F0F0;" parent="1" vertex="1">
          <mxGeometry x="210" y="40" width="960" height="60" as="geometry" />
        </mxCell>
        <mxCell id="L036Lrs4o9vSsCxOo9B4-29" style="edgeStyle=orthogonalEdgeStyle;rounded=0;orthogonalLoop=1;jettySize=auto;html=1;exitX=1;exitY=0.5;exitDx=0;exitDy=0;" parent="1" source="L036Lrs4o9vSsCxOo9B4-30" target="L036Lrs4o9vSsCxOo9B4-34" edge="1">
          <mxGeometry relative="1" as="geometry" />
        </mxCell>
        <mxCell id="L036Lrs4o9vSsCxOo9B4-30" value="Safety Briefing" style="rounded=0;whiteSpace=wrap;html=1;labelBackgroundColor=none;fontStyle=1;fontSize=13;" parent="1" vertex="1">
          <mxGeometry x="230" y="570" width="120" height="60" as="geometry" />
        </mxCell>
        <mxCell id="L036Lrs4o9vSsCxOo9B4-31" style="edgeStyle=orthogonalEdgeStyle;rounded=0;orthogonalLoop=1;jettySize=auto;html=1;exitX=1;exitY=0.5;exitDx=0;exitDy=0;entryX=0;entryY=0.5;entryDx=0;entryDy=0;" parent="1" source="L036Lrs4o9vSsCxOo9B4-32" target="L036Lrs4o9vSsCxOo9B4-54" edge="1">
          <mxGeometry relative="1" as="geometry">
            <mxPoint x="70" y="710" as="targetPoint" />
          </mxGeometry>
        </mxCell>
        <mxCell id="L036Lrs4o9vSsCxOo9B4-32" value="&lt;div style=&quot;font-size: 13px;&quot;&gt;Test Readiness&lt;/div&gt;&lt;div style=&quot;font-size: 13px;&quot;&gt;Review (TRR)&lt;br style=&quot;font-size: 13px;&quot;&gt;&lt;/div&gt;" style="rounded=0;whiteSpace=wrap;html=1;labelBackgroundColor=none;fontStyle=1;fontSize=13;fillColor=#f8cecc;strokeColor=#b85450;" parent="1" vertex="1">
          <mxGeometry x="710" y="570" width="120" height="60" as="geometry" />
        </mxCell>
        <mxCell id="L036Lrs4o9vSsCxOo9B4-33" style="edgeStyle=orthogonalEdgeStyle;rounded=0;orthogonalLoop=1;jettySize=auto;html=1;exitX=1;exitY=0.5;exitDx=0;exitDy=0;entryX=0;entryY=0.5;entryDx=0;entryDy=0;" parent="1" source="L036Lrs4o9vSsCxOo9B4-34" target="L036Lrs4o9vSsCxOo9B4-36" edge="1">
          <mxGeometry relative="1" as="geometry">
            <mxPoint x="550" y="600" as="targetPoint" />
          </mxGeometry>
        </mxCell>
        <mxCell id="L036Lrs4o9vSsCxOo9B4-34" value="Cleaning" style="rounded=0;whiteSpace=wrap;html=1;labelBackgroundColor=none;fontStyle=1;fontSize=13;fillColor=#d5e8d4;strokeColor=#82b366;" parent="1" vertex="1">
          <mxGeometry x="390" y="570" width="120" height="60" as="geometry" />
        </mxCell>
        <mxCell id="L036Lrs4o9vSsCxOo9B4-35" style="edgeStyle=orthogonalEdgeStyle;rounded=0;orthogonalLoop=1;jettySize=auto;html=1;exitX=1;exitY=0.5;exitDx=0;exitDy=0;" parent="1" source="L036Lrs4o9vSsCxOo9B4-36" target="L036Lrs4o9vSsCxOo9B4-32" edge="1">
          <mxGeometry relative="1" as="geometry" />
        </mxCell>
        <mxCell id="L036Lrs4o9vSsCxOo9B4-36" value="GEN Test Setup" style="rounded=0;whiteSpace=wrap;html=1;labelBackgroundColor=none;fontStyle=1;fontSize=13;fillColor=#d5e8d4;strokeColor=#82b366;" parent="1" vertex="1">
          <mxGeometry x="550" y="570" width="120" height="60" as="geometry" />
        </mxCell>
        <mxCell id="L036Lrs4o9vSsCxOo9B4-37" style="edgeStyle=orthogonalEdgeStyle;rounded=0;orthogonalLoop=1;jettySize=auto;html=1;exitX=1;exitY=0.5;exitDx=0;exitDy=0;entryX=0;entryY=0.5;entryDx=0;entryDy=0;" parent="1" source="L036Lrs4o9vSsCxOo9B4-38" target="L036Lrs4o9vSsCxOo9B4-43" edge="1">
          <mxGeometry relative="1" as="geometry" />
        </mxCell>
        <mxCell id="L036Lrs4o9vSsCxOo9B4-38" value="Image&lt;br&gt;generation" style="rounded=0;whiteSpace=wrap;html=1;labelBackgroundColor=none;fontStyle=1;fontSize=13;fillColor=#ffe6cc;strokeColor=#d79b00;" parent="1" vertex="1">
          <mxGeometry x="230" y="680" width="120" height="60" as="geometry" />
        </mxCell>
        <mxCell id="L036Lrs4o9vSsCxOo9B4-39" value="Pump &amp;amp; valves&lt;br&gt;health check" style="rounded=0;whiteSpace=wrap;html=1;labelBackgroundColor=none;fontStyle=1;fontSize=13;fillColor=#fff2cc;strokeColor=#d6b656;" parent="1" vertex="1">
          <mxGeometry x="550" y="680" width="120" height="60" as="geometry" />
        </mxCell>
        <mxCell id="L036Lrs4o9vSsCxOo9B4-40" style="edgeStyle=orthogonalEdgeStyle;rounded=0;orthogonalLoop=1;jettySize=auto;html=1;exitX=1;exitY=0.5;exitDx=0;exitDy=0;entryX=0;entryY=0.5;entryDx=0;entryDy=0;" parent="1" source="L036Lrs4o9vSsCxOo9B4-41" target="L036Lrs4o9vSsCxOo9B4-38" edge="1">
          <mxGeometry relative="1" as="geometry" />
        </mxCell>
        <mxCell id="L036Lrs4o9vSsCxOo9B4-41" value="Camera &amp;amp; LEDs health check" style="rounded=0;whiteSpace=wrap;html=1;labelBackgroundColor=none;fontStyle=1;fontSize=13;fillColor=#fff2cc;strokeColor=#d6b656;" parent="1" vertex="1">
          <mxGeometry x="1030" y="570" width="120" height="60" as="geometry" />
        </mxCell>
        <mxCell id="L036Lrs4o9vSsCxOo9B4-42" style="edgeStyle=orthogonalEdgeStyle;rounded=0;orthogonalLoop=1;jettySize=auto;html=1;exitX=1;exitY=0.5;exitDx=0;exitDy=0;" parent="1" source="L036Lrs4o9vSsCxOo9B4-43" target="L036Lrs4o9vSsCxOo9B4-39" edge="1">
          <mxGeometry relative="1" as="geometry" />
        </mxCell>
        <mxCell id="L036Lrs4o9vSsCxOo9B4-43" value="&lt;div&gt;Image&lt;/div&gt;&lt;div&gt;downlink&lt;br&gt;&lt;/div&gt;" style="rounded=0;whiteSpace=wrap;html=1;labelBackgroundColor=none;fontStyle=1;fontSize=13;fillColor=#fff2cc;strokeColor=#d6b656;" parent="1" vertex="1">
          <mxGeometry x="390" y="680" width="120" height="60" as="geometry" />
        </mxCell>
        <mxCell id="L036Lrs4o9vSsCxOo9B4-44" style="edgeStyle=orthogonalEdgeStyle;rounded=0;orthogonalLoop=1;jettySize=auto;html=1;exitX=1;exitY=0.5;exitDx=0;exitDy=0;entryX=0;entryY=0.5;entryDx=0;entryDy=0;" parent="1" source="L036Lrs4o9vSsCxOo9B4-45" target="L036Lrs4o9vSsCxOo9B4-48" edge="1">
          <mxGeometry relative="1" as="geometry" />
        </mxCell>
        <mxCell id="L036Lrs4o9vSsCxOo9B4-45" value="Chip priming" style="rounded=0;whiteSpace=wrap;html=1;labelBackgroundColor=none;fontStyle=1;fontSize=13;fillColor=#dae8fc;strokeColor=#6c8ebf;" parent="1" vertex="1">
          <mxGeometry x="710" y="680" width="120" height="60" as="geometry" />
        </mxCell>
        <mxCell id="L036Lrs4o9vSsCxOo9B4-46" style="edgeStyle=orthogonalEdgeStyle;rounded=0;orthogonalLoop=1;jettySize=auto;html=1;exitX=1;exitY=0.5;exitDx=0;exitDy=0;" parent="1" source="L036Lrs4o9vSsCxOo9B4-39" target="L036Lrs4o9vSsCxOo9B4-45" edge="1">
          <mxGeometry relative="1" as="geometry">
            <mxPoint x="830" y="710" as="sourcePoint" />
          </mxGeometry>
        </mxCell>
        <mxCell id="L036Lrs4o9vSsCxOo9B4-47" style="edgeStyle=orthogonalEdgeStyle;rounded=0;orthogonalLoop=1;jettySize=auto;html=1;exitX=1;exitY=0.5;exitDx=0;exitDy=0;entryX=0;entryY=0.5;entryDx=0;entryDy=0;" parent="1" source="L036Lrs4o9vSsCxOo9B4-48" target="L036Lrs4o9vSsCxOo9B4-52" edge="1">
          <mxGeometry relative="1" as="geometry">
            <mxPoint x="70" y="820" as="targetPoint" />
          </mxGeometry>
        </mxCell>
        <mxCell id="L036Lrs4o9vSsCxOo9B4-48" value="&lt;div&gt;Image&lt;/div&gt;&lt;div&gt;generation&lt;br&gt;&lt;/div&gt;" style="rounded=0;whiteSpace=wrap;html=1;labelBackgroundColor=none;fontStyle=1;fontSize=13;fillColor=#ffe6cc;strokeColor=#d79b00;" parent="1" vertex="1">
          <mxGeometry x="870" y="680" width="120" height="60" as="geometry" />
        </mxCell>
        <mxCell id="L036Lrs4o9vSsCxOo9B4-49" style="edgeStyle=orthogonalEdgeStyle;rounded=0;orthogonalLoop=1;jettySize=auto;html=1;exitX=1;exitY=0.5;exitDx=0;exitDy=0;entryX=0;entryY=0.5;entryDx=0;entryDy=0;" parent="1" source="L036Lrs4o9vSsCxOo9B4-50" target="L036Lrs4o9vSsCxOo9B4-53" edge="1">
          <mxGeometry relative="1" as="geometry" />
        </mxCell>
        <mxCell id="L036Lrs4o9vSsCxOo9B4-50" value="Cell culture &amp;amp; imaging" style="rounded=0;whiteSpace=wrap;html=1;labelBackgroundColor=none;fontStyle=1;fontSize=13;fillColor=#dae8fc;strokeColor=#6c8ebf;" parent="1" vertex="1">
          <mxGeometry x="230" y="790" width="120" height="60" as="geometry" />
        </mxCell>
        <mxCell id="L036Lrs4o9vSsCxOo9B4-51" style="edgeStyle=orthogonalEdgeStyle;rounded=0;orthogonalLoop=1;jettySize=auto;html=1;exitX=1;exitY=0.5;exitDx=0;exitDy=0;entryX=0;entryY=0.5;entryDx=0;entryDy=0;" parent="1" source="L036Lrs4o9vSsCxOo9B4-52" target="L036Lrs4o9vSsCxOo9B4-50" edge="1">
          <mxGeometry relative="1" as="geometry" />
        </mxCell>
        <mxCell id="L036Lrs4o9vSsCxOo9B4-52" value="&lt;div&gt;Image&lt;/div&gt;&lt;div&gt;downlink&lt;br&gt;&lt;/div&gt;" style="rounded=0;whiteSpace=wrap;html=1;labelBackgroundColor=none;fontStyle=1;fontSize=13;fillColor=#fff2cc;strokeColor=#d6b656;" parent="1" vertex="1">
          <mxGeometry x="1030" y="680" width="120" height="60" as="geometry" />
        </mxCell>
        <mxCell id="L036Lrs4o9vSsCxOo9B4-53" value="&lt;div&gt;Image&lt;/div&gt;&lt;div&gt;downlink&lt;br&gt;&lt;/div&gt;" style="rounded=0;whiteSpace=wrap;html=1;labelBackgroundColor=none;fontStyle=1;fontSize=13;fillColor=#fff2cc;strokeColor=#d6b656;" parent="1" vertex="1">
          <mxGeometry x="390" y="790" width="120" height="60" as="geometry" />
        </mxCell>
        <mxCell id="L036Lrs4o9vSsCxOo9B4-54" value="Temperature check" style="rounded=0;whiteSpace=wrap;html=1;labelBackgroundColor=none;fontStyle=1;fontSize=13;fillColor=#fff2cc;strokeColor=#d6b656;" parent="1" vertex="1">
          <mxGeometry x="870" y="570" width="120" height="60" as="geometry" />
        </mxCell>
        <mxCell id="L036Lrs4o9vSsCxOo9B4-55" style="edgeStyle=orthogonalEdgeStyle;rounded=0;orthogonalLoop=1;jettySize=auto;html=1;exitX=1;exitY=0.5;exitDx=0;exitDy=0;entryX=0;entryY=0.5;entryDx=0;entryDy=0;" parent="1" source="L036Lrs4o9vSsCxOo9B4-54" target="L036Lrs4o9vSsCxOo9B4-41" edge="1">
          <mxGeometry relative="1" as="geometry">
            <mxPoint x="1170" y="610" as="sourcePoint" />
            <mxPoint x="1210" y="610" as="targetPoint" />
          </mxGeometry>
        </mxCell>
        <mxCell id="L036Lrs4o9vSsCxOo9B4-56" value="Post-Test Review" style="rounded=0;whiteSpace=wrap;html=1;labelBackgroundColor=none;fontStyle=1;fontSize=13;fillColor=#f8cecc;strokeColor=#b85450;" parent="1" vertex="1">
          <mxGeometry x="550" y="790" width="120" height="60" as="geometry" />
        </mxCell>
        <mxCell id="L036Lrs4o9vSsCxOo9B4-57" style="edgeStyle=orthogonalEdgeStyle;rounded=0;orthogonalLoop=1;jettySize=auto;html=1;exitX=1;exitY=0.5;exitDx=0;exitDy=0;entryX=0;entryY=0.5;entryDx=0;entryDy=0;" parent="1" edge="1">
          <mxGeometry relative="1" as="geometry">
            <mxPoint x="510" y="819.5" as="sourcePoint" />
            <mxPoint x="550" y="819.5" as="targetPoint" />
          </mxGeometry>
        </mxCell>
        <mxCell id="L036Lrs4o9vSsCxOo9B4-58" value="GEN Test Setup Dismantling" style="rounded=0;whiteSpace=wrap;html=1;labelBackgroundColor=none;fontStyle=1;fontSize=13;fillColor=#d5e8d4;strokeColor=#82b366;" parent="1" vertex="1">
          <mxGeometry x="710" y="790" width="120" height="60" as="geometry" />
        </mxCell>
        <mxCell id="L036Lrs4o9vSsCxOo9B4-59" style="edgeStyle=orthogonalEdgeStyle;rounded=0;orthogonalLoop=1;jettySize=auto;html=1;exitX=1;exitY=0.5;exitDx=0;exitDy=0;" parent="1" edge="1">
          <mxGeometry relative="1" as="geometry">
            <mxPoint x="670" y="819.5" as="sourcePoint" />
            <mxPoint x="710" y="819.5" as="targetPoint" />
          </mxGeometry>
        </mxCell>
        <mxCell id="L036Lrs4o9vSsCxOo9B4-60" value="Full Functional Test" style="rounded=0;whiteSpace=wrap;html=1;labelBackgroundColor=none;fontStyle=1;fontSize=18;fillColor=#F0F0F0;" parent="1" vertex="1">
          <mxGeometry x="210" y="480" width="960" height="60" as="geometry" />
        </mxCell>
      </root>
    </mxGraphModel>
  </diagram>
  <diagram name="VIBE (complete)" id="qXTIEdaEWhtemk4ypRBw">
    <mxGraphModel dx="1310" dy="913" grid="1" gridSize="10" guides="1" tooltips="1" connect="1" arrows="1" fold="1" page="1" pageScale="1" pageWidth="850" pageHeight="1100" background="none" math="0" shadow="1">
      <root>
        <mxCell id="r4HV4cJx_bj7ma0suZPp-0" />
        <mxCell id="r4HV4cJx_bj7ma0suZPp-1" parent="r4HV4cJx_bj7ma0suZPp-0" />
        <mxCell id="r4HV4cJx_bj7ma0suZPp-2" style="edgeStyle=orthogonalEdgeStyle;rounded=0;orthogonalLoop=1;jettySize=auto;html=1;exitX=1;exitY=0.5;exitDx=0;exitDy=0;" parent="r4HV4cJx_bj7ma0suZPp-1" source="r4HV4cJx_bj7ma0suZPp-3" target="r4HV4cJx_bj7ma0suZPp-9" edge="1">
          <mxGeometry relative="1" as="geometry" />
        </mxCell>
        <mxCell id="r4HV4cJx_bj7ma0suZPp-3" value="Safety Briefing" style="rounded=0;whiteSpace=wrap;html=1;labelBackgroundColor=none;fontStyle=1;fontSize=13;fillColor=#F8CECC;strokeColor=#B85450;" parent="r4HV4cJx_bj7ma0suZPp-1" vertex="1">
          <mxGeometry x="70" y="130" width="120" height="60" as="geometry" />
        </mxCell>
        <mxCell id="r4HV4cJx_bj7ma0suZPp-4" style="edgeStyle=orthogonalEdgeStyle;rounded=0;orthogonalLoop=1;jettySize=auto;html=1;exitX=1;exitY=0.5;exitDx=0;exitDy=0;entryX=0;entryY=0.5;entryDx=0;entryDy=0;" parent="r4HV4cJx_bj7ma0suZPp-1" source="r4HV4cJx_bj7ma0suZPp-5" target="9c8uwt9igoJB4OCapaf--0" edge="1">
          <mxGeometry relative="1" as="geometry">
            <mxPoint x="560" y="160" as="targetPoint" />
          </mxGeometry>
        </mxCell>
        <mxCell id="r4HV4cJx_bj7ma0suZPp-5" value="Full Functional Test" style="rounded=0;whiteSpace=wrap;html=1;labelBackgroundColor=none;fontStyle=1;fontSize=13;fillColor=#dae8fc;strokeColor=#6c8ebf;" parent="r4HV4cJx_bj7ma0suZPp-1" vertex="1">
          <mxGeometry x="390" y="130" width="120" height="60" as="geometry" />
        </mxCell>
        <mxCell id="r4HV4cJx_bj7ma0suZPp-6" style="edgeStyle=orthogonalEdgeStyle;rounded=0;orthogonalLoop=1;jettySize=auto;html=1;exitX=1;exitY=0.5;exitDx=0;exitDy=0;entryX=0;entryY=0.5;entryDx=0;entryDy=0;" parent="r4HV4cJx_bj7ma0suZPp-1" source="r4HV4cJx_bj7ma0suZPp-7" target="r4HV4cJx_bj7ma0suZPp-13" edge="1">
          <mxGeometry relative="1" as="geometry" />
        </mxCell>
        <mxCell id="r4HV4cJx_bj7ma0suZPp-7" value="&lt;div style=&quot;font-size: 13px;&quot;&gt;Test Readiness&lt;/div&gt;&lt;div style=&quot;font-size: 13px;&quot;&gt;Review&lt;br style=&quot;font-size: 13px;&quot;&gt;&lt;/div&gt;" style="rounded=0;whiteSpace=wrap;html=1;labelBackgroundColor=none;fontStyle=1;fontSize=13;fillColor=#F8CECC;strokeColor=#B85450;" parent="r4HV4cJx_bj7ma0suZPp-1" vertex="1">
          <mxGeometry x="870" y="130" width="120" height="60" as="geometry" />
        </mxCell>
        <mxCell id="r4HV4cJx_bj7ma0suZPp-8" style="edgeStyle=orthogonalEdgeStyle;rounded=0;orthogonalLoop=1;jettySize=auto;html=1;exitX=1;exitY=0.5;exitDx=0;exitDy=0;entryX=0;entryY=0.5;entryDx=0;entryDy=0;" parent="r4HV4cJx_bj7ma0suZPp-1" source="r4HV4cJx_bj7ma0suZPp-9" target="r4HV4cJx_bj7ma0suZPp-5" edge="1">
          <mxGeometry relative="1" as="geometry" />
        </mxCell>
        <mxCell id="r4HV4cJx_bj7ma0suZPp-9" value="Unpacking and Cleaning" style="rounded=0;whiteSpace=wrap;html=1;labelBackgroundColor=none;fontStyle=1;fontSize=13;fillColor=#d5e8d4;strokeColor=#82b366;" parent="r4HV4cJx_bj7ma0suZPp-1" vertex="1">
          <mxGeometry x="230" y="130" width="120" height="60" as="geometry" />
        </mxCell>
        <mxCell id="r4HV4cJx_bj7ma0suZPp-10" style="edgeStyle=orthogonalEdgeStyle;rounded=0;orthogonalLoop=1;jettySize=auto;html=1;exitX=1;exitY=0.5;exitDx=0;exitDy=0;" parent="r4HV4cJx_bj7ma0suZPp-1" source="r4HV4cJx_bj7ma0suZPp-11" target="r4HV4cJx_bj7ma0suZPp-7" edge="1">
          <mxGeometry relative="1" as="geometry" />
        </mxCell>
        <mxCell id="r4HV4cJx_bj7ma0suZPp-11" value="X-axis Test Setup" style="rounded=0;whiteSpace=wrap;html=1;labelBackgroundColor=none;fontStyle=1;fontSize=13;fillColor=#d5e8d4;strokeColor=#82B366;" parent="r4HV4cJx_bj7ma0suZPp-1" vertex="1">
          <mxGeometry x="710" y="130" width="120" height="60" as="geometry" />
        </mxCell>
        <mxCell id="r4HV4cJx_bj7ma0suZPp-12" style="edgeStyle=orthogonalEdgeStyle;rounded=0;orthogonalLoop=1;jettySize=auto;html=1;exitX=1;exitY=0.5;exitDx=0;exitDy=0;entryX=0;entryY=0.5;entryDx=0;entryDy=0;" parent="r4HV4cJx_bj7ma0suZPp-1" source="r4HV4cJx_bj7ma0suZPp-13" target="r4HV4cJx_bj7ma0suZPp-18" edge="1">
          <mxGeometry relative="1" as="geometry" />
        </mxCell>
        <mxCell id="r4HV4cJx_bj7ma0suZPp-13" value="&lt;div&gt;Modal Search&lt;/div&gt;&lt;div&gt;&lt;br&gt;&lt;/div&gt;" style="rounded=0;whiteSpace=wrap;html=1;labelBackgroundColor=none;fontStyle=1;fontSize=13;fillColor=#ffe6cc;strokeColor=#d79b00;" parent="r4HV4cJx_bj7ma0suZPp-1" vertex="1">
          <mxGeometry x="70" y="240" width="120" height="60" as="geometry" />
        </mxCell>
        <mxCell id="r4HV4cJx_bj7ma0suZPp-17" style="edgeStyle=orthogonalEdgeStyle;rounded=0;orthogonalLoop=1;jettySize=auto;html=1;exitX=1;exitY=0.5;exitDx=0;exitDy=0;entryX=0;entryY=0.5;entryDx=0;entryDy=0;" parent="r4HV4cJx_bj7ma0suZPp-1" source="r4HV4cJx_bj7ma0suZPp-18" target="r4HV4cJx_bj7ma0suZPp-22" edge="1">
          <mxGeometry relative="1" as="geometry">
            <mxPoint x="950" y="270" as="targetPoint" />
          </mxGeometry>
        </mxCell>
        <mxCell id="r4HV4cJx_bj7ma0suZPp-18" value="Random Vibrations at X-axis {-12, -3 dB}" style="rounded=0;whiteSpace=wrap;html=1;labelBackgroundColor=none;fontStyle=1;fontSize=13;fillColor=#fff2cc;strokeColor=#d6b656;" parent="r4HV4cJx_bj7ma0suZPp-1" vertex="1">
          <mxGeometry x="230" y="240" width="120" height="60" as="geometry" />
        </mxCell>
        <mxCell id="r4HV4cJx_bj7ma0suZPp-21" style="edgeStyle=orthogonalEdgeStyle;rounded=0;orthogonalLoop=1;jettySize=auto;html=1;exitX=1;exitY=0.5;exitDx=0;exitDy=0;entryX=0;entryY=0.5;entryDx=0;entryDy=0;" parent="r4HV4cJx_bj7ma0suZPp-1" source="r4HV4cJx_bj7ma0suZPp-22" edge="1">
          <mxGeometry relative="1" as="geometry">
            <mxPoint x="550" y="270" as="targetPoint" />
          </mxGeometry>
        </mxCell>
        <mxCell id="r4HV4cJx_bj7ma0suZPp-22" value="&lt;div&gt;Random Vibrations at X-axis Full Spectrum Level&lt;/div&gt;" style="rounded=0;whiteSpace=wrap;html=1;labelBackgroundColor=none;fontStyle=1;fontSize=13;fillColor=#fff2cc;strokeColor=#d6b656;" parent="r4HV4cJx_bj7ma0suZPp-1" vertex="1">
          <mxGeometry x="390" y="240" width="120" height="60" as="geometry" />
        </mxCell>
        <mxCell id="r4HV4cJx_bj7ma0suZPp-29" style="edgeStyle=orthogonalEdgeStyle;rounded=0;orthogonalLoop=1;jettySize=auto;html=1;exitX=1;exitY=0.5;exitDx=0;exitDy=0;entryX=0;entryY=0.5;entryDx=0;entryDy=0;" parent="r4HV4cJx_bj7ma0suZPp-1" source="r4HV4cJx_bj7ma0suZPp-30" target="r4HV4cJx_bj7ma0suZPp-38" edge="1">
          <mxGeometry relative="1" as="geometry">
            <mxPoint x="550" y="380" as="targetPoint" />
          </mxGeometry>
        </mxCell>
        <mxCell id="r4HV4cJx_bj7ma0suZPp-30" value="&lt;div&gt;Random Vibrations at Z-axis {-12, -3 dB}&lt;/div&gt;" style="rounded=0;whiteSpace=wrap;html=1;labelBackgroundColor=none;fontStyle=1;fontSize=13;fillColor=#fff2cc;strokeColor=#d6b656;" parent="r4HV4cJx_bj7ma0suZPp-1" vertex="1">
          <mxGeometry x="230" y="350" width="120" height="60" as="geometry" />
        </mxCell>
        <mxCell id="r4HV4cJx_bj7ma0suZPp-38" value="&lt;div&gt;Random Vibrations at Z-axis Full Spectrum Level&lt;/div&gt;" style="rounded=0;whiteSpace=wrap;html=1;labelBackgroundColor=none;fontStyle=1;fontSize=13;fillColor=#fff2cc;strokeColor=#d6b656;" parent="r4HV4cJx_bj7ma0suZPp-1" vertex="1">
          <mxGeometry x="390" y="350" width="120" height="60" as="geometry" />
        </mxCell>
        <mxCell id="r4HV4cJx_bj7ma0suZPp-42" style="edgeStyle=orthogonalEdgeStyle;rounded=0;orthogonalLoop=1;jettySize=auto;html=1;exitX=1;exitY=0.5;exitDx=0;exitDy=0;entryX=0;entryY=0.5;entryDx=0;entryDy=0;" parent="r4HV4cJx_bj7ma0suZPp-1" source="r4HV4cJx_bj7ma0suZPp-43" target="r4HV4cJx_bj7ma0suZPp-51" edge="1">
          <mxGeometry relative="1" as="geometry">
            <mxPoint x="550" y="490" as="targetPoint" />
          </mxGeometry>
        </mxCell>
        <mxCell id="r4HV4cJx_bj7ma0suZPp-43" value="&lt;div&gt;Random Vibrations at Y-axis {-12, -3 dB}&lt;/div&gt;" style="rounded=0;whiteSpace=wrap;html=1;labelBackgroundColor=none;fontStyle=1;fontSize=13;fillColor=#fff2cc;strokeColor=#d6b656;" parent="r4HV4cJx_bj7ma0suZPp-1" vertex="1">
          <mxGeometry x="230" y="460" width="120" height="60" as="geometry" />
        </mxCell>
        <mxCell id="r4HV4cJx_bj7ma0suZPp-51" value="&lt;div&gt;Random Vibrations at Y-axis Full Spectrum Level&lt;/div&gt;" style="rounded=0;whiteSpace=wrap;html=1;labelBackgroundColor=none;fontStyle=1;fontSize=13;fillColor=#fff2cc;strokeColor=#d6b656;" parent="r4HV4cJx_bj7ma0suZPp-1" vertex="1">
          <mxGeometry x="390" y="460" width="120" height="60" as="geometry" />
        </mxCell>
        <mxCell id="r4HV4cJx_bj7ma0suZPp-52" style="edgeStyle=orthogonalEdgeStyle;rounded=0;orthogonalLoop=1;jettySize=auto;html=1;exitX=1;exitY=0.5;exitDx=0;exitDy=0;entryX=0;entryY=0.5;entryDx=0;entryDy=0;" parent="r4HV4cJx_bj7ma0suZPp-1" source="r4HV4cJx_bj7ma0suZPp-53" target="U8GJlR49KaFFiEEN1-uM-2" edge="1">
          <mxGeometry relative="1" as="geometry" />
        </mxCell>
        <mxCell id="r4HV4cJx_bj7ma0suZPp-53" value="&lt;div&gt;Y-axis Test Setup&lt;/div&gt;" style="rounded=0;whiteSpace=wrap;html=1;labelBackgroundColor=none;fontStyle=1;fontSize=13;fillColor=#d5e8d4;strokeColor=#82b366;" parent="r4HV4cJx_bj7ma0suZPp-1" vertex="1">
          <mxGeometry x="870" y="350" width="120" height="60" as="geometry" />
        </mxCell>
        <mxCell id="r4HV4cJx_bj7ma0suZPp-54" value="Test Setup Dismantling" style="rounded=0;whiteSpace=wrap;html=1;labelBackgroundColor=none;fontStyle=1;fontSize=13;fillColor=#d5e8d4;strokeColor=#82b366;" parent="r4HV4cJx_bj7ma0suZPp-1" vertex="1">
          <mxGeometry x="70" y="570" width="120" height="60" as="geometry" />
        </mxCell>
        <mxCell id="r4HV4cJx_bj7ma0suZPp-55" style="edgeStyle=orthogonalEdgeStyle;rounded=0;orthogonalLoop=1;jettySize=auto;html=1;exitX=1;exitY=0.5;exitDx=0;exitDy=0;entryX=0;entryY=0.5;entryDx=0;entryDy=0;" parent="r4HV4cJx_bj7ma0suZPp-1" source="r4HV4cJx_bj7ma0suZPp-56" target="r4HV4cJx_bj7ma0suZPp-54" edge="1">
          <mxGeometry relative="1" as="geometry">
            <mxPoint x="400" y="600" as="targetPoint" />
          </mxGeometry>
        </mxCell>
        <mxCell id="r4HV4cJx_bj7ma0suZPp-56" value="Post-Test Review (Part 1)" style="rounded=0;whiteSpace=wrap;html=1;labelBackgroundColor=none;fontStyle=1;fontSize=13;fillColor=#f8cecc;strokeColor=#b85450;" parent="r4HV4cJx_bj7ma0suZPp-1" vertex="1">
          <mxGeometry x="870" y="460" width="120" height="60" as="geometry" />
        </mxCell>
        <mxCell id="r4HV4cJx_bj7ma0suZPp-57" style="edgeStyle=orthogonalEdgeStyle;rounded=0;orthogonalLoop=1;jettySize=auto;html=1;exitX=1;exitY=0.5;exitDx=0;exitDy=0;" parent="r4HV4cJx_bj7ma0suZPp-1" source="r4HV4cJx_bj7ma0suZPp-61" target="9c8uwt9igoJB4OCapaf--2" edge="1">
          <mxGeometry relative="1" as="geometry">
            <mxPoint x="920" y="600" as="sourcePoint" />
            <mxPoint x="1010" y="600" as="targetPoint" />
            <Array as="points" />
          </mxGeometry>
        </mxCell>
        <mxCell id="r4HV4cJx_bj7ma0suZPp-58" style="edgeStyle=orthogonalEdgeStyle;rounded=0;orthogonalLoop=1;jettySize=auto;html=1;exitX=1;exitY=0.5;exitDx=0;exitDy=0;entryX=0;entryY=0.5;entryDx=0;entryDy=0;" parent="r4HV4cJx_bj7ma0suZPp-1" source="r4HV4cJx_bj7ma0suZPp-54" target="r4HV4cJx_bj7ma0suZPp-61" edge="1">
          <mxGeometry relative="1" as="geometry">
            <mxPoint x="760" y="600" as="sourcePoint" />
            <mxPoint x="800" y="600" as="targetPoint" />
          </mxGeometry>
        </mxCell>
        <mxCell id="r4HV4cJx_bj7ma0suZPp-59" value="Post-Test Review (Part 2)" style="rounded=0;whiteSpace=wrap;html=1;labelBackgroundColor=none;fontStyle=1;fontSize=13;fillColor=#f8cecc;strokeColor=#b85450;" parent="r4HV4cJx_bj7ma0suZPp-1" vertex="1">
          <mxGeometry x="550" y="570" width="120" height="60" as="geometry" />
        </mxCell>
        <mxCell id="r4HV4cJx_bj7ma0suZPp-61" value="Full Functional Test" style="rounded=0;whiteSpace=wrap;html=1;labelBackgroundColor=none;fontStyle=1;fontSize=13;fillColor=#dae8fc;strokeColor=#6c8ebf;" parent="r4HV4cJx_bj7ma0suZPp-1" vertex="1">
          <mxGeometry x="230" y="570" width="120" height="60" as="geometry" />
        </mxCell>
        <mxCell id="r4HV4cJx_bj7ma0suZPp-62" style="edgeStyle=orthogonalEdgeStyle;rounded=0;orthogonalLoop=1;jettySize=auto;html=1;exitX=1;exitY=0.5;exitDx=0;exitDy=0;entryX=0;entryY=0.5;entryDx=0;entryDy=0;" parent="r4HV4cJx_bj7ma0suZPp-1" source="r4HV4cJx_bj7ma0suZPp-63" target="U8GJlR49KaFFiEEN1-uM-0" edge="1">
          <mxGeometry relative="1" as="geometry" />
        </mxCell>
        <mxCell id="r4HV4cJx_bj7ma0suZPp-63" value="&lt;div&gt;Z-axis Test Setup&lt;/div&gt;" style="rounded=0;whiteSpace=wrap;html=1;labelBackgroundColor=none;fontStyle=1;fontSize=13;fillColor=#d5e8d4;strokeColor=#82b366;" parent="r4HV4cJx_bj7ma0suZPp-1" vertex="1">
          <mxGeometry x="870" y="240" width="120" height="60" as="geometry" />
        </mxCell>
        <mxCell id="9c8uwt9igoJB4OCapaf--0" value="Leak&lt;br&gt;Test" style="rounded=0;whiteSpace=wrap;html=1;labelBackgroundColor=none;fontStyle=1;fontSize=13;fillColor=#e1d5e7;strokeColor=#9673a6;" parent="r4HV4cJx_bj7ma0suZPp-1" vertex="1">
          <mxGeometry x="550" y="130" width="120" height="60" as="geometry" />
        </mxCell>
        <mxCell id="9c8uwt9igoJB4OCapaf--1" style="edgeStyle=orthogonalEdgeStyle;rounded=0;orthogonalLoop=1;jettySize=auto;html=1;exitX=1;exitY=0.5;exitDx=0;exitDy=0;entryX=0;entryY=0.5;entryDx=0;entryDy=0;" parent="r4HV4cJx_bj7ma0suZPp-1" source="9c8uwt9igoJB4OCapaf--0" target="r4HV4cJx_bj7ma0suZPp-11" edge="1">
          <mxGeometry relative="1" as="geometry">
            <mxPoint x="710" y="159.5" as="sourcePoint" />
            <mxPoint x="780" y="159.5" as="targetPoint" />
          </mxGeometry>
        </mxCell>
        <mxCell id="9c8uwt9igoJB4OCapaf--2" value="Leak&lt;br&gt;Test" style="rounded=0;whiteSpace=wrap;html=1;labelBackgroundColor=none;fontStyle=1;fontSize=13;fillColor=#e1d5e7;strokeColor=#9673a6;" parent="r4HV4cJx_bj7ma0suZPp-1" vertex="1">
          <mxGeometry x="390" y="570" width="120" height="60" as="geometry" />
        </mxCell>
        <mxCell id="9c8uwt9igoJB4OCapaf--3" style="edgeStyle=orthogonalEdgeStyle;rounded=0;orthogonalLoop=1;jettySize=auto;html=1;exitX=1;exitY=0.5;exitDx=0;exitDy=0;entryX=0;entryY=0.5;entryDx=0;entryDy=0;" parent="r4HV4cJx_bj7ma0suZPp-1" source="9c8uwt9igoJB4OCapaf--2" target="r4HV4cJx_bj7ma0suZPp-59" edge="1">
          <mxGeometry relative="1" as="geometry">
            <mxPoint x="1100" y="599.5" as="sourcePoint" />
            <mxPoint x="1150" y="599.5" as="targetPoint" />
            <Array as="points" />
          </mxGeometry>
        </mxCell>
        <mxCell id="jZZBdJXvlGfhbp4en7x2-1" style="edgeStyle=orthogonalEdgeStyle;rounded=0;orthogonalLoop=1;jettySize=auto;html=1;exitX=1;exitY=0.5;exitDx=0;exitDy=0;entryX=0;entryY=0.5;entryDx=0;entryDy=0;" parent="r4HV4cJx_bj7ma0suZPp-1" target="r4HV4cJx_bj7ma0suZPp-63" edge="1">
          <mxGeometry relative="1" as="geometry">
            <mxPoint x="830" y="270" as="sourcePoint" />
            <mxPoint x="790" y="500" as="targetPoint" />
          </mxGeometry>
        </mxCell>
        <mxCell id="jZZBdJXvlGfhbp4en7x2-2" value="" style="edgeStyle=orthogonalEdgeStyle;rounded=0;orthogonalLoop=1;jettySize=auto;html=1;exitX=1;exitY=0.5;exitDx=0;exitDy=0;entryX=0;entryY=0.5;entryDx=0;entryDy=0;" parent="r4HV4cJx_bj7ma0suZPp-1" source="r4HV4cJx_bj7ma0suZPp-38" edge="1">
          <mxGeometry relative="1" as="geometry">
            <mxPoint x="550" y="380" as="targetPoint" />
            <mxPoint x="670" y="380" as="sourcePoint" />
          </mxGeometry>
        </mxCell>
        <mxCell id="jZZBdJXvlGfhbp4en7x2-4" style="edgeStyle=orthogonalEdgeStyle;rounded=0;orthogonalLoop=1;jettySize=auto;html=1;exitX=1;exitY=0.5;exitDx=0;exitDy=0;entryX=0;entryY=0.5;entryDx=0;entryDy=0;" parent="r4HV4cJx_bj7ma0suZPp-1" target="r4HV4cJx_bj7ma0suZPp-53" edge="1">
          <mxGeometry relative="1" as="geometry">
            <mxPoint x="830" y="380" as="sourcePoint" />
            <mxPoint x="230" y="490" as="targetPoint" />
          </mxGeometry>
        </mxCell>
        <mxCell id="jZZBdJXvlGfhbp4en7x2-6" value="" style="edgeStyle=orthogonalEdgeStyle;rounded=0;orthogonalLoop=1;jettySize=auto;html=1;exitX=1;exitY=0.5;exitDx=0;exitDy=0;entryX=0;entryY=0.5;entryDx=0;entryDy=0;" parent="r4HV4cJx_bj7ma0suZPp-1" source="r4HV4cJx_bj7ma0suZPp-51" edge="1">
          <mxGeometry relative="1" as="geometry">
            <mxPoint x="550" y="490" as="targetPoint" />
            <mxPoint x="670" y="490" as="sourcePoint" />
          </mxGeometry>
        </mxCell>
        <mxCell id="jZZBdJXvlGfhbp4en7x2-8" style="edgeStyle=orthogonalEdgeStyle;rounded=0;orthogonalLoop=1;jettySize=auto;html=1;exitX=1;exitY=0.5;exitDx=0;exitDy=0;entryX=0;entryY=0.5;entryDx=0;entryDy=0;" parent="r4HV4cJx_bj7ma0suZPp-1" target="r4HV4cJx_bj7ma0suZPp-56" edge="1">
          <mxGeometry relative="1" as="geometry">
            <mxPoint x="830" y="490" as="sourcePoint" />
            <mxPoint x="230" y="600" as="targetPoint" />
          </mxGeometry>
        </mxCell>
        <mxCell id="U8GJlR49KaFFiEEN1-uM-0" value="&lt;div&gt;Modal Search&lt;/div&gt;&lt;div&gt;&lt;br&gt;&lt;/div&gt;" style="rounded=0;whiteSpace=wrap;html=1;labelBackgroundColor=none;fontStyle=1;fontSize=13;fillColor=#ffe6cc;strokeColor=#d79b00;" parent="r4HV4cJx_bj7ma0suZPp-1" vertex="1">
          <mxGeometry x="70" y="350" width="120" height="60" as="geometry" />
        </mxCell>
        <mxCell id="U8GJlR49KaFFiEEN1-uM-1" style="edgeStyle=orthogonalEdgeStyle;rounded=0;orthogonalLoop=1;jettySize=auto;html=1;exitX=1;exitY=0.5;exitDx=0;exitDy=0;entryX=0;entryY=0.5;entryDx=0;entryDy=0;" parent="r4HV4cJx_bj7ma0suZPp-1" source="U8GJlR49KaFFiEEN1-uM-0" target="r4HV4cJx_bj7ma0suZPp-30" edge="1">
          <mxGeometry relative="1" as="geometry">
            <mxPoint x="200" y="379.5" as="sourcePoint" />
            <mxPoint x="240" y="379.5" as="targetPoint" />
          </mxGeometry>
        </mxCell>
        <mxCell id="U8GJlR49KaFFiEEN1-uM-2" value="&lt;div&gt;Modal Search&lt;/div&gt;&lt;div&gt;&lt;br&gt;&lt;/div&gt;" style="rounded=0;whiteSpace=wrap;html=1;labelBackgroundColor=none;fontStyle=1;fontSize=13;fillColor=#ffe6cc;strokeColor=#d79b00;" parent="r4HV4cJx_bj7ma0suZPp-1" vertex="1">
          <mxGeometry x="70" y="460" width="120" height="60" as="geometry" />
        </mxCell>
        <mxCell id="U8GJlR49KaFFiEEN1-uM-3" style="edgeStyle=orthogonalEdgeStyle;rounded=0;orthogonalLoop=1;jettySize=auto;html=1;exitX=1;exitY=0.5;exitDx=0;exitDy=0;entryX=0;entryY=0.5;entryDx=0;entryDy=0;" parent="r4HV4cJx_bj7ma0suZPp-1" source="U8GJlR49KaFFiEEN1-uM-2" target="r4HV4cJx_bj7ma0suZPp-43" edge="1">
          <mxGeometry relative="1" as="geometry">
            <mxPoint x="210" y="489.5" as="sourcePoint" />
            <mxPoint x="250" y="489.5" as="targetPoint" />
            <Array as="points" />
          </mxGeometry>
        </mxCell>
        <mxCell id="NOxBPof9bXQMeQthtxV7-2" style="edgeStyle=orthogonalEdgeStyle;rounded=0;orthogonalLoop=1;jettySize=auto;html=1;exitX=1;exitY=0.5;exitDx=0;exitDy=0;entryX=0;entryY=0.5;entryDx=0;entryDy=0;" edge="1" parent="r4HV4cJx_bj7ma0suZPp-1" source="NOxBPof9bXQMeQthtxV7-0" target="NOxBPof9bXQMeQthtxV7-1">
          <mxGeometry relative="1" as="geometry" />
        </mxCell>
        <mxCell id="NOxBPof9bXQMeQthtxV7-0" value="&lt;div&gt;Visual Inspection&lt;br&gt;&lt;/div&gt;&lt;div&gt;&lt;br&gt;&lt;/div&gt;" style="rounded=0;whiteSpace=wrap;html=1;labelBackgroundColor=none;fontStyle=1;fontSize=13;fillColor=#D5E8D4;strokeColor=#82B366;" vertex="1" parent="r4HV4cJx_bj7ma0suZPp-1">
          <mxGeometry x="550" y="240" width="120" height="60" as="geometry" />
        </mxCell>
        <mxCell id="NOxBPof9bXQMeQthtxV7-1" value="&lt;div&gt;Modal Search&lt;/div&gt;&lt;div&gt;&lt;br&gt;&lt;/div&gt;" style="rounded=0;whiteSpace=wrap;html=1;labelBackgroundColor=none;fontStyle=1;fontSize=13;fillColor=#ffe6cc;strokeColor=#d79b00;" vertex="1" parent="r4HV4cJx_bj7ma0suZPp-1">
          <mxGeometry x="710" y="240" width="120" height="60" as="geometry" />
        </mxCell>
        <mxCell id="NOxBPof9bXQMeQthtxV7-5" style="edgeStyle=orthogonalEdgeStyle;rounded=0;orthogonalLoop=1;jettySize=auto;html=1;exitX=1;exitY=0.5;exitDx=0;exitDy=0;entryX=0;entryY=0.5;entryDx=0;entryDy=0;" edge="1" parent="r4HV4cJx_bj7ma0suZPp-1" source="NOxBPof9bXQMeQthtxV7-6" target="NOxBPof9bXQMeQthtxV7-7">
          <mxGeometry relative="1" as="geometry" />
        </mxCell>
        <mxCell id="NOxBPof9bXQMeQthtxV7-6" value="&lt;div&gt;Visual Inspection&lt;br&gt;&lt;/div&gt;&lt;div&gt;&lt;br&gt;&lt;/div&gt;" style="rounded=0;whiteSpace=wrap;html=1;labelBackgroundColor=none;fontStyle=1;fontSize=13;fillColor=#D5E8D4;strokeColor=#82B366;" vertex="1" parent="r4HV4cJx_bj7ma0suZPp-1">
          <mxGeometry x="550" y="350" width="120" height="60" as="geometry" />
        </mxCell>
        <mxCell id="NOxBPof9bXQMeQthtxV7-7" value="&lt;div&gt;Modal Search&lt;/div&gt;&lt;div&gt;&lt;br&gt;&lt;/div&gt;" style="rounded=0;whiteSpace=wrap;html=1;labelBackgroundColor=none;fontStyle=1;fontSize=13;fillColor=#ffe6cc;strokeColor=#d79b00;" vertex="1" parent="r4HV4cJx_bj7ma0suZPp-1">
          <mxGeometry x="710" y="350" width="120" height="60" as="geometry" />
        </mxCell>
        <mxCell id="NOxBPof9bXQMeQthtxV7-8" style="edgeStyle=orthogonalEdgeStyle;rounded=0;orthogonalLoop=1;jettySize=auto;html=1;exitX=1;exitY=0.5;exitDx=0;exitDy=0;entryX=0;entryY=0.5;entryDx=0;entryDy=0;" edge="1" parent="r4HV4cJx_bj7ma0suZPp-1" source="NOxBPof9bXQMeQthtxV7-9" target="NOxBPof9bXQMeQthtxV7-10">
          <mxGeometry relative="1" as="geometry" />
        </mxCell>
        <mxCell id="NOxBPof9bXQMeQthtxV7-9" value="&lt;div&gt;Visual Inspection&lt;br&gt;&lt;/div&gt;&lt;div&gt;&lt;br&gt;&lt;/div&gt;" style="rounded=0;whiteSpace=wrap;html=1;labelBackgroundColor=none;fontStyle=1;fontSize=13;fillColor=#D5E8D4;strokeColor=#82B366;" vertex="1" parent="r4HV4cJx_bj7ma0suZPp-1">
          <mxGeometry x="550" y="460" width="120" height="60" as="geometry" />
        </mxCell>
        <mxCell id="NOxBPof9bXQMeQthtxV7-10" value="&lt;div&gt;Modal Search&lt;/div&gt;&lt;div&gt;&lt;br&gt;&lt;/div&gt;" style="rounded=0;whiteSpace=wrap;html=1;labelBackgroundColor=none;fontStyle=1;fontSize=13;fillColor=#ffe6cc;strokeColor=#d79b00;" vertex="1" parent="r4HV4cJx_bj7ma0suZPp-1">
          <mxGeometry x="710" y="460" width="120" height="60" as="geometry" />
        </mxCell>
      </root>
    </mxGraphModel>
  </diagram>
</mxfile>
