Ref,Val,Package,PosX,PosY,Rot,Side
"C1","1n","C_0603_1608Metric",2.200000,84.400000,-90.000000,top
"C2","1n","C_0603_1608Metric",6.700000,84.400000,-90.000000,top
"C3","1n","C_0603_1608Metric",3.700000,84.400000,-90.000000,top
"C4","100n","C_0402_1005Metric",8.900000,74.250000,180.000000,top
"C5","100n","C_0402_1005Metric",20.500000,71.000000,180.000000,top
"C6","100n","R_0402_1005Metric",20.600000,51.400000,-90.000000,top
"C7","10u","C_0603_1608Metric",8.900000,73.000000,180.000000,top
"C8","10u","C_0603_1608Metric",20.450000,69.750000,180.000000,top
"C9","390n","C_0603_1608Metric",40.900000,61.200000,90.000000,top
"C10","390n","C_0603_1608Metric",48.200960,65.900000,-90.000000,top
"C11","100n","C_0402_1005Metric",43.600000,51.450000,-90.000000,top
"C12","0.1u","C_0603_1608Metric",36.375000,69.050000,0.000000,top
"C13","390n","C_0603_1608Metric",37.525960,61.186779,-90.000000,top
"C14","390n","C_0603_1608Metric",51.400000,65.900000,90.000000,top
"C15","0.1u","C_0603_1608Metric",49.800000,73.750000,0.000000,top
"C16","0.1u","C_0603_1608Metric",58.300000,52.550000,0.000000,top
"C17","100n","C_0402_1005Metric",23.600000,41.700000,180.000000,top
"C18","100n","C_0402_1005Metric",21.625000,26.800000,90.000000,top
"C19","100n","C_0402_1005Metric",20.450000,34.600000,180.000000,top
"C20","100n","C_0402_1005Metric",20.900000,33.650000,180.000000,top
"C21","100n","C_0402_1005Metric",39.450000,41.650000,180.000000,top
"C22","100n","C_0402_1005Metric",47.200000,35.800000,90.000000,top
"C23","11p","C_0603_1608Metric",48.000000,38.500000,0.000000,top
"C24","100n","C_0402_1005Metric",36.000000,43.700000,90.000000,top
"C25","11p","C_0603_1608Metric",45.660000,42.655000,90.000000,top
"C26","100n","C_0402_1005Metric",46.200000,24.650000,-90.000000,top
"C27","100n","C_0402_1005Metric",51.200000,34.250000,0.000000,top
"C28","100n","C_0402_1005Metric",50.400000,37.200000,90.000000,top
"C29","390n","C_0603_1608Metric",68.300000,31.400000,90.000000,top
"C30","390n","C_0603_1608Metric",58.900000,42.200000,0.000000,top
"C31","100n","C_0603_1608Metric",65.700000,26.000000,180.000000,top
"C32","390n","C_0603_1608Metric",71.300000,31.400000,-90.000000,top
"C33","390n","C_0603_1608Metric",58.900000,45.400000,180.000000,top
"C34","0.1u","C_0603_1608Metric",70.400000,43.350000,0.000000,top
"C35","100n","C_0402_1005Metric",12.000000,17.250000,0.000000,top
"C36","100n","C_0402_1005Metric",21.700000,20.300000,-90.000000,top
"C37","100n","C_0402_1005Metric",18.250000,11.550000,90.000000,top
"C38","100n","C_0402_1005Metric",37.900000,17.150000,0.000000,top
"C39","100n","C_0402_1005Metric",31.700000,16.000000,-90.000000,top
"C40","1u","C_0603_1608Metric",47.500000,20.400000,-90.000000,top
"C41","100n","C_0402_1005Metric",46.250000,22.800000,90.000000,top
"C42","100n","C_0402_1005Metric",46.250000,20.950000,-90.000000,top
"C43","100n","C_0402_1005Metric",39.800000,17.150000,180.000000,top
"C44","4.7u","C_0603_1608Metric",48.200000,23.410000,90.000000,top
"C45","100n","C_0402_1005Metric",46.600000,15.900000,-90.000000,top
"C46","100n","C_0603_1608Metric",66.000000,11.200000,0.000000,top
"C47","1n","C_0603_1608Metric",78.600000,5.300000,180.000000,top
"F1","MF-PSML075_12-2","MFPSML075122",71.600000,79.000000,180.000000,top
"F2","MF-ASML035_6-2","MF-ASML035_6-2",15.100000,73.600000,180.000000,top
"F3","MF-ASML035_6-2","MF-ASML035_6-2",29.000000,73.900000,180.000000,top
"F4","FEMTOASMDC005F-2","FEMTOASMDC005F-2",10.600000,18.600000,0.000000,top
"F5","FEMTOASMDC005F-2","FEMTOASMDC005F-2",16.150000,11.250000,0.000000,top
"FID1","Fiducial","Fiducial_0.5mm_Mask1mm",87.800000,93.800000,0.000000,top
"FID2","Fiducial","Fiducial_0.5mm_Mask1mm",2.300000,2.300000,0.000000,top
"FID3","Fiducial","Fiducial_0.5mm_Mask1mm",87.800000,2.300000,0.000000,top
"FL1","470 @ 100 MHz","BLM18PG471SH1D",48.300000,25.800000,180.000000,top
"FL2","470 @ 100 MHz","BLM18PG471SH1D",33.000000,15.400000,90.000000,top
"FL3","470 @ 100 MHz","BLM18PG471SH1D",40.300000,15.150000,90.000000,top
"IC1","TLC555QDR","TLC555QDR",35.900000,65.500000,0.000000,top
"IC2","MT29F64G08AFAAAWP-ITZ_A_TR","SOP50P2000X120-48N",32.315242,51.399040,0.000000,top
"IC3","TLC555QDR","TLC555QDR",48.100000,70.200000,0.000000,top
"IC4","TLV2254AIDR","TVL2254AIDR",67.700000,55.000000,90.000000,top
"IC5","TLC555QDR","TLC555QDR",57.200000,49.000000,0.000000,top
"IC6","TLC555QDR","TLC555QDR",68.900000,39.800000,0.000000,top
"J1","SSQ-126-03-G-D","SAMTEC_SSQ-126-03-G-D",45.098000,84.579000,0.000000,top
"J2","SSQ-126-03-G-D","SAMTEC_SSQ-126-03-G-D",45.098000,89.659000,0.000000,top
"J3","TFML-110-02-L-D-LC-TR","SAMTEC_TFML-110-02-L-D-LC-TR",8.900000,60.012500,-90.000000,top
"J4","M80-6661022","M80-66610YY",77.800000,54.900000,90.000000,top
"J5","M80-6661222","M80-66612YY",77.500000,72.800000,90.000000,top
"J6","DF58-4P-1.2V_21_","DF584P12V21",4.400000,24.340000,-90.000000,top
"J7","SAMTEC-FTS-103-01-X-SV","SAMTEC-FTS-103-01-X-SV",7.600000,47.200000,-90.000000,top
"J8","DF58-4P-1.2V_21_","DF584P12V21",83.700000,31.900000,90.000000,top
"J9","DF58-4P-1.2V_21_","DF584P12V21",83.700000,41.700000,90.000000,top
"J10","Conn_01x01_Male","PinHeader_1x01_P1.00mm_Vertical",3.000000,9.700000,0.000000,top
"J11","DF57H-3P-1.2V_21_","DF57H3P12V21",1.900000,14.800000,-90.000000,top
"J12","DF58-4P-1.2V_21_","DF584P12V21",13.500000,5.500000,0.000000,top
"J13","DF58-4P-1.2V_21_","DF584P12V21",41.600000,6.500000,0.000000,top
"J14","DF58-6P-1.2V_21_","DF586P12V21",27.500000,5.242500,0.000000,top
"J15","DF58-4P-1.2V_21_","DF584P12V21",51.500000,6.500000,0.000000,top
"J16","DF58-4P-1.2V_21_","DF584P12V21",68.200000,5.200000,0.000000,top
"J17","DF58-4P-1.2V_21_","DF584P12V21",83.720000,21.380000,90.000000,top
"Q1","2N7002NXAKR","2N7002NXAKR",36.800000,75.600000,180.000000,top
"Q2","SI6926ADQ-T1-E3","SI6926ADQ-T1-E3",59.200000,76.700000,-90.000000,top
"Q3","PMV28XPEAR","PMV28XPEAR",47.300000,55.200000,180.000000,top
"Q4","2N7002NXAKR","2N7002NXAKR",30.200000,66.900000,180.000000,top
"Q5","PMV28XPEAR","PMV28XPEAR",26.100000,68.800000,180.000000,top
"Q6","PMV28XPEAR","PMV28XPEAR",32.200000,73.900000,180.000000,top
"Q7","2N7002NXAKR","2N7002NXAKR",51.350960,54.180779,180.000000,top
"Q8","PMV28XPEAR","PMV28XPEAR",61.300000,35.600000,-90.000000,top
"Q9","2N7002NXAKR","2N7002NXAKR",68.950960,35.200000,180.000000,top
"R1","100K","R_0402_1005Metric",12.260000,80.160000,90.000000,top
"R2","100k","R_0603_1608Metric_Pad0.98x0.95mm_HandSolder",5.200000,84.300000,-90.000000,top
"R3","0.5","R_0603_1608Metric",46.200000,76.350000,-90.000000,top
"R4","100K","R_0402_1005Metric",23.800000,76.700000,90.000000,top
"R5","510k","R_0603_1608Metric",65.400000,79.200000,90.000000,top
"R6","1.5M","R_0603_1608Metric",68.100000,78.100000,-90.000000,top
"R7","1M","R_0603_1608Metric",68.400000,75.800000,180.000000,top
"R8","300k","R_0603_1608Metric",70.700000,75.100000,-90.000000,top
"R9","10k","R_0603_1608Metric",16.500000,55.400000,-90.000000,top
"R10","10k","R_0603_1608Metric",20.400000,57.500000,-90.000000,top
"R11","10k","R_0603_1608Metric",22.200000,59.700000,-90.000000,top
"R12","10k","R_0603_1608Metric",18.800000,56.500000,-90.000000,top
"R13","1k","R_0603_1608Metric",47.700960,50.700000,0.000000,top
"R14","1K","R_0603_1608Metric",30.600000,64.300000,180.000000,top
"R15","10K","R_0603_1608Metric",30.600000,62.100000,0.000000,top
"R16","10K","R_0603_1608Metric",43.550000,73.550000,-90.000000,top
"R17","10K","R_0603_1608Metric",32.400000,58.700000,0.000000,top
"R18","10K","R_0603_1608Metric",45.100000,65.900000,90.000000,top
"R19","10k","R_0603_1608Metric",46.600000,65.900000,-90.000000,top
"R20","1k","R_0603_1608Metric",35.700000,71.500000,0.000000,top
"R21","10k","R_0603_1608Metric",35.600000,61.200000,-90.000000,top
"R22","10k","R_0603_1608Metric",39.125960,61.186779,90.000000,top
"R23","30K","R_0603_1608Metric",27.600000,63.200000,180.000000,top
"R24","1k","R_0603_1608Metric",26.700000,64.700000,0.000000,top
"R25","1K","R_0603_1608Metric",47.700960,52.200000,0.000000,top
"R26","1K","R_0603_1608Metric",40.500000,72.300000,90.000000,top
"R27","1K","R_0603_1608Metric",35.700000,73.000000,0.000000,top
"R28","1K","R_0603_1608Metric",26.700000,66.200000,0.000000,top
"R29","30K","R_0603_1608Metric",39.000000,72.300000,-90.000000,top
"R30","100k","R_0402_1005Metric",74.300000,57.700000,-90.000000,top
"R31","500k","R_0603_1608Metric",66.000960,63.900000,180.000000,top
"R32","1K","R_0603_1608Metric",52.700000,50.900000,90.000000,top
"R33","30k","R_0603_1608Metric",68.400000,74.300000,0.000000,top
"R34","1k","R_0603_1608Metric",72.175960,61.000000,180.000000,top
"R35","20k","R_0603_1608Metric",60.500000,58.300000,0.000000,top
"R36","30K","R_0603_1608Metric",51.200000,50.900000,-90.000000,top
"R37","500K","R_0603_1608Metric",72.175960,59.500000,180.000000,top
"R38","0.5","R_0603_1608Metric",51.100000,61.400000,0.000000,top
"R39","30k","R_0603_1608Metric",68.400000,72.800000,0.000000,top
"R40","20k","R_0603_1608Metric",69.150960,62.700000,0.000000,top
"R41","1k","R_0603_1608Metric",60.500000,56.800000,0.000000,top
"R42","1k","R_0603_1608Metric",69.175960,61.100000,0.000000,top
"R43","20k","R_0603_1608Metric",55.825000,54.100000,180.000000,top
"R44","500K","R_0603_1608Metric",63.700000,50.450000,0.000000,top
"R45","1k","R_0603_1608Metric",66.000000,62.400000,0.000000,top
"R46","100k","R_0603_1608Metric",70.700000,72.100000,-90.000000,top
"R47","100k","R_0402_1005Metric",74.200000,55.350000,-90.000000,top
"R48","40k","R_0603_1608Metric",68.400000,71.300000,180.000000,top
"R49","500K","R_0603_1608Metric",63.000000,59.800000,0.000000,top
"R50","10k","R_0603_1608Metric",49.800960,65.900000,90.000000,top
"R51","20k","R_0603_1608Metric",55.700000,62.800000,0.000000,top
"R52","500k","R_0603_1608Metric",69.200000,59.600000,180.000000,top
"R53","20k","R_0603_1608Metric",71.475960,63.400000,90.000000,top
"R54","20k","R_0603_1608Metric",56.700000,61.200000,180.000000,top
"R55","500k","R_0603_1608Metric",60.700000,54.400000,180.000000,top
"R56","1k","R_0603_1608Metric",62.900000,61.300000,0.000000,top
"R57","300K","R_0603_1608Metric",72.280000,49.740000,180.000000,top
"R58","300k","R_0603_1608Metric",69.250960,49.550000,180.000000,top
"R59","0.5","R_0603_1608Metric",55.825000,55.700000,0.000000,top
"R60","1.5k","R_0402_1005Metric",7.500000,40.100000,0.000000,top
"R61","100k","R_0402_1005Metric",19.800000,36.600000,0.000000,top
"R62","100k","R_0402_1005Metric",21.100000,30.700000,0.000000,top
"R63","30K","R_0603_1608Metric",73.300000,35.200000,90.000000,top
"R64","1k","R_0603_1608Metric",65.500000,34.300000,0.000000,top
"R65","20k","R_0603_1608Metric",72.300000,45.350000,0.000000,top
"R66","10k","R_0603_1608Metric",69.800000,31.400000,-90.000000,top
"R67","20k","R_0603_1608Metric",69.250000,46.450000,0.000000,top
"R68","1k","R_0603_1608Metric",69.250000,48.000000,0.000000,top
"R69","1k","R_0603_1608Metric",72.400000,47.550000,180.000000,top
"R70","10K","R_0603_1608Metric",64.400000,38.300000,-90.000000,top
"R71","10K","R_0603_1608Metric",56.600000,44.700000,90.000000,top
"R72","10K","R_0603_1608Metric",64.400000,41.300000,-90.000000,top
"R73","1K","R_0603_1608Metric",71.700000,35.400000,-90.000000,top
"R74","1K","R_0603_1608Metric",65.500000,35.800000,0.000000,top
"R75","10k","R_0603_1608Metric",58.900000,40.600000,0.000000,top
"R76","10k","R_0603_1608Metric",58.900000,43.800000,180.000000,top
"R77","10k","R_0603_1608Metric",66.800000,31.400000,90.000000,top
"R78","10K","R_0603_1608Metric",51.900000,47.300000,0.000000,top
"R79","1k","R_0603_1608Metric",63.700000,48.900000,0.000000,top
"R80","0.5","R_0603_1608Metric",67.550000,44.900000,180.000000,top
"R81","1.5k","R_0402_1005Metric",6.700000,19.100000,180.000000,top
"R82","1.5k","R_0402_1005Metric",21.100000,22.500000,90.000000,top
"R83","1.5k","R_0402_1005Metric",24.300000,16.400000,-90.000000,top
"R84","10k","R_0603_1608Metric",69.000000,11.200000,0.000000,top
"R85","10k","R_0603_1608Metric",62.000960,11.200000,0.000000,top
"R86","100k","R_0603_1608Metric_Pad0.98x0.95mm_HandSolder",78.400000,3.800000,180.000000,top
"TP3","5015","KEYSTONE_5015",4.600000,74.900000,90.000000,top
"TP4","5015","KEYSTONE_5015",13.000000,77.110000,90.000000,top
"TP29","5015","KEYSTONE_5015",51.050000,18.000000,0.000000,top
"U1","TCAN337GD","TCAN337GDR",20.500000,75.200000,90.000000,top
"U2","TCAN337GD","TCAN337GDR",8.900000,78.500000,90.000000,top
"U3","LTC4367","LTC4367",64.400000,74.500000,90.000000,top
"U4","ATSAMV71Q21B-AAB","ATSAMV71Q21B-AAB",33.965242,29.399040,180.000000,top
"U5","MCP9808T-E_MS","MCP9808T-E_MS",20.550000,12.800000,-90.000000,top
"U6","MCP9808T-E_MS","MCP9808T-E_MS",14.300000,14.950000,180.000000,top
"U7","MR4A08BUYS45","MR4A08BUYS45",66.300960,18.586779,90.000000,top
"Y1","FC-135_32.7680KA-AG3","FC135327680KAAG3",48.400000,42.000000,90.000000,top
"Y2","ECS-TXO-2520-33-160-AN-TR","ECSTXO252033160ANTR",43.900000,15.200000,90.000000,top
