(footprint "MF-ASML035_6-2" (version 20211014) (generator pcbnew)
  (layer "F.Cu")
  (tedit 0)
  (descr "MF-ASML035/6-2+")
  (tags "Fuse")
  (attr smd)
  (fp_text reference "F**" (at 0 0) (layer "F.SilkS")
    (effects (font (size 1.27 1.27) (thickness 0.254)))
    (tstamp 2f6cbfe8-42c7-4e33-ba50-e35c68da5d9a)
  )
  (fp_text value "FUSC1005X60N" (at 0 0) (layer "F.SilkS") hide
    (effects (font (size 1.27 1.27) (thickness 0.254)))
    (tstamp ebf85c8b-1212-4d36-a69f-ecfe45ed0201)
  )
  (fp_text user "${REFERENCE}" (at 0 0) (layer "F.Fab")
    (effects (font (size 1.27 1.27) (thickness 0.254)))
    (tstamp 2a9dc246-15a7-4c3b-a212-00808becdc42)
  )
  (fp_line (start 0 -0.15) (end 0 0.15) (layer "F.SilkS") (width 0.2) (tstamp 84172753-dc4b-4e2f-8009-fedcb93b8b2e))
  (fp_line (start 1.185 0.585) (end -1.185 0.585) (layer "F.CrtYd") (width 0.05) (tstamp 098109b6-bfed-41e1-9593-bddad016ea18))
  (fp_line (start -1.185 -0.585) (end 1.185 -0.585) (layer "F.CrtYd") (width 0.05) (tstamp 21abc1b5-4c19-42cf-97fb-c6c42a0b3939))
  (fp_line (start -1.185 0.585) (end -1.185 -0.585) (layer "F.CrtYd") (width 0.05) (tstamp 2382424b-0905-467b-a458-dad739d3178b))
  (fp_line (start 1.185 -0.585) (end 1.185 0.585) (layer "F.CrtYd") (width 0.05) (tstamp cb0b1ab5-9bb3-4739-8432-5bb872c1dcaf))
  (fp_line (start 0.5 0.25) (end -0.5 0.25) (layer "F.Fab") (width 0.1) (tstamp 197ee073-8df2-40ec-bccc-00e85fb1ca6e))
  (fp_line (start -0.5 0.25) (end -0.5 -0.25) (layer "F.Fab") (width 0.1) (tstamp 1c906085-d1de-4322-8260-c3da1fa2c346))
  (fp_line (start -0.5 -0.25) (end 0.5 -0.25) (layer "F.Fab") (width 0.1) (tstamp 4725caf9-fd3b-453d-bc25-8fa970919cfc))
  (fp_line (start 0.5 -0.25) (end 0.5 0.25) (layer "F.Fab") (width 0.1) (tstamp d7a53569-e088-46e2-8314-072cb6504943))
  (pad "1" smd rect (at -0.625 0) (size 0.62 0.67) (layers "F.Cu" "F.Paste" "F.Mask") (tstamp b2378185-7fff-4c42-afc5-18ead00ec14e))
  (pad "2" smd rect (at 0.625 0) (size 0.62 0.67) (layers "F.Cu" "F.Paste" "F.Mask") (tstamp d84d5d47-57a7-42ec-b083-1ded8201a6ac))
  (model "${KIPRJMOD}/3D/wrl/MF-ASML035_6-2.wrl"
    (offset (xyz 0 0 0))
    (scale (xyz 1 1 1))
    (rotate (xyz 0 0 0))
  )
  (model "${KIPRJMOD}/3D/step/MF-ASML035_6-2.stp"
    (offset (xyz 0 0 0))
    (scale (xyz 1 1 1))
    (rotate (xyz 0 0 0))
  )
)
