EESchema Schematic File Version 4
EELAYER 30 0
EELAYER END
$Descr A4 11693 8268
encoding utf-8
Sheet 1 1
Title "Ground Station Mockup"
Date ""
Rev "0.1"
Comp "A.S.A.T"
Comment1 ""
Comment2 ""
Comment3 ""
Comment4 ""
$EndDescr
$Comp
L Device:LED D1
U 1 1 5D75CBF6
P 4450 1700
F 0 "D1" V 4489 1583 50  0000 R CNN
F 1 "LED" V 4398 1583 50  0000 R CNN
F 2 "" H 4450 1700 50  0001 C CNN
F 3 "~" H 4450 1700 50  0001 C CNN
	1    4450 1700
	0    -1   -1   0   
$EndComp
$Comp
L Device:LED D2
U 1 1 5D75D216
P 4900 1700
F 0 "D2" V 4939 1583 50  0000 R CNN
F 1 "LED" V 4848 1583 50  0000 R CNN
F 2 "" H 4900 1700 50  0001 C CNN
F 3 "~" H 4900 1700 50  0001 C CNN
	1    4900 1700
	0    -1   -1   0   
$EndComp
$Comp
L Device:R R2
U 1 1 5D75E69A
P 4900 1250
F 0 "R2" H 4970 1296 50  0000 L CNN
F 1 "470" H 4970 1205 50  0000 L CNN
F 2 "" V 4830 1250 50  0001 C CNN
F 3 "~" H 4900 1250 50  0001 C CNN
	1    4900 1250
	1    0    0    -1  
$EndComp
Wire Wire Line
	4450 1400 4450 1550
Wire Wire Line
	4900 1400 4900 1550
$Comp
L power:VCC #PWR05
U 1 1 5D75FA56
P 4450 1100
F 0 "#PWR05" H 4450 950 50  0001 C CNN
F 1 "VCC" H 4467 1273 50  0000 C CNN
F 2 "" H 4450 1100 50  0001 C CNN
F 3 "" H 4450 1100 50  0001 C CNN
	1    4450 1100
	1    0    0    -1  
$EndComp
$Comp
L power:VCC #PWR07
U 1 1 5D7615E1
P 4900 1100
F 0 "#PWR07" H 4900 950 50  0001 C CNN
F 1 "VCC" H 4917 1273 50  0000 C CNN
F 2 "" H 4900 1100 50  0001 C CNN
F 3 "" H 4900 1100 50  0001 C CNN
	1    4900 1100
	1    0    0    -1  
$EndComp
$Comp
L power:GND #PWR06
U 1 1 5D762B54
P 4450 1850
F 0 "#PWR06" H 4450 1600 50  0001 C CNN
F 1 "GND" H 4455 1677 50  0000 C CNN
F 2 "" H 4450 1850 50  0001 C CNN
F 3 "" H 4450 1850 50  0001 C CNN
	1    4450 1850
	1    0    0    -1  
$EndComp
$Comp
L power:GND #PWR08
U 1 1 5D763067
P 4900 1850
F 0 "#PWR08" H 4900 1600 50  0001 C CNN
F 1 "GND" H 4905 1677 50  0000 C CNN
F 2 "" H 4900 1850 50  0001 C CNN
F 3 "" H 4900 1850 50  0001 C CNN
	1    4900 1850
	1    0    0    -1  
$EndComp
$Comp
L Device:R R1
U 1 1 5D75DE1B
P 4450 1250
F 0 "R1" H 4520 1296 50  0000 L CNN
F 1 "470" H 4520 1205 50  0000 L CNN
F 2 "" V 4380 1250 50  0001 C CNN
F 3 "~" H 4450 1250 50  0001 C CNN
	1    4450 1250
	1    0    0    -1  
$EndComp
$Comp
L power:GND #PWR010
U 1 1 5D78A515
P 6850 3100
F 0 "#PWR010" H 6850 2850 50  0001 C CNN
F 1 "GND" V 6855 2972 50  0000 R CNN
F 2 "" H 6850 3100 50  0001 C CNN
F 3 "" H 6850 3100 50  0001 C CNN
	1    6850 3100
	0    -1   -1   0   
$EndComp
$Comp
L power:VCC #PWR09
U 1 1 5D78D2DC
P 5400 3600
F 0 "#PWR09" H 5400 3450 50  0001 C CNN
F 1 "VCC" H 5418 3773 50  0000 C CNN
F 2 "" H 5400 3600 50  0001 C CNN
F 3 "" H 5400 3600 50  0001 C CNN
	1    5400 3600
	-1   0    0    1   
$EndComp
$Comp
L Device:R R3
U 1 1 5D78D6FE
P 5400 3450
F 0 "R3" H 5470 3496 50  0000 L CNN
F 1 "47k" H 5470 3405 50  0000 L CNN
F 2 "" V 5330 3450 50  0001 C CNN
F 3 "~" H 5400 3450 50  0001 C CNN
	1    5400 3450
	1    0    0    -1  
$EndComp
$Comp
L LM385:LM385BZ-2.5G D3
U 1 1 5D785E3C
P 5950 3100
F 0 "D3" H 6400 3365 50  0000 C CNN
F 1 "LM385BZ-2.5G" H 6400 3274 50  0000 C CNN
F 2 "TO-92_(TO-226)" H 6700 3200 50  0001 L CNN
F 3 "http://www.onsemi.com/pub/Collateral/LM285-D.PDF" H 6700 3100 50  0001 L CNN
F 4 "ON Semiconductor LM385BZ-2.5G, Fixed Shunt Voltage Reference 2.5V, +/-1.5 % 3-Pin, TO-92" H 6700 3000 50  0001 L CNN "Description"
F 5 "" H 6700 2900 50  0001 L CNN "Height"
F 6 "ON Semiconductor" H 6700 2800 50  0001 L CNN "Manufacturer_Name"
F 7 "LM385BZ-2.5G" H 6700 2700 50  0001 L CNN "Manufacturer_Part_Number"
F 8 "863-LM385BZ-2.5G" H 6700 2600 50  0001 L CNN "Mouser Part Number"
F 9 "https://www.mouser.com/Search/Refine.aspx?Keyword=863-LM385BZ-2.5G" H 6700 2500 50  0001 L CNN "Mouser Price/Stock"
F 10 "7743486P" H 6700 2400 50  0001 L CNN "RS Part Number"
F 11 "http://uk.rs-online.com/web/p/products/7743486P" H 6700 2300 50  0001 L CNN "RS Price/Stock"
F 12 "70099811" H 6700 2200 50  0001 L CNN "Allied_Number"
F 13 "http://www.alliedelec.com/on-semiconductor-lm385bz-2-5g/70099811/" H 6700 2100 50  0001 L CNN "Allied Price/Stock"
	1    5950 3100
	1    0    0    -1  
$EndComp
$Comp
L Device:R R4
U 1 1 5D791CAB
P 5700 3100
F 0 "R4" V 5493 3100 50  0000 C CNN
F 1 "1k" V 5584 3100 50  0000 C CNN
F 2 "" V 5630 3100 50  0001 C CNN
F 3 "~" H 5700 3100 50  0001 C CNN
	1    5700 3100
	0    1    1    0   
$EndComp
$Comp
L Device:R R5
U 1 1 5D793596
P 6400 2650
F 0 "R5" V 6193 2650 50  0000 C CNN
F 1 "330k" V 6284 2650 50  0000 C CNN
F 2 "" V 6330 2650 50  0001 C CNN
F 3 "~" H 6400 2650 50  0001 C CNN
	1    6400 2650
	0    1    1    0   
$EndComp
Wire Wire Line
	5950 3100 5850 3100
Wire Wire Line
	5400 3200 5400 3300
Wire Wire Line
	5400 3200 5950 3200
Wire Wire Line
	5550 3100 5400 3100
Wire Wire Line
	5400 3100 5400 3200
Connection ~ 5400 3200
Wire Wire Line
	6250 2650 5950 2650
Wire Wire Line
	5950 2650 5950 3100
Connection ~ 5950 3100
Wire Wire Line
	6850 2650 6850 3100
Wire Wire Line
	6550 2650 6850 2650
Connection ~ 6850 3100
Wire Wire Line
	5950 3200 5950 3450
Connection ~ 5950 3200
Text Label 6750 3450 0    50   ~ 0
2.7V
Text Notes 1600 5500 0    50   ~ 0
MOSI: cable to MCU is common\nMISO: cable to MCU is common\nSCK: cable to MCU is common\n\nSEL: 2 different cables
$Comp
L Connector:Conn_01x08_Male J?
U 1 1 5D75B7BE
P 2300 3050
F 0 "J?" H 2408 3531 50  0000 C CNN
F 1 "Conn_01x08_Male" H 2408 3440 50  0000 C CNN
F 2 "" H 2300 3050 50  0001 C CNN
F 3 "~" H 2300 3050 50  0001 C CNN
	1    2300 3050
	1    0    0    -1  
$EndComp
$Comp
L power:GND #PWR?
U 1 1 5D75F3AD
P 2500 2850
F 0 "#PWR?" H 2500 2600 50  0001 C CNN
F 1 "GND" H 2505 2677 50  0000 C CNN
F 2 "" H 2500 2850 50  0001 C CNN
F 3 "" H 2500 2850 50  0001 C CNN
	1    2500 2850
	0    -1   -1   0   
$EndComp
Wire Wire Line
	2500 2750 2850 2750
Wire Wire Line
	2500 3050 2850 3050
Wire Wire Line
	2500 3150 2850 3150
Wire Wire Line
	2500 3250 2850 3250
Wire Wire Line
	2500 3350 2850 3350
Wire Wire Line
	2500 3450 2850 3450
$Comp
L power:VCC #PWR?
U 1 1 5D7673CF
P 2850 2750
F 0 "#PWR?" H 2850 2600 50  0001 C CNN
F 1 "VCC" H 2868 2923 50  0000 C CNN
F 2 "" H 2850 2750 50  0001 C CNN
F 3 "" H 2850 2750 50  0001 C CNN
	1    2850 2750
	0    1    1    0   
$EndComp
$Comp
L power:GND #PWR?
U 1 1 5D767BF3
P 2850 3450
F 0 "#PWR?" H 2850 3200 50  0001 C CNN
F 1 "GND" H 2855 3277 50  0000 C CNN
F 2 "" H 2850 3450 50  0001 C CNN
F 3 "" H 2850 3450 50  0001 C CNN
	1    2850 3450
	0    -1   -1   0   
$EndComp
Text Label 2850 3050 0    50   ~ 0
MISO
Text Label 2850 3150 0    50   ~ 0
MOSI
Text Label 2850 3250 0    50   ~ 0
SCK
Text Label 2850 3350 0    50   ~ 0
SEL_AT86
Wire Wire Line
	2500 2950 3000 2950
Wire Notes Line
	1600 2500 1600 3600
Wire Notes Line
	1600 3600 3650 3600
Wire Notes Line
	3650 3600 3650 2500
Wire Notes Line
	3650 2500 1600 2500
Text Notes 2150 2500 0    50   ~ 0
Connector for AT86RF233\n
$Comp
L Connector:Conn_01x07_Male J?
U 1 1 5D79557D
P 7200 4350
F 0 "J?" V 7127 4328 50  0000 C CNN
F 1 "Conn_01x07_Male" V 7036 4328 50  0000 C CNN
F 2 "" H 7200 4350 50  0001 C CNN
F 3 "~" H 7200 4350 50  0001 C CNN
	1    7200 4350
	1    0    0    -1  
$EndComp
Wire Wire Line
	7600 4050 7400 4050
Wire Wire Line
	7600 4050 7850 4050
Connection ~ 7600 4050
Text Label 7850 4050 0    50   ~ 0
VAUX
$Comp
L power:GND #PWR?
U 1 1 5D7993ED
P 7400 4150
F 0 "#PWR?" H 7400 3900 50  0001 C CNN
F 1 "GND" H 7405 3977 50  0000 C CNN
F 2 "" H 7400 4150 50  0001 C CNN
F 3 "" H 7400 4150 50  0001 C CNN
	1    7400 4150
	0    -1   -1   0   
$EndComp
Wire Wire Line
	7400 4250 7750 4250
Wire Wire Line
	7400 4350 7750 4350
Wire Wire Line
	7400 4450 7750 4450
Wire Wire Line
	7400 4550 7750 4550
Wire Wire Line
	7400 4650 7750 4650
Text Label 7750 4250 0    50   ~ 0
SEL_AX50
Text Label 7750 4350 0    50   ~ 0
MISO
Text Label 7750 4450 0    50   ~ 0
MOSI
Text Label 7750 4550 0    50   ~ 0
SCK
Text Label 7750 4650 0    50   ~ 0
USUP
Wire Wire Line
	5950 3450 7600 3450
Wire Wire Line
	7600 3450 7600 4050
Wire Notes Line
	7150 3850 7150 2400
Wire Notes Line
	6900 3950 6900 4800
Wire Notes Line
	6900 4800 8250 4800
Wire Notes Line
	8250 4800 8250 3950
Wire Notes Line
	8250 3950 6900 3950
Text Notes 7200 3950 0    50   ~ 0
Connector for AX5043\n
Wire Notes Line
	5200 2400 5200 3850
Wire Notes Line
	7150 3850 5200 3850
Wire Notes Line
	5200 2400 7150 2400
Text Notes 5550 2400 0    50   ~ 0
Voltage regulator\n
$Comp
L power:VCC #PWR?
U 1 1 5D72B5BB
P 3000 2950
F 0 "#PWR?" H 3000 2800 50  0001 C CNN
F 1 "VCC" H 3018 3123 50  0000 C CNN
F 2 "" H 3000 2950 50  0001 C CNN
F 3 "" H 3000 2950 50  0001 C CNN
	1    3000 2950
	0    1    1    0   
$EndComp
$EndSCHEMATC
