PCBNEW-LibModule-V1  2019-09-05 14:31:50
# encoding utf-8
Units mm
$INDEX
TO-92_(TO-226)
$EndINDEX
$MODULE TO-92_(TO-226)
Po 0 0 0 15 5d710e46 00000000 ~~
Li TO-92_(TO-226)
Cd TO−92 (TO−226)
Kw Diode
Sc 0
At STD
AR 
Op 0 0 0
T0 0 0 1.27 1.27 0 0.254 N V 21 N "D**"
T1 0 0 1.27 1.27 0 0.254 N I 21 N "TO-92_(TO-226)"
DS -3.37217 -1.53 0.83217 -1.53 0.2 24
DS -3.37217 -1.53 0.83217 -1.53 0.1 21
DA -1.27 -0 -3.37217 -1.53 -2521 0.2 24
DA -1.27 -0 -3.37217 -1.53 -2521 0.1 21
$PAD
Po 0 0
Sh "1" C 1.44 1.44 0 0 900
Dr 0.94 0 0
At STD N 00E0FFFF
Ne 0 ""
$EndPAD
$PAD
Po -1.27 1.27
Sh "2" C 1.44 1.44 0 0 900
Dr 0.94 0 0
At STD N 00E0FFFF
Ne 0 ""
$EndPAD
$PAD
Po -2.54 0
Sh "3" C 1.44 1.44 0 0 900
Dr 0.94 0 0
At STD N 00E0FFFF
Ne 0 ""
$EndPAD
$EndMODULE TO-92_(TO-226)
$EndLIBRARY
