PCBNEW-LibModule-V1  2019-09-05 15:56:09
# encoding utf-8
Units mm
$INDEX
SOP65P490X110-8N
$EndINDEX
$MODULE SOP65P490X110-8N
Po 0 0 0 15 5d712209 00000000 ~~
Li SOP65P490X110-8N
Cd 8 Lead MS MSOP
Kw Integrated Circuit
Sc 0
At SMD
AR 
Op 0 0 0
T0 0 0 1.27 1.27 0 0.254 N V 21 N "IC**"
T1 0 0 1.27 1.27 0 0.254 N I 21 N "SOP65P490X110-8N"
DS -3.15 -1.75 3.15 -1.75 0.05 24
DS 3.15 -1.75 3.15 1.75 0.05 24
DS 3.15 1.75 -3.15 1.75 0.05 24
DS -3.15 1.75 -3.15 -1.75 0.05 24
DS -1.5 -1.5 1.5 -1.5 0.1 24
DS 1.5 -1.5 1.5 1.5 0.1 24
DS 1.5 1.5 -1.5 1.5 0.1 24
DS -1.5 1.5 -1.5 -1.5 0.1 24
DS -1.5 -0.85 -0.85 -1.5 0.1 24
DS -1.15 -1.5 1.15 -1.5 0.2 21
DS 1.15 -1.5 1.15 1.5 0.2 21
DS 1.15 1.5 -1.15 1.5 0.2 21
DS -1.15 1.5 -1.15 -1.5 0.2 21
DS -2.9 -1.55 -1.5 -1.55 0.2 21
$PAD
Po -2.2 -0.975
Sh "1" R 0.45 1.4 0 0 900
At SMD N 00888000
Ne 0 ""
$EndPAD
$PAD
Po -2.2 -0.325
Sh "2" R 0.45 1.4 0 0 900
At SMD N 00888000
Ne 0 ""
$EndPAD
$PAD
Po -2.2 0.325
Sh "3" R 0.45 1.4 0 0 900
At SMD N 00888000
Ne 0 ""
$EndPAD
$PAD
Po -2.2 0.975
Sh "4" R 0.45 1.4 0 0 900
At SMD N 00888000
Ne 0 ""
$EndPAD
$PAD
Po 2.2 0.975
Sh "5" R 0.45 1.4 0 0 900
At SMD N 00888000
Ne 0 ""
$EndPAD
$PAD
Po 2.2 0.325
Sh "6" R 0.45 1.4 0 0 900
At SMD N 00888000
Ne 0 ""
$EndPAD
$PAD
Po 2.2 -0.325
Sh "7" R 0.45 1.4 0 0 900
At SMD N 00888000
Ne 0 ""
$EndPAD
$PAD
Po 2.2 -0.975
Sh "8" R 0.45 1.4 0 0 900
At SMD N 00888000
Ne 0 ""
$EndPAD
$EndMODULE SOP65P490X110-8N
$EndLIBRARY
