0110011110001110110010110101000111111110100000100001110101011100
1111101001011111010000100100101111110101010110010010011110101010
0011111010000010011010010001001100110010111000000100101100001100
0100111110001000100001100010101110000000001101000011001011101111
0100001010110010011101100010010110011111100011011010000111100001
1111100001000111001011010001101111011001010000111101001110010100
0010100100100110000101010111010110111010010000110100110001101000
0001100011101111001101001001101000100111110010100001110011000100
1110110010010000000000111001011101100100101001001010000001100011
1001101111001110110001001010011011010000010110111010011100001111
1110011100010101010110111110000101111111111100001001110011000001
0110111000101110001000000101100101111111000101010110011111100101
0101011000010110000100000001110011101010000001100000111000101011
1011011001110011000001101000101110010010001110111101111110001011
1011100110111001001101000011110100000100100111000110001110101000
0011001100111110100111001111111010000000100110110011011000101101
1001110101000001011000110100110001000000010011100001011111011010
0011101101000001011000011111001001010010001101011001100100101110
1110101001001011010010111000101101000110100100001011110011100001
1111100111011010001101101010000100010110010000111001101110110001
0101110101110010010101001011010100010101101101001001011110001011
0000000011010000010100100010010000010000011110111101100100000100
1100100001011101011111100101100000000100010100011111000110100101
1110111010011101000110001001011110010001001111011010011011111001
0100001010000001100111110110000100110100001101110111001111001010
0001000110100110010010010010101001001000001100101111010000111111
1000010010011100000100011110110111110000111111101000011001001111
1100110000100111000001000000000010010111001001101101011001101110
1000100111101110001010100100010001101000010111000001111101100111
0001110111110110111001000001011001010000011110111111001011101111
1000011101011001110000101111101101010010000101100010101010111111
0010101101100001110100111111101110011000100001110000100011000100
0100101010001111111010100000100101010011010001010010001101010100
1010001100111110001011100111001100100111000111101000001000010001
0001011011011111011000101110010100000011110111111000000111110100
1000100001001000101111010000111111111001010111011111001101010111
1001101111100000101001111011001101100001011100100101011011101011
1001101001001101000010111011010011111110001110100011101000011001
1111101010100110001111011001111001100101001100101000100100011000
1101011010011001101110100011010101001100110111100110111111100000
1000010010001011000111111110010100001010101101011000101001101111
0011010000010111000001111111000111101111001101100100011101001011
1111011000100011101001111010010110100011010111101100100110111010
0010010010010000100110110110111001100100101001111010100010011000
1011110111011111001110111010111001110010000000101111101000100110
1000011011111001000011000101011110100000001110011001111100100000
1001011100101011100110100011000110000111101100100100010110101110
1110000011000101101000110011100001001001010110011010101011011001
1100111101110010011011000010011101111011001110000100001010011010
1011101000110111110000100100010011101110011101110001011111011011
1110010001011100100110011100101001111110001111100000000100111011
0111101110000000000011001010010001100101001001111111001011100111
0111010111000110001101111000001000011100110001000000000100110111
0101000111100110100111110001011001000001010010110001010101011111
1101111100011001011001001101111011110001001111000111000111110111
0110111010011110100000000100010001101100010111001110110010000110
0110111100101010011011011111100010011111111100101011111110000010
1101001101100010010100110101010100100100010001100110100110000001
1101010111110001010010101100000111100001110000100100101011101010
1010100010000101000011011000001101111010001111000101000100100000
1011101010101011101011011100001100011110110011110000011001101101
0111011001010011100000110100100011111100010111010100110101010100
0100001110101101010001101100111100110011010000100000000100101100
0110001111101011111000101101110011011000001100101110111110001110
1110011011101100100000101111000101001010101011111110011110000010
0001010011011000100111100011100000100011110010000011010000000010
1000101101001000110101101011111111001000001000111011100010011010
0110100010100011010101100010011011101000100111111110000100100001
0100101110111010101000110011000100100000111011000001011011001001
0110101011011010101111100000011011011000000000111101101001101101
1111110011001000100111010100000111100101011110110001000011101000
1100110000111111111100000001010001001101101101110100001000000110
0101000000111111110101011000011001010010111101101000101110010001
1001011111010110100111011111001100010010100111000111011001001110
1000101100100001010000111111011110100011011011101111001110111010
0111110000100111100010010110110001010110000011110110011110110101
1101011100000011100100001110011010011000101100110011011111101010
1000100101010110100000110110001100101010000101101000000111011111
0100101101001110100100101000110001000001111011000011110110011100
1101111111011001001011101011001010100101110101011100100001011100
0010101001010000100010001011110101110110110010110110100000010000
1100101101101001001111010010000111000000111010011110111111010101
1111100110010010010100000110111000101001100111001110000010000010
1001000000010001010101011010011000001011100100111010101000010110
0001100011111110111111101100111010110000000001100011010100110110
1001010101001000011100001000100101001011101100110001101110111001
0110011011110011111111011001011111100011001010110101100010100000
0010101000111001010000100111101001011100110110001101111010011111
0001101010001111100001100001011011000101111101111101001010110010
0101101011010010101111000100111010111111000111101000011011011011
1010110011110111101111111111101011110011010110001001010110010111
1010011101110111011001010100110000010010110111010001001101100100
1111111111000000001110100101100111011100010001010000010100100111
0011001110110100110010000111000110111010101000101110101000110011
1001001110100111010100011010011011111001110101110010111001001101
0110100110110101000011000111111111110111010000010101000111111001
0111101111101000010100011001110110101111011011111111101011111010
0010011010001101101110100111001110100011010101100001001010001100
0000010000011000101111100010110000011010010000110100011001011010
0110000011000110110111110110010100001110001001000011100010100000
1110110000100101110111000000010101100110101011101110010010101000
1010011100101010000000110000101010110001000111111011011000010000
1101110101110100110110101111011101100010111101101101010101100101
0101010101001110101011101011011100010101111101111010111001101100
0101000101000111111110010000101011111111000011101110110000000001
0001001010101001100101100110110010000111000101110000010110110001
1110100100110101111111110011000001000110111000110010100101010111
0101010001101101011010011111110010111000101000011011110100000110
0110101010000000111010100110111101110001101000101001010100000110
1110111101111000101010101100111110001101010100101011010111101101
1001111100001010010010010110011001100001101100111011011010001110
0100101100010111101011111001011001011011001010000010110000101110
0111010101011000001000100111001000010110111001010100001010011001
0111110100000111000010111001110010101011000100110000000101010111
0111011011000110000110011101001001010101000000001110001011010101
0001111110011000000001000101100101011101100111000111111110000011
0110101000001101110110100001110111110110111010001011011000010000
0010010111010000111000001010000100100100001001110100100111100000
1111111011011010010010100000011000000111001011010110100111010110
0000001111000111110110100111100101010001101010100011001101010101
0110111010011111111011111111000000000111100101111100101111110001
1110100100110110110010000010010011001001110000011110101011110101
1101010001100000011111100100011010001000111011010111101100001110
1001001011100001011000001010110101110011000100010100000010101101
0011001011111110111111001010111101110000100001100011101101110101
0011100001000110111100010001000011000100111000100011110111111111
0111100111010011111101110101001100000110010001100100100011111010
1000001100000100010100101111010110111001111011011000010001000101
