*$
******************************************************************************
* TLC555 TIMER MACROMODEL 
* 4/1/92 DBB
* REV N/A 
******************************************************************************
*                  GND
*                  |  TRIG
*                  |  |  OUT
*                  |  |  |  RST
*                  |  |  |  |  CV
*                  |  |  |  |  |  THRS
*                  |  |  |  |  |  |  DIS
*                  |  |  |  |  |  |  |	VDD
*                  |  |  |  |  |  |  |	|
.SUBCKT  TLC555/TI GND  TRIG  OUT  RST  CV  THRS  DIS VDD 
EREF 15 GND (8,1) .5
GSOURCE VDD OUT (8,26) 12.5E-3
GSINK OUT GND (26,1) 67E-3
VD1 VDD 27 DC .8
VD2 28 GND DC .85
VREF 30 GND DC 1.2
C1 29 GND 700E-15
RREF2 30 GND 100E3
RREF 15 GND 100E3
ROUT OUT GND 100K
R1 THRS GND 500E9
R2 TRIG GND 500E9
R3 VDD CV 75E3
R4 CV 9 75E3
R5 9 GND 75E3
R6 10 11 1E3
R7 13 14 1E3
R8 VDD 12 150E3
R9 RST VDD 500E9
R10 20 19 1E3
R11 16 17 1E3
R12 VDD 18 150E3
R13 VDD 21 150E3
R14 22 23 1E3
R15 VDD 26 150E3
R16 24 25 1E3
R19 DIS GND 500E9
R20 29 26 1E6
D1 GND 11 DMOD
D2 12 11 DMOD
D3 12 14 DMOD
D4 GND 14 DMOD
D5 18 17 DMOD
D6 GND 17 DMOD
D7 18 19 DMOD
D8 GND 19 DMOD
D9 21 14 DMOD
D10 21 25 DMOD
D11 GND 23 DMOD
D12 18 23 DMOD
D13 26 25 DMOD
D14 GND 25 DMOD1
D15 OUT 27 DMOD
D16 28 OUT DMOD
E1 10 GND (6,5) 1000
E2 13 GND (2,9) 1000
E3 16 GND (15,12) 1000
E4 22 GND (15,21) 1000
E5 24 GND (15,18) 1000
E7 20 GND (4,30) 1000
M1 DIS 29 GND GND MOSMOD
.MODEL MOSMOD NMOS (LEVEL=1 KP=1 VTO=1 RD=5)
.MODEL DMOD D (RS=1E-6)
.MODEL DMOD1 D (RS=1E-6 IS=1E-9)
.ENDS