 TLV2254 OPERATIONAL AMPLIFIER MACROMODEL SUBCIRCUIT
 CREATED USING PARTS RELEASE 4.03 ON 011295 AT 1120
 REV (NA) (3V MODEL)
 CONNECTIONS   NON-INVERTING INPUT
                 INVERTING INPUT
                  POSITIVE POWER SUPPLY
                   NEGATIVE POWER SUPPLY
                    OUTPUT

.SUBCKT TLV22543_1TI-BACKUP  2 1 3 4 5

  C1   11 12 8.29E-12
  C2    6  7 60.00E-12
  DC    5 53 DX
  DE   54  5 DX
  DLP  90 91 DX
  DLN  92 90 DX
  DP    4  3 DX
  EGND 99  0 POLY(2) (3,0) (4,0) 0 .5 .5
  FB    7 99 POLY(5) VB VC VE VLP VLN 0 61.40E6 -60E6 60E6 60E6 -60E6
  GA 6  0 11 12 37.32E-6
  GCM 0  6 10 99 9.654E-9
  ISS   3 10 DC 6.000E-6
  HLIM 90  0 VLIM 1K
  J1   11  2 10 JX
  J2   12  1 10 JX
  R2    6  9 100.0E3
  RD1 60 11 29.47E3
  RD2 60 12 29.47E3
  RO1   8  5 80
  RO2   7 99 60
  RP 3  4 107E3
  RSS  10 99 33.33E6
  VAD 60 4 -.5
  VB    9  0 DC 0
  VC    3 53 DC .6
  VE   54  4 DC .6
  VLIM  7  8 DC 0
  VLP  91  0 DC -.3
  VLN 0 92 DC 5.1
.MODEL DX D(IS=800.0E-18)
.MODEL JX PJF(IS=500.0E-15 BETA=383.7E-6 VTO=-.04)
.ENDSE-15 BETA=383.7E-6 VTO=-.04)
.ENDS
