(footprint "SAMTEC_TSW-104-14-F-S" (version 20211014) (generator pcbnew)
  (layer "F.Cu")
  (tedit 63550C59)
  (attr through_hole)
  (fp_text reference "REF**" (at 0.905 -3.155) (layer "F.SilkS")
    (effects (font (size 1 1) (thickness 0.15)))
    (tstamp 9372d45d-6185-44b6-837f-31f346092cf3)
  )
  (fp_text value "SAMTEC_TSW-104-14-F-S" (at 11.065 3.135) (layer "F.Fab")
    (effects (font (size 1 1) (thickness 0.15)))
    (tstamp db80d97d-ce94-44f9-b6a6-efe23a2d0808)
  )
  (fp_line (start 8.89 -1.27) (end 8.89 1.27) (layer "F.SilkS") (width 0.2) (tstamp 4339118c-ba6b-4830-a146-742472ac1884))
  (fp_line (start -1.27 1.27) (end -1.27 -1.27) (layer "F.SilkS") (width 0.2) (tstamp c0b3eaa1-b1b2-4882-9f53-0f3b64b9e6a2))
  (fp_line (start 8.89 -1.27) (end -1.27 -1.27) (layer "F.SilkS") (width 0.2) (tstamp df8d5299-3f61-4004-8c9f-5d2ce27278e5))
  (fp_line (start 8.89 1.27) (end -1.27 1.27) (layer "F.SilkS") (width 0.2) (tstamp f236ceae-ed39-4edb-ac26-169f3c04f416))
  (fp_circle (center -1.92 0) (end -1.82 0) (layer "F.SilkS") (width 0.2) (fill none) (tstamp f2f0fa1d-160f-4e82-84e3-c5a75f68eb11))
  (fp_line (start 9.14 -1.52) (end 9.14 1.52) (layer "F.CrtYd") (width 0.05) (tstamp 29805bf2-7517-4bdb-9c4a-0e90cfbc37ab))
  (fp_line (start 9.14 1.52) (end -1.52 1.52) (layer "F.CrtYd") (width 0.05) (tstamp 5b0d9e5d-38cc-4b8a-9465-1e8c5319500c))
  (fp_line (start -1.52 -1.52) (end 9.14 -1.52) (layer "F.CrtYd") (width 0.05) (tstamp 5c0f6527-38b3-45d3-9086-32b82e3acef0))
  (fp_line (start -1.52 1.52) (end -1.52 -1.52) (layer "F.CrtYd") (width 0.05) (tstamp 88f81dc2-4132-4de1-8dfb-e75fee7e097d))
  (fp_line (start 8.89 1.27) (end -1.27 1.27) (layer "F.Fab") (width 0.1) (tstamp 07c841ec-3e6f-4434-859d-55e953afda2b))
  (fp_line (start -1.27 1.27) (end -1.27 -1.27) (layer "F.Fab") (width 0.1) (tstamp 13c0ee7b-66ea-49de-b82e-1e1202536d3e))
  (fp_line (start 8.89 -1.27) (end 8.89 1.27) (layer "F.Fab") (width 0.1) (tstamp 926a2e4e-30c1-4f85-aa94-23cf35cba56a))
  (fp_line (start -1.27 -1.27) (end 8.89 -1.27) (layer "F.Fab") (width 0.1) (tstamp b9ee9593-f9eb-4842-a13c-c992bd12303b))
  (fp_circle (center -1.92 0) (end -1.82 0) (layer "F.Fab") (width 0.2) (fill none) (tstamp ec5a2568-da94-41c4-8ddc-97f4ec77b004))
  (pad "01" thru_hole rect (at 0 0) (size 1.37 1.37) (drill 1.02) (layers *.Cu *.Mask) (tstamp acebd194-76cf-4b1e-9f7f-7b04412ca185))
  (pad "02" thru_hole circle (at 2.54 0) (size 1.37 1.37) (drill 1.02) (layers *.Cu *.Mask) (tstamp 5053d14d-884d-4704-a40c-31a70be8cf11))
  (pad "03" thru_hole circle (at 5.08 0) (size 1.37 1.37) (drill 1.02) (layers *.Cu *.Mask) (tstamp 324f05d5-12bb-4445-b79d-d5df210375fe))
  (pad "04" thru_hole circle (at 7.62 0) (size 1.37 1.37) (drill 1.02) (layers *.Cu *.Mask) (tstamp a2c8dd04-559f-4304-b015-dbad7175a1d0))
  (model "${KIPRJMOD}/3D/TSW-104-14-F-S.stp"
    (offset (xyz 3.8 0 0))
    (scale (xyz 1 1 1))
    (rotate (xyz -90 0 0))
  )
)
