(footprint "RHDR3W64P254_1X3_813X241X851P" (version 20211014) (generator pcbnew)
  (layer "F.Cu")
  (tedit 0)
  (descr "SSQ-103-03-G-S")
  (tags "Connector")
  (attr through_hole)
  (fp_text reference "J**" (at 0 0) (layer "F.SilkS")
    (effects (font (size 1.27 1.27) (thickness 0.254)))
    (tstamp 09bd2189-01f9-4701-931d-f50f235a7e3e)
  )
  (fp_text value "RHDR3W64P254_1X3_813X241X851P" (at 0 0) (layer "F.SilkS") hide
    (effects (font (size 1.27 1.27) (thickness 0.254)))
    (tstamp 76a08878-78db-47b0-ad78-a44f3817eae4)
  )
  (fp_text user "${REFERENCE}" (at 0 0) (layer "F.Fab")
    (effects (font (size 1.27 1.27) (thickness 0.254)))
    (tstamp a857fe6e-d6b5-4216-9956-deef55a43d59)
  )
  (fp_line (start -6.605 -1.205) (end 1.525 -1.205) (layer "F.SilkS") (width 0.2) (tstamp 590b53ba-a74a-4937-9362-d54237e4e035))
  (fp_line (start 1.525 -1.205) (end 1.525 0) (layer "F.SilkS") (width 0.2) (tstamp 7a0dd082-5b88-4edf-8c42-e065bb07b0e9))
  (fp_line (start -6.605 1.205) (end -6.605 -1.205) (layer "F.SilkS") (width 0.2) (tstamp c93e217b-09bf-4af6-8c3e-71e649fc421e))
  (fp_line (start 0 1.205) (end -6.605 1.205) (layer "F.SilkS") (width 0.2) (tstamp cfe69105-c279-498b-892e-405a7d35e4ba))
  (fp_line (start -6.855 -1.455) (end 1.775 -1.455) (layer "F.CrtYd") (width 0.05) (tstamp 24f82477-c551-4f5a-9497-755cd95bde68))
  (fp_line (start 1.775 1.455) (end -6.855 1.455) (layer "F.CrtYd") (width 0.05) (tstamp 4533b743-2948-4d68-ae95-8e4b6747b915))
  (fp_line (start 1.775 -1.455) (end 1.775 1.455) (layer "F.CrtYd") (width 0.05) (tstamp 50ab54aa-a55d-4bc4-aee6-3aeb08b0eb86))
  (fp_line (start -6.855 1.455) (end -6.855 -1.455) (layer "F.CrtYd") (width 0.05) (tstamp 73ae94d4-ed7a-430d-8e8a-c4f2cd6d1e20))
  (fp_line (start -6.605 1.205) (end -6.605 -1.205) (layer "F.Fab") (width 0.1) (tstamp 12d80a2b-3a35-4d1c-ab3d-842169bfd804))
  (fp_line (start 1.525 -1.205) (end 1.525 1.205) (layer "F.Fab") (width 0.1) (tstamp 2d9dff17-ee22-466e-9228-52d6c3dba4c3))
  (fp_line (start -6.605 -1.205) (end 1.525 -1.205) (layer "F.Fab") (width 0.1) (tstamp d97769fa-ec01-4518-aad2-7c357245bf19))
  (fp_line (start 1.525 1.205) (end -6.605 1.205) (layer "F.Fab") (width 0.1) (tstamp df86acf2-ceb4-4a2b-9356-72eb7b0856a9))
  (pad "1" thru_hole rect (at 0 0) (size 1.65 1.65) (drill 1.1) (layers *.Cu *.Mask) (tstamp 77ff5231-0184-480f-bf1e-de55b3a27fbf))
  (pad "2" thru_hole circle (at -2.54 0) (size 1.65 1.65) (drill 1.1) (layers *.Cu *.Mask) (tstamp aecfda49-59eb-4f5a-8ec5-4ea70b8e74bc))
  (pad "3" thru_hole circle (at -5.08 0) (size 1.65 1.65) (drill 1.1) (layers *.Cu *.Mask) (tstamp aaf0a6e3-d866-430e-9b93-5d9f9e0aae61))
  (model "/home/steltze/SpaceDot/HW projects/KiCAD Projects/OBC/set/breakout-boards/3D/step/SSQ-103-03-G-S.stp"
    (offset (xyz 0 0 0))
    (scale (xyz 1 1 1))
    (rotate (xyz 0 0 0))
  )
)
