(footprint "HRS_DF58-6P-1.2V(21)" (version 20211014) (generator pcbnew)
  (layer "F.Cu")
  (tedit 630889EA)
  (attr through_hole)
  (fp_text reference "REF**" (at -2.6 -5.87) (layer "F.SilkS")
    (effects (font (size 0.787402 0.787402) (thickness 0.15)))
    (tstamp 2908a663-3bd3-4a8c-bf83-9953a83f502b)
  )
  (fp_text value "HRS_DF58-6P-1.2V_21_" (at 4.9 -4.35) (layer "F.Fab")
    (effects (font (size 0.787402 0.787402) (thickness 0.15)))
    (tstamp 7ccbd583-cea5-4321-af5a-993805b1eee6)
  )
  (fp_line (start 4.65 0.66) (end 4.65 -2.25) (layer "F.SilkS") (width 0.127) (tstamp 07d19fba-fdba-42d0-983b-bc9f3c083c60))
  (fp_line (start 4.65 -2.25) (end 3.62 -2.25) (layer "F.SilkS") (width 0.127) (tstamp 09201954-43b1-43d1-94ec-710ff99d9b22))
  (fp_line (start -4.65 -2.25) (end -4.65 0.66) (layer "F.SilkS") (width 0.127) (tstamp 6da64028-a698-4c54-9f7a-30424a6e61ca))
  (fp_line (start -3.4 2.52) (end 3.4 2.52) (layer "F.SilkS") (width 0.127) (tstamp 95fa2ec4-8ac9-4f7d-8526-5fdd0ad31907))
  (fp_line (start -3.62 -2.25) (end -4.65 -2.25) (layer "F.SilkS") (width 0.127) (tstamp ed0d08de-2b5d-4669-b658-428f08116b7e))
  (fp_circle (center -3 -3.15) (end -2.9 -3.15) (layer "F.SilkS") (width 0.2) (fill none) (tstamp 15fbb08f-bcc4-412f-9b60-19b1ab27f478))
  (fp_line (start -5.1 2.77) (end 5.1 2.77) (layer "F.CrtYd") (width 0.05) (tstamp 28c93c16-c9e2-429e-9d58-3be66c56e0a3))
  (fp_line (start 5.1 -2.6) (end -5.1 -2.6) (layer "F.CrtYd") (width 0.05) (tstamp 3db6cb3d-88f4-4431-9e1e-0f5a7fa02c59))
  (fp_line (start -5.1 -2.6) (end -5.1 2.77) (layer "F.CrtYd") (width 0.05) (tstamp 56aaa6b3-e891-4881-9ac5-db135108cae4))
  (fp_line (start 5.1 2.77) (end 5.1 -2.6) (layer "F.CrtYd") (width 0.05) (tstamp ccf714e9-98ea-49a0-9332-ade28f066cff))
  (fp_line (start -4.65 -2.25) (end -4.65 2.52) (layer "F.Fab") (width 0.127) (tstamp 02582cf1-d7e3-48b6-8b14-27c6e56c3d65))
  (fp_line (start 4.65 -2.25) (end -4.65 -2.25) (layer "F.Fab") (width 0.127) (tstamp 3e86c3ac-254a-487b-9a58-b8315473c844))
  (fp_line (start -4.65 2.52) (end 4.65 2.52) (layer "F.Fab") (width 0.127) (tstamp b8769444-92b8-4479-b231-98b6a07138b0))
  (fp_line (start 4.65 2.52) (end 4.65 -2.25) (layer "F.Fab") (width 0.127) (tstamp e019ba26-4f48-4766-8e4b-093670c59d48))
  (fp_circle (center -3 -3.15) (end -2.9 -3.15) (layer "F.Fab") (width 0.2) (fill none) (tstamp 79260855-f1e4-41fe-9cd7-d2e8f6ee0e9c))
  (pad "1" smd rect (at -3 -2.025) (size 0.6 0.65) (layers "F.Cu" "F.Paste" "F.Mask") (tstamp 66243d30-c42e-406e-bafe-7893cae597a7))
  (pad "2" smd rect (at -1.8 -2.025) (size 0.6 0.65) (layers "F.Cu" "F.Paste" "F.Mask") (tstamp 053c2241-71c7-4c35-9bcc-492ead758b24))
  (pad "3" smd rect (at -0.6 -2.025) (size 0.6 0.65) (layers "F.Cu" "F.Paste" "F.Mask") (tstamp 0e82face-2fe0-44bc-a670-ec4559b7e4e5))
  (pad "4" smd rect (at 0.6 -2.025) (size 0.6 0.65) (layers "F.Cu" "F.Paste" "F.Mask") (tstamp dded5957-e906-4087-af3b-8f38d0bb5b0d))
  (pad "5" smd rect (at 1.8 -2.025) (size 0.6 0.65) (layers "F.Cu" "F.Paste" "F.Mask") (tstamp 6090afef-0295-46e8-8859-fdc9593f7e44))
  (pad "6" smd rect (at 3 -2.025) (size 0.6 0.65) (layers "F.Cu" "F.Paste" "F.Mask") (tstamp d1c6846b-860d-406d-a0a7-fc427e2c142d))
  (pad "S1" smd rect (at -4.425 1.68) (size 0.85 1.34) (layers "F.Cu" "F.Paste" "F.Mask") (tstamp 9fb439e9-93e4-418b-a9e7-7e9946213b01))
  (pad "S2" smd rect (at 4.425 1.68) (size 0.85 1.34) (layers "F.Cu" "F.Paste" "F.Mask") (tstamp b81249fd-6f47-49bc-be14-cfc134a7341e))
  (zone (net 0) (net_name "") (layer "F.Cu") (tstamp 06da1781-1338-4113-8e1c-9fb3042db7b3) (hatch full 0.508)
    (connect_pads (clearance 0))
    (min_thickness 0.01)
    (keepout (tracks not_allowed) (vias not_allowed) (pads not_allowed ) (copperpour not_allowed) (footprints allowed))
    (fill (thermal_gap 0.508) (thermal_bridge_width 0.508))
    (polygon
      (pts
        (xy -3.65 -1.7)
        (xy 3.65 -1.7)
        (xy 3.65 -0.2)
        (xy -3.65 -0.2)
      )
    )
  )
  (zone (net 0) (net_name "") (layers *.Cu) (tstamp f94d828e-9e4e-4c7c-91e4-69352b0f8152) (hatch full 0.508)
    (connect_pads (clearance 0))
    (min_thickness 0.01)
    (keepout (tracks allowed) (vias not_allowed) (pads allowed ) (copperpour allowed) (footprints allowed))
    (fill (thermal_gap 0.508) (thermal_bridge_width 0.508))
    (polygon
      (pts
        (xy -3.65 -1.7)
        (xy 3.65 -1.7)
        (xy 3.65 -0.2)
        (xy -3.65 -0.2)
      )
    )
  )
  (model "${KIPRJMOD}/lib/3D/DF58-6P-1.2V_21_.step"
    (offset (xyz 0 0 0))
    (scale (xyz 1 1 1))
    (rotate (xyz 0 0 0))
  )
)
