(footprint "SAMTEC_TSW-107-24-L-S" (version 20211014) (generator pcbnew)
  (layer "F.Cu")
  (tedit 6353D711)
  (attr through_hole)
  (fp_text reference "REF**" (at 0.905 -3.155) (layer "F.SilkS")
    (effects (font (size 1 1) (thickness 0.15)))
    (tstamp f4b26d08-2384-49b6-bb0a-8a3e6e4c3cb9)
  )
  (fp_text value "SAMTEC_TSW-107-24-L-S" (at 11.065 3.135) (layer "F.Fab")
    (effects (font (size 1 1) (thickness 0.15)))
    (tstamp c28e43c7-d31c-4881-ab34-63a5cc9d0f9d)
  )
  (fp_line (start 16.51 -1.27) (end 16.51 1.27) (layer "F.SilkS") (width 0.2) (tstamp a2c50815-4cbc-47e3-9c38-096db4434450))
  (fp_line (start 16.51 1.27) (end -1.27 1.27) (layer "F.SilkS") (width 0.2) (tstamp cfa619c1-5dd8-497e-aafa-62ccf1ae5b18))
  (fp_line (start -1.27 1.27) (end -1.27 -1.27) (layer "F.SilkS") (width 0.2) (tstamp ef09faa1-3dc1-429c-bb27-cc53ee2bf202))
  (fp_line (start 16.51 -1.27) (end -1.27 -1.27) (layer "F.SilkS") (width 0.2) (tstamp faaa4dbb-6566-4dd3-82f7-3a7b760f269e))
  (fp_circle (center -1.92 0) (end -1.82 0) (layer "F.SilkS") (width 0.2) (fill none) (tstamp c331ae88-84b5-4f73-8508-5f3d74659346))
  (fp_line (start 16.76 -1.52) (end 16.76 1.52) (layer "F.CrtYd") (width 0.05) (tstamp 0579ed48-9b58-4d88-8992-34c604b04229))
  (fp_line (start -1.52 1.52) (end -1.52 -1.52) (layer "F.CrtYd") (width 0.05) (tstamp 256dbdf0-bf46-42e3-9a62-85663fbf4431))
  (fp_line (start -1.52 -1.52) (end 16.76 -1.52) (layer "F.CrtYd") (width 0.05) (tstamp 62b74a8c-cc1c-41cf-b852-8c6e9b47e43d))
  (fp_line (start 16.76 1.52) (end -1.52 1.52) (layer "F.CrtYd") (width 0.05) (tstamp fa076002-6874-47d4-ab08-0bb834ef9d8d))
  (fp_line (start -1.27 -1.27) (end 16.51 -1.27) (layer "F.Fab") (width 0.1) (tstamp 58e6fad6-943b-4f38-96eb-9e3f0f98fddb))
  (fp_line (start 16.51 -1.27) (end 16.51 1.27) (layer "F.Fab") (width 0.1) (tstamp 99926a3a-c21e-4b9a-8144-703892a4bd5d))
  (fp_line (start -1.27 1.27) (end -1.27 -1.27) (layer "F.Fab") (width 0.1) (tstamp cc195705-6ae6-4c5f-ae14-0eeeb3f2e9ce))
  (fp_line (start 16.51 1.27) (end -1.27 1.27) (layer "F.Fab") (width 0.1) (tstamp e317ee50-3421-40c1-9340-47e715940395))
  (fp_circle (center -1.92 0) (end -1.82 0) (layer "F.Fab") (width 0.2) (fill none) (tstamp f9e58614-bea5-42f5-90a9-32ae0d5e5599))
  (pad "01" thru_hole rect (at 0 0) (size 1.37 1.37) (drill 1.02) (layers *.Cu *.Mask) (tstamp ef9f8bfa-1df3-4588-a69c-2f0d6d996fa4))
  (pad "02" thru_hole circle (at 2.54 0) (size 1.37 1.37) (drill 1.02) (layers *.Cu *.Mask) (tstamp 3bfb2552-0c76-4f1d-90d5-05517f528eea))
  (pad "03" thru_hole circle (at 5.08 0) (size 1.37 1.37) (drill 1.02) (layers *.Cu *.Mask) (tstamp 96d4e355-00ee-4635-867c-fb73ae9d87fd))
  (pad "04" thru_hole circle (at 7.62 0) (size 1.37 1.37) (drill 1.02) (layers *.Cu *.Mask) (tstamp beff4e69-9b6c-4768-a221-6f26cf3eaa31))
  (pad "05" thru_hole circle (at 10.16 0) (size 1.37 1.37) (drill 1.02) (layers *.Cu *.Mask) (tstamp 5dd2a20a-9672-40fa-89a3-7a1c88e22c62))
  (pad "06" thru_hole circle (at 12.7 0) (size 1.37 1.37) (drill 1.02) (layers *.Cu *.Mask) (tstamp 4fe641c6-8532-4bde-bd8b-213867201aed))
  (pad "07" thru_hole circle (at 15.24 0) (size 1.37 1.37) (drill 1.02) (layers *.Cu *.Mask) (tstamp f9226226-bd0a-464a-8aa9-05e3c28ae8cb))
)
