(footprint "M80-88708YY" (version 20211014) (generator pcbnew)
  (layer "F.Cu")
  (tedit 0)
  (descr "M80-88708YY")
  (tags "Connector")
  (attr through_hole)
  (fp_text reference "J**" (at 0 0) (layer "F.SilkS")
    (effects (font (size 1.27 1.27) (thickness 0.254)))
    (tstamp 8c35dde2-47f5-43d6-8f5f-de8d3df0fcbb)
  )
  (fp_text value "M80-88708YY" (at 0 0) (layer "F.SilkS") hide
    (effects (font (size 1.27 1.27) (thickness 0.254)))
    (tstamp e2787dc0-0a6c-4592-ae45-134a3162a218)
  )
  (fp_text user "${REFERENCE}" (at 0 0) (layer "F.Fab")
    (effects (font (size 1.27 1.27) (thickness 0.254)))
    (tstamp 12f7fad1-35ba-4b69-b620-a196f684c171)
  )
  (fp_line (start 4.5 0.5) (end 3.5 0) (layer "F.SilkS") (width 0.1) (tstamp 2ba91546-2be6-4a5f-95ae-34ea4e742793))
  (fp_line (start -8.575 -3.725) (end 2.575 -3.725) (layer "F.SilkS") (width 0.1) (tstamp 2e4464ef-12bc-41f9-bb4e-5fbb2253f91b))
  (fp_line (start 2.575 1.725) (end -8.575 1.725) (layer "F.SilkS") (width 0.1) (tstamp 3f9ce6c5-819c-4494-8d60-5215b2e0fe12))
  (fp_line (start 4.5 -0.5) (end 4.5 0.5) (layer "F.SilkS") (width 0.1) (tstamp 586e1e0c-86a9-4903-9510-6e9ae35c834d))
  (fp_line (start -8.575 1.725) (end -8.575 -3.725) (layer "F.SilkS") (width 0.1) (tstamp 61bd47cc-9381-4a12-a8d3-e882f9251797))
  (fp_line (start 2.575 -3.725) (end 2.575 1.725) (layer "F.SilkS") (width 0.1) (tstamp 7f25e3e4-cefc-4fcc-80ca-ea50cb4b7927))
  (fp_line (start 3.5 0) (end 4.5 -0.5) (layer "F.SilkS") (width 0.1) (tstamp b936836c-41b4-43fc-8e52-07df0eb52822))
  (fp_line (start -9.575 -4.725) (end 5.5 -4.725) (layer "F.CrtYd") (width 0.05) (tstamp a071df4a-4cd0-476c-acdf-bb81efd925ca))
  (fp_line (start 5.5 2.725) (end -9.575 2.725) (layer "F.CrtYd") (width 0.05) (tstamp b162cd4d-61a3-4d97-a63c-8b99823d885d))
  (fp_line (start 5.5 -4.725) (end 5.5 2.725) (layer "F.CrtYd") (width 0.05) (tstamp c3e9c526-7e53-4c2e-98f9-6e2e0b26a21e))
  (fp_line (start -9.575 2.725) (end -9.575 -4.725) (layer "F.CrtYd") (width 0.05) (tstamp d167d785-3482-4b17-bc22-cb87d891ad8f))
  (fp_line (start 4.5 0.5) (end 3.5 0) (layer "F.Fab") (width 0.2) (tstamp 093db229-5083-4e04-be96-f2cb37b0af94))
  (fp_line (start 3.5 0) (end 4.5 -0.5) (layer "F.Fab") (width 0.2) (tstamp 0dd34870-81b7-4e01-899d-1c1380963768))
  (fp_line (start 2.575 -3.725) (end 2.575 1.725) (layer "F.Fab") (width 0.2) (tstamp 2edb78b0-0034-4048-94de-7c0b49fcf61a))
  (fp_line (start 4.5 -0.5) (end 4.5 0.5) (layer "F.Fab") (width 0.2) (tstamp 4fd446fb-8691-4996-9a05-13b5a36b0638))
  (fp_line (start -8.575 -3.725) (end 2.575 -3.725) (layer "F.Fab") (width 0.2) (tstamp 6ab56405-0fa1-477e-9d02-3402f28ed641))
  (fp_line (start -8.575 1.725) (end -8.575 -3.725) (layer "F.Fab") (width 0.2) (tstamp 93475395-a3b1-455c-a7d6-24cb58c5324b))
  (fp_line (start 2.575 1.725) (end -8.575 1.725) (layer "F.Fab") (width 0.2) (tstamp f8268703-1a53-4592-b92a-d1b0637a41aa))
  (pad "1" thru_hole rect (at 0 0) (size 1.3 1.3) (drill 0.8) (layers *.Cu *.Mask) (tstamp 3a0e91fe-98ac-4b46-b01a-889f88e269b8))
  (pad "2" thru_hole circle (at -2 0) (size 1.3 1.3) (drill 0.8) (layers *.Cu *.Mask) (tstamp 1e841eb7-4b4d-4f55-8689-a0f19daebe55))
  (pad "3" thru_hole circle (at -4 0) (size 1.3 1.3) (drill 0.8) (layers *.Cu *.Mask) (tstamp 90ca0e74-0efd-4a11-bfae-738c0d8153c5))
  (pad "4" thru_hole circle (at -6 0) (size 1.3 1.3) (drill 0.8) (layers *.Cu *.Mask) (tstamp c398af1a-c8a1-4254-ab5d-aac3c38cebc2))
  (pad "5" thru_hole circle (at 0 -2) (size 1.3 1.3) (drill 0.8) (layers *.Cu *.Mask) (tstamp 30bd5c35-e105-4ed2-b950-df4c51258be0))
  (pad "6" thru_hole circle (at -2 -2) (size 1.3 1.3) (drill 0.8) (layers *.Cu *.Mask) (tstamp ded89191-00b4-47f8-a5bb-3c9935c17ed4))
  (pad "7" thru_hole circle (at -4 -2) (size 1.3 1.3) (drill 0.8) (layers *.Cu *.Mask) (tstamp 554d27e4-6e87-4aef-abed-b6c4859dd53a))
  (pad "8" thru_hole circle (at -6 -2) (size 1.3 1.3) (drill 0.8) (layers *.Cu *.Mask) (tstamp 0d34d041-8205-40f4-9620-f21b87bef61d))
  (model "${KIPRJMOD}/3D/M80-8870805.stp"
    (offset (xyz -3 1 5))
    (scale (xyz 1 1 1))
    (rotate (xyz -90 0 0))
  )
)
