(footprint "DF57H3P12V21" (version 20211014) (generator pcbnew)
  (layer "F.Cu")
  (tedit 0)
  (descr "DF57H-3P-1.2V(21)-2")
  (tags "Connector")
  (attr smd)
  (fp_text reference "J**" (at 0 -2.53) (layer "F.SilkS")
    (effects (font (size 1.27 1.27) (thickness 0.254)))
    (tstamp d0f11060-bc65-49c7-b1f8-1ffca12c5c16)
  )
  (fp_text value "DF57H3P12V21" (at 0 -2.53) (layer "F.SilkS") hide
    (effects (font (size 1.27 1.27) (thickness 0.254)))
    (tstamp 1a0c5194-0d7e-4fcc-a11d-049fac80c4dc)
  )
  (fp_text user "${REFERENCE}" (at 0 -2.53) (layer "F.Fab")
    (effects (font (size 1.27 1.27) (thickness 0.254)))
    (tstamp 1002411f-a485-468c-981b-cec2ce41d8bd)
  )
  (fp_line (start 1.8 -4.475) (end 2.6 -4.475) (layer "F.SilkS") (width 0.1) (tstamp 1c6c46b2-dd9e-430f-85e9-621815ceca94))
  (fp_line (start -1.2 -4.962) (end -1.2 -4.962) (layer "F.SilkS") (width 0.1) (tstamp 226748a0-9c54-4438-a724-741c7846a7bf))
  (fp_line (start -1.2 -5.062) (end -1.2 -5.062) (layer "F.SilkS") (width 0.1) (tstamp 28aab436-a04a-4f1d-a887-4f09513fdc8a))
  (fp_line (start -2.65 -4.475) (end -2.65 -0.962) (layer "F.SilkS") (width 0.1) (tstamp 5ea450c5-c799-4c49-a77b-90af3b812ea4))
  (fp_line (start 2.65 -4.475) (end 2.65 -0.962) (layer "F.SilkS") (width 0.1) (tstamp 6e23d37a-3804-4cb0-9f56-ede150eedda5))
  (fp_line (start -1.8 -4.475) (end -2.65 -4.475) (layer "F.SilkS") (width 0.1) (tstamp 730780c7-40bd-484b-b640-ae047209b478))
  (fp_line (start 2.6 -4.475) (end 2.65 -4.475) (layer "F.SilkS") (width 0.1) (tstamp 9c7af13e-949e-4a55-a6b7-45ef51b4f106))
  (fp_line (start -1.8 -0.25) (end 1.6 -0.25) (layer "F.SilkS") (width 0.1) (tstamp a56d1fde-b4ad-42de-a848-9c94bc0cbe09))
  (fp_arc (start -1.2 -5.062) (mid -1.15 -5.012) (end -1.2 -4.962) (layer "F.SilkS") (width 0.1) (tstamp 45b2cd71-50dd-4f61-80ce-9a5382fe6dd4))
  (fp_arc (start -1.2 -4.962) (mid -1.25 -5.012) (end -1.2 -5.062) (layer "F.SilkS") (width 0.1) (tstamp 481d8c49-260f-40f8-9d7a-177fecb9140f))
  (fp_line (start 3.7 1.001) (end -3.7 1.001) (layer "F.CrtYd") (width 0.1) (tstamp 3520b9bf-2dfc-4868-a650-86ff98682e83))
  (fp_line (start -3.7 -6.062) (end 3.7 -6.062) (layer "F.CrtYd") (width 0.1) (tstamp 494a6b97-f33e-4834-b724-0c3a3ff54317))
  (fp_line (start 3.7 -6.062) (end 3.7 1.001) (layer "F.CrtYd") (width 0.1) (tstamp 506110af-ac51-4501-bfa6-1552a848d599))
  (fp_line (start -3.7 1.001) (end -3.7 -6.062) (layer "F.CrtYd") (width 0.1) (tstamp ab3e0d45-ad5b-42a1-ab02-8fee32ad804e))
  (fp_line (start -2.65 -4.475) (end 2.65 -4.475) (layer "F.Fab") (width 0.2) (tstamp 415d6a7d-98b2-4d17-b46f-6f38749a3ba2))
  (fp_line (start 2.65 -4.475) (end 2.65 -0.25) (layer "F.Fab") (width 0.2) (tstamp 4dfbe524-132d-43d4-8ae0-9aa2f72df70b))
  (fp_line (start 2.65 -0.25) (end -2.65 -0.25) (layer "F.Fab") (width 0.2) (tstamp 6b1d6bcd-1928-474b-8dbd-6dab746597ca))
  (fp_line (start -2.65 -0.25) (end -2.65 -4.475) (layer "F.Fab") (width 0.2) (tstamp b9f8ba78-9b7b-4a7c-8351-c9f145a140ab))
  (pad "1" smd rect (at -1.2 -4.175) (size 0.6 0.85) (layers "F.Cu" "F.Paste" "F.Mask") (tstamp 443b842e-cdd6-495f-a7fb-0cef04c17274))
  (pad "2" smd rect (at 0 -4.175) (size 0.6 0.85) (layers "F.Cu" "F.Paste" "F.Mask") (tstamp 7ab8aff0-29e4-4be7-af1f-6a97b7752e20))
  (pad "3" smd rect (at 1.2 -4.175) (size 0.6 0.85) (layers "F.Cu" "F.Paste" "F.Mask") (tstamp 52fe3400-bf18-4fe5-aa6e-2be779b65697))
  (pad "MP1" smd rect (at -2.35 -0.4) (size 0.7 0.8) (layers "F.Cu" "F.Paste" "F.Mask") (tstamp 7112d2ae-7915-4f1a-aae6-e71244f669d8))
  (pad "MP2" smd rect (at 2.35 -0.4) (size 0.7 0.8) (layers "F.Cu" "F.Paste" "F.Mask") (tstamp 510813ff-4301-4d7b-b640-805049ac6194))
  (model "DF57H-3P-1.2V_21_.stp"
    (offset (xyz 0 0 0))
    (scale (xyz 1 1 1))
    (rotate (xyz 0 0 0))
  )
)
