(footprint "SAMTEC_FTSH-110-01-F-DV-007" (version 20211014) (generator pcbnew)
  (layer "F.Cu")
  (tedit 63089C12)
  (attr through_hole)
  (fp_text reference "REF**" (at -4.175 -5.315) (layer "F.SilkS")
    (effects (font (size 1 1) (thickness 0.15)))
    (tstamp 01345bb2-03a6-4bda-a569-72fd10a39388)
  )
  (fp_text value "SAMTEC_FTSH-110-01-F-DV-007" (at 9.795 5.295) (layer "F.Fab")
    (effects (font (size 1 1) (thickness 0.15)))
    (tstamp 3dc95d4d-db20-4d0c-93a8-d492300b6113)
  )
  (fp_line (start 6.435 -1.715) (end 6.435 -1.715) (layer "F.SilkS") (width 0.2) (tstamp 06d1f6a2-288f-4bf7-a300-7bd39c476080))
  (fp_line (start -6.435 -1.715) (end -6.435 -1.715) (layer "F.SilkS") (width 0.2) (tstamp 52a9164a-e418-44b0-8900-c13c15a85457))
  (fp_line (start 6.435 -1.715) (end 6.435 1.715) (layer "F.SilkS") (width 0.2) (tstamp 8d2931f5-39d5-4a7d-a2bc-6f736d7d53a0))
  (fp_line (start 6.435 1.715) (end 6.435 1.715) (layer "F.SilkS") (width 0.2) (tstamp c8ee7929-955c-47e7-bd42-90771ed7a776))
  (fp_line (start -6.435 1.715) (end -6.435 -1.715) (layer "F.SilkS") (width 0.2) (tstamp d77d0b23-22ef-4036-9d80-e6b5b27bb323))
  (fp_line (start -6.435 1.715) (end -6.435 1.715) (layer "F.SilkS") (width 0.2) (tstamp fb5bead5-69f1-47b0-827a-dab7d76dd912))
  (fp_circle (center -7 2.035) (end -6.9 2.035) (layer "F.SilkS") (width 0.2) (fill none) (tstamp fcf78bfd-12a2-4fcc-808b-6bf22a4cd8fe))
  (fp_line (start -6.6 -3.68) (end 6.6 -3.68) (layer "F.CrtYd") (width 0.05) (tstamp 117ba83c-fc02-4d0d-a395-e9aebeb9b19c))
  (fp_line (start 6.6 -3.68) (end 6.6 3.68) (layer "F.CrtYd") (width 0.05) (tstamp 152cc439-983b-4a42-9c88-a905eead27be))
  (fp_line (start -6.6 3.68) (end -6.6 -3.68) (layer "F.CrtYd") (width 0.05) (tstamp 91bbc8e7-d0e8-4817-a8f6-a6ef94f534a2))
  (fp_line (start 6.6 3.68) (end -6.6 3.68) (layer "F.CrtYd") (width 0.05) (tstamp ac9771c2-71ea-4523-b987-09bdc151bcd5))
  (fp_line (start -6.35 -1.715) (end 6.35 -1.715) (layer "F.Fab") (width 0.1) (tstamp 0d087dde-0510-4b1b-8491-5c91dc1152a6))
  (fp_line (start -6.35 1.715) (end -6.35 -1.715) (layer "F.Fab") (width 0.1) (tstamp 170b93c0-6175-4f45-9989-6e9e2373f266))
  (fp_line (start 6.35 1.715) (end -6.35 1.715) (layer "F.Fab") (width 0.1) (tstamp 4d8f64f2-cba1-423f-b7a6-5fd77fa6f223))
  (fp_line (start -6.35 1.715) (end -6.35 -1.715) (layer "F.Fab") (width 0.1) (tstamp a354cf05-4763-4317-8622-a9e26d130ed0))
  (fp_line (start -6.35 -1.715) (end 6.35 -1.715) (layer "F.Fab") (width 0.1) (tstamp ac674b8b-ba31-4937-bbaa-f41f2fac71c1))
  (fp_line (start 6.35 -1.715) (end 6.35 1.715) (layer "F.Fab") (width 0.1) (tstamp b05f911d-ae63-4ff8-acd2-c00ca7aee312))
  (fp_line (start 6.35 -1.715) (end 6.35 1.715) (layer "F.Fab") (width 0.1) (tstamp b0d84016-4ccc-4d11-a6b3-256f6ea72e6c))
  (fp_circle (center -7 2.035) (end -6.9 2.035) (layer "F.Fab") (width 0.2) (fill none) (tstamp c4a9fa6c-7148-43d3-af7f-2bf11d409658))
  (pad "01" smd rect (at -5.715 2.035) (size 0.74 2.79) (layers "F.Cu" "F.Paste" "F.Mask") (tstamp 10338831-21ed-4846-bb0b-9a2d5171a2cc))
  (pad "02" smd rect (at -5.715 -2.035) (size 0.74 2.79) (layers "F.Cu" "F.Paste" "F.Mask") (tstamp 1eee0cc0-dd42-4568-9485-13cb777c0bbf))
  (pad "03" smd rect (at -4.445 2.035) (size 0.74 2.79) (layers "F.Cu" "F.Paste" "F.Mask") (tstamp ee1272b3-9d1a-4cb9-afec-56d80f5cecd2))
  (pad "04" smd rect (at -4.445 -2.035) (size 0.74 2.79) (layers "F.Cu" "F.Paste" "F.Mask") (tstamp 60f91271-88d1-4b4b-86aa-83e3d09eee5f))
  (pad "05" smd rect (at -3.175 2.035) (size 0.74 2.79) (layers "F.Cu" "F.Paste" "F.Mask") (tstamp 871c14c3-1b68-4a7f-9853-209095cb7fa7))
  (pad "06" smd rect (at -3.175 -2.035) (size 0.74 2.79) (layers "F.Cu" "F.Paste" "F.Mask") (tstamp 9192af68-c0d2-4b37-89ae-516d37cba59f))
  (pad "08" smd rect (at -1.905 -2.035) (size 0.74 2.79) (layers "F.Cu" "F.Paste" "F.Mask") (tstamp a2e672c6-2580-4deb-b1e7-8428b055d3bb))
  (pad "09" smd rect (at -0.635 2.035) (size 0.74 2.79) (layers "F.Cu" "F.Paste" "F.Mask") (tstamp 3f7952c4-3b85-410c-bf2f-9fd0e550e76f))
  (pad "10" smd rect (at -0.635 -2.035) (size 0.74 2.79) (layers "F.Cu" "F.Paste" "F.Mask") (tstamp 90b8683a-dffc-4e7d-999b-243118332a16))
  (pad "11" smd rect (at 0.635 2.035) (size 0.74 2.79) (layers "F.Cu" "F.Paste" "F.Mask") (tstamp b8b6c479-b286-47b3-b383-4cdd0551263e))
  (pad "12" smd rect (at 0.635 -2.035) (size 0.74 2.79) (layers "F.Cu" "F.Paste" "F.Mask") (tstamp c2feeb8d-9ea3-49c2-aa11-023feb88115e))
  (pad "13" smd rect (at 1.905 2.035) (size 0.74 2.79) (layers "F.Cu" "F.Paste" "F.Mask") (tstamp 7d880049-8648-4406-8309-5e99cef070b0))
  (pad "14" smd rect (at 1.905 -2.035) (size 0.74 2.79) (layers "F.Cu" "F.Paste" "F.Mask") (tstamp 0c0c5514-14ff-4bfe-a204-94dbfc88e46d))
  (pad "15" smd rect (at 3.175 2.035) (size 0.74 2.79) (layers "F.Cu" "F.Paste" "F.Mask") (tstamp fd46dd9e-82df-4487-a51d-68b93d0b0262))
  (pad "16" smd rect (at 3.175 -2.035) (size 0.74 2.79) (layers "F.Cu" "F.Paste" "F.Mask") (tstamp 0d89ae73-5d72-4a1b-9dc4-666975fb28de))
  (pad "17" smd rect (at 4.445 2.035) (size 0.74 2.79) (layers "F.Cu" "F.Paste" "F.Mask") (tstamp c3b31060-2b47-4370-9b77-337c3df93e61))
  (pad "18" smd rect (at 4.445 -2.035) (size 0.74 2.79) (layers "F.Cu" "F.Paste" "F.Mask") (tstamp 5583c330-3f1e-48a9-a0c4-1e75db635d8c))
  (pad "19" smd rect (at 5.715 2.035) (size 0.74 2.79) (layers "F.Cu" "F.Paste" "F.Mask") (tstamp 138f3c14-3699-440f-9752-c6f7f4e0375d))
  (pad "20" smd rect (at 5.715 -2.035) (size 0.74 2.79) (layers "F.Cu" "F.Paste" "F.Mask") (tstamp 0a25fec0-1dc6-47cf-aade-17d3a669916e))
  (model "${KIPRJMOD}/lib/3D/FTSH-110-01-F-DV-007.step"
    (offset (xyz 0 0 0))
    (scale (xyz 1 1 1))
    (rotate (xyz -90 0 0))
  )
)
