ISO-10303-21;
HEADER;
/* Generated by software containing ST-Developer
 * from STEP Tools, Inc. (www.steptools.com) 
 */
/* OPTION: using custom renumber hook */

FILE_DESCRIPTION(
/* description */ ('STEP AP214'),
/* implementation_level */ '2;1');

FILE_NAME(
/* name */ 'SSW-102-03-G-S',
/* time_stamp */ '2022-10-27T22:40:32+02:00',
/* author */ ('License CC BY-ND 4.0'),
/* organization */ ('CADENAS'),
/* preprocessor_version */ 'ST-DEVELOPER v18.102',
/* originating_system */ 'PARTsolutions',
/* authorisation */ '  ');

FILE_SCHEMA (('AUTOMOTIVE_DESIGN {1 0 10303 214 3 1 1}'));
ENDSEC;

DATA;
#10=PROPERTY_DEFINITION_REPRESENTATION(#14,#12);
#11=PROPERTY_DEFINITION_REPRESENTATION(#15,#13);
#12=REPRESENTATION('',(#16),#1317);
#13=REPRESENTATION('',(#17),#1317);
#14=PROPERTY_DEFINITION('pmi validation property','',#1329);
#15=PROPERTY_DEFINITION('pmi validation property','',#1329);
#16=VALUE_REPRESENTATION_ITEM('number of annotations',COUNT_MEASURE(0.));
#17=VALUE_REPRESENTATION_ITEM('number of views',COUNT_MEASURE(0.));
#18=COLOUR_RGB('',0.689999997615814,0.689999997615814,0.689999997615814);
#19=CONTEXT_DEPENDENT_SHAPE_REPRESENTATION(#23,#1331);
#20=CONTEXT_DEPENDENT_SHAPE_REPRESENTATION(#24,#1333);
#21=NEXT_ASSEMBLY_USAGE_OCCURRENCE('NAUO1','P2SSW-102-03-G-S',
'P2SSW-102-03-G-S',#1334,#1335,'');
#22=NEXT_ASSEMBLY_USAGE_OCCURRENCE('NAUO2','T1SSW-102-03-G-S',
'T1SSW-102-03-G-S',#1334,#1336,'');
#23=(
REPRESENTATION_RELATIONSHIP(' ',' ',#846,#845)
REPRESENTATION_RELATIONSHIP_WITH_TRANSFORMATION(#25)
SHAPE_REPRESENTATION_RELATIONSHIP()
);
#24=(
REPRESENTATION_RELATIONSHIP(' ',' ',#847,#845)
REPRESENTATION_RELATIONSHIP_WITH_TRANSFORMATION(#26)
SHAPE_REPRESENTATION_RELATIONSHIP()
);
#25=ITEM_DEFINED_TRANSFORMATION(' ',' ',#848,#869);
#26=ITEM_DEFINED_TRANSFORMATION(' ',' ',#848,#892);
#27=SHAPE_REPRESENTATION_RELATIONSHIP('','',#846,#29);
#28=SHAPE_REPRESENTATION_RELATIONSHIP('','',#847,#30);
#29=ADVANCED_BREP_SHAPE_REPRESENTATION('',(#840),#1318);
#30=ADVANCED_BREP_SHAPE_REPRESENTATION('',(#841),#1319);
#31=ORIENTED_EDGE('',*,*,#247,.F.);
#32=ORIENTED_EDGE('',*,*,#248,.F.);
#33=ORIENTED_EDGE('',*,*,#249,.F.);
#34=ORIENTED_EDGE('',*,*,#250,.F.);
#35=ORIENTED_EDGE('',*,*,#251,.F.);
#36=ORIENTED_EDGE('',*,*,#252,.F.);
#37=ORIENTED_EDGE('',*,*,#253,.F.);
#38=ORIENTED_EDGE('',*,*,#254,.F.);
#39=ORIENTED_EDGE('',*,*,#255,.F.);
#40=ORIENTED_EDGE('',*,*,#256,.F.);
#41=ORIENTED_EDGE('',*,*,#257,.F.);
#42=ORIENTED_EDGE('',*,*,#258,.F.);
#43=ORIENTED_EDGE('',*,*,#259,.F.);
#44=ORIENTED_EDGE('',*,*,#260,.T.);
#45=ORIENTED_EDGE('',*,*,#261,.F.);
#46=ORIENTED_EDGE('',*,*,#262,.F.);
#47=ORIENTED_EDGE('',*,*,#263,.F.);
#48=ORIENTED_EDGE('',*,*,#264,.F.);
#49=ORIENTED_EDGE('',*,*,#265,.F.);
#50=ORIENTED_EDGE('',*,*,#266,.F.);
#51=ORIENTED_EDGE('',*,*,#267,.F.);
#52=ORIENTED_EDGE('',*,*,#268,.F.);
#53=ORIENTED_EDGE('',*,*,#269,.F.);
#54=ORIENTED_EDGE('',*,*,#270,.T.);
#55=ORIENTED_EDGE('',*,*,#271,.F.);
#56=ORIENTED_EDGE('',*,*,#252,.T.);
#57=ORIENTED_EDGE('',*,*,#272,.T.);
#58=ORIENTED_EDGE('',*,*,#260,.F.);
#59=ORIENTED_EDGE('',*,*,#273,.T.);
#60=ORIENTED_EDGE('',*,*,#270,.F.);
#61=ORIENTED_EDGE('',*,*,#274,.F.);
#62=ORIENTED_EDGE('',*,*,#254,.T.);
#63=ORIENTED_EDGE('',*,*,#266,.T.);
#64=ORIENTED_EDGE('',*,*,#275,.T.);
#65=ORIENTED_EDGE('',*,*,#258,.T.);
#66=ORIENTED_EDGE('',*,*,#276,.T.);
#67=ORIENTED_EDGE('',*,*,#248,.T.);
#68=ORIENTED_EDGE('',*,*,#277,.T.);
#69=ORIENTED_EDGE('',*,*,#264,.T.);
#70=ORIENTED_EDGE('',*,*,#278,.F.);
#71=ORIENTED_EDGE('',*,*,#262,.T.);
#72=ORIENTED_EDGE('',*,*,#279,.T.);
#73=ORIENTED_EDGE('',*,*,#250,.T.);
#74=ORIENTED_EDGE('',*,*,#280,.T.);
#75=ORIENTED_EDGE('',*,*,#256,.T.);
#76=ORIENTED_EDGE('',*,*,#281,.T.);
#77=ORIENTED_EDGE('',*,*,#268,.T.);
#78=ORIENTED_EDGE('',*,*,#282,.F.);
#79=ORIENTED_EDGE('',*,*,#283,.T.);
#80=ORIENTED_EDGE('',*,*,#284,.F.);
#81=ORIENTED_EDGE('',*,*,#285,.T.);
#82=ORIENTED_EDGE('',*,*,#286,.T.);
#83=ORIENTED_EDGE('',*,*,#287,.T.);
#84=ORIENTED_EDGE('',*,*,#288,.T.);
#85=ORIENTED_EDGE('',*,*,#289,.F.);
#86=ORIENTED_EDGE('',*,*,#290,.F.);
#87=ORIENTED_EDGE('',*,*,#290,.T.);
#88=ORIENTED_EDGE('',*,*,#291,.T.);
#89=ORIENTED_EDGE('',*,*,#285,.F.);
#90=ORIENTED_EDGE('',*,*,#292,.T.);
#91=ORIENTED_EDGE('',*,*,#293,.T.);
#92=ORIENTED_EDGE('',*,*,#287,.F.);
#93=ORIENTED_EDGE('',*,*,#292,.F.);
#94=ORIENTED_EDGE('',*,*,#284,.T.);
#95=ORIENTED_EDGE('',*,*,#249,.T.);
#96=ORIENTED_EDGE('',*,*,#278,.T.);
#97=ORIENTED_EDGE('',*,*,#263,.T.);
#98=ORIENTED_EDGE('',*,*,#280,.F.);
#99=ORIENTED_EDGE('',*,*,#257,.T.);
#100=ORIENTED_EDGE('',*,*,#282,.T.);
#101=ORIENTED_EDGE('',*,*,#267,.T.);
#102=ORIENTED_EDGE('',*,*,#276,.F.);
#103=ORIENTED_EDGE('',*,*,#288,.F.);
#104=ORIENTED_EDGE('',*,*,#293,.F.);
#105=ORIENTED_EDGE('',*,*,#283,.F.);
#106=ORIENTED_EDGE('',*,*,#294,.F.);
#107=ORIENTED_EDGE('',*,*,#294,.T.);
#108=ORIENTED_EDGE('',*,*,#286,.F.);
#109=ORIENTED_EDGE('',*,*,#291,.F.);
#110=ORIENTED_EDGE('',*,*,#289,.T.);
#111=ORIENTED_EDGE('',*,*,#255,.T.);
#112=ORIENTED_EDGE('',*,*,#274,.T.);
#113=ORIENTED_EDGE('',*,*,#269,.T.);
#114=ORIENTED_EDGE('',*,*,#281,.F.);
#115=ORIENTED_EDGE('',*,*,#251,.T.);
#116=ORIENTED_EDGE('',*,*,#279,.F.);
#117=ORIENTED_EDGE('',*,*,#261,.T.);
#118=ORIENTED_EDGE('',*,*,#272,.F.);
#119=ORIENTED_EDGE('',*,*,#247,.T.);
#120=ORIENTED_EDGE('',*,*,#271,.T.);
#121=ORIENTED_EDGE('',*,*,#259,.T.);
#122=ORIENTED_EDGE('',*,*,#277,.F.);
#123=ORIENTED_EDGE('',*,*,#253,.T.);
#124=ORIENTED_EDGE('',*,*,#275,.F.);
#125=ORIENTED_EDGE('',*,*,#265,.T.);
#126=ORIENTED_EDGE('',*,*,#273,.F.);
#127=ORIENTED_EDGE('',*,*,#295,.F.);
#128=ORIENTED_EDGE('',*,*,#296,.F.);
#129=ORIENTED_EDGE('',*,*,#297,.F.);
#130=ORIENTED_EDGE('',*,*,#298,.T.);
#131=ORIENTED_EDGE('',*,*,#299,.F.);
#132=ORIENTED_EDGE('',*,*,#300,.F.);
#133=ORIENTED_EDGE('',*,*,#301,.F.);
#134=ORIENTED_EDGE('',*,*,#302,.T.);
#135=ORIENTED_EDGE('',*,*,#303,.F.);
#136=ORIENTED_EDGE('',*,*,#304,.F.);
#137=ORIENTED_EDGE('',*,*,#305,.T.);
#138=ORIENTED_EDGE('',*,*,#306,.T.);
#139=ORIENTED_EDGE('',*,*,#307,.F.);
#140=ORIENTED_EDGE('',*,*,#308,.T.);
#141=ORIENTED_EDGE('',*,*,#309,.F.);
#142=ORIENTED_EDGE('',*,*,#310,.F.);
#143=ORIENTED_EDGE('',*,*,#311,.T.);
#144=ORIENTED_EDGE('',*,*,#312,.T.);
#145=ORIENTED_EDGE('',*,*,#313,.F.);
#146=ORIENTED_EDGE('',*,*,#314,.F.);
#147=ORIENTED_EDGE('',*,*,#315,.F.);
#148=ORIENTED_EDGE('',*,*,#316,.T.);
#149=ORIENTED_EDGE('',*,*,#317,.F.);
#150=ORIENTED_EDGE('',*,*,#318,.F.);
#151=ORIENTED_EDGE('',*,*,#319,.T.);
#152=ORIENTED_EDGE('',*,*,#320,.T.);
#153=ORIENTED_EDGE('',*,*,#321,.F.);
#154=ORIENTED_EDGE('',*,*,#322,.T.);
#155=ORIENTED_EDGE('',*,*,#321,.T.);
#156=ORIENTED_EDGE('',*,*,#323,.T.);
#157=ORIENTED_EDGE('',*,*,#324,.F.);
#158=ORIENTED_EDGE('',*,*,#325,.T.);
#159=ORIENTED_EDGE('',*,*,#324,.T.);
#160=ORIENTED_EDGE('',*,*,#326,.T.);
#161=ORIENTED_EDGE('',*,*,#327,.F.);
#162=ORIENTED_EDGE('',*,*,#328,.T.);
#163=ORIENTED_EDGE('',*,*,#329,.T.);
#164=ORIENTED_EDGE('',*,*,#330,.T.);
#165=ORIENTED_EDGE('',*,*,#331,.F.);
#166=ORIENTED_EDGE('',*,*,#332,.T.);
#167=ORIENTED_EDGE('',*,*,#331,.T.);
#168=ORIENTED_EDGE('',*,*,#333,.T.);
#169=ORIENTED_EDGE('',*,*,#334,.F.);
#170=ORIENTED_EDGE('',*,*,#335,.T.);
#171=ORIENTED_EDGE('',*,*,#334,.T.);
#172=ORIENTED_EDGE('',*,*,#336,.T.);
#173=ORIENTED_EDGE('',*,*,#337,.F.);
#174=ORIENTED_EDGE('',*,*,#338,.T.);
#175=ORIENTED_EDGE('',*,*,#327,.T.);
#176=ORIENTED_EDGE('',*,*,#339,.T.);
#177=ORIENTED_EDGE('',*,*,#319,.F.);
#178=ORIENTED_EDGE('',*,*,#340,.T.);
#179=ORIENTED_EDGE('',*,*,#337,.T.);
#180=ORIENTED_EDGE('',*,*,#341,.T.);
#181=ORIENTED_EDGE('',*,*,#329,.F.);
#182=ORIENTED_EDGE('',*,*,#342,.T.);
#183=ORIENTED_EDGE('',*,*,#343,.F.);
#184=ORIENTED_EDGE('',*,*,#312,.F.);
#185=ORIENTED_EDGE('',*,*,#344,.F.);
#186=ORIENTED_EDGE('',*,*,#302,.F.);
#187=ORIENTED_EDGE('',*,*,#345,.F.);
#188=ORIENTED_EDGE('',*,*,#306,.F.);
#189=ORIENTED_EDGE('',*,*,#346,.F.);
#190=ORIENTED_EDGE('',*,*,#308,.F.);
#191=ORIENTED_EDGE('',*,*,#347,.F.);
#192=ORIENTED_EDGE('',*,*,#316,.F.);
#193=ORIENTED_EDGE('',*,*,#348,.F.);
#194=ORIENTED_EDGE('',*,*,#298,.F.);
#195=ORIENTED_EDGE('',*,*,#344,.T.);
#196=ORIENTED_EDGE('',*,*,#311,.F.);
#197=ORIENTED_EDGE('',*,*,#349,.F.);
#198=ORIENTED_EDGE('',*,*,#303,.T.);
#199=ORIENTED_EDGE('',*,*,#346,.T.);
#200=ORIENTED_EDGE('',*,*,#305,.F.);
#201=ORIENTED_EDGE('',*,*,#350,.F.);
#202=ORIENTED_EDGE('',*,*,#309,.T.);
#203=ORIENTED_EDGE('',*,*,#332,.F.);
#204=ORIENTED_EDGE('',*,*,#335,.F.);
#205=ORIENTED_EDGE('',*,*,#338,.F.);
#206=ORIENTED_EDGE('',*,*,#342,.F.);
#207=ORIENTED_EDGE('',*,*,#322,.F.);
#208=ORIENTED_EDGE('',*,*,#325,.F.);
#209=ORIENTED_EDGE('',*,*,#328,.F.);
#210=ORIENTED_EDGE('',*,*,#340,.F.);
#211=ORIENTED_EDGE('',*,*,#304,.T.);
#212=ORIENTED_EDGE('',*,*,#349,.T.);
#213=ORIENTED_EDGE('',*,*,#310,.T.);
#214=ORIENTED_EDGE('',*,*,#350,.T.);
#215=ORIENTED_EDGE('',*,*,#299,.T.);
#216=ORIENTED_EDGE('',*,*,#348,.T.);
#217=ORIENTED_EDGE('',*,*,#315,.T.);
#218=ORIENTED_EDGE('',*,*,#351,.T.);
#219=ORIENTED_EDGE('',*,*,#301,.T.);
#220=ORIENTED_EDGE('',*,*,#352,.F.);
#221=ORIENTED_EDGE('',*,*,#313,.T.);
#222=ORIENTED_EDGE('',*,*,#343,.T.);
#223=ORIENTED_EDGE('',*,*,#341,.F.);
#224=ORIENTED_EDGE('',*,*,#336,.F.);
#225=ORIENTED_EDGE('',*,*,#333,.F.);
#226=ORIENTED_EDGE('',*,*,#330,.F.);
#227=ORIENTED_EDGE('',*,*,#300,.T.);
#228=ORIENTED_EDGE('',*,*,#351,.F.);
#229=ORIENTED_EDGE('',*,*,#314,.T.);
#230=ORIENTED_EDGE('',*,*,#352,.T.);
#231=ORIENTED_EDGE('',*,*,#339,.F.);
#232=ORIENTED_EDGE('',*,*,#326,.F.);
#233=ORIENTED_EDGE('',*,*,#323,.F.);
#234=ORIENTED_EDGE('',*,*,#320,.F.);
#235=ORIENTED_EDGE('',*,*,#296,.T.);
#236=ORIENTED_EDGE('',*,*,#353,.F.);
#237=ORIENTED_EDGE('',*,*,#318,.T.);
#238=ORIENTED_EDGE('',*,*,#354,.T.);
#239=ORIENTED_EDGE('',*,*,#295,.T.);
#240=ORIENTED_EDGE('',*,*,#345,.T.);
#241=ORIENTED_EDGE('',*,*,#307,.T.);
#242=ORIENTED_EDGE('',*,*,#353,.T.);
#243=ORIENTED_EDGE('',*,*,#297,.T.);
#244=ORIENTED_EDGE('',*,*,#354,.F.);
#245=ORIENTED_EDGE('',*,*,#317,.T.);
#246=ORIENTED_EDGE('',*,*,#347,.T.);
#247=EDGE_CURVE('',#355,#356,#427,.T.);
#248=EDGE_CURVE('',#357,#355,#428,.T.);
#249=EDGE_CURVE('',#358,#357,#429,.T.);
#250=EDGE_CURVE('',#359,#358,#430,.T.);
#251=EDGE_CURVE('',#360,#359,#431,.T.);
#252=EDGE_CURVE('',#356,#360,#432,.T.);
#253=EDGE_CURVE('',#361,#362,#433,.T.);
#254=EDGE_CURVE('',#363,#361,#434,.T.);
#255=EDGE_CURVE('',#364,#363,#435,.T.);
#256=EDGE_CURVE('',#365,#364,#436,.T.);
#257=EDGE_CURVE('',#366,#365,#437,.T.);
#258=EDGE_CURVE('',#362,#366,#438,.T.);
#259=EDGE_CURVE('',#367,#368,#439,.T.);
#260=EDGE_CURVE('',#367,#369,#440,.T.);
#261=EDGE_CURVE('',#370,#369,#441,.T.);
#262=EDGE_CURVE('',#371,#370,#442,.T.);
#263=EDGE_CURVE('',#372,#371,#443,.T.);
#264=EDGE_CURVE('',#368,#372,#444,.T.);
#265=EDGE_CURVE('',#373,#374,#445,.T.);
#266=EDGE_CURVE('',#375,#373,#446,.T.);
#267=EDGE_CURVE('',#376,#375,#447,.T.);
#268=EDGE_CURVE('',#377,#376,#448,.T.);
#269=EDGE_CURVE('',#378,#377,#449,.T.);
#270=EDGE_CURVE('',#378,#374,#450,.T.);
#271=EDGE_CURVE('',#356,#367,#451,.T.);
#272=EDGE_CURVE('',#360,#369,#452,.T.);
#273=EDGE_CURVE('',#361,#374,#453,.T.);
#274=EDGE_CURVE('',#363,#378,#454,.T.);
#275=EDGE_CURVE('',#373,#362,#455,.T.);
#276=EDGE_CURVE('',#366,#375,#456,.T.);
#277=EDGE_CURVE('',#355,#368,#457,.T.);
#278=EDGE_CURVE('',#357,#372,#458,.T.);
#279=EDGE_CURVE('',#370,#359,#459,.T.);
#280=EDGE_CURVE('',#358,#371,#460,.T.);
#281=EDGE_CURVE('',#364,#377,#461,.T.);
#282=EDGE_CURVE('',#365,#376,#462,.T.);
#283=EDGE_CURVE('',#379,#380,#463,.T.);
#284=EDGE_CURVE('',#381,#380,#464,.T.);
#285=EDGE_CURVE('',#381,#382,#465,.T.);
#286=EDGE_CURVE('',#382,#379,#466,.T.);
#287=EDGE_CURVE('',#383,#384,#467,.T.);
#288=EDGE_CURVE('',#384,#385,#468,.T.);
#289=EDGE_CURVE('',#386,#385,#469,.T.);
#290=EDGE_CURVE('',#383,#386,#470,.T.);
#291=EDGE_CURVE('',#386,#382,#471,.T.);
#292=EDGE_CURVE('',#381,#383,#472,.T.);
#293=EDGE_CURVE('',#380,#384,#473,.T.);
#294=EDGE_CURVE('',#385,#379,#474,.T.);
#295=EDGE_CURVE('',#387,#388,#475,.T.);
#296=EDGE_CURVE('',#389,#387,#476,.T.);
#297=EDGE_CURVE('',#390,#389,#477,.T.);
#298=EDGE_CURVE('',#390,#391,#478,.T.);
#299=EDGE_CURVE('',#392,#391,#479,.T.);
#300=EDGE_CURVE('',#393,#392,#480,.T.);
#301=EDGE_CURVE('',#394,#393,#481,.T.);
#302=EDGE_CURVE('',#394,#395,#482,.T.);
#303=EDGE_CURVE('',#396,#395,#483,.T.);
#304=EDGE_CURVE('',#397,#396,#484,.T.);
#305=EDGE_CURVE('',#397,#398,#485,.T.);
#306=EDGE_CURVE('',#398,#388,#486,.T.);
#307=EDGE_CURVE('',#399,#400,#487,.T.);
#308=EDGE_CURVE('',#399,#401,#488,.T.);
#309=EDGE_CURVE('',#402,#401,#489,.T.);
#310=EDGE_CURVE('',#403,#402,#490,.T.);
#311=EDGE_CURVE('',#403,#404,#491,.T.);
#312=EDGE_CURVE('',#404,#405,#492,.T.);
#313=EDGE_CURVE('',#406,#405,#493,.T.);
#314=EDGE_CURVE('',#407,#406,#494,.T.);
#315=EDGE_CURVE('',#408,#407,#495,.T.);
#316=EDGE_CURVE('',#408,#409,#496,.T.);
#317=EDGE_CURVE('',#410,#409,#497,.T.);
#318=EDGE_CURVE('',#400,#410,#498,.T.);
#319=EDGE_CURVE('',#411,#412,#499,.T.);
#320=EDGE_CURVE('',#412,#413,#500,.T.);
#321=EDGE_CURVE('',#414,#413,#501,.T.);
#322=EDGE_CURVE('',#414,#411,#502,.T.);
#323=EDGE_CURVE('',#413,#415,#503,.T.);
#324=EDGE_CURVE('',#416,#415,#504,.T.);
#325=EDGE_CURVE('',#416,#414,#505,.T.);
#326=EDGE_CURVE('',#415,#417,#506,.T.);
#327=EDGE_CURVE('',#418,#417,#507,.T.);
#328=EDGE_CURVE('',#418,#416,#508,.T.);
#329=EDGE_CURVE('',#419,#420,#509,.T.);
#330=EDGE_CURVE('',#420,#421,#510,.T.);
#331=EDGE_CURVE('',#422,#421,#511,.T.);
#332=EDGE_CURVE('',#422,#419,#512,.T.);
#333=EDGE_CURVE('',#421,#423,#513,.T.);
#334=EDGE_CURVE('',#424,#423,#514,.T.);
#335=EDGE_CURVE('',#424,#422,#515,.T.);
#336=EDGE_CURVE('',#423,#425,#516,.T.);
#337=EDGE_CURVE('',#426,#425,#517,.T.);
#338=EDGE_CURVE('',#426,#424,#518,.T.);
#339=EDGE_CURVE('',#417,#412,#519,.T.);
#340=EDGE_CURVE('',#411,#418,#520,.T.);
#341=EDGE_CURVE('',#425,#420,#521,.T.);
#342=EDGE_CURVE('',#419,#426,#522,.T.);
#343=EDGE_CURVE('',#405,#394,#523,.T.);
#344=EDGE_CURVE('',#395,#404,#524,.T.);
#345=EDGE_CURVE('',#388,#399,#525,.T.);
#346=EDGE_CURVE('',#401,#398,#526,.T.);
#347=EDGE_CURVE('',#409,#390,#527,.T.);
#348=EDGE_CURVE('',#391,#408,#528,.T.);
#349=EDGE_CURVE('',#396,#403,#529,.T.);
#350=EDGE_CURVE('',#402,#397,#530,.T.);
#351=EDGE_CURVE('',#407,#392,#531,.T.);
#352=EDGE_CURVE('',#406,#393,#532,.T.);
#353=EDGE_CURVE('',#400,#387,#533,.T.);
#354=EDGE_CURVE('',#410,#389,#534,.T.);
#355=VERTEX_POINT('',#1094);
#356=VERTEX_POINT('',#1095);
#357=VERTEX_POINT('',#1097);
#358=VERTEX_POINT('',#1099);
#359=VERTEX_POINT('',#1101);
#360=VERTEX_POINT('',#1103);
#361=VERTEX_POINT('',#1107);
#362=VERTEX_POINT('',#1108);
#363=VERTEX_POINT('',#1110);
#364=VERTEX_POINT('',#1112);
#365=VERTEX_POINT('',#1114);
#366=VERTEX_POINT('',#1116);
#367=VERTEX_POINT('',#1120);
#368=VERTEX_POINT('',#1121);
#369=VERTEX_POINT('',#1123);
#370=VERTEX_POINT('',#1125);
#371=VERTEX_POINT('',#1127);
#372=VERTEX_POINT('',#1129);
#373=VERTEX_POINT('',#1133);
#374=VERTEX_POINT('',#1134);
#375=VERTEX_POINT('',#1136);
#376=VERTEX_POINT('',#1138);
#377=VERTEX_POINT('',#1140);
#378=VERTEX_POINT('',#1142);
#379=VERTEX_POINT('',#1164);
#380=VERTEX_POINT('',#1165);
#381=VERTEX_POINT('',#1167);
#382=VERTEX_POINT('',#1169);
#383=VERTEX_POINT('',#1173);
#384=VERTEX_POINT('',#1174);
#385=VERTEX_POINT('',#1176);
#386=VERTEX_POINT('',#1178);
#387=VERTEX_POINT('',#1195);
#388=VERTEX_POINT('',#1196);
#389=VERTEX_POINT('',#1198);
#390=VERTEX_POINT('',#1200);
#391=VERTEX_POINT('',#1202);
#392=VERTEX_POINT('',#1204);
#393=VERTEX_POINT('',#1206);
#394=VERTEX_POINT('',#1208);
#395=VERTEX_POINT('',#1210);
#396=VERTEX_POINT('',#1212);
#397=VERTEX_POINT('',#1214);
#398=VERTEX_POINT('',#1216);
#399=VERTEX_POINT('',#1220);
#400=VERTEX_POINT('',#1221);
#401=VERTEX_POINT('',#1223);
#402=VERTEX_POINT('',#1225);
#403=VERTEX_POINT('',#1227);
#404=VERTEX_POINT('',#1229);
#405=VERTEX_POINT('',#1231);
#406=VERTEX_POINT('',#1233);
#407=VERTEX_POINT('',#1235);
#408=VERTEX_POINT('',#1237);
#409=VERTEX_POINT('',#1239);
#410=VERTEX_POINT('',#1241);
#411=VERTEX_POINT('',#1245);
#412=VERTEX_POINT('',#1246);
#413=VERTEX_POINT('',#1248);
#414=VERTEX_POINT('',#1250);
#415=VERTEX_POINT('',#1254);
#416=VERTEX_POINT('',#1256);
#417=VERTEX_POINT('',#1260);
#418=VERTEX_POINT('',#1262);
#419=VERTEX_POINT('',#1266);
#420=VERTEX_POINT('',#1267);
#421=VERTEX_POINT('',#1269);
#422=VERTEX_POINT('',#1271);
#423=VERTEX_POINT('',#1275);
#424=VERTEX_POINT('',#1277);
#425=VERTEX_POINT('',#1281);
#426=VERTEX_POINT('',#1283);
#427=LINE('',#1093,#535);
#428=LINE('',#1096,#536);
#429=LINE('',#1098,#537);
#430=LINE('',#1100,#538);
#431=LINE('',#1102,#539);
#432=LINE('',#1104,#540);
#433=LINE('',#1106,#541);
#434=LINE('',#1109,#542);
#435=LINE('',#1111,#543);
#436=LINE('',#1113,#544);
#437=LINE('',#1115,#545);
#438=LINE('',#1117,#546);
#439=LINE('',#1119,#547);
#440=LINE('',#1122,#548);
#441=LINE('',#1124,#549);
#442=LINE('',#1126,#550);
#443=LINE('',#1128,#551);
#444=LINE('',#1130,#552);
#445=LINE('',#1132,#553);
#446=LINE('',#1135,#554);
#447=LINE('',#1137,#555);
#448=LINE('',#1139,#556);
#449=LINE('',#1141,#557);
#450=LINE('',#1143,#558);
#451=LINE('',#1145,#559);
#452=LINE('',#1146,#560);
#453=LINE('',#1148,#561);
#454=LINE('',#1149,#562);
#455=LINE('',#1151,#563);
#456=LINE('',#1152,#564);
#457=LINE('',#1154,#565);
#458=LINE('',#1155,#566);
#459=LINE('',#1157,#567);
#460=LINE('',#1158,#568);
#461=LINE('',#1160,#569);
#462=LINE('',#1161,#570);
#463=LINE('',#1163,#571);
#464=LINE('',#1166,#572);
#465=LINE('',#1168,#573);
#466=LINE('',#1170,#574);
#467=LINE('',#1172,#575);
#468=LINE('',#1175,#576);
#469=LINE('',#1177,#577);
#470=LINE('',#1179,#578);
#471=LINE('',#1181,#579);
#472=LINE('',#1182,#580);
#473=LINE('',#1184,#581);
#474=LINE('',#1186,#582);
#475=LINE('',#1194,#583);
#476=LINE('',#1197,#584);
#477=LINE('',#1199,#585);
#478=LINE('',#1201,#586);
#479=LINE('',#1203,#587);
#480=LINE('',#1205,#588);
#481=LINE('',#1207,#589);
#482=LINE('',#1209,#590);
#483=LINE('',#1211,#591);
#484=LINE('',#1213,#592);
#485=LINE('',#1215,#593);
#486=LINE('',#1217,#594);
#487=LINE('',#1219,#595);
#488=LINE('',#1222,#596);
#489=LINE('',#1224,#597);
#490=LINE('',#1226,#598);
#491=LINE('',#1228,#599);
#492=LINE('',#1230,#600);
#493=LINE('',#1232,#601);
#494=LINE('',#1234,#602);
#495=LINE('',#1236,#603);
#496=LINE('',#1238,#604);
#497=LINE('',#1240,#605);
#498=LINE('',#1242,#606);
#499=LINE('',#1244,#607);
#500=LINE('',#1247,#608);
#501=LINE('',#1249,#609);
#502=LINE('',#1251,#610);
#503=LINE('',#1253,#611);
#504=LINE('',#1255,#612);
#505=LINE('',#1257,#613);
#506=LINE('',#1259,#614);
#507=LINE('',#1261,#615);
#508=LINE('',#1263,#616);
#509=LINE('',#1265,#617);
#510=LINE('',#1268,#618);
#511=LINE('',#1270,#619);
#512=LINE('',#1272,#620);
#513=LINE('',#1274,#621);
#514=LINE('',#1276,#622);
#515=LINE('',#1278,#623);
#516=LINE('',#1280,#624);
#517=LINE('',#1282,#625);
#518=LINE('',#1284,#626);
#519=LINE('',#1286,#627);
#520=LINE('',#1287,#628);
#521=LINE('',#1289,#629);
#522=LINE('',#1290,#630);
#523=LINE('',#1292,#631);
#524=LINE('',#1293,#632);
#525=LINE('',#1295,#633);
#526=LINE('',#1296,#634);
#527=LINE('',#1298,#635);
#528=LINE('',#1299,#636);
#529=LINE('',#1301,#637);
#530=LINE('',#1303,#638);
#531=LINE('',#1306,#639);
#532=LINE('',#1308,#640);
#533=LINE('',#1311,#641);
#534=LINE('',#1312,#642);
#535=VECTOR('',#897,39.3700787401575);
#536=VECTOR('',#898,39.3700787401575);
#537=VECTOR('',#899,39.3700787401575);
#538=VECTOR('',#900,39.3700787401575);
#539=VECTOR('',#901,39.3700787401575);
#540=VECTOR('',#902,39.3700787401575);
#541=VECTOR('',#905,39.3700787401575);
#542=VECTOR('',#906,39.3700787401575);
#543=VECTOR('',#907,39.3700787401575);
#544=VECTOR('',#908,39.3700787401575);
#545=VECTOR('',#909,39.3700787401575);
#546=VECTOR('',#910,39.3700787401575);
#547=VECTOR('',#913,39.3700787401575);
#548=VECTOR('',#914,39.3700787401575);
#549=VECTOR('',#915,39.3700787401575);
#550=VECTOR('',#916,39.3700787401575);
#551=VECTOR('',#917,39.3700787401575);
#552=VECTOR('',#918,39.3700787401575);
#553=VECTOR('',#921,39.3700787401575);
#554=VECTOR('',#922,39.3700787401575);
#555=VECTOR('',#923,39.3700787401575);
#556=VECTOR('',#924,39.3700787401575);
#557=VECTOR('',#925,39.3700787401575);
#558=VECTOR('',#926,39.3700787401575);
#559=VECTOR('',#929,39.3700787401575);
#560=VECTOR('',#930,39.3700787401575);
#561=VECTOR('',#933,39.3700787401575);
#562=VECTOR('',#934,39.3700787401575);
#563=VECTOR('',#937,39.3700787401575);
#564=VECTOR('',#938,39.3700787401575);
#565=VECTOR('',#941,39.3700787401575);
#566=VECTOR('',#942,39.3700787401575);
#567=VECTOR('',#945,39.3700787401575);
#568=VECTOR('',#946,39.3700787401575);
#569=VECTOR('',#949,39.3700787401575);
#570=VECTOR('',#950,39.3700787401575);
#571=VECTOR('',#953,39.3700787401575);
#572=VECTOR('',#954,39.3700787401575);
#573=VECTOR('',#955,39.3700787401575);
#574=VECTOR('',#956,39.3700787401575);
#575=VECTOR('',#959,39.3700787401575);
#576=VECTOR('',#960,39.3700787401575);
#577=VECTOR('',#961,39.3700787401575);
#578=VECTOR('',#962,39.3700787401575);
#579=VECTOR('',#965,39.3700787401575);
#580=VECTOR('',#966,39.3700787401575);
#581=VECTOR('',#969,39.3700787401575);
#582=VECTOR('',#972,39.3700787401575);
#583=VECTOR('',#987,39.3700787401575);
#584=VECTOR('',#988,39.3700787401575);
#585=VECTOR('',#989,39.3700787401575);
#586=VECTOR('',#990,39.3700787401575);
#587=VECTOR('',#991,39.3700787401575);
#588=VECTOR('',#992,39.3700787401575);
#589=VECTOR('',#993,39.3700787401575);
#590=VECTOR('',#994,39.3700787401575);
#591=VECTOR('',#995,39.3700787401575);
#592=VECTOR('',#996,39.3700787401575);
#593=VECTOR('',#997,39.3700787401575);
#594=VECTOR('',#998,39.3700787401575);
#595=VECTOR('',#1001,39.3700787401575);
#596=VECTOR('',#1002,39.3700787401575);
#597=VECTOR('',#1003,39.3700787401575);
#598=VECTOR('',#1004,39.3700787401575);
#599=VECTOR('',#1005,39.3700787401575);
#600=VECTOR('',#1006,39.3700787401575);
#601=VECTOR('',#1007,39.3700787401575);
#602=VECTOR('',#1008,39.3700787401575);
#603=VECTOR('',#1009,39.3700787401575);
#604=VECTOR('',#1010,39.3700787401575);
#605=VECTOR('',#1011,39.3700787401575);
#606=VECTOR('',#1012,39.3700787401575);
#607=VECTOR('',#1015,39.3700787401575);
#608=VECTOR('',#1016,39.3700787401575);
#609=VECTOR('',#1017,39.3700787401575);
#610=VECTOR('',#1018,39.3700787401575);
#611=VECTOR('',#1021,39.3700787401575);
#612=VECTOR('',#1022,39.3700787401575);
#613=VECTOR('',#1023,39.3700787401575);
#614=VECTOR('',#1026,39.3700787401575);
#615=VECTOR('',#1027,39.3700787401575);
#616=VECTOR('',#1028,39.3700787401575);
#617=VECTOR('',#1031,39.3700787401575);
#618=VECTOR('',#1032,39.3700787401575);
#619=VECTOR('',#1033,39.3700787401575);
#620=VECTOR('',#1034,39.3700787401575);
#621=VECTOR('',#1037,39.3700787401575);
#622=VECTOR('',#1038,39.3700787401575);
#623=VECTOR('',#1039,39.3700787401575);
#624=VECTOR('',#1042,39.3700787401575);
#625=VECTOR('',#1043,39.3700787401575);
#626=VECTOR('',#1044,39.3700787401575);
#627=VECTOR('',#1047,39.3700787401575);
#628=VECTOR('',#1048,39.3700787401575);
#629=VECTOR('',#1051,39.3700787401575);
#630=VECTOR('',#1052,39.3700787401575);
#631=VECTOR('',#1055,39.3700787401575);
#632=VECTOR('',#1056,39.3700787401575);
#633=VECTOR('',#1059,39.3700787401575);
#634=VECTOR('',#1060,39.3700787401575);
#635=VECTOR('',#1063,39.3700787401575);
#636=VECTOR('',#1064,39.3700787401575);
#637=VECTOR('',#1067,39.3700787401575);
#638=VECTOR('',#1070,39.3700787401575);
#639=VECTOR('',#1075,39.3700787401575);
#640=VECTOR('',#1078,39.3700787401575);
#641=VECTOR('',#1083,39.3700787401575);
#642=VECTOR('',#1084,39.3700787401575);
#643=EDGE_LOOP('',(#31,#32,#33,#34,#35,#36));
#644=EDGE_LOOP('',(#37,#38,#39,#40,#41,#42));
#645=EDGE_LOOP('',(#43,#44,#45,#46,#47,#48));
#646=EDGE_LOOP('',(#49,#50,#51,#52,#53,#54));
#647=EDGE_LOOP('',(#55,#56,#57,#58));
#648=EDGE_LOOP('',(#59,#60,#61,#62));
#649=EDGE_LOOP('',(#63,#64,#65,#66));
#650=EDGE_LOOP('',(#67,#68,#69,#70));
#651=EDGE_LOOP('',(#71,#72,#73,#74));
#652=EDGE_LOOP('',(#75,#76,#77,#78));
#653=EDGE_LOOP('',(#79,#80,#81,#82));
#654=EDGE_LOOP('',(#83,#84,#85,#86));
#655=EDGE_LOOP('',(#87,#88,#89,#90));
#656=EDGE_LOOP('',(#91,#92,#93,#94));
#657=EDGE_LOOP('',(#95,#96,#97,#98));
#658=EDGE_LOOP('',(#99,#100,#101,#102));
#659=EDGE_LOOP('',(#103,#104,#105,#106));
#660=EDGE_LOOP('',(#107,#108,#109,#110));
#661=EDGE_LOOP('',(#111,#112,#113,#114));
#662=EDGE_LOOP('',(#115,#116,#117,#118));
#663=EDGE_LOOP('',(#119,#120,#121,#122));
#664=EDGE_LOOP('',(#123,#124,#125,#126));
#665=EDGE_LOOP('',(#127,#128,#129,#130,#131,#132,#133,#134,#135,#136,#137,
#138));
#666=EDGE_LOOP('',(#139,#140,#141,#142,#143,#144,#145,#146,#147,#148,#149,
#150));
#667=EDGE_LOOP('',(#151,#152,#153,#154));
#668=EDGE_LOOP('',(#155,#156,#157,#158));
#669=EDGE_LOOP('',(#159,#160,#161,#162));
#670=EDGE_LOOP('',(#163,#164,#165,#166));
#671=EDGE_LOOP('',(#167,#168,#169,#170));
#672=EDGE_LOOP('',(#171,#172,#173,#174));
#673=EDGE_LOOP('',(#175,#176,#177,#178));
#674=EDGE_LOOP('',(#179,#180,#181,#182));
#675=EDGE_LOOP('',(#183,#184,#185,#186));
#676=EDGE_LOOP('',(#187,#188,#189,#190));
#677=EDGE_LOOP('',(#191,#192,#193,#194));
#678=EDGE_LOOP('',(#195,#196,#197,#198));
#679=EDGE_LOOP('',(#199,#200,#201,#202));
#680=EDGE_LOOP('',(#203,#204,#205,#206));
#681=EDGE_LOOP('',(#207,#208,#209,#210));
#682=EDGE_LOOP('',(#211,#212,#213,#214));
#683=EDGE_LOOP('',(#215,#216,#217,#218));
#684=EDGE_LOOP('',(#219,#220,#221,#222));
#685=EDGE_LOOP('',(#223,#224,#225,#226));
#686=EDGE_LOOP('',(#227,#228,#229,#230));
#687=EDGE_LOOP('',(#231,#232,#233,#234));
#688=EDGE_LOOP('',(#235,#236,#237,#238));
#689=EDGE_LOOP('',(#239,#240,#241,#242));
#690=EDGE_LOOP('',(#243,#244,#245,#246));
#691=FACE_BOUND('',#643,.T.);
#692=FACE_BOUND('',#644,.T.);
#693=FACE_BOUND('',#645,.T.);
#694=FACE_BOUND('',#646,.T.);
#695=FACE_BOUND('',#647,.T.);
#696=FACE_BOUND('',#648,.T.);
#697=FACE_BOUND('',#649,.T.);
#698=FACE_BOUND('',#650,.T.);
#699=FACE_BOUND('',#651,.T.);
#700=FACE_BOUND('',#652,.T.);
#701=FACE_BOUND('',#653,.T.);
#702=FACE_BOUND('',#654,.T.);
#703=FACE_BOUND('',#655,.T.);
#704=FACE_BOUND('',#656,.T.);
#705=FACE_BOUND('',#657,.T.);
#706=FACE_BOUND('',#658,.T.);
#707=FACE_BOUND('',#659,.T.);
#708=FACE_BOUND('',#660,.T.);
#709=FACE_BOUND('',#661,.T.);
#710=FACE_BOUND('',#662,.T.);
#711=FACE_BOUND('',#663,.T.);
#712=FACE_BOUND('',#664,.T.);
#713=FACE_BOUND('',#665,.T.);
#714=FACE_BOUND('',#666,.T.);
#715=FACE_BOUND('',#667,.T.);
#716=FACE_BOUND('',#668,.T.);
#717=FACE_BOUND('',#669,.T.);
#718=FACE_BOUND('',#670,.T.);
#719=FACE_BOUND('',#671,.T.);
#720=FACE_BOUND('',#672,.T.);
#721=FACE_BOUND('',#673,.T.);
#722=FACE_BOUND('',#674,.T.);
#723=FACE_BOUND('',#675,.T.);
#724=FACE_BOUND('',#676,.T.);
#725=FACE_BOUND('',#677,.T.);
#726=FACE_BOUND('',#678,.T.);
#727=FACE_BOUND('',#679,.T.);
#728=FACE_BOUND('',#680,.T.);
#729=FACE_BOUND('',#681,.T.);
#730=FACE_BOUND('',#682,.T.);
#731=FACE_BOUND('',#683,.T.);
#732=FACE_BOUND('',#684,.T.);
#733=FACE_BOUND('',#685,.T.);
#734=FACE_BOUND('',#686,.T.);
#735=FACE_BOUND('',#687,.T.);
#736=FACE_BOUND('',#688,.T.);
#737=FACE_BOUND('',#689,.T.);
#738=FACE_BOUND('',#690,.T.);
#739=PLANE('',#849);
#740=PLANE('',#850);
#741=PLANE('',#851);
#742=PLANE('',#852);
#743=PLANE('',#853);
#744=PLANE('',#854);
#745=PLANE('',#855);
#746=PLANE('',#856);
#747=PLANE('',#857);
#748=PLANE('',#858);
#749=PLANE('',#859);
#750=PLANE('',#860);
#751=PLANE('',#861);
#752=PLANE('',#862);
#753=PLANE('',#863);
#754=PLANE('',#864);
#755=PLANE('',#865);
#756=PLANE('',#866);
#757=PLANE('',#867);
#758=PLANE('',#868);
#759=PLANE('',#870);
#760=PLANE('',#871);
#761=PLANE('',#872);
#762=PLANE('',#873);
#763=PLANE('',#874);
#764=PLANE('',#875);
#765=PLANE('',#876);
#766=PLANE('',#877);
#767=PLANE('',#878);
#768=PLANE('',#879);
#769=PLANE('',#880);
#770=PLANE('',#881);
#771=PLANE('',#882);
#772=PLANE('',#883);
#773=PLANE('',#884);
#774=PLANE('',#885);
#775=PLANE('',#886);
#776=PLANE('',#887);
#777=PLANE('',#888);
#778=PLANE('',#889);
#779=PLANE('',#890);
#780=PLANE('',#891);
#781=ADVANCED_FACE('',(#691),#739,.F.);
#782=ADVANCED_FACE('',(#692),#740,.F.);
#783=ADVANCED_FACE('',(#693),#741,.F.);
#784=ADVANCED_FACE('',(#694),#742,.F.);
#785=ADVANCED_FACE('',(#695),#743,.F.);
#786=ADVANCED_FACE('',(#696),#744,.F.);
#787=ADVANCED_FACE('',(#697),#745,.T.);
#788=ADVANCED_FACE('',(#698),#746,.T.);
#789=ADVANCED_FACE('',(#699),#747,.T.);
#790=ADVANCED_FACE('',(#700),#748,.T.);
#791=ADVANCED_FACE('',(#701),#749,.T.);
#792=ADVANCED_FACE('',(#702),#750,.F.);
#793=ADVANCED_FACE('',(#703),#751,.F.);
#794=ADVANCED_FACE('',(#704),#752,.F.);
#795=ADVANCED_FACE('',(#705,#706,#707),#753,.F.);
#796=ADVANCED_FACE('',(#708),#754,.F.);
#797=ADVANCED_FACE('',(#709),#755,.T.);
#798=ADVANCED_FACE('',(#710),#756,.T.);
#799=ADVANCED_FACE('',(#711),#757,.T.);
#800=ADVANCED_FACE('',(#712),#758,.T.);
#801=ADVANCED_FACE('',(#713),#759,.F.);
#802=ADVANCED_FACE('',(#714),#760,.F.);
#803=ADVANCED_FACE('',(#715),#761,.T.);
#804=ADVANCED_FACE('',(#716),#762,.T.);
#805=ADVANCED_FACE('',(#717),#763,.T.);
#806=ADVANCED_FACE('',(#718),#764,.T.);
#807=ADVANCED_FACE('',(#719),#765,.T.);
#808=ADVANCED_FACE('',(#720),#766,.T.);
#809=ADVANCED_FACE('',(#721),#767,.T.);
#810=ADVANCED_FACE('',(#722),#768,.T.);
#811=ADVANCED_FACE('',(#723),#769,.F.);
#812=ADVANCED_FACE('',(#724),#770,.F.);
#813=ADVANCED_FACE('',(#725),#771,.F.);
#814=ADVANCED_FACE('',(#726),#772,.F.);
#815=ADVANCED_FACE('',(#727),#773,.F.);
#816=ADVANCED_FACE('',(#728,#729,#730),#774,.T.);
#817=ADVANCED_FACE('',(#731),#775,.T.);
#818=ADVANCED_FACE('',(#732),#776,.T.);
#819=ADVANCED_FACE('',(#733,#734),#777,.T.);
#820=ADVANCED_FACE('',(#735,#736),#778,.T.);
#821=ADVANCED_FACE('',(#737),#779,.T.);
#822=ADVANCED_FACE('',(#738),#780,.T.);
#823=CLOSED_SHELL('',(#781,#782,#783,#784,#785,#786,#787,#788,#789,#790,
#791,#792,#793,#794,#795,#796,#797,#798,#799,#800));
#824=CLOSED_SHELL('',(#801,#802,#803,#804,#805,#806,#807,#808,#809,#810,
#811,#812,#813,#814,#815,#816,#817,#818,#819,#820,#821,#822));
#825=STYLED_ITEM('',(#827),#840);
#826=STYLED_ITEM('',(#828),#841);
#827=PRESENTATION_STYLE_ASSIGNMENT((#829));
#828=PRESENTATION_STYLE_ASSIGNMENT((#830));
#829=SURFACE_STYLE_USAGE(.BOTH.,#831);
#830=SURFACE_STYLE_USAGE(.BOTH.,#832);
#831=SURFACE_SIDE_STYLE('',(#833));
#832=SURFACE_SIDE_STYLE('',(#834));
#833=SURFACE_STYLE_FILL_AREA(#835);
#834=SURFACE_STYLE_FILL_AREA(#836);
#835=FILL_AREA_STYLE('',(#837));
#836=FILL_AREA_STYLE('',(#838));
#837=FILL_AREA_STYLE_COLOUR('',#839);
#838=FILL_AREA_STYLE_COLOUR('',#18);
#839=DRAUGHTING_PRE_DEFINED_COLOUR('yellow');
#840=MANIFOLD_SOLID_BREP('P2SSW-102-03-G-S',#823);
#841=MANIFOLD_SOLID_BREP('T1SSW-102-03-G-S',#824);
#842=SHAPE_DEFINITION_REPRESENTATION(#1329,#845);
#843=SHAPE_DEFINITION_REPRESENTATION(#1330,#846);
#844=SHAPE_DEFINITION_REPRESENTATION(#1332,#847);
#845=SHAPE_REPRESENTATION('SSW-102-03-G-S',(#848,#869,#892),#1317);
#846=SHAPE_REPRESENTATION('P2SSW-102-03-G-S',(#848),#1318);
#847=SHAPE_REPRESENTATION('T1SSW-102-03-G-S',(#848),#1319);
#848=AXIS2_PLACEMENT_3D('',#1091,#893,#894);
#849=AXIS2_PLACEMENT_3D('',#1092,#895,#896);
#850=AXIS2_PLACEMENT_3D('',#1105,#903,#904);
#851=AXIS2_PLACEMENT_3D('',#1118,#911,#912);
#852=AXIS2_PLACEMENT_3D('',#1131,#919,#920);
#853=AXIS2_PLACEMENT_3D('',#1144,#927,#928);
#854=AXIS2_PLACEMENT_3D('',#1147,#931,#932);
#855=AXIS2_PLACEMENT_3D('',#1150,#935,#936);
#856=AXIS2_PLACEMENT_3D('',#1153,#939,#940);
#857=AXIS2_PLACEMENT_3D('',#1156,#943,#944);
#858=AXIS2_PLACEMENT_3D('',#1159,#947,#948);
#859=AXIS2_PLACEMENT_3D('',#1162,#951,#952);
#860=AXIS2_PLACEMENT_3D('',#1171,#957,#958);
#861=AXIS2_PLACEMENT_3D('',#1180,#963,#964);
#862=AXIS2_PLACEMENT_3D('',#1183,#967,#968);
#863=AXIS2_PLACEMENT_3D('',#1185,#970,#971);
#864=AXIS2_PLACEMENT_3D('',#1187,#973,#974);
#865=AXIS2_PLACEMENT_3D('',#1188,#975,#976);
#866=AXIS2_PLACEMENT_3D('',#1189,#977,#978);
#867=AXIS2_PLACEMENT_3D('',#1190,#979,#980);
#868=AXIS2_PLACEMENT_3D('',#1191,#981,#982);
#869=AXIS2_PLACEMENT_3D('',#1192,#983,#984);
#870=AXIS2_PLACEMENT_3D('',#1193,#985,#986);
#871=AXIS2_PLACEMENT_3D('',#1218,#999,#1000);
#872=AXIS2_PLACEMENT_3D('',#1243,#1013,#1014);
#873=AXIS2_PLACEMENT_3D('',#1252,#1019,#1020);
#874=AXIS2_PLACEMENT_3D('',#1258,#1024,#1025);
#875=AXIS2_PLACEMENT_3D('',#1264,#1029,#1030);
#876=AXIS2_PLACEMENT_3D('',#1273,#1035,#1036);
#877=AXIS2_PLACEMENT_3D('',#1279,#1040,#1041);
#878=AXIS2_PLACEMENT_3D('',#1285,#1045,#1046);
#879=AXIS2_PLACEMENT_3D('',#1288,#1049,#1050);
#880=AXIS2_PLACEMENT_3D('',#1291,#1053,#1054);
#881=AXIS2_PLACEMENT_3D('',#1294,#1057,#1058);
#882=AXIS2_PLACEMENT_3D('',#1297,#1061,#1062);
#883=AXIS2_PLACEMENT_3D('',#1300,#1065,#1066);
#884=AXIS2_PLACEMENT_3D('',#1302,#1068,#1069);
#885=AXIS2_PLACEMENT_3D('',#1304,#1071,#1072);
#886=AXIS2_PLACEMENT_3D('',#1305,#1073,#1074);
#887=AXIS2_PLACEMENT_3D('',#1307,#1076,#1077);
#888=AXIS2_PLACEMENT_3D('',#1309,#1079,#1080);
#889=AXIS2_PLACEMENT_3D('',#1310,#1081,#1082);
#890=AXIS2_PLACEMENT_3D('',#1313,#1085,#1086);
#891=AXIS2_PLACEMENT_3D('',#1314,#1087,#1088);
#892=AXIS2_PLACEMENT_3D('',#1315,#1089,#1090);
#893=DIRECTION('',(0.,0.,1.));
#894=DIRECTION('',(1.,0.,0.));
#895=DIRECTION('',(0.,0.,-1.));
#896=DIRECTION('',(-1.,0.,0.));
#897=DIRECTION('',(-0.5,-0.866025403784439,0.));
#898=DIRECTION('',(0.,-1.,0.));
#899=DIRECTION('',(1.,0.,0.));
#900=DIRECTION('',(0.,1.,0.));
#901=DIRECTION('',(-0.5,0.866025403784439,0.));
#902=DIRECTION('',(-1.,0.,0.));
#903=DIRECTION('',(0.,0.,-1.));
#904=DIRECTION('',(-1.,0.,0.));
#905=DIRECTION('',(-0.5,0.866025403784439,0.));
#906=DIRECTION('',(-1.,0.,0.));
#907=DIRECTION('',(-0.5,-0.866025403784439,0.));
#908=DIRECTION('',(0.,-1.,0.));
#909=DIRECTION('',(1.,0.,0.));
#910=DIRECTION('',(0.,1.,0.));
#911=DIRECTION('',(0.,0.,1.));
#912=DIRECTION('',(1.,0.,0.));
#913=DIRECTION('',(0.5,0.866025403784439,0.));
#914=DIRECTION('',(-1.,0.,0.));
#915=DIRECTION('',(0.5,-0.866025403784439,0.));
#916=DIRECTION('',(0.,-1.,0.));
#917=DIRECTION('',(-1.,0.,0.));
#918=DIRECTION('',(0.,1.,0.));
#919=DIRECTION('',(0.,0.,1.));
#920=DIRECTION('',(1.,0.,0.));
#921=DIRECTION('',(0.5,-0.866025403784439,0.));
#922=DIRECTION('',(0.,-1.,0.));
#923=DIRECTION('',(-1.,0.,0.));
#924=DIRECTION('',(0.,1.,0.));
#925=DIRECTION('',(0.5,0.866025403784439,0.));
#926=DIRECTION('',(-1.,0.,0.));
#927=DIRECTION('',(0.,1.,0.));
#928=DIRECTION('',(0.,0.,1.));
#929=DIRECTION('',(0.,0.,-1.));
#930=DIRECTION('',(0.,0.,-1.));
#931=DIRECTION('',(0.,1.,0.));
#932=DIRECTION('',(0.,0.,1.));
#933=DIRECTION('',(0.,0.,-1.));
#934=DIRECTION('',(0.,0.,-1.));
#935=DIRECTION('',(-1.,0.,0.));
#936=DIRECTION('',(0.,0.,1.));
#937=DIRECTION('',(0.,0.,1.));
#938=DIRECTION('',(0.,0.,-1.));
#939=DIRECTION('',(1.,0.,0.));
#940=DIRECTION('',(0.,0.,-1.));
#941=DIRECTION('',(0.,0.,-1.));
#942=DIRECTION('',(0.,0.,-1.));
#943=DIRECTION('',(-1.,0.,0.));
#944=DIRECTION('',(0.,0.,1.));
#945=DIRECTION('',(0.,0.,1.));
#946=DIRECTION('',(0.,0.,-1.));
#947=DIRECTION('',(1.,0.,0.));
#948=DIRECTION('',(0.,0.,-1.));
#949=DIRECTION('',(0.,0.,-1.));
#950=DIRECTION('',(0.,0.,-1.));
#951=DIRECTION('',(1.,0.,0.));
#952=DIRECTION('',(0.,0.,-1.));
#953=DIRECTION('',(0.,0.,-1.));
#954=DIRECTION('',(0.,-1.,0.));
#955=DIRECTION('',(0.,0.,1.));
#956=DIRECTION('',(0.,-1.,0.));
#957=DIRECTION('',(1.,0.,0.));
#958=DIRECTION('',(0.,0.,-1.));
#959=DIRECTION('',(0.,-1.,0.));
#960=DIRECTION('',(0.,0.,1.));
#961=DIRECTION('',(0.,-1.,0.));
#962=DIRECTION('',(0.,0.,1.));
#963=DIRECTION('',(0.,-1.,0.));
#964=DIRECTION('',(0.,0.,-1.));
#965=DIRECTION('',(1.,0.,0.));
#966=DIRECTION('',(-1.,0.,0.));
#967=DIRECTION('',(0.,0.,1.));
#968=DIRECTION('',(1.,0.,0.));
#969=DIRECTION('',(-1.,0.,0.));
#970=DIRECTION('',(0.,1.,0.));
#971=DIRECTION('',(0.,0.,1.));
#972=DIRECTION('',(1.,0.,0.));
#973=DIRECTION('',(0.,0.,-1.));
#974=DIRECTION('',(-1.,0.,0.));
#975=DIRECTION('',(0.866025403784438,-0.5,0.));
#976=DIRECTION('',(0.5,0.866025403784439,0.));
#977=DIRECTION('',(-0.866025403784439,-0.5,0.));
#978=DIRECTION('',(0.5,-0.866025403784439,0.));
#979=DIRECTION('',(0.866025403784438,-0.5,0.));
#980=DIRECTION('',(0.5,0.866025403784439,0.));
#981=DIRECTION('',(-0.866025403784439,-0.5,0.));
#982=DIRECTION('',(0.5,-0.866025403784439,0.));
#983=DIRECTION('',(0.,0.,1.));
#984=DIRECTION('',(1.,0.,0.));
#985=DIRECTION('',(0.,0.,1.));
#986=DIRECTION('',(1.,0.,0.));
#987=DIRECTION('',(-1.70740499604016E-16,-1.,0.));
#988=DIRECTION('',(1.,5.33564061262551E-17,0.));
#989=DIRECTION('',(0.,1.,0.));
#990=DIRECTION('',(-1.,0.,0.));
#991=DIRECTION('',(0.,-1.,0.));
#992=DIRECTION('',(1.,5.33564061262551E-17,0.));
#993=DIRECTION('',(0.,1.,0.));
#994=DIRECTION('',(-1.,0.,0.));
#995=DIRECTION('',(0.,-1.,0.));
#996=DIRECTION('',(-1.,0.,0.));
#997=DIRECTION('',(0.,-1.,0.));
#998=DIRECTION('',(-1.,0.,0.));
#999=DIRECTION('',(0.,0.,-1.));
#1000=DIRECTION('',(-1.,0.,0.));
#1001=DIRECTION('',(1.70740499604016E-16,1.,0.));
#1002=DIRECTION('',(1.,0.,0.));
#1003=DIRECTION('',(0.,-1.,0.));
#1004=DIRECTION('',(1.,0.,0.));
#1005=DIRECTION('',(0.,-1.,0.));
#1006=DIRECTION('',(1.,0.,0.));
#1007=DIRECTION('',(0.,-1.,0.));
#1008=DIRECTION('',(-1.,-5.33564061262551E-17,0.));
#1009=DIRECTION('',(0.,1.,0.));
#1010=DIRECTION('',(1.,0.,0.));
#1011=DIRECTION('',(0.,-1.,0.));
#1012=DIRECTION('',(-1.,-5.33564061262551E-17,0.));
#1013=DIRECTION('',(0.,0.,1.));
#1014=DIRECTION('',(1.,0.,0.));
#1015=DIRECTION('',(0.,-1.,0.));
#1016=DIRECTION('',(1.,5.33564061262551E-17,0.));
#1017=DIRECTION('',(0.,-1.,0.));
#1018=DIRECTION('',(-1.,0.,0.));
#1019=DIRECTION('',(-1.,0.,0.));
#1020=DIRECTION('',(0.,0.,1.));
#1021=DIRECTION('',(0.,0.,1.));
#1022=DIRECTION('',(0.,-1.,0.));
#1023=DIRECTION('',(0.,0.,-1.));
#1024=DIRECTION('',(0.,0.,-1.));
#1025=DIRECTION('',(-1.,0.,0.));
#1026=DIRECTION('',(-1.,-5.33564061262551E-17,0.));
#1027=DIRECTION('',(0.,-1.,0.));
#1028=DIRECTION('',(1.,0.,0.));
#1029=DIRECTION('',(0.,0.,1.));
#1030=DIRECTION('',(1.,0.,0.));
#1031=DIRECTION('',(0.,-1.,0.));
#1032=DIRECTION('',(1.,5.33564061262551E-17,0.));
#1033=DIRECTION('',(0.,-1.,0.));
#1034=DIRECTION('',(-1.,0.,0.));
#1035=DIRECTION('',(-1.,0.,0.));
#1036=DIRECTION('',(0.,0.,1.));
#1037=DIRECTION('',(0.,0.,1.));
#1038=DIRECTION('',(0.,-1.,0.));
#1039=DIRECTION('',(0.,0.,-1.));
#1040=DIRECTION('',(0.,0.,-1.));
#1041=DIRECTION('',(-1.,0.,0.));
#1042=DIRECTION('',(-1.,-5.33564061262551E-17,0.));
#1043=DIRECTION('',(0.,-1.,0.));
#1044=DIRECTION('',(1.,0.,0.));
#1045=DIRECTION('',(1.,0.,0.));
#1046=DIRECTION('',(0.,0.,-1.));
#1047=DIRECTION('',(0.,0.,-1.));
#1048=DIRECTION('',(0.,0.,1.));
#1049=DIRECTION('',(1.,0.,0.));
#1050=DIRECTION('',(0.,0.,-1.));
#1051=DIRECTION('',(0.,0.,-1.));
#1052=DIRECTION('',(0.,0.,1.));
#1053=DIRECTION('',(0.,1.,0.));
#1054=DIRECTION('',(0.,0.,1.));
#1055=DIRECTION('',(0.,0.,-1.));
#1056=DIRECTION('',(0.,0.,1.));
#1057=DIRECTION('',(0.,1.,0.));
#1058=DIRECTION('',(0.,0.,1.));
#1059=DIRECTION('',(0.,0.,1.));
#1060=DIRECTION('',(0.,0.,-1.));
#1061=DIRECTION('',(0.,1.,0.));
#1062=DIRECTION('',(0.,0.,1.));
#1063=DIRECTION('',(0.,0.,-1.));
#1064=DIRECTION('',(0.,0.,1.));
#1065=DIRECTION('',(1.,0.,0.));
#1066=DIRECTION('',(0.,0.,-1.));
#1067=DIRECTION('',(0.,0.,1.));
#1068=DIRECTION('',(-1.,0.,0.));
#1069=DIRECTION('',(0.,0.,1.));
#1070=DIRECTION('',(0.,0.,-1.));
#1071=DIRECTION('',(0.,1.,0.));
#1072=DIRECTION('',(0.,0.,1.));
#1073=DIRECTION('',(-1.,0.,0.));
#1074=DIRECTION('',(0.,0.,1.));
#1075=DIRECTION('',(0.,0.,-1.));
#1076=DIRECTION('',(1.,0.,0.));
#1077=DIRECTION('',(0.,0.,-1.));
#1078=DIRECTION('',(0.,0.,-1.));
#1079=DIRECTION('',(5.33564061262551E-17,-1.,0.));
#1080=DIRECTION('',(1.,5.33564061262551E-17,0.));
#1081=DIRECTION('',(5.33564061262551E-17,-1.,0.));
#1082=DIRECTION('',(1.,5.33564061262551E-17,0.));
#1083=DIRECTION('',(0.,0.,-1.));
#1084=DIRECTION('',(0.,0.,-1.));
#1085=DIRECTION('',(-1.,1.70740499604016E-16,0.));
#1086=DIRECTION('',(-1.70740499604016E-16,-1.,0.));
#1087=DIRECTION('',(1.,0.,0.));
#1088=DIRECTION('',(0.,0.,-1.));
#1089=DIRECTION('',(0.,0.,1.));
#1090=DIRECTION('',(1.,0.,0.));
#1091=CARTESIAN_POINT('',(0.,0.,0.));
#1092=CARTESIAN_POINT('',(0.0705,0.434,0.008));
#1093=CARTESIAN_POINT('',(0.247177512621223,0.331995190528383,0.008));
#1094=CARTESIAN_POINT('',(0.0655,0.0173205080756888,0.00800000000000002));
#1095=CARTESIAN_POINT('',(0.0555,0.,0.00800000000000002));
#1096=CARTESIAN_POINT('',(0.0655,0.434,0.008));
#1097=CARTESIAN_POINT('',(0.0655,0.429,0.00800000000000002));
#1098=CARTESIAN_POINT('',(0.0705,0.429,0.008));
#1099=CARTESIAN_POINT('',(0.0345,0.429,0.00800000000000002));
#1100=CARTESIAN_POINT('',(0.0345,0.434,0.008));
#1101=CARTESIAN_POINT('',(0.0345,0.0173205080756887,0.008));
#1102=CARTESIAN_POINT('',(-0.136927512621223,0.314241669750802,0.008));
#1103=CARTESIAN_POINT('',(0.0445,0.,0.00800000000000002));
#1104=CARTESIAN_POINT('',(0.0705,0.,0.008));
#1105=CARTESIAN_POINT('',(0.0705,0.434,0.008));
#1106=CARTESIAN_POINT('',(-0.211927512621223,0.27094039956158,0.008));
#1107=CARTESIAN_POINT('',(-0.0555,0.,0.00800000000000002));
#1108=CARTESIAN_POINT('',(-0.0655,0.0173205080756887,0.008));
#1109=CARTESIAN_POINT('',(0.0705,0.,0.008));
#1110=CARTESIAN_POINT('',(-0.0445,0.,0.00800000000000002));
#1111=CARTESIAN_POINT('',(0.172177512621223,0.375296460717605,0.008));
#1112=CARTESIAN_POINT('',(-0.0345,0.0173205080756887,0.00800000000000002));
#1113=CARTESIAN_POINT('',(-0.0345,0.434,0.008));
#1114=CARTESIAN_POINT('',(-0.0345,0.429,0.00800000000000002));
#1115=CARTESIAN_POINT('',(0.0705,0.429,0.008));
#1116=CARTESIAN_POINT('',(-0.0655,0.429,0.00800000000000002));
#1117=CARTESIAN_POINT('',(-0.0655,0.434,0.008));
#1118=CARTESIAN_POINT('',(0.0705,0.,-0.008));
#1119=CARTESIAN_POINT('',(0.05925,0.00649519052838329,-0.008));
#1120=CARTESIAN_POINT('',(0.0555,0.,-0.00800000000000002));
#1121=CARTESIAN_POINT('',(0.0655,0.0173205080756887,-0.008));
#1122=CARTESIAN_POINT('',(0.0705,0.,-0.008));
#1123=CARTESIAN_POINT('',(0.0445,0.,-0.00800000000000002));
#1124=CARTESIAN_POINT('',(0.051,-0.0112583302491977,-0.008));
#1125=CARTESIAN_POINT('',(0.0345,0.0173205080756888,-0.00800000000000002));
#1126=CARTESIAN_POINT('',(0.0345,0.,-0.008));
#1127=CARTESIAN_POINT('',(0.0345,0.429,-0.00800000000000002));
#1128=CARTESIAN_POINT('',(0.0705,0.429,-0.008));
#1129=CARTESIAN_POINT('',(0.0655,0.429,-0.00800000000000002));
#1130=CARTESIAN_POINT('',(0.0655,0.,-0.008));
#1131=CARTESIAN_POINT('',(0.0705,0.,-0.008));
#1132=CARTESIAN_POINT('',(-0.024,-0.0545596004384196,-0.008));
#1133=CARTESIAN_POINT('',(-0.0655,0.0173205080756888,-0.00800000000000002));
#1134=CARTESIAN_POINT('',(-0.0555,0.,-0.00800000000000002));
#1135=CARTESIAN_POINT('',(-0.0655,0.,-0.008));
#1136=CARTESIAN_POINT('',(-0.0655,0.429,-0.00800000000000002));
#1137=CARTESIAN_POINT('',(0.0705,0.429,-0.008));
#1138=CARTESIAN_POINT('',(-0.0345,0.429,-0.00800000000000002));
#1139=CARTESIAN_POINT('',(-0.0345,0.,-0.008));
#1140=CARTESIAN_POINT('',(-0.0345,0.0173205080756887,-0.008));
#1141=CARTESIAN_POINT('',(-0.01575,0.0497964607176052,-0.008));
#1142=CARTESIAN_POINT('',(-0.0445,0.,-0.00800000000000002));
#1143=CARTESIAN_POINT('',(0.0705,0.,-0.008));
#1144=CARTESIAN_POINT('',(0.0705,0.,0.008));
#1145=CARTESIAN_POINT('',(0.0555,0.,0.5));
#1146=CARTESIAN_POINT('',(0.0445,0.,0.5));
#1147=CARTESIAN_POINT('',(0.0705,0.,0.008));
#1148=CARTESIAN_POINT('',(-0.0555,0.,0.5));
#1149=CARTESIAN_POINT('',(-0.0445,0.,0.5));
#1150=CARTESIAN_POINT('',(-0.0655,-0.35,1.));
#1151=CARTESIAN_POINT('',(-0.0655,0.0173205080756887,1.));
#1152=CARTESIAN_POINT('',(-0.0655,0.429,1.));
#1153=CARTESIAN_POINT('',(0.0655,0.429,1.));
#1154=CARTESIAN_POINT('',(0.0655,0.0173205080756887,1.));
#1155=CARTESIAN_POINT('',(0.0655,0.429,1.));
#1156=CARTESIAN_POINT('',(0.0345,-0.35,1.));
#1157=CARTESIAN_POINT('',(0.0345,0.0173205080756887,1.));
#1158=CARTESIAN_POINT('',(0.0345,0.429,1.));
#1159=CARTESIAN_POINT('',(-0.0345,0.429,1.));
#1160=CARTESIAN_POINT('',(-0.0345,0.0173205080756887,1.));
#1161=CARTESIAN_POINT('',(-0.0345,0.429,1.));
#1162=CARTESIAN_POINT('',(0.0705,0.,0.));
#1163=CARTESIAN_POINT('',(0.0705,0.429,0.024));
#1164=CARTESIAN_POINT('',(0.0705,0.429,0.024));
#1165=CARTESIAN_POINT('',(0.0705,0.429,-0.024));
#1166=CARTESIAN_POINT('',(0.0705,0.434,-0.024));
#1167=CARTESIAN_POINT('',(0.0705,0.434,-0.024));
#1168=CARTESIAN_POINT('',(0.0705,0.434,-0.008));
#1169=CARTESIAN_POINT('',(0.0705,0.434,0.024));
#1170=CARTESIAN_POINT('',(0.0705,0.434,0.024));
#1171=CARTESIAN_POINT('',(-0.0705,0.,0.));
#1172=CARTESIAN_POINT('',(-0.0705,0.434,-0.024));
#1173=CARTESIAN_POINT('',(-0.0705,0.434,-0.024));
#1174=CARTESIAN_POINT('',(-0.0705,0.429,-0.024));
#1175=CARTESIAN_POINT('',(-0.0705,0.429,-0.024));
#1176=CARTESIAN_POINT('',(-0.0705,0.429,0.024));
#1177=CARTESIAN_POINT('',(-0.0705,0.434,0.024));
#1178=CARTESIAN_POINT('',(-0.0705,0.434,0.024));
#1179=CARTESIAN_POINT('',(-0.0705,0.434,-0.008));
#1180=CARTESIAN_POINT('',(0.0705,0.434,-0.008));
#1181=CARTESIAN_POINT('',(-0.0705,0.434,0.024));
#1182=CARTESIAN_POINT('',(0.0705,0.434,-0.024));
#1183=CARTESIAN_POINT('',(0.0705,0.434,-0.024));
#1184=CARTESIAN_POINT('',(0.0705,0.429,-0.024));
#1185=CARTESIAN_POINT('',(0.,0.429,0.));
#1186=CARTESIAN_POINT('',(-0.0705,0.429,0.024));
#1187=CARTESIAN_POINT('',(-0.0705,0.434,0.024));
#1188=CARTESIAN_POINT('',(-0.0345,0.0173205080756888,0.5));
#1189=CARTESIAN_POINT('',(0.0445,0.,0.5));
#1190=CARTESIAN_POINT('',(0.0655,0.0173205080756888,0.5));
#1191=CARTESIAN_POINT('',(-0.0555,0.,0.5));
#1192=CARTESIAN_POINT('',(0.,-0.394,-4.82510838864057E-17));
#1193=CARTESIAN_POINT('',(0.11,0.335,-0.0475));
#1194=CARTESIAN_POINT('',(0.0900000000000001,0.335,-0.0475));
#1195=CARTESIAN_POINT('',(0.09,0.02,-0.0475));
#1196=CARTESIAN_POINT('',(0.09,0.,-0.0475));
#1197=CARTESIAN_POINT('',(0.11,0.02,-0.0475));
#1198=CARTESIAN_POINT('',(0.01,0.02,-0.0475));
#1199=CARTESIAN_POINT('',(0.01,0.335,-0.0475));
#1200=CARTESIAN_POINT('',(0.01,0.,-0.0475));
#1201=CARTESIAN_POINT('',(0.11,0.,-0.0475));
#1202=CARTESIAN_POINT('',(-0.01,0.,-0.0475));
#1203=CARTESIAN_POINT('',(-0.01,0.335,-0.0475));
#1204=CARTESIAN_POINT('',(-0.01,0.02,-0.0475));
#1205=CARTESIAN_POINT('',(0.11,0.02,-0.0475));
#1206=CARTESIAN_POINT('',(-0.09,0.02,-0.0475));
#1207=CARTESIAN_POINT('',(-0.09,0.335,-0.0475));
#1208=CARTESIAN_POINT('',(-0.09,0.,-0.0475));
#1209=CARTESIAN_POINT('',(0.11,0.,-0.0475));
#1210=CARTESIAN_POINT('',(-0.11,0.,-0.0475));
#1211=CARTESIAN_POINT('',(-0.11,0.335,-0.0475));
#1212=CARTESIAN_POINT('',(-0.11,0.335,-0.0475));
#1213=CARTESIAN_POINT('',(0.11,0.335,-0.0475));
#1214=CARTESIAN_POINT('',(0.11,0.335,-0.0475));
#1215=CARTESIAN_POINT('',(0.11,0.335,-0.0475));
#1216=CARTESIAN_POINT('',(0.11,0.,-0.0475));
#1217=CARTESIAN_POINT('',(0.11,0.,-0.0475));
#1218=CARTESIAN_POINT('',(-0.11,0.335,0.0475));
#1219=CARTESIAN_POINT('',(0.0900000000000001,0.335,0.0475));
#1220=CARTESIAN_POINT('',(0.09,0.,0.0475));
#1221=CARTESIAN_POINT('',(0.09,0.02,0.0475));
#1222=CARTESIAN_POINT('',(-0.11,0.,0.0475));
#1223=CARTESIAN_POINT('',(0.11,0.,0.0475));
#1224=CARTESIAN_POINT('',(0.11,0.335,0.0475));
#1225=CARTESIAN_POINT('',(0.11,0.335,0.0475));
#1226=CARTESIAN_POINT('',(-0.11,0.335,0.0475));
#1227=CARTESIAN_POINT('',(-0.11,0.335,0.0475));
#1228=CARTESIAN_POINT('',(-0.11,0.335,0.0475));
#1229=CARTESIAN_POINT('',(-0.11,0.,0.0475));
#1230=CARTESIAN_POINT('',(-0.11,0.,0.0475));
#1231=CARTESIAN_POINT('',(-0.09,0.,0.0475));
#1232=CARTESIAN_POINT('',(-0.09,0.335,0.0475));
#1233=CARTESIAN_POINT('',(-0.09,0.02,0.0475));
#1234=CARTESIAN_POINT('',(-0.11,0.02,0.0475));
#1235=CARTESIAN_POINT('',(-0.01,0.02,0.0475));
#1236=CARTESIAN_POINT('',(-0.01,0.335,0.0475));
#1237=CARTESIAN_POINT('',(-0.01,0.,0.0475));
#1238=CARTESIAN_POINT('',(-0.11,0.,0.0475));
#1239=CARTESIAN_POINT('',(0.01,0.,0.0475));
#1240=CARTESIAN_POINT('',(0.01,0.335,0.0475));
#1241=CARTESIAN_POINT('',(0.01,0.02,0.0475));
#1242=CARTESIAN_POINT('',(-0.11,0.02,0.0475));
#1243=CARTESIAN_POINT('',(0.0655,0.335,-0.0155));
#1244=CARTESIAN_POINT('',(0.0345,0.335,-0.0155));
#1245=CARTESIAN_POINT('',(0.0345,0.335,-0.0155));
#1246=CARTESIAN_POINT('',(0.0345,0.02,-0.0155));
#1247=CARTESIAN_POINT('',(0.0655,0.02,-0.0155));
#1248=CARTESIAN_POINT('',(0.0655,0.02,-0.0155));
#1249=CARTESIAN_POINT('',(0.0655,0.335,-0.0155));
#1250=CARTESIAN_POINT('',(0.0655,0.335,-0.0155));
#1251=CARTESIAN_POINT('',(0.0655,0.335,-0.0155));
#1252=CARTESIAN_POINT('',(0.0655,0.335,0.0155));
#1253=CARTESIAN_POINT('',(0.0655,0.02,0.0155));
#1254=CARTESIAN_POINT('',(0.0655,0.02,0.0155));
#1255=CARTESIAN_POINT('',(0.0655,0.335,0.0155));
#1256=CARTESIAN_POINT('',(0.0655,0.335,0.0155));
#1257=CARTESIAN_POINT('',(0.0655,0.335,0.0155));
#1258=CARTESIAN_POINT('',(0.0345,0.335,0.0155));
#1259=CARTESIAN_POINT('',(0.0345,0.02,0.0155));
#1260=CARTESIAN_POINT('',(0.0345,0.02,0.0155));
#1261=CARTESIAN_POINT('',(0.0345,0.335,0.0155));
#1262=CARTESIAN_POINT('',(0.0345,0.335,0.0155));
#1263=CARTESIAN_POINT('',(0.0345,0.335,0.0155));
#1264=CARTESIAN_POINT('',(-0.0345,0.335,-0.0155));
#1265=CARTESIAN_POINT('',(-0.0655,0.335,-0.0155));
#1266=CARTESIAN_POINT('',(-0.0655,0.335,-0.0155));
#1267=CARTESIAN_POINT('',(-0.0655,0.02,-0.0155));
#1268=CARTESIAN_POINT('',(-0.0345,0.02,-0.0155));
#1269=CARTESIAN_POINT('',(-0.0345,0.02,-0.0155));
#1270=CARTESIAN_POINT('',(-0.0345,0.335,-0.0155));
#1271=CARTESIAN_POINT('',(-0.0345,0.335,-0.0155));
#1272=CARTESIAN_POINT('',(-0.0345,0.335,-0.0155));
#1273=CARTESIAN_POINT('',(-0.0345,0.335,0.0155));
#1274=CARTESIAN_POINT('',(-0.0345,0.02,0.0155));
#1275=CARTESIAN_POINT('',(-0.0345,0.02,0.0155));
#1276=CARTESIAN_POINT('',(-0.0345,0.335,0.0155));
#1277=CARTESIAN_POINT('',(-0.0345,0.335,0.0155));
#1278=CARTESIAN_POINT('',(-0.0345,0.335,0.0155));
#1279=CARTESIAN_POINT('',(-0.0655,0.335,0.0155));
#1280=CARTESIAN_POINT('',(-0.0655,0.02,0.0155));
#1281=CARTESIAN_POINT('',(-0.0655,0.02,0.0155));
#1282=CARTESIAN_POINT('',(-0.0655,0.335,0.0155));
#1283=CARTESIAN_POINT('',(-0.0655,0.335,0.0155));
#1284=CARTESIAN_POINT('',(-0.0655,0.335,0.0155));
#1285=CARTESIAN_POINT('',(0.0345,0.335,-0.0155));
#1286=CARTESIAN_POINT('',(0.0345,0.02,-0.0155));
#1287=CARTESIAN_POINT('',(0.0345,0.335,-0.0155));
#1288=CARTESIAN_POINT('',(-0.0655,0.335,-0.0155));
#1289=CARTESIAN_POINT('',(-0.0655,0.02,-0.0155));
#1290=CARTESIAN_POINT('',(-0.0655,0.335,-0.0155));
#1291=CARTESIAN_POINT('',(0.,0.,0.));
#1292=CARTESIAN_POINT('',(-0.09,0.,0.));
#1293=CARTESIAN_POINT('',(-0.11,0.,-0.0475));
#1294=CARTESIAN_POINT('',(0.,0.,0.));
#1295=CARTESIAN_POINT('',(0.09,0.,0.));
#1296=CARTESIAN_POINT('',(0.11,0.,0.0475));
#1297=CARTESIAN_POINT('',(0.,0.,0.));
#1298=CARTESIAN_POINT('',(0.01,0.,0.));
#1299=CARTESIAN_POINT('',(-0.01,0.,0.));
#1300=CARTESIAN_POINT('',(-0.11,0.335,-0.0475));
#1301=CARTESIAN_POINT('',(-0.11,0.335,-0.0475));
#1302=CARTESIAN_POINT('',(0.11,0.335,0.0475));
#1303=CARTESIAN_POINT('',(0.11,0.335,0.0475));
#1304=CARTESIAN_POINT('',(0.,0.335,0.));
#1305=CARTESIAN_POINT('',(-0.01,-0.05,0.2));
#1306=CARTESIAN_POINT('',(-0.01,0.02,0.2));
#1307=CARTESIAN_POINT('',(-0.09,0.02,0.2));
#1308=CARTESIAN_POINT('',(-0.09,0.02,0.2));
#1309=CARTESIAN_POINT('',(-0.01,0.02,0.2));
#1310=CARTESIAN_POINT('',(0.09,0.02,0.2));
#1311=CARTESIAN_POINT('',(0.09,0.02,0.2));
#1312=CARTESIAN_POINT('',(0.01,0.02,0.2));
#1313=CARTESIAN_POINT('',(0.09,-0.08,0.2));
#1314=CARTESIAN_POINT('',(0.01,0.02,0.2));
#1315=CARTESIAN_POINT('',(0.,0.,0.));
#1316=MECHANICAL_DESIGN_GEOMETRIC_PRESENTATION_REPRESENTATION('',(#825,
#826),#1317);
#1317=(
GEOMETRIC_REPRESENTATION_CONTEXT(3)
GLOBAL_UNCERTAINTY_ASSIGNED_CONTEXT((#1320))
GLOBAL_UNIT_ASSIGNED_CONTEXT((#1325,#1324,#1323))
REPRESENTATION_CONTEXT('SSW-102-03-G-S','TOP_LEVEL_ASSEMBLY_PART')
);
#1318=(
GEOMETRIC_REPRESENTATION_CONTEXT(3)
GLOBAL_UNCERTAINTY_ASSIGNED_CONTEXT((#1321))
GLOBAL_UNIT_ASSIGNED_CONTEXT((#1325,#1324,#1323))
REPRESENTATION_CONTEXT('P2SSW-102-03-G-S','COMPONENT_PART')
);
#1319=(
GEOMETRIC_REPRESENTATION_CONTEXT(3)
GLOBAL_UNCERTAINTY_ASSIGNED_CONTEXT((#1322))
GLOBAL_UNIT_ASSIGNED_CONTEXT((#1325,#1324,#1323))
REPRESENTATION_CONTEXT('T1SSW-102-03-G-S','COMPONENT_PART')
);
#1320=UNCERTAINTY_MEASURE_WITH_UNIT(LENGTH_MEASURE(0.000196850393700787),
#1325,'DISTANCE_ACCURACY_VALUE','Maximum Tolerance applied to model');
#1321=UNCERTAINTY_MEASURE_WITH_UNIT(LENGTH_MEASURE(0.000196850393700787),
#1325,'DISTANCE_ACCURACY_VALUE','Maximum Tolerance applied to model');
#1322=UNCERTAINTY_MEASURE_WITH_UNIT(LENGTH_MEASURE(0.000196850393700787),
#1325,'DISTANCE_ACCURACY_VALUE','Maximum Tolerance applied to model');
#1323=(
NAMED_UNIT(*)
SI_UNIT($,.STERADIAN.)
SOLID_ANGLE_UNIT()
);
#1324=(
NAMED_UNIT(*)
PLANE_ANGLE_UNIT()
SI_UNIT($,.RADIAN.)
);
#1325=(
CONVERSION_BASED_UNIT('INCH',#1327)
LENGTH_UNIT()
NAMED_UNIT(#1326)
);
#1326=DIMENSIONAL_EXPONENTS(1.,0.,0.,0.,0.,0.,0.);
#1327=LENGTH_MEASURE_WITH_UNIT(LENGTH_MEASURE(25.4),#1328);
#1328=(
LENGTH_UNIT()
NAMED_UNIT(*)
SI_UNIT(.MILLI.,.METRE.)
);
#1329=PRODUCT_DEFINITION_SHAPE('','',#1334);
#1330=PRODUCT_DEFINITION_SHAPE('','',#1335);
#1331=PRODUCT_DEFINITION_SHAPE(' ','NAUO PRDDFN',#21);
#1332=PRODUCT_DEFINITION_SHAPE('','',#1336);
#1333=PRODUCT_DEFINITION_SHAPE(' ','NAUO PRDDFN',#22);
#1334=PRODUCT_DEFINITION('','',#1340,#1337);
#1335=PRODUCT_DEFINITION('','',#1341,#1338);
#1336=PRODUCT_DEFINITION('','',#1342,#1339);
#1337=PRODUCT_DEFINITION_CONTEXT('',#1356,'design');
#1338=PRODUCT_DEFINITION_CONTEXT('',#1356,'design');
#1339=PRODUCT_DEFINITION_CONTEXT('',#1356,'design');
#1340=PRODUCT_DEFINITION_FORMATION_WITH_SPECIFIED_SOURCE('','',#1346,
 .NOT_KNOWN.);
#1341=PRODUCT_DEFINITION_FORMATION_WITH_SPECIFIED_SOURCE('','',#1347,
 .NOT_KNOWN.);
#1342=PRODUCT_DEFINITION_FORMATION_WITH_SPECIFIED_SOURCE('','',#1348,
 .NOT_KNOWN.);
#1343=PRODUCT_RELATED_PRODUCT_CATEGORY('','',(#1346));
#1344=PRODUCT_RELATED_PRODUCT_CATEGORY('','',(#1347));
#1345=PRODUCT_RELATED_PRODUCT_CATEGORY('','',(#1348));
#1346=PRODUCT('SSW-102-03-G-S','SSW-102-03-G-S','SSW-102-03-G-S',(#1352));
#1347=PRODUCT('P2SSW-102-03-G-S','P2SSW-102-03-G-S','P2SSW-102-03-G-S',
(#1353));
#1348=PRODUCT('T1SSW-102-03-G-S','T1SSW-102-03-G-S','T1SSW-102-03-G-S',
(#1354));
#1349=PRODUCT_CATEGORY('','');
#1350=PRODUCT_CATEGORY('','');
#1351=PRODUCT_CATEGORY('','');
#1352=PRODUCT_CONTEXT('',#1356,'mechanical');
#1353=PRODUCT_CONTEXT('',#1356,'mechanical');
#1354=PRODUCT_CONTEXT('',#1356,'mechanical');
#1355=APPLICATION_PROTOCOL_DEFINITION('international standard',
'automotive_design',2010,#1356);
#1356=APPLICATION_CONTEXT(
'core data for automotive mechanical design processes');
ENDSEC;
END-ISO-10303-21;
