(footprint "SSW-102-XX-YYY-S" (version 20211014) (generator pcbnew)
  (layer "F.Cu")
  (tedit 0)
  (descr "SSW-102-XX-YYY-S")
  (tags "Connector")
  (attr through_hole)
  (fp_text reference "J**" (at 0 0) (layer "F.SilkS")
    (effects (font (size 1.27 1.27) (thickness 0.254)))
    (tstamp ce9d88c0-e46c-4bbd-8931-d91fa5f2d3b5)
  )
  (fp_text value "SSW-102-XX-YYY-S" (at 0 0) (layer "F.SilkS") hide
    (effects (font (size 1.27 1.27) (thickness 0.254)))
    (tstamp 6bdb8174-e30f-4cdb-9c5d-d26722801f97)
  )
  (fp_text user "${REFERENCE}" (at 0 0) (layer "F.Fab")
    (effects (font (size 1.27 1.27) (thickness 0.254)))
    (tstamp f49241e4-c513-4c3a-b8ab-2343ae67591e)
  )
  (fp_line (start -1.525 -1.205) (end 4.065 -1.205) (layer "F.SilkS") (width 0.1) (tstamp 1708e9e2-ecb0-4f0f-89b3-d2e2be42bd11))
  (fp_line (start -1.525 1.205) (end -1.525 -1.205) (layer "F.SilkS") (width 0.1) (tstamp 3ec726dd-24c9-4d2b-ae39-a2d36c2909a7))
  (fp_line (start 4.065 1.205) (end -1.525 1.205) (layer "F.SilkS") (width 0.1) (tstamp 6e01474c-e506-4bc3-98c8-ab99e39eb4bb))
  (fp_line (start 4.065 -1.205) (end 4.065 1.205) (layer "F.SilkS") (width 0.1) (tstamp ed44913e-63bb-4397-9998-8f936a01e8d0))
  (fp_circle (center 0.05 1.65) (end 0.05 1.7) (layer "F.SilkS") (width 0.2) (fill none) (tstamp 02fef05f-4fb8-4d10-9f8a-4990009240f1))
  (fp_line (start 5.265 2.75) (end -2.725 2.75) (layer "F.CrtYd") (width 0.05) (tstamp bf74b572-5110-489f-94e3-1d8aa6ee71bd))
  (fp_line (start 5.265 -2.405) (end 5.265 2.75) (layer "F.CrtYd") (width 0.05) (tstamp c27f3e6e-cc0f-4961-90d8-0fe9bb3fb1c5))
  (fp_line (start -2.725 2.75) (end -2.725 -2.405) (layer "F.CrtYd") (width 0.05) (tstamp d2e8cd4e-1aa5-4a20-ae0e-fdd5ccafa33c))
  (fp_line (start -2.725 -2.405) (end 5.265 -2.405) (layer "F.CrtYd") (width 0.05) (tstamp d3825920-dce2-43a1-bd21-78a9d9ad1858))
  (fp_line (start 4.065 1.205) (end -1.525 1.205) (layer "F.Fab") (width 0.2) (tstamp 1addca4a-0391-4fe3-a856-c12a84185216))
  (fp_line (start -1.525 1.205) (end -1.525 -1.205) (layer "F.Fab") (width 0.2) (tstamp 407df91c-4ba9-4f0f-be3c-24f5c5d1f365))
  (fp_line (start -1.525 -1.205) (end 4.065 -1.205) (layer "F.Fab") (width 0.2) (tstamp 4efd2ef0-a427-4fcb-b99c-beaa850dff3b))
  (fp_line (start 4.065 -1.205) (end 4.065 1.205) (layer "F.Fab") (width 0.2) (tstamp a53b8ec9-9302-4483-ac87-1471f76c5cdd))
  (pad "1" thru_hole circle (at 0 0) (size 1.57 1.57) (drill 1.04) (layers *.Cu *.Mask) (tstamp 744f85bf-5b3e-4124-afc0-f4e1f9e9cac4))
  (pad "2" thru_hole circle (at 2.54 0) (size 1.57 1.57) (drill 1.04) (layers *.Cu *.Mask) (tstamp b3c663b6-1744-42cd-bc41-6fab6d3f7fb9))
  (model "${KIPRJMOD}/3D/SSW-102-03-G-S.stp"
    (offset (xyz 1.25 0 0))
    (scale (xyz 1 1 1))
    (rotate (xyz -90 0 0))
  )
)
