(kicad_symbol_lib (version 20211014) (generator kicad_symbol_editor)
  (symbol "DF57H-3P-1.2V_21_" (pin_names (offset 0.762)) (in_bom yes) (on_board yes)
    (property "Reference" "J" (id 0) (at 19.05 7.62 0)
      (effects (font (size 1.27 1.27)) (justify left))
    )
    (property "Value" "DF57H-3P-1.2V_21_" (id 1) (at 19.05 5.08 0)
      (effects (font (size 1.27 1.27)) (justify left))
    )
    (property "Footprint" "DF57H3P12V21" (id 2) (at 19.05 2.54 0)
      (effects (font (size 1.27 1.27)) (justify left) hide)
    )
    (property "Datasheet" "https://datasheet.datasheetarchive.com/originals/distributors/Datasheets-DGA21/2082773.pdf" (id 3) (at 19.05 0 0)
      (effects (font (size 1.27 1.27)) (justify left) hide)
    )
    (property "Description" "HIROSE(HRS) - DF57H-3P-1.2V(21) - CONNECTOR, HEADER, 3POS, 1ROW, 1.2MM" (id 4) (at 19.05 -2.54 0)
      (effects (font (size 1.27 1.27)) (justify left) hide)
    )
    (property "Height" "1.55" (id 5) (at 19.05 -5.08 0)
      (effects (font (size 1.27 1.27)) (justify left) hide)
    )
    (property "Mouser Part Number" "798-DF57H-3P-1.2V21" (id 6) (at 19.05 -7.62 0)
      (effects (font (size 1.27 1.27)) (justify left) hide)
    )
    (property "Mouser Price/Stock" "https://www.mouser.co.uk/ProductDetail/Hirose-Connector/DF57H-3P-12V21?qs=Gufeu08L%2Fl2PQI%252ByibwXvg%3D%3D" (id 7) (at 19.05 -10.16 0)
      (effects (font (size 1.27 1.27)) (justify left) hide)
    )
    (property "Manufacturer_Name" "Hirose" (id 8) (at 19.05 -12.7 0)
      (effects (font (size 1.27 1.27)) (justify left) hide)
    )
    (property "Manufacturer_Part_Number" "DF57H-3P-1.2V(21)" (id 9) (at 19.05 -15.24 0)
      (effects (font (size 1.27 1.27)) (justify left) hide)
    )
    (property "ki_description" "HIROSE(HRS) - DF57H-3P-1.2V(21) - CONNECTOR, HEADER, 3POS, 1ROW, 1.2MM" (id 10) (at 0 0 0)
      (effects (font (size 1.27 1.27)) hide)
    )
    (symbol "DF57H-3P-1.2V_21__0_0"
      (pin passive line (at 22.86 0 180) (length 5.08)
        (name "1" (effects (font (size 1.27 1.27))))
        (number "1" (effects (font (size 1.27 1.27))))
      )
      (pin passive line (at 22.86 -2.54 180) (length 5.08)
        (name "2" (effects (font (size 1.27 1.27))))
        (number "2" (effects (font (size 1.27 1.27))))
      )
      (pin passive line (at 22.86 -5.08 180) (length 5.08)
        (name "3" (effects (font (size 1.27 1.27))))
        (number "3" (effects (font (size 1.27 1.27))))
      )
      (pin passive line (at 0 0 0) (length 5.08)
        (name "MP1" (effects (font (size 1.27 1.27))))
        (number "MP1" (effects (font (size 1.27 1.27))))
      )
      (pin passive line (at 0 -2.54 0) (length 5.08)
        (name "MP2" (effects (font (size 1.27 1.27))))
        (number "MP2" (effects (font (size 1.27 1.27))))
      )
    )
    (symbol "DF57H-3P-1.2V_21__0_1"
      (polyline
        (pts
          (xy 5.08 2.54)
          (xy 17.78 2.54)
          (xy 17.78 -7.62)
          (xy 5.08 -7.62)
          (xy 5.08 2.54)
        )
        (stroke (width 0.1524) (type default) (color 0 0 0 0))
        (fill (type none))
      )
    )
  )
  (symbol "HMTSW-108-08-F-D-295" (pin_names (offset 0.762)) (in_bom yes) (on_board yes)
    (property "Reference" "J" (id 0) (at 19.05 7.62 0)
      (effects (font (size 1.27 1.27)) (justify left))
    )
    (property "Value" "HMTSW-108-08-F-D-295" (id 1) (at 19.05 5.08 0)
      (effects (font (size 1.27 1.27)) (justify left))
    )
    (property "Footprint" "HDRV16W64P254_2X8_2032X502X1117P" (id 2) (at 19.05 2.54 0)
      (effects (font (size 1.27 1.27)) (justify left) hide)
    )
    (property "Datasheet" "" (id 3) (at 19.05 0 0)
      (effects (font (size 1.27 1.27)) (justify left) hide)
    )
    (property "Description" "Board to Board & Mezzanine Connectors .100\" High-Temp Variable Post Height Terminal Strip" (id 4) (at 19.05 -2.54 0)
      (effects (font (size 1.27 1.27)) (justify left) hide)
    )
    (property "Height" "11.17" (id 5) (at 19.05 -5.08 0)
      (effects (font (size 1.27 1.27)) (justify left) hide)
    )
    (property "Mouser Part Number" "200-HMTSW10808FD295" (id 6) (at 19.05 -7.62 0)
      (effects (font (size 1.27 1.27)) (justify left) hide)
    )
    (property "Mouser Price/Stock" "https://www.mouser.co.uk/ProductDetail/Samtec/HMTSW-108-08-F-D-295?qs=PB6%2FjmICvI2Y04a7hUz40A%3D%3D" (id 7) (at 19.05 -10.16 0)
      (effects (font (size 1.27 1.27)) (justify left) hide)
    )
    (property "Manufacturer_Name" "SAMTEC" (id 8) (at 19.05 -12.7 0)
      (effects (font (size 1.27 1.27)) (justify left) hide)
    )
    (property "Manufacturer_Part_Number" "HMTSW-108-08-F-D-295" (id 9) (at 19.05 -15.24 0)
      (effects (font (size 1.27 1.27)) (justify left) hide)
    )
    (property "ki_description" "Board to Board & Mezzanine Connectors .100\" High-Temp Variable Post Height Terminal Strip" (id 10) (at 0 0 0)
      (effects (font (size 1.27 1.27)) hide)
    )
    (symbol "HMTSW-108-08-F-D-295_0_0"
      (pin passive line (at 0 0 0) (length 5.08)
        (name "1" (effects (font (size 1.27 1.27))))
        (number "1" (effects (font (size 1.27 1.27))))
      )
      (pin passive line (at 22.86 -10.16 180) (length 5.08)
        (name "10" (effects (font (size 1.27 1.27))))
        (number "10" (effects (font (size 1.27 1.27))))
      )
      (pin passive line (at 0 -12.7 0) (length 5.08)
        (name "11" (effects (font (size 1.27 1.27))))
        (number "11" (effects (font (size 1.27 1.27))))
      )
      (pin passive line (at 22.86 -12.7 180) (length 5.08)
        (name "12" (effects (font (size 1.27 1.27))))
        (number "12" (effects (font (size 1.27 1.27))))
      )
      (pin passive line (at 0 -15.24 0) (length 5.08)
        (name "13" (effects (font (size 1.27 1.27))))
        (number "13" (effects (font (size 1.27 1.27))))
      )
      (pin passive line (at 22.86 -15.24 180) (length 5.08)
        (name "14" (effects (font (size 1.27 1.27))))
        (number "14" (effects (font (size 1.27 1.27))))
      )
      (pin passive line (at 0 -17.78 0) (length 5.08)
        (name "15" (effects (font (size 1.27 1.27))))
        (number "15" (effects (font (size 1.27 1.27))))
      )
      (pin passive line (at 22.86 -17.78 180) (length 5.08)
        (name "16" (effects (font (size 1.27 1.27))))
        (number "16" (effects (font (size 1.27 1.27))))
      )
      (pin passive line (at 22.86 0 180) (length 5.08)
        (name "2" (effects (font (size 1.27 1.27))))
        (number "2" (effects (font (size 1.27 1.27))))
      )
      (pin passive line (at 0 -2.54 0) (length 5.08)
        (name "3" (effects (font (size 1.27 1.27))))
        (number "3" (effects (font (size 1.27 1.27))))
      )
      (pin passive line (at 22.86 -2.54 180) (length 5.08)
        (name "4" (effects (font (size 1.27 1.27))))
        (number "4" (effects (font (size 1.27 1.27))))
      )
      (pin passive line (at 0 -5.08 0) (length 5.08)
        (name "5" (effects (font (size 1.27 1.27))))
        (number "5" (effects (font (size 1.27 1.27))))
      )
      (pin passive line (at 22.86 -5.08 180) (length 5.08)
        (name "6" (effects (font (size 1.27 1.27))))
        (number "6" (effects (font (size 1.27 1.27))))
      )
      (pin passive line (at 0 -7.62 0) (length 5.08)
        (name "7" (effects (font (size 1.27 1.27))))
        (number "7" (effects (font (size 1.27 1.27))))
      )
      (pin passive line (at 22.86 -7.62 180) (length 5.08)
        (name "8" (effects (font (size 1.27 1.27))))
        (number "8" (effects (font (size 1.27 1.27))))
      )
      (pin passive line (at 0 -10.16 0) (length 5.08)
        (name "9" (effects (font (size 1.27 1.27))))
        (number "9" (effects (font (size 1.27 1.27))))
      )
    )
    (symbol "HMTSW-108-08-F-D-295_0_1"
      (polyline
        (pts
          (xy 5.08 2.54)
          (xy 17.78 2.54)
          (xy 17.78 -20.32)
          (xy 5.08 -20.32)
          (xy 5.08 2.54)
        )
        (stroke (width 0.1524) (type default) (color 0 0 0 0))
        (fill (type none))
      )
    )
  )
  (symbol "M80-8870805" (pin_names (offset 0.762)) (in_bom yes) (on_board yes)
    (property "Reference" "J" (id 0) (at 16.51 7.62 0)
      (effects (font (size 1.27 1.27)) (justify left))
    )
    (property "Value" "M80-8870805" (id 1) (at 16.51 5.08 0)
      (effects (font (size 1.27 1.27)) (justify left))
    )
    (property "Footprint" "M80-88708YY" (id 2) (at 16.51 2.54 0)
      (effects (font (size 1.27 1.27)) (justify left) hide)
    )
    (property "Datasheet" "https://cdn.harwin.com/pdfs/M80-541.pdf" (id 3) (at 16.51 0 0)
      (effects (font (size 1.27 1.27)) (justify left) hide)
    )
    (property "Description" "8 Pos. Male DIL Horizontal Throughboard Conn. Jackscrews, 2.00mm Pitch High-Reliability Connector - Datamate J-Tek" (id 4) (at 16.51 -2.54 0)
      (effects (font (size 1.27 1.27)) (justify left) hide)
    )
    (property "Height" "6.05" (id 5) (at 16.51 -5.08 0)
      (effects (font (size 1.27 1.27)) (justify left) hide)
    )
    (property "Mouser Part Number" "855-M80-8870805" (id 6) (at 16.51 -7.62 0)
      (effects (font (size 1.27 1.27)) (justify left) hide)
    )
    (property "Mouser Price/Stock" "https://www.mouser.co.uk/ProductDetail/Harwin/M80-8870805?qs=SevrRHiFoLhttX1H%2FGWiUA%3D%3D" (id 7) (at 16.51 -10.16 0)
      (effects (font (size 1.27 1.27)) (justify left) hide)
    )
    (property "Manufacturer_Name" "Harwin" (id 8) (at 16.51 -12.7 0)
      (effects (font (size 1.27 1.27)) (justify left) hide)
    )
    (property "Manufacturer_Part_Number" "M80-8870805" (id 9) (at 16.51 -15.24 0)
      (effects (font (size 1.27 1.27)) (justify left) hide)
    )
    (property "ki_description" "8 Pos. Male DIL Horizontal Throughboard Conn. Jackscrews, 2.00mm Pitch High-Reliability Connector - Datamate J-Tek" (id 10) (at 0 0 0)
      (effects (font (size 1.27 1.27)) hide)
    )
    (symbol "M80-8870805_0_0"
      (pin passive line (at 0 -7.62 0) (length 5.08)
        (name "1" (effects (font (size 1.27 1.27))))
        (number "1" (effects (font (size 1.27 1.27))))
      )
      (pin passive line (at 0 -5.08 0) (length 5.08)
        (name "2" (effects (font (size 1.27 1.27))))
        (number "2" (effects (font (size 1.27 1.27))))
      )
      (pin passive line (at 0 -2.54 0) (length 5.08)
        (name "3" (effects (font (size 1.27 1.27))))
        (number "3" (effects (font (size 1.27 1.27))))
      )
      (pin passive line (at 0 0 0) (length 5.08)
        (name "4" (effects (font (size 1.27 1.27))))
        (number "4" (effects (font (size 1.27 1.27))))
      )
      (pin passive line (at 20.32 -7.62 180) (length 5.08)
        (name "5" (effects (font (size 1.27 1.27))))
        (number "5" (effects (font (size 1.27 1.27))))
      )
      (pin passive line (at 20.32 -5.08 180) (length 5.08)
        (name "6" (effects (font (size 1.27 1.27))))
        (number "6" (effects (font (size 1.27 1.27))))
      )
      (pin passive line (at 20.32 -2.54 180) (length 5.08)
        (name "7" (effects (font (size 1.27 1.27))))
        (number "7" (effects (font (size 1.27 1.27))))
      )
      (pin passive line (at 20.32 0 180) (length 5.08)
        (name "8" (effects (font (size 1.27 1.27))))
        (number "8" (effects (font (size 1.27 1.27))))
      )
    )
    (symbol "M80-8870805_0_1"
      (polyline
        (pts
          (xy 5.08 2.54)
          (xy 15.24 2.54)
          (xy 15.24 -10.16)
          (xy 5.08 -10.16)
          (xy 5.08 2.54)
        )
        (stroke (width 0.1524) (type default) (color 0 0 0 0))
        (fill (type none))
      )
    )
  )
  (symbol "SSW-102-03-G-S" (pin_names (offset 0.762)) (in_bom yes) (on_board yes)
    (property "Reference" "J" (id 0) (at 16.51 7.62 0)
      (effects (font (size 1.27 1.27)) (justify left))
    )
    (property "Value" "SSW-102-03-G-S" (id 1) (at 16.51 5.08 0)
      (effects (font (size 1.27 1.27)) (justify left))
    )
    (property "Footprint" "SSW-102-XX-YYY-S" (id 2) (at 16.51 2.54 0)
      (effects (font (size 1.27 1.27)) (justify left) hide)
    )
    (property "Datasheet" "http://suddendocs.samtec.com/prints/ssw-1xx-xx-xxx-x-xx-xxx-xx-mkt.pdf" (id 3) (at 16.51 0 0)
      (effects (font (size 1.27 1.27)) (justify left) hide)
    )
    (property "Description" "2 Position, .100&quot; Tiger Buy&trade; Socket Strip" (id 4) (at 16.51 -2.54 0)
      (effects (font (size 1.27 1.27)) (justify left) hide)
    )
    (property "Height" "" (id 5) (at 16.51 -5.08 0)
      (effects (font (size 1.27 1.27)) (justify left) hide)
    )
    (property "Mouser Part Number" "200-SSW10203GS" (id 6) (at 16.51 -7.62 0)
      (effects (font (size 1.27 1.27)) (justify left) hide)
    )
    (property "Mouser Price/Stock" "https://www.mouser.co.uk/ProductDetail/Samtec/SSW-102-03-G-S?qs=iT52DjcXudsR3hQqmQkgkQ%3D%3D" (id 7) (at 16.51 -10.16 0)
      (effects (font (size 1.27 1.27)) (justify left) hide)
    )
    (property "Manufacturer_Name" "SAMTEC" (id 8) (at 16.51 -12.7 0)
      (effects (font (size 1.27 1.27)) (justify left) hide)
    )
    (property "Manufacturer_Part_Number" "SSW-102-03-G-S" (id 9) (at 16.51 -15.24 0)
      (effects (font (size 1.27 1.27)) (justify left) hide)
    )
    (property "ki_description" "2 Position, .100&quot; Tiger Buy&trade; Socket Strip" (id 10) (at 0 0 0)
      (effects (font (size 1.27 1.27)) hide)
    )
    (symbol "SSW-102-03-G-S_0_0"
      (pin passive line (at 0 0 0) (length 5.08)
        (name "1" (effects (font (size 1.27 1.27))))
        (number "1" (effects (font (size 1.27 1.27))))
      )
      (pin passive line (at 0 -2.54 0) (length 5.08)
        (name "2" (effects (font (size 1.27 1.27))))
        (number "2" (effects (font (size 1.27 1.27))))
      )
    )
    (symbol "SSW-102-03-G-S_0_1"
      (polyline
        (pts
          (xy 5.08 2.54)
          (xy 15.24 2.54)
          (xy 15.24 -5.08)
          (xy 5.08 -5.08)
          (xy 5.08 2.54)
        )
        (stroke (width 0.1524) (type default) (color 0 0 0 0))
        (fill (type none))
      )
    )
  )
)
