(footprint "HDRV16W64P254_2X8_2032X502X1117P" (version 20211014) (generator pcbnew)
  (layer "F.Cu")
  (tedit 0)
  (descr "HMTSW-108-08-F-D-295")
  (tags "Connector")
  (attr through_hole)
  (fp_text reference "J**" (at 0 0) (layer "F.SilkS")
    (effects (font (size 1.27 1.27) (thickness 0.254)))
    (tstamp 7708751b-f1fc-4b5b-bfe2-e33a648263cb)
  )
  (fp_text value "HDRV16W64P254_2X8_2032X502X1117P" (at 0 0) (layer "F.SilkS") hide
    (effects (font (size 1.27 1.27) (thickness 0.254)))
    (tstamp 2706b976-ba58-4c7e-8189-883571ba2660)
  )
  (fp_text user "${REFERENCE}" (at 0 0) (layer "F.Fab")
    (effects (font (size 1.27 1.27) (thickness 0.254)))
    (tstamp d63ff3d1-a2ba-49e1-8c4e-7fc743d13630)
  )
  (fp_line (start -1.27 1.24) (end 19.05 1.24) (layer "F.SilkS") (width 0.2) (tstamp 08ac6023-cb5c-4349-a619-22faa2bb854d))
  (fp_line (start -1.27 0) (end -1.27 1.24) (layer "F.SilkS") (width 0.2) (tstamp 5acb0532-24a6-41c8-a443-bdf1698f0321))
  (fp_line (start 19.05 -3.78) (end 0 -3.78) (layer "F.SilkS") (width 0.2) (tstamp 679fff56-7d07-4ef4-ba8d-a7bfc332c139))
  (fp_line (start 19.05 1.24) (end 19.05 -3.78) (layer "F.SilkS") (width 0.2) (tstamp 931e122c-51e6-4624-ae6b-05b3bbec7412))
  (fp_line (start -1.52 1.49) (end -1.52 -4.03) (layer "F.CrtYd") (width 0.05) (tstamp 382b5d0c-6fe9-4d0e-95fd-4f3d6f5cb4ef))
  (fp_line (start -1.52 -4.03) (end 19.3 -4.03) (layer "F.CrtYd") (width 0.05) (tstamp 94a5cf68-84eb-4f77-a70c-32e283596007))
  (fp_line (start 19.3 -4.03) (end 19.3 1.49) (layer "F.CrtYd") (width 0.05) (tstamp 9a6fccb0-2616-446e-bdec-7b374de8d5d0))
  (fp_line (start 19.3 1.49) (end -1.52 1.49) (layer "F.CrtYd") (width 0.05) (tstamp f26cb59d-8347-4085-b752-9fcf783da672))
  (fp_line (start -1.27 1.24) (end -1.27 -3.78) (layer "F.Fab") (width 0.1) (tstamp 04fafa54-930e-4516-9047-a91b368b3187))
  (fp_line (start 19.05 -3.78) (end 19.05 1.24) (layer "F.Fab") (width 0.1) (tstamp 31e6e789-622a-4242-9b1e-0ec54477b4a3))
  (fp_line (start -1.27 -3.78) (end 19.05 -3.78) (layer "F.Fab") (width 0.1) (tstamp 6244630c-05de-4d59-85d8-bfbe006c6c02))
  (fp_line (start 19.05 1.24) (end -1.27 1.24) (layer "F.Fab") (width 0.1) (tstamp b57939af-d110-42a9-93f7-0cca137e2f1b))
  (pad "1" thru_hole rect (at 0 0) (size 1.65 1.65) (drill 1.1) (layers *.Cu *.Mask) (tstamp 6cade329-6a05-4128-8f71-b59922595f66))
  (pad "2" thru_hole circle (at 0 -2.54) (size 1.65 1.65) (drill 1.1) (layers *.Cu *.Mask) (tstamp dd93a78c-775e-42db-a166-f2e5b6dae3d9))
  (pad "3" thru_hole circle (at 2.54 0) (size 1.65 1.65) (drill 1.1) (layers *.Cu *.Mask) (tstamp 1262b83a-00ce-4c6c-9d66-1cee42b96656))
  (pad "4" thru_hole circle (at 2.54 -2.54) (size 1.65 1.65) (drill 1.1) (layers *.Cu *.Mask) (tstamp 0f6bca22-15b4-41a1-af4c-8af2004e3878))
  (pad "5" thru_hole circle (at 5.08 0) (size 1.65 1.65) (drill 1.1) (layers *.Cu *.Mask) (tstamp 453f991a-8ab3-4b02-b4dd-23a3f74ad85e))
  (pad "6" thru_hole circle (at 5.08 -2.54) (size 1.65 1.65) (drill 1.1) (layers *.Cu *.Mask) (tstamp 7a3a9348-b90f-4cee-b277-08997ed25723))
  (pad "7" thru_hole circle (at 7.62 0) (size 1.65 1.65) (drill 1.1) (layers *.Cu *.Mask) (tstamp e6ad5417-a6c2-498d-9b5d-5d90500c5fb3))
  (pad "8" thru_hole circle (at 7.62 -2.54) (size 1.65 1.65) (drill 1.1) (layers *.Cu *.Mask) (tstamp 93ce2e83-acf7-4155-b713-16f38e9b85cd))
  (pad "9" thru_hole circle (at 10.16 0) (size 1.65 1.65) (drill 1.1) (layers *.Cu *.Mask) (tstamp 087f5d5f-dae0-4ab4-8d4b-285d9904ca68))
  (pad "10" thru_hole circle (at 10.16 -2.54) (size 1.65 1.65) (drill 1.1) (layers *.Cu *.Mask) (tstamp eedc1446-7702-4e17-a3b8-cb85cb073515))
  (pad "11" thru_hole circle (at 12.7 0) (size 1.65 1.65) (drill 1.1) (layers *.Cu *.Mask) (tstamp 508dbe5c-59b9-4137-be70-0df62ff3d934))
  (pad "12" thru_hole circle (at 12.7 -2.54) (size 1.65 1.65) (drill 1.1) (layers *.Cu *.Mask) (tstamp 628ee5ce-261b-42fe-9e52-ce186fb5755b))
  (pad "13" thru_hole circle (at 15.24 0) (size 1.65 1.65) (drill 1.1) (layers *.Cu *.Mask) (tstamp 2593698b-513c-4bf1-b89e-c384b5c39744))
  (pad "14" thru_hole circle (at 15.24 -2.54) (size 1.65 1.65) (drill 1.1) (layers *.Cu *.Mask) (tstamp c4139bc9-b7a3-4a2a-ade8-87c006bff500))
  (pad "15" thru_hole circle (at 17.78 0) (size 1.65 1.65) (drill 1.1) (layers *.Cu *.Mask) (tstamp 08f538d9-ba16-4ae7-a90b-88cf63eb24bd))
  (pad "16" thru_hole circle (at 17.78 -2.54) (size 1.65 1.65) (drill 1.1) (layers *.Cu *.Mask) (tstamp db15b491-30f1-4e04-9931-0f1f0d7d3cb9))
  (model "${KIPRJMOD}/3D/HMTSW-108-08-F-D-295.stp"
    (offset (xyz 0 0 0))
    (scale (xyz 1 1 1))
    (rotate (xyz 0 0 0))
  )
)
