(footprint "HD3SS3411IRWAR" (version 20211014) (generator pcbnew)
  (layer "F.Cu")
  (tedit 0)
  (descr "RWA0014A")
  (tags "Integrated Circuit")
  (attr smd)
  (fp_text reference "IC**" (at 0 0) (layer "F.SilkS")
    (effects (font (size 1.27 1.27) (thickness 0.254)))
    (tstamp d5a33fbb-37dc-42c2-a294-73bfe6666d33)
  )
  (fp_text value "HD3SS3411IRWAR" (at 0 0) (layer "F.SilkS") hide
    (effects (font (size 1.27 1.27) (thickness 0.254)))
    (tstamp 9f1ca334-299d-4ff0-a3e5-6f2a2b11213d)
  )
  (fp_text user "${REFERENCE}" (at 0 0) (layer "F.Fab")
    (effects (font (size 1.27 1.27) (thickness 0.254)))
    (tstamp 3573eddf-bb88-4f2d-8916-45f7017694d1)
  )
  (fp_line (start -0.75 -2.2) (end -0.75 -2.2) (layer "F.SilkS") (width 0.1) (tstamp 5afa69a4-f502-4364-a7d8-5aaaf8298841))
  (fp_line (start -0.75 -2.3) (end -0.75 -2.3) (layer "F.SilkS") (width 0.1) (tstamp 9fd089bc-058c-4040-bae8-2881722cfeb4))
  (fp_arc (start -0.75 -2.3) (mid -0.7 -2.25) (end -0.75 -2.2) (layer "F.SilkS") (width 0.1) (tstamp 2b522440-9bb4-46e1-83a1-6a08ecb96ed3))
  (fp_arc (start -0.75 -2.2) (mid -0.8 -2.25) (end -0.75 -2.3) (layer "F.SilkS") (width 0.1) (tstamp 36876b85-9727-41e9-89e1-61350ac8651b))
  (fp_line (start 2.75 -2.75) (end 2.75 2.75) (layer "F.CrtYd") (width 0.1) (tstamp 35decefe-be49-4b01-8695-3601f407edf7))
  (fp_line (start -2.75 2.75) (end -2.75 -2.75) (layer "F.CrtYd") (width 0.1) (tstamp 36b7df6e-c34b-4c4f-8659-5aaca46df367))
  (fp_line (start 2.75 2.75) (end -2.75 2.75) (layer "F.CrtYd") (width 0.1) (tstamp 86d3d4eb-f614-4c3f-a418-d9db059cf5a8))
  (fp_line (start -2.75 -2.75) (end 2.75 -2.75) (layer "F.CrtYd") (width 0.1) (tstamp d4227d02-014c-4051-b924-99146fb1b674))
  (fp_line (start -1.75 -1.75) (end 1.75 -1.75) (layer "F.Fab") (width 0.2) (tstamp 36a5f2b3-a5e8-4353-b9ce-3eec105046a1))
  (fp_line (start -1.75 1.75) (end -1.75 -1.75) (layer "F.Fab") (width 0.2) (tstamp 98dbb050-e0e6-4b02-9e64-f57be13d3545))
  (fp_line (start 1.75 1.75) (end -1.75 1.75) (layer "F.Fab") (width 0.2) (tstamp d8c728fe-04cb-4f87-b228-a99e70e93da3))
  (fp_line (start 1.75 -1.75) (end 1.75 1.75) (layer "F.Fab") (width 0.2) (tstamp e1b3c209-9c43-47a1-9c2f-143d637bae29))
  (pad "1" smd rect (at -0.75 -1.65) (size 0.24 0.6) (layers "F.Cu" "F.Paste" "F.Mask") (tstamp f5a4179c-800d-4ce6-9869-29012ef46c20))
  (pad "2" smd rect (at -1.65 -1 90) (size 0.24 0.6) (layers "F.Cu" "F.Paste" "F.Mask") (tstamp ad65bd27-82f5-4fc9-a7a2-097f52219f88))
  (pad "3" smd rect (at -1.65 -0.5 90) (size 0.24 0.6) (layers "F.Cu" "F.Paste" "F.Mask") (tstamp 026b35d9-8db7-499b-9149-833412cf9ef8))
  (pad "4" smd rect (at -1.65 0 90) (size 0.24 0.6) (layers "F.Cu" "F.Paste" "F.Mask") (tstamp f12dde6a-c291-4bcf-91c7-b89f339492cc))
  (pad "5" smd rect (at -1.65 0.5 90) (size 0.24 0.6) (layers "F.Cu" "F.Paste" "F.Mask") (tstamp d5e8b4e6-de6b-413c-94cd-2c4a29fb6626))
  (pad "6" smd rect (at -1.65 1 90) (size 0.24 0.6) (layers "F.Cu" "F.Paste" "F.Mask") (tstamp fe7865e7-1271-4c83-bf81-6a289fcf0bec))
  (pad "7" smd rect (at -0.75 1.65) (size 0.24 0.6) (layers "F.Cu" "F.Paste" "F.Mask") (tstamp 0b4ec601-bf4a-41dd-8ed9-5e6996513463))
  (pad "8" smd rect (at 0.75 1.65) (size 0.24 0.6) (layers "F.Cu" "F.Paste" "F.Mask") (tstamp de9ba629-2f1f-4fb5-806d-f0931acfd185))
  (pad "9" smd rect (at 1.65 1 90) (size 0.24 0.6) (layers "F.Cu" "F.Paste" "F.Mask") (tstamp f3c8774d-1981-4813-b80a-ef2b7dc256fe))
  (pad "10" smd rect (at 1.65 0.5 90) (size 0.24 0.6) (layers "F.Cu" "F.Paste" "F.Mask") (tstamp 00215f74-e731-41d3-904a-f3de2f160d8d))
  (pad "11" smd rect (at 1.65 0 90) (size 0.24 0.6) (layers "F.Cu" "F.Paste" "F.Mask") (tstamp ba0dd9a5-9b76-4508-9669-1998191d02a7))
  (pad "12" smd rect (at 1.65 -0.5 90) (size 0.24 0.6) (layers "F.Cu" "F.Paste" "F.Mask") (tstamp 76b11a8e-c778-44e8-b486-3655e2b8f1b7))
  (pad "13" smd rect (at 1.65 -1 90) (size 0.24 0.6) (layers "F.Cu" "F.Paste" "F.Mask") (tstamp 7192c601-83d8-42a0-9f5a-f8d4b8ae66f4))
  (pad "14" smd rect (at 0.75 -1.65) (size 0.24 0.6) (layers "F.Cu" "F.Paste" "F.Mask") (tstamp 13e2acf3-53c9-4957-83bb-f90b25bd67e3))
  (pad "15" smd rect (at 0 0) (size 2.05 2.05) (layers "F.Cu" "F.Paste" "F.Mask") (tstamp e44c2e6a-8a87-49d9-be22-38c82353d5b4))
  (model "HD3SS3411IRWAR.stp"
    (offset (xyz 0 0 0))
    (scale (xyz 1 1 1))
    (rotate (xyz 0 0 0))
  )
)
