(footprint "DSUB37_Adapter" (version 20211014) (generator pcbnew)
  (layer "F.Cu")
  (tedit 0)
  (attr smd)
  (fp_text reference "REF**" (at 0 -0.5 unlocked) (layer "F.SilkS")
    (effects (font (size 1 1) (thickness 0.15)))
    (tstamp 103391e6-3714-4bad-a607-05ad48433772)
  )
  (fp_text value "DSUB37_Adapter" (at 0 1 unlocked) (layer "F.Fab")
    (effects (font (size 1 1) (thickness 0.15)))
    (tstamp 0515cf27-0a5f-4ded-82a8-f0604f80847a)
  )
  (fp_text user "${REFERENCE}" (at 0 2.5 unlocked) (layer "F.Fab")
    (effects (font (size 1 1) (thickness 0.15)))
    (tstamp 0fc46b30-5600-4ac0-9f60-d0b8ecf2038f)
  )
  (fp_text user "${REFERENCE}" (at -0.005 -0.474669 180) (layer "F.Fab")
    (effects (font (size 1 1) (thickness 0.15)))
    (tstamp b3a04465-25a4-44b1-921b-056354cc9927)
  )
  (fp_line (start 25.175 14.359669) (end 24.675 14.359669) (layer "F.SilkS") (width 0.12) (tstamp 23662f3f-09d4-44ed-934e-edc7835a61ad))
  (fp_line (start 34.755 2.985331) (end 34.755 13.465331) (layer "F.SilkS") (width 0.12) (tstamp 32a1f0fc-9c71-4f4c-afed-fff0f7c53fd6))
  (fp_line (start 24.675 14.359669) (end 24.925 13.926656) (layer "F.SilkS") (width 0.12) (tstamp 6ff306ce-71af-4e37-8ddc-29fe3901f564))
  (fp_line (start 34.755 13.465331) (end -34.765 13.465331) (layer "F.SilkS") (width 0.12) (tstamp 7982051d-7b27-4d47-a349-7408cca55d06))
  (fp_line (start 24.925 13.926656) (end 25.175 14.359669) (layer "F.SilkS") (width 0.12) (tstamp bcd9a160-839c-4039-adaa-7ffb1628d2cd))
  (fp_line (start -34.765 13.465331) (end -34.765 2.985331) (layer "F.SilkS") (width 0.12) (tstamp d2924528-4477-4d47-abea-cfed6fa6074b))
  (fp_line (start 35.225 -3.994669) (end -35.225 -3.994669) (layer "F.CrtYd") (width 0.05) (tstamp 7c070ef5-998d-4fde-898f-5531b4f9dc52))
  (fp_line (start -35.225 -3.994669) (end -35.225 13.955331) (layer "F.CrtYd") (width 0.05) (tstamp b947578f-844b-4724-84d7-57611abe502e))
  (fp_line (start 35.225 13.955331) (end 35.225 -3.994669) (layer "F.CrtYd") (width 0.05) (tstamp da895fcf-315e-4730-98bb-a67e372439d7))
  (fp_line (start -35.225 13.955331) (end 35.225 13.955331) (layer "F.CrtYd") (width 0.05) (tstamp feb9b696-13d3-47ea-899d-38aaf75a5410))
  (fp_line (start -27.405 2.525331) (end 27.395 2.525331) (layer "F.Fab") (width 0.1) (tstamp 02734b62-1b4f-42c3-9133-daa67b59b196))
  (fp_line (start 27.395 -3.474669) (end -27.405 -3.474669) (layer "F.Fab") (width 0.1) (tstamp 02fc10ac-695b-4185-be2e-cc3a003a7259))
  (fp_line (start 34.695 2.925331) (end -34.705 2.925331) (layer "F.Fab") (width 0.1) (tstamp 3153e161-e33f-4e4d-8c4d-89902f1e953f))
  (fp_line (start -34.255 -2.474669) (end -34.255 2.525331) (layer "F.Fab") (width 0.1) (tstamp 35186051-9c19-4603-b9cf-26aa715072e0))
  (fp_line (start 27.395 2.525331) (end 27.395 -3.474669) (layer "F.Fab") (width 0.1) (tstamp 4b61b39a-ad45-4c2c-b7d5-f6a6b8bdcf7c))
  (fp_line (start -34.255 2.525331) (end -29.255 2.525331) (layer "F.Fab") (width 0.1) (tstamp 532df629-3d9c-47bd-a120-4fa99b1f32dc))
  (fp_line (start 34.695 2.525331) (end -34.705 2.525331) (layer "F.Fab") (width 0.1) (tstamp 54477ae0-75ae-4418-95ba-f2e747ff1811))
  (fp_line (start -30.155 2.925331) (end -30.155 10.405331) (layer "F.Fab") (width 0.1) (tstamp 5645c4a9-1b84-4cb5-b148-ecfa3c538c08))
  (fp_line (start 33.345 2.925331) (end 33.345 10.405331) (layer "F.Fab") (width 0.1) (tstamp 58dc3ad0-6aa6-4677-928d-f35759064780))
  (fp_line (start -34.705 2.925331) (end -34.705 13.405331) (layer "F.Fab") (width 0.1) (tstamp 5ecaa185-492f-462a-a5d7-df5878ca1f59))
  (fp_line (start 34.245 2.525331) (end 34.245 -2.474669) (layer "F.Fab") (width 0.1) (tstamp 6a67d434-2351-461f-aac2-93d3519bfc61))
  (fp_line (start -33.355 2.925331) (end -33.355 10.405331) (layer "F.Fab") (width 0.1) (tstamp 6aa8efa2-afbd-476b-afe0-9b2d8eed4145))
  (fp_line (start 34.245 -2.474669) (end 29.245 -2.474669) (layer "F.Fab") (width 0.1) (tstamp 7b33347b-f897-4a2f-8d9d-59a04eb364aa))
  (fp_line (start 34.695 13.405331) (end 34.695 2.925331) (layer "F.Fab") (width 0.1) (tstamp 86ab3ff1-2207-4ddf-839b-9468db054340))
  (fp_line (start 29.245 2.525331) (end 34.245 2.525331) (layer "F.Fab") (width 0.1) (tstamp 8a94b0bf-49af-438c-bf36-e6d983c2ce7c))
  (fp_line (start -27.405 -3.474669) (end -27.405 2.525331) (layer "F.Fab") (width 0.1) (tstamp 8ea241a3-23ab-4afa-a1dd-7296f08aae52))
  (fp_line (start -29.255 -2.474669) (end -34.255 -2.474669) (layer "F.Fab") (width 0.1) (tstamp a2dcaa55-859b-4a27-bc21-e93413d2fd10))
  (fp_line (start 29.245 -2.474669) (end 29.245 2.525331) (layer "F.Fab") (width 0.1) (tstamp aad64321-0fb5-4c7b-9b45-6794281345a7))
  (fp_line (start -34.705 13.405331) (end 34.695 13.405331) (layer "F.Fab") (width 0.1) (tstamp b67b3764-c904-46b6-8284-4e534bbd85a3))
  (fp_line (start -34.705 2.925331) (end 34.695 2.925331) (layer "F.Fab") (width 0.1) (tstamp b7273387-c4dd-461d-a933-9f54d28a2462))
  (fp_line (start -29.255 2.525331) (end -29.255 -2.474669) (layer "F.Fab") (width 0.1) (tstamp d4b4a911-761d-4daa-8fdb-8093673dfd75))
  (fp_line (start 34.695 2.925331) (end 34.695 2.525331) (layer "F.Fab") (width 0.1) (tstamp df4ceae8-49b1-48f8-8c44-96a7c7a132be))
  (fp_line (start -34.705 2.525331) (end -34.705 2.925331) (layer "F.Fab") (width 0.1) (tstamp f5d153ed-cc40-474e-8475-dd25a8a06d9e))
  (fp_line (start 30.145 2.925331) (end 30.145 10.405331) (layer "F.Fab") (width 0.1) (tstamp fc067b93-82da-44a0-90d3-cc9d9cfbbabd))
  (fp_arc (start -30.155 10.405331) (mid -31.755 12.005331) (end -33.355 10.405331) (layer "F.Fab") (width 0.1) (tstamp 0df0d0ef-0e46-4f35-a046-005721ac2699))
  (fp_arc (start 33.345 10.405331) (mid 31.745 12.005331) (end 30.145 10.405331) (layer "F.Fab") (width 0.1) (tstamp b687f9f9-1ea0-4150-b6bc-9133164712e0))
  (pad "0" thru_hole circle (at 31.8365 9.285331 180) (size 4.65 4.65) (drill 3.1) (layers *.Cu *.Mask) (tstamp 6c5c51dd-cde1-467f-8ad3-452f920b735d))
  (pad "0" thru_hole circle (at -31.6635 9.285331 180) (size 4.65 4.65) (drill 3.1) (layers *.Cu *.Mask) (tstamp f4d74039-3362-431b-a5f9-b0afe2ef7eb4))
  (pad "1" thru_hole rect (at 24.925 10.705331 180) (size 1.6 1.6) (drill 1) (layers *.Cu *.Mask) (tstamp 9b31bd07-e22c-4251-813d-954d1b7eb43b))
  (pad "2" thru_hole circle (at 22.155 10.705331 180) (size 1.6 1.6) (drill 1) (layers *.Cu *.Mask) (tstamp 83681240-aff6-466e-8dd7-5d198585671b))
  (pad "3" thru_hole circle (at 19.385 10.705331 180) (size 1.6 1.6) (drill 1) (layers *.Cu *.Mask) (tstamp 0e6b3598-baed-4f0e-84b2-7a31fe04fdfb))
  (pad "4" thru_hole circle (at 16.615 10.705331 180) (size 1.6 1.6) (drill 1) (layers *.Cu *.Mask) (tstamp 59cc1346-bb3b-42ed-a380-7b1e205a153b))
  (pad "5" thru_hole circle (at 13.845 10.705331 180) (size 1.6 1.6) (drill 1) (layers *.Cu *.Mask) (tstamp 547fac52-7be2-4b4e-9c38-76b51fc2a7ab))
  (pad "6" thru_hole circle (at 11.075 10.705331 180) (size 1.6 1.6) (drill 1) (layers *.Cu *.Mask) (tstamp 4cd50f7c-b447-47ce-b532-834ed919dc00))
  (pad "7" thru_hole circle (at 8.305 10.705331 180) (size 1.6 1.6) (drill 1) (layers *.Cu *.Mask) (tstamp 45c2132b-cf56-4b59-9025-a0e04084517f))
  (pad "8" thru_hole circle (at 5.535 10.705331 180) (size 1.6 1.6) (drill 1) (layers *.Cu *.Mask) (tstamp 0839a969-3930-47a9-ae41-ed5ca3f8f819))
  (pad "9" thru_hole circle (at 2.765 10.705331 180) (size 1.6 1.6) (drill 1) (layers *.Cu *.Mask) (tstamp f46b7a3c-3386-4bf3-aa37-8569648ac0c2))
  (pad "10" thru_hole circle (at -0.005 10.705331 180) (size 1.6 1.6) (drill 1) (layers *.Cu *.Mask) (tstamp 641e669a-eac0-4af5-b494-597a6615bf09))
  (pad "11" thru_hole circle (at -2.775 10.705331 180) (size 1.6 1.6) (drill 1) (layers *.Cu *.Mask) (tstamp b2cf157d-f42d-4e11-8752-c065eaaf5af0))
  (pad "12" thru_hole circle (at -5.545 10.705331 180) (size 1.6 1.6) (drill 1) (layers *.Cu *.Mask) (tstamp c75aa701-5801-4e8e-99a4-f669dc7e436e))
  (pad "13" thru_hole circle (at -8.315 10.705331 180) (size 1.6 1.6) (drill 1) (layers *.Cu *.Mask) (tstamp 78924916-9f83-48ff-9e5a-c5597c08fcb5))
  (pad "14" thru_hole circle (at -11.085 10.705331 180) (size 1.6 1.6) (drill 1) (layers *.Cu *.Mask) (tstamp 08c33658-301d-470d-bdca-416a921118d6))
  (pad "15" thru_hole circle (at -13.855 10.705331 180) (size 1.6 1.6) (drill 1) (layers *.Cu *.Mask) (tstamp 58d3d7c7-a9bd-4f17-9dc6-f3933777b2fa))
  (pad "16" thru_hole circle (at -16.625 10.705331 180) (size 1.6 1.6) (drill 1) (layers *.Cu *.Mask) (tstamp ed525eb2-b047-488a-a475-9c0c2e11c2e9))
  (pad "17" thru_hole circle (at -19.395 10.705331 180) (size 1.6 1.6) (drill 1) (layers *.Cu *.Mask) (tstamp 36f83714-5238-4ff5-a473-8404dd14ffe8))
  (pad "18" thru_hole circle (at -22.165 10.705331 180) (size 1.6 1.6) (drill 1) (layers *.Cu *.Mask) (tstamp 4fe13c19-a7f6-4a16-9953-af0548d7802c))
  (pad "19" thru_hole circle (at -24.935 10.705331 180) (size 1.6 1.6) (drill 1) (layers *.Cu *.Mask) (tstamp 2480e0ce-8f27-4e3c-9441-44ce8680d313))
  (pad "20" thru_hole circle (at 23.54 7.865331 180) (size 1.6 1.6) (drill 1) (layers *.Cu *.Mask) (tstamp 54f1bd7b-88ad-4011-9e84-a88928cc2840))
  (pad "21" thru_hole circle (at 20.77 7.865331 180) (size 1.6 1.6) (drill 1) (layers *.Cu *.Mask) (tstamp b9448616-edf5-4904-be54-fa02dcc76600))
  (pad "22" thru_hole circle (at 18 7.865331 180) (size 1.6 1.6) (drill 1) (layers *.Cu *.Mask) (tstamp a5349764-15ba-4b95-8b3f-406ffeadbeb4))
  (pad "23" thru_hole circle (at 15.23 7.865331 180) (size 1.6 1.6) (drill 1) (layers *.Cu *.Mask) (tstamp 2b299576-a122-4058-8f5f-f3136fa5d6b0))
  (pad "24" thru_hole circle (at 12.46 7.865331 180) (size 1.6 1.6) (drill 1) (layers *.Cu *.Mask) (tstamp 1377ce32-0526-4c53-b057-1827f8d31775))
  (pad "25" thru_hole circle (at 9.69 7.865331 180) (size 1.6 1.6) (drill 1) (layers *.Cu *.Mask) (tstamp 0496db11-464d-474f-866b-97fce85cd6f0))
  (pad "26" thru_hole circle (at 6.92 7.865331 180) (size 1.6 1.6) (drill 1) (layers *.Cu *.Mask) (tstamp 42d3be5e-4ef8-4fd9-adec-35be56d4eb12))
  (pad "27" thru_hole circle (at 4.15 7.865331 180) (size 1.6 1.6) (drill 1) (layers *.Cu *.Mask) (tstamp 3e39ad4e-9ea2-4ae9-8396-0580912a84e9))
  (pad "28" thru_hole circle (at 1.38 7.865331 180) (size 1.6 1.6) (drill 1) (layers *.Cu *.Mask) (tstamp f7dc962c-860a-42d8-8452-154448ef236e))
  (pad "29" thru_hole circle (at -1.39 7.865331 180) (size 1.6 1.6) (drill 1) (layers *.Cu *.Mask) (tstamp c3cc536e-3811-4668-8076-eebd301f474a))
  (pad "30" thru_hole circle (at -4.16 7.865331 180) (size 1.6 1.6) (drill 1) (layers *.Cu *.Mask) (tstamp b966244d-8923-46a3-9ce1-8dd48bcc88d1))
  (pad "31" thru_hole circle (at -6.93 7.865331 180) (size 1.6 1.6) (drill 1) (layers *.Cu *.Mask) (tstamp cef0889b-0976-4e06-a4fd-eeb5ed03b352))
  (pad "32" thru_hole circle (at -9.7 7.865331 180) (size 1.6 1.6) (drill 1) (layers *.Cu *.Mask) (tstamp e813eaf2-7811-4c58-8f1a-24e8785c1c07))
  (pad "33" thru_hole circle (at -12.47 7.865331 180) (size 1.6 1.6) (drill 1) (layers *.Cu *.Mask) (tstamp 141f2d94-50c4-4482-8416-b9337a94c327))
  (pad "34" thru_hole circle (at -15.24 7.865331 180) (size 1.6 1.6) (drill 1) (layers *.Cu *.Mask) (tstamp 23bc5619-3435-4662-aa94-59fac2f08edf))
  (pad "35" thru_hole circle (at -18.01 7.865331 180) (size 1.6 1.6) (drill 1) (layers *.Cu *.Mask) (tstamp 1cf30f98-e0d7-42b9-9266-5ee1bf771af0))
  (pad "36" thru_hole circle (at -20.78 7.865331 180) (size 1.6 1.6) (drill 1) (layers *.Cu *.Mask) (tstamp 44365e5e-a3ce-42e4-97cf-2dbe2daf9d30))
  (pad "37" thru_hole circle (at -23.55 7.865331 180) (size 1.6 1.6) (drill 1) (layers *.Cu *.Mask) (tstamp 26048172-3a13-47cb-8173-e6c9951c67c6))
  (model "${KIPRJMOD}/lib/3D/D37S13A4PA00LF.stp"
    (offset (xyz -19.24 1.98 0))
    (scale (xyz 1 1 1))
    (rotate (xyz 0 0 -180))
  )
)
