(footprint "78171-0002" (version 20211014) (generator pcbnew)
  (layer "F.Cu")
  (tedit 0)
  (descr "78171-0002")
  (tags "Connector")
  (attr smd)
  (fp_text reference "J**" (at 1.59667 -2.327) (layer "F.SilkS")
    (effects (font (size 1.27 1.27) (thickness 0.254)))
    (tstamp 9dcdc92b-2219-4a4a-8954-45f02cc3ab25)
  )
  (fp_text value "78171-0002" (at 1.59667 -2.327) (layer "F.SilkS") hide
    (effects (font (size 1.27 1.27) (thickness 0.254)))
    (tstamp 5d9921f1-08b3-4cc9-8cf7-e9a72ca2fdb7)
  )
  (fp_text user "${REFERENCE}" (at 1.59667 -2.327) (layer "F.Fab")
    (effects (font (size 1.27 1.27) (thickness 0.254)))
    (tstamp dae72997-44fc-4275-b36f-cd70bf46cfba)
  )
  (fp_line (start 0 0) (end 4.2 0) (layer "F.SilkS") (width 0.254) (tstamp 4d4fecdd-be4a-47e9-9085-2268d5852d8f))
  (fp_line (start 4.2 -4.5) (end 4.2 -1.50567) (layer "F.SilkS") (width 0.254) (tstamp 8458d41c-5d62-455d-b6e1-9f718c0faac9))
  (fp_line (start 0 -4.5) (end 0 -1.421) (layer "F.SilkS") (width 0.254) (tstamp 8de2d84c-ff45-4d4f-bc49-c166f6ae6b91))
  (fp_line (start 0 -4.5) (end 0.86033 -4.5) (layer "F.SilkS") (width 0.254) (tstamp 935057d5-6882-4c15-9a35-54677912ba12))
  (fp_line (start 4.2 -4.5) (end 3.36667 -4.5) (layer "F.SilkS") (width 0.254) (tstamp e091e263-c616-48ef-a460-465c70218987))
  (fp_circle (center 0.846 -5.23) (end 0.846 -5.16665) (layer "F.SilkS") (width 0.254) (fill none) (tstamp 71c6e723-673c-45a9-a0e4-9742220c52a3))
  (fp_line (start 0 0) (end 0 -4.5) (layer "F.Fab") (width 0.254) (tstamp 3326423d-8df7-4a7e-a354-349430b8fbd7))
  (fp_line (start 4.2 0) (end 0 0) (layer "F.Fab") (width 0.254) (tstamp 4ec618ae-096f-4256-9328-005ee04f13d6))
  (fp_line (start 4.2 -4.5) (end 4.2 0) (layer "F.Fab") (width 0.254) (tstamp 92035a88-6c95-4a61-bd8a-cb8dd9e5018a))
  (fp_line (start 0 -4.5) (end 4.2 -4.5) (layer "F.Fab") (width 0.254) (tstamp c8b6b273-3d20-4a46-8069-f6d608563604))
  (pad "1" smd rect (at 1.5 -4.41) (size 0.7 0.9) (layers "F.Cu" "F.Paste" "F.Mask") (tstamp b4833916-7a3e-4498-86fb-ec6d13262ffe))
  (pad "2" smd rect (at 2.7 -4.41) (size 0.7 0.9) (layers "F.Cu" "F.Paste" "F.Mask") (tstamp cc48dd41-7768-48d3-b096-2c4cc2126c9d))
  (pad "3" smd rect (at 0.325 -0.66) (size 0.75 0.9) (layers "F.Cu" "F.Paste" "F.Mask") (tstamp 4185c36c-c66e-4dbd-be5d-841e551f4885))
  (pad "4" smd rect (at 3.875 -0.66) (size 0.75 0.9) (layers "F.Cu" "F.Paste" "F.Mask") (tstamp a8b4bc7e-da32-4fb8-b71a-d7b47c6f741f))
  (model "${KIPRJMOD}/3D/wrl/78171-0002.wrl"
    (offset (xyz 2.099999873 2.539999924 1.479999997))
    (scale (xyz 1 1 1))
    (rotate (xyz -90 0 0))
  )
  (model "${KIPRJMOD}/3D/step/78171-0002.stp"
    (offset (xyz 2.1 2.5 1.5))
    (scale (xyz 1 1 1))
    (rotate (xyz -90 0 0))
  )
)
