{
  "board": {
    "3dviewports": [],
    "design_settings": {
      "defaults": {
        "board_outline_line_width": 0.09999999999999999,
        "copper_line_width": 0.19999999999999998,
        "copper_text_italic": false,
        "copper_text_size_h": 1.5,
        "copper_text_size_v": 1.5,
        "copper_text_thickness": 0.3,
        "copper_text_upright": false,
        "courtyard_line_width": 0.049999999999999996,
        "dimension_precision": 4,
        "dimension_units": 3,
        "dimensions": {
          "arrow_length": 1270000,
          "extension_offset": 500000,
          "keep_text_aligned": true,
          "suppress_zeroes": false,
          "text_position": 0,
          "units_format": 1
        },
        "fab_line_width": 0.09999999999999999,
        "fab_text_italic": false,
        "fab_text_size_h": 1.0,
        "fab_text_size_v": 1.0,
        "fab_text_thickness": 0.15,
        "fab_text_upright": false,
        "other_line_width": 0.15,
        "other_text_italic": false,
        "other_text_size_h": 1.0,
        "other_text_size_v": 1.0,
        "other_text_thickness": 0.15,
        "other_text_upright": false,
        "pads": {
          "drill": 1.0,
          "height": 1.7,
          "width": 1.7
        },
        "silk_line_width": 0.15,
        "silk_text_italic": false,
        "silk_text_size_h": 1.0,
        "silk_text_size_v": 1.0,
        "silk_text_thickness": 0.15,
        "silk_text_upright": false,
        "zones": {
          "45_degree_only": false,
          "min_clearance": 0.3
        }
      },
      "diff_pair_dimensions": [
        {
          "gap": 0.0,
          "via_gap": 0.0,
          "width": 0.0
        }
      ],
      "drc_exclusions": [],
      "meta": {
        "version": 2
      },
      "rule_severities": {
        "annular_width": "error",
        "clearance": "error",
        "connection_width": "warning",
        "copper_edge_clearance": "error",
        "copper_sliver": "warning",
        "courtyards_overlap": "error",
        "diff_pair_gap_out_of_range": "error",
        "diff_pair_uncoupled_length_too_long": "error",
        "drill_out_of_range": "error",
        "duplicate_footprints": "warning",
        "extra_footprint": "warning",
        "footprint": "error",
        "footprint_type_mismatch": "error",
        "hole_clearance": "error",
        "hole_near_hole": "error",
        "invalid_outline": "error",
        "isolated_copper": "warning",
        "item_on_disabled_layer": "error",
        "items_not_allowed": "error",
        "length_out_of_range": "error",
        "lib_footprint_issues": "warning",
        "lib_footprint_mismatch": "warning",
        "malformed_courtyard": "error",
        "microvia_drill_out_of_range": "error",
        "missing_courtyard": "ignore",
        "missing_footprint": "warning",
        "net_conflict": "warning",
        "npth_inside_courtyard": "ignore",
        "padstack": "error",
        "pth_inside_courtyard": "ignore",
        "shorting_items": "error",
        "silk_edge_clearance": "warning",
        "silk_over_copper": "warning",
        "silk_overlap": "warning",
        "skew_out_of_range": "error",
        "solder_mask_bridge": "error",
        "starved_thermal": "error",
        "text_height": "warning",
        "text_thickness": "warning",
        "through_hole_pad_without_hole": "error",
        "too_many_vias": "error",
        "track_dangling": "warning",
        "track_width": "error",
        "tracks_crossing": "error",
        "unconnected_items": "error",
        "unresolved_variable": "error",
        "via_dangling": "warning",
        "zones_intersect": "error"
      },
      "rules": {
        "allow_blind_buried_vias": false,
        "allow_microvias": false,
        "max_error": 0.005,
        "min_clearance": 0.15,
        "min_connection": 0.0,
        "min_copper_edge_clearance": 0.01,
        "min_hole_clearance": 0.15,
        "min_hole_to_hole": 0.15,
        "min_microvia_diameter": 0.19999999999999998,
        "min_microvia_drill": 0.09999999999999999,
        "min_resolved_spokes": 2,
        "min_silk_clearance": 0.0,
        "min_text_height": 0.7999999999999999,
        "min_text_thickness": 0.08,
        "min_through_hole_diameter": 0.3,
        "min_track_width": 0.19999999999999998,
        "min_via_annular_width": 0.125,
        "min_via_diameter": 0.39999999999999997,
        "solder_mask_clearance": 0.0,
        "solder_mask_min_width": 0.0,
        "solder_mask_to_copper_clearance": 0.0,
        "use_height_for_length_calcs": true
      },
      "teardrop_options": [
        {
          "td_allow_use_two_tracks": true,
          "td_curve_segcount": 5,
          "td_on_pad_in_zone": false,
          "td_onpadsmd": true,
          "td_onroundshapesonly": false,
          "td_ontrackend": false,
          "td_onviapad": true
        }
      ],
      "teardrop_parameters": [
        {
          "td_curve_segcount": 0,
          "td_height_ratio": 1.0,
          "td_length_ratio": 0.5,
          "td_maxheight": 2.0,
          "td_maxlen": 1.0,
          "td_target_name": "td_round_shape",
          "td_width_to_size_filter_ratio": 0.9
        },
        {
          "td_curve_segcount": 0,
          "td_height_ratio": 1.0,
          "td_length_ratio": 0.5,
          "td_maxheight": 2.0,
          "td_maxlen": 1.0,
          "td_target_name": "td_rect_shape",
          "td_width_to_size_filter_ratio": 0.9
        },
        {
          "td_curve_segcount": 0,
          "td_height_ratio": 1.0,
          "td_length_ratio": 0.5,
          "td_maxheight": 2.0,
          "td_maxlen": 1.0,
          "td_target_name": "td_track_end",
          "td_width_to_size_filter_ratio": 0.9
        }
      ],
      "track_widths": [
        0.0,
        0.127
      ],
      "via_dimensions": [
        {
          "diameter": 0.0,
          "drill": 0.0
        }
      ],
      "zones_allow_external_fillets": false,
      "zones_use_no_outline": true
    },
    "layer_presets": [
      {
        "activeLayer": -2,
        "layers": [
          0,
          2,
          31,
          32,
          34,
          36,
          38,
          44,
          46,
          48
        ],
        "name": "Back-clear",
        "renderLayers": [
          125,
          126,
          127,
          128,
          129,
          130,
          133,
          134,
          135,
          137,
          138,
          139,
          140,
          141,
          144,
          145,
          146,
          147,
          148,
          149,
          150,
          151,
          152,
          153,
          154,
          155,
          157,
          158,
          159,
          160,
          161
        ]
      },
      {
        "activeLayer": -2,
        "layers": [
          0,
          2,
          31,
          33,
          35,
          37,
          39,
          44,
          47,
          49
        ],
        "name": "Front-clear",
        "renderLayers": [
          125,
          126,
          127,
          128,
          129,
          130,
          133,
          134,
          135,
          137,
          138,
          139,
          140,
          141,
          144,
          145,
          146,
          147,
          148,
          149,
          150,
          151,
          152,
          153,
          154,
          155,
          157,
          158,
          159,
          160,
          161
        ]
      },
      {
        "activeLayer": -2,
        "layers": [
          3,
          5,
          6,
          7,
          8,
          9,
          10,
          11,
          12,
          13,
          14,
          15,
          16,
          17,
          18,
          19,
          20,
          21,
          22,
          23,
          24,
          25,
          26,
          27,
          28,
          29,
          30,
          44
        ],
        "name": "Power-clear",
        "renderLayers": [
          125,
          126,
          127,
          128,
          129,
          130,
          133,
          134,
          135,
          137,
          138,
          139,
          140,
          141,
          142,
          143,
          144,
          145,
          146,
          147,
          148,
          149,
          150,
          151,
          152,
          153,
          154,
          155,
          157,
          158,
          159,
          160,
          161
        ]
      }
    ],
    "viewports": []
  },
  "boards": [],
  "cvpcb": {
    "equivalence_files": []
  },
  "erc": {
    "erc_exclusions": [],
    "meta": {
      "version": 0
    },
    "pin_map": [
      [
        0,
        0,
        0,
        0,
        0,
        0,
        1,
        0,
        0,
        0,
        0,
        2
      ],
      [
        0,
        2,
        0,
        1,
        0,
        0,
        1,
        0,
        2,
        2,
        2,
        2
      ],
      [
        0,
        0,
        0,
        0,
        0,
        0,
        1,
        0,
        1,
        0,
        1,
        2
      ],
      [
        0,
        1,
        0,
        0,
        0,
        0,
        1,
        1,
        2,
        1,
        1,
        2
      ],
      [
        0,
        0,
        0,
        0,
        0,
        0,
        1,
        0,
        0,
        0,
        0,
        2
      ],
      [
        0,
        0,
        0,
        0,
        0,
        0,
        0,
        0,
        0,
        0,
        0,
        2
      ],
      [
        1,
        1,
        1,
        1,
        1,
        0,
        1,
        1,
        1,
        1,
        1,
        2
      ],
      [
        0,
        0,
        0,
        1,
        0,
        0,
        1,
        0,
        0,
        0,
        0,
        2
      ],
      [
        0,
        2,
        1,
        2,
        0,
        0,
        1,
        0,
        2,
        2,
        2,
        2
      ],
      [
        0,
        2,
        0,
        1,
        0,
        0,
        1,
        0,
        2,
        0,
        0,
        2
      ],
      [
        0,
        2,
        1,
        1,
        0,
        0,
        1,
        0,
        2,
        0,
        0,
        2
      ],
      [
        2,
        2,
        2,
        2,
        2,
        2,
        2,
        2,
        2,
        2,
        2,
        2
      ]
    ],
    "rule_severities": {
      "bus_definition_conflict": "error",
      "bus_entry_needed": "error",
      "bus_label_syntax": "error",
      "bus_to_bus_conflict": "error",
      "bus_to_net_conflict": "error",
      "different_unit_footprint": "error",
      "different_unit_net": "error",
      "duplicate_reference": "error",
      "duplicate_sheet_names": "error",
      "extra_units": "error",
      "global_label_dangling": "warning",
      "hier_label_mismatch": "error",
      "label_dangling": "error",
      "lib_symbol_issues": "warning",
      "multiple_net_names": "warning",
      "net_not_bus_member": "warning",
      "no_connect_connected": "warning",
      "no_connect_dangling": "warning",
      "pin_not_connected": "error",
      "pin_not_driven": "error",
      "pin_to_pin": "warning",
      "power_pin_not_driven": "error",
      "similar_labels": "warning",
      "unannotated": "error",
      "unit_value_mismatch": "error",
      "unresolved_variable": "error",
      "wire_dangling": "error"
    }
  },
  "libraries": {
    "pinned_footprint_libs": [],
    "pinned_symbol_libs": []
  },
  "meta": {
    "filename": "magnetometer_nand-flash.kicad_pro",
    "version": 1
  },
  "net_settings": {
    "classes": [
      {
        "bus_width": 12,
        "clearance": 0.15,
        "diff_pair_gap": 0.25,
        "diff_pair_via_gap": 0.25,
        "diff_pair_width": 0.2,
        "line_style": 0,
        "microvia_diameter": 0.3,
        "microvia_drill": 0.1,
        "name": "Default",
        "pcb_color": "rgba(0, 0, 0, 0.000)",
        "schematic_color": "rgba(0, 0, 0, 0.000)",
        "track_width": 0.25,
        "via_diameter": 0.8,
        "via_drill": 0.4,
        "wire_width": 6
      },
      {
        "bus_width": 12,
        "clearance": 0.15,
        "diff_pair_gap": 0.25,
        "diff_pair_via_gap": 0.25,
        "diff_pair_width": 0.2,
        "line_style": 0,
        "microvia_diameter": 0.3,
        "microvia_drill": 0.1,
        "name": "CANs",
        "pcb_color": "rgba(0, 0, 0, 0.000)",
        "schematic_color": "rgba(0, 0, 0, 0.000)",
        "track_width": 0.3,
        "via_diameter": 0.8,
        "via_drill": 0.4,
        "wire_width": 6
      },
      {
        "bus_width": 12,
        "clearance": 0.15,
        "diff_pair_gap": 0.25,
        "diff_pair_via_gap": 0.25,
        "diff_pair_width": 0.2,
        "line_style": 0,
        "microvia_diameter": 0.3,
        "microvia_drill": 0.1,
        "name": "Magnetometer",
        "pcb_color": "rgba(0, 0, 0, 0.000)",
        "schematic_color": "rgba(0, 0, 0, 0.000)",
        "track_width": 0.2,
        "via_diameter": 0.8,
        "via_drill": 0.4,
        "wire_width": 6
      },
      {
        "bus_width": 12,
        "clearance": 0.2,
        "diff_pair_gap": 0.25,
        "diff_pair_via_gap": 0.25,
        "diff_pair_width": 0.2,
        "line_style": 0,
        "microvia_diameter": 0.3,
        "microvia_drill": 0.1,
        "name": "Power",
        "pcb_color": "rgba(0, 0, 0, 0.000)",
        "schematic_color": "rgba(0, 0, 0, 0.000)",
        "track_width": 0.3,
        "via_diameter": 0.8,
        "via_drill": 0.4,
        "wire_width": 6
      }
    ],
    "meta": {
      "version": 3
    },
    "net_colors": null,
    "netclass_assignments": null,
    "netclass_patterns": [
      {
        "netclass": "CANs",
        "pattern": "/ADCS module/ADCS_TRACECLK"
      },
      {
        "netclass": "CANs",
        "pattern": "/ADCS module/CAN_RX_1"
      },
      {
        "netclass": "CANs",
        "pattern": "/ADCS module/CAN_RX_2"
      },
      {
        "netclass": "CANs",
        "pattern": "/ADCS module/CAN_TX_1"
      },
      {
        "netclass": "CANs",
        "pattern": "/ADCS module/CAN_TX_2"
      },
      {
        "netclass": "CANs",
        "pattern": "/OBC module/CAN_RX_1"
      },
      {
        "netclass": "CANs",
        "pattern": "/OBC module/CAN_RX_2"
      },
      {
        "netclass": "CANs",
        "pattern": "/OBC module/CAN_TX_1"
      },
      {
        "netclass": "CANs",
        "pattern": "/OBC module/CAN_TX_2"
      },
      {
        "netclass": "CANs",
        "pattern": "CAN1+"
      },
      {
        "netclass": "CANs",
        "pattern": "CAN1-"
      },
      {
        "netclass": "CANs",
        "pattern": "CAN2+"
      },
      {
        "netclass": "CANs",
        "pattern": "CAN2-"
      },
      {
        "netclass": "Magnetometer",
        "pattern": "/ADCS module/MAG_CS"
      },
      {
        "netclass": "Magnetometer",
        "pattern": "/ADCS module/MAG_DRDY"
      },
      {
        "netclass": "Magnetometer",
        "pattern": "/ADCS module/MAG_FUSE"
      },
      {
        "netclass": "Magnetometer",
        "pattern": "/ADCS module/MAG_MISO"
      },
      {
        "netclass": "Magnetometer",
        "pattern": "/ADCS module/MAG_MOSI"
      },
      {
        "netclass": "Magnetometer",
        "pattern": "/ADCS module/MAG_SPCK"
      },
      {
        "netclass": "Power",
        "pattern": "/EPS_12V_SU"
      },
      {
        "netclass": "Power",
        "pattern": "/EPS_3V3_ADCS"
      },
      {
        "netclass": "Power",
        "pattern": "/EPS_3V3_OBC"
      },
      {
        "netclass": "Power",
        "pattern": "/EPS_3V3_RW"
      },
      {
        "netclass": "Power",
        "pattern": "/EPS_3V3_SU"
      },
      {
        "netclass": "Power",
        "pattern": "/EPS_5V_ADM"
      },
      {
        "netclass": "Power",
        "pattern": "/EPS_5V_PANELS"
      },
      {
        "netclass": "Power",
        "pattern": "/EPS_5V_SU"
      }
    ]
  },
  "pcbnew": {
    "last_paths": {
      "gencad": "",
      "idf": "",
      "netlist": "",
      "specctra_dsn": "",
      "step": "3D/step/obc-adcs-boardv0.step",
      "vrml": ""
    },
    "page_layout_descr_file": ""
  },
  "schematic": {
    "annotate_start_num": 0,
    "drawing": {
      "default_line_thickness": 6.0,
      "default_text_size": 50.0,
      "field_names": [],
      "intersheets_ref_own_page": false,
      "intersheets_ref_prefix": "",
      "intersheets_ref_short": false,
      "intersheets_ref_show": false,
      "intersheets_ref_suffix": "",
      "junction_size_choice": 3,
      "label_size_ratio": 0.25,
      "pin_symbol_size": 0.0,
      "text_offset_ratio": 0.08
    },
    "legacy_lib_dir": "",
    "legacy_lib_list": [],
    "meta": {
      "version": 1
    },
    "net_format_name": "Pcbnew",
    "ngspice": {
      "fix_include_paths": true,
      "fix_passive_vals": false,
      "meta": {
        "version": 0
      },
      "model_mode": 0,
      "workbook_filename": ""
    },
    "page_layout_descr_file": "",
    "plot_directory": "/home/lightspot21/repos/obc-pcb/",
    "spice_adjust_passive_values": false,
    "spice_external_command": "spice \"%I\"",
    "subpart_first_id": 65,
    "subpart_id_separator": 0
  },
  "sheets": [
    [
      "5e6153e6-2c19-46de-9a8e-b310a2a07861",
      ""
    ],
    [
      "dbedcbef-29e2-4237-ae7b-0011e28fb138",
      "Memory Modules"
    ],
    [
      "00000000-0000-0000-0000-0000600c7b11",
      "ADCS module"
    ],
    [
      "4a1d6cfb-16b0-44c0-b383-e0cecbe55ec1",
      "Gyroscopes"
    ],
    [
      "c46c11c9-eb23-4ad5-880c-4323401418dd",
      "Magnetometer"
    ],
    [
      "aa6a552e-71e5-4257-8785-7b5d5d2a903c",
      "CAN transceivers"
    ],
    [
      "ce02de0b-86a8-4920-ac32-18f095cb2d96",
      "Temperature Sensors"
    ],
    [
      "bbd59462-1b35-4863-8cf4-92231f4f37b4",
      "Microcontroller"
    ],
    [
      "18593091-9e03-4f21-bab3-44c5d90284ac",
      "Over-voltage Protection"
    ],
    [
      "264ea1cd-7e3a-479f-996a-c3cc3e2732eb",
      "OBC module"
    ],
    [
      "cf794e69-a61b-4d23-9c0b-f8bf9a0e96d3",
      "Microcontroller"
    ],
    [
      "309de9a7-bbb8-48c0-be72-34f8fc205890",
      "CAN transceivers"
    ],
    [
      "91e18cb9-58d8-46b9-8757-75285bd297f6",
      "Overvoltage-RP protection"
    ],
    [
      "763ee5ca-cbd2-4411-9298-01d9c72534ca",
      "Temperature Sensors"
    ],
    [
      "d4684672-575c-4fc8-95f9-19ad6f1145b8",
      "LCL"
    ],
    [
      "9c18c228-21e1-4b16-9298-abfe20c28989",
      "Connectors"
    ],
    [
      "6c81640a-72a5-49a4-8e9e-ce76864d44fe",
      "Connectors"
    ],
    [
      "c0bd92b4-a0a1-4f93-9999-22b89c23412d",
      "Test Points"
    ],
    [
      "a1437ebd-1473-47f8-a5e1-005d3930a0d5",
      "Test Points"
    ]
  ],
  "text_variables": {}
}
