(kicad_symbol_lib (version 20211014) (generator kicad_symbol_editor)
  (symbol "70246-1001" (pin_names (offset 0.762)) (in_bom yes) (on_board yes)
    (property "Reference" "J" (id 0) (at 19.05 7.62 0)
      (effects (font (size 1.27 1.27)) (justify left))
    )
    (property "Value" "70246-1001" (id 1) (at 19.05 5.08 0)
      (effects (font (size 1.27 1.27)) (justify left))
    )
    (property "Footprint" "SHDR10W99P254_2X5_2032X889X927P" (id 2) (at 19.05 2.54 0)
      (effects (font (size 1.27 1.27)) (justify left) hide)
    )
    (property "Datasheet" "http://www.molex.com/pdm_docs/sd/702461001_sd.pdf" (id 3) (at 19.05 0 0)
      (effects (font (size 1.27 1.27)) (justify left) hide)
    )
    (property "Description" "Header 2.54mm, dual row, vertical, 10w Molex C-GRID Series, Series Number 70246, 2.54mm Pitch 10 Way 2 Row Straight PCB Header, Solder Termination, 2.5A" (id 4) (at 19.05 -2.54 0)
      (effects (font (size 1.27 1.27)) (justify left) hide)
    )
    (property "Height" "9.27" (id 5) (at 19.05 -5.08 0)
      (effects (font (size 1.27 1.27)) (justify left) hide)
    )
    (property "Mouser Part Number" "538-70246-1001" (id 6) (at 19.05 -7.62 0)
      (effects (font (size 1.27 1.27)) (justify left) hide)
    )
    (property "Mouser Price/Stock" "https://www.mouser.co.uk/ProductDetail/Molex/70246-1001?qs=L7RdmAxh%252BcP9d7Ope9dnAA%3D%3D" (id 7) (at 19.05 -10.16 0)
      (effects (font (size 1.27 1.27)) (justify left) hide)
    )
    (property "Manufacturer_Name" "Molex" (id 8) (at 19.05 -12.7 0)
      (effects (font (size 1.27 1.27)) (justify left) hide)
    )
    (property "Manufacturer_Part_Number" "70246-1001" (id 9) (at 19.05 -15.24 0)
      (effects (font (size 1.27 1.27)) (justify left) hide)
    )
    (property "ki_description" "Header 2.54mm, dual row, vertical, 10w Molex C-GRID Series, Series Number 70246, 2.54mm Pitch 10 Way 2 Row Straight PCB Header, Solder Termination, 2.5A" (id 10) (at 0 0 0)
      (effects (font (size 1.27 1.27)) hide)
    )
    (symbol "70246-1001_0_0"
      (pin passive line (at 0 0 0) (length 5.08)
        (name "1" (effects (font (size 1.27 1.27))))
        (number "1" (effects (font (size 1.27 1.27))))
      )
      (pin passive line (at 22.86 -10.16 180) (length 5.08)
        (name "10" (effects (font (size 1.27 1.27))))
        (number "10" (effects (font (size 1.27 1.27))))
      )
      (pin passive line (at 22.86 0 180) (length 5.08)
        (name "2" (effects (font (size 1.27 1.27))))
        (number "2" (effects (font (size 1.27 1.27))))
      )
      (pin passive line (at 0 -2.54 0) (length 5.08)
        (name "3" (effects (font (size 1.27 1.27))))
        (number "3" (effects (font (size 1.27 1.27))))
      )
      (pin passive line (at 22.86 -2.54 180) (length 5.08)
        (name "4" (effects (font (size 1.27 1.27))))
        (number "4" (effects (font (size 1.27 1.27))))
      )
      (pin passive line (at 0 -5.08 0) (length 5.08)
        (name "5" (effects (font (size 1.27 1.27))))
        (number "5" (effects (font (size 1.27 1.27))))
      )
      (pin passive line (at 22.86 -5.08 180) (length 5.08)
        (name "6" (effects (font (size 1.27 1.27))))
        (number "6" (effects (font (size 1.27 1.27))))
      )
      (pin passive line (at 0 -7.62 0) (length 5.08)
        (name "7" (effects (font (size 1.27 1.27))))
        (number "7" (effects (font (size 1.27 1.27))))
      )
      (pin passive line (at 22.86 -7.62 180) (length 5.08)
        (name "8" (effects (font (size 1.27 1.27))))
        (number "8" (effects (font (size 1.27 1.27))))
      )
      (pin passive line (at 0 -10.16 0) (length 5.08)
        (name "9" (effects (font (size 1.27 1.27))))
        (number "9" (effects (font (size 1.27 1.27))))
      )
    )
    (symbol "70246-1001_0_1"
      (polyline
        (pts
          (xy 5.08 2.54)
          (xy 17.78 2.54)
          (xy 17.78 -12.7)
          (xy 5.08 -12.7)
          (xy 5.08 2.54)
        )
        (stroke (width 0.1524) (type default) (color 0 0 0 0))
        (fill (type none))
      )
    )
  )
  (symbol "879140804" (pin_names (offset 0.254) hide) (in_bom yes) (on_board yes)
    (property "Reference" "J" (id 0) (at 8.89 6.35 0)
      (effects (font (size 1.524 1.524)))
    )
    (property "Value" "879140804" (id 1) (at 10.16 -10.16 0)
      (effects (font (size 1.524 1.524)))
    )
    (property "Footprint" "CON_879140804" (id 2) (at 10.16 -11.684 0)
      (effects (font (size 1.524 1.524)) hide)
    )
    (property "Datasheet" "" (id 3) (at 0 0 0)
      (effects (font (size 1.524 1.524)))
    )
    (property "ki_locked" "" (id 4) (at 0 0 0)
      (effects (font (size 1.27 1.27)))
    )
    (property "ki_fp_filters" "CON_879140804" (id 5) (at 0 0 0)
      (effects (font (size 1.27 1.27)) hide)
    )
    (symbol "879140804_1_1"
      (polyline
        (pts
          (xy 5.08 -20.32)
          (xy 12.7 -20.32)
        )
        (stroke (width 0.127) (type default) (color 0 0 0 0))
        (fill (type none))
      )
      (polyline
        (pts
          (xy 5.08 2.54)
          (xy 5.08 -20.32)
        )
        (stroke (width 0.127) (type default) (color 0 0 0 0))
        (fill (type none))
      )
      (polyline
        (pts
          (xy 10.16 -17.78)
          (xy 5.08 -17.78)
        )
        (stroke (width 0.127) (type default) (color 0 0 0 0))
        (fill (type none))
      )
      (polyline
        (pts
          (xy 10.16 -17.78)
          (xy 8.89 -18.6182)
        )
        (stroke (width 0.127) (type default) (color 0 0 0 0))
        (fill (type none))
      )
      (polyline
        (pts
          (xy 10.16 -17.78)
          (xy 8.89 -16.9418)
        )
        (stroke (width 0.127) (type default) (color 0 0 0 0))
        (fill (type none))
      )
      (polyline
        (pts
          (xy 10.16 -15.24)
          (xy 5.08 -15.24)
        )
        (stroke (width 0.127) (type default) (color 0 0 0 0))
        (fill (type none))
      )
      (polyline
        (pts
          (xy 10.16 -15.24)
          (xy 8.89 -16.0782)
        )
        (stroke (width 0.127) (type default) (color 0 0 0 0))
        (fill (type none))
      )
      (polyline
        (pts
          (xy 10.16 -15.24)
          (xy 8.89 -14.4018)
        )
        (stroke (width 0.127) (type default) (color 0 0 0 0))
        (fill (type none))
      )
      (polyline
        (pts
          (xy 10.16 -12.7)
          (xy 5.08 -12.7)
        )
        (stroke (width 0.127) (type default) (color 0 0 0 0))
        (fill (type none))
      )
      (polyline
        (pts
          (xy 10.16 -12.7)
          (xy 8.89 -13.5382)
        )
        (stroke (width 0.127) (type default) (color 0 0 0 0))
        (fill (type none))
      )
      (polyline
        (pts
          (xy 10.16 -12.7)
          (xy 8.89 -11.8618)
        )
        (stroke (width 0.127) (type default) (color 0 0 0 0))
        (fill (type none))
      )
      (polyline
        (pts
          (xy 10.16 -10.16)
          (xy 5.08 -10.16)
        )
        (stroke (width 0.127) (type default) (color 0 0 0 0))
        (fill (type none))
      )
      (polyline
        (pts
          (xy 10.16 -10.16)
          (xy 8.89 -10.9982)
        )
        (stroke (width 0.127) (type default) (color 0 0 0 0))
        (fill (type none))
      )
      (polyline
        (pts
          (xy 10.16 -10.16)
          (xy 8.89 -9.3218)
        )
        (stroke (width 0.127) (type default) (color 0 0 0 0))
        (fill (type none))
      )
      (polyline
        (pts
          (xy 10.16 -7.62)
          (xy 5.08 -7.62)
        )
        (stroke (width 0.127) (type default) (color 0 0 0 0))
        (fill (type none))
      )
      (polyline
        (pts
          (xy 10.16 -7.62)
          (xy 8.89 -8.4582)
        )
        (stroke (width 0.127) (type default) (color 0 0 0 0))
        (fill (type none))
      )
      (polyline
        (pts
          (xy 10.16 -7.62)
          (xy 8.89 -6.7818)
        )
        (stroke (width 0.127) (type default) (color 0 0 0 0))
        (fill (type none))
      )
      (polyline
        (pts
          (xy 10.16 -5.08)
          (xy 5.08 -5.08)
        )
        (stroke (width 0.127) (type default) (color 0 0 0 0))
        (fill (type none))
      )
      (polyline
        (pts
          (xy 10.16 -5.08)
          (xy 8.89 -5.9182)
        )
        (stroke (width 0.127) (type default) (color 0 0 0 0))
        (fill (type none))
      )
      (polyline
        (pts
          (xy 10.16 -5.08)
          (xy 8.89 -4.2418)
        )
        (stroke (width 0.127) (type default) (color 0 0 0 0))
        (fill (type none))
      )
      (polyline
        (pts
          (xy 10.16 -2.54)
          (xy 5.08 -2.54)
        )
        (stroke (width 0.127) (type default) (color 0 0 0 0))
        (fill (type none))
      )
      (polyline
        (pts
          (xy 10.16 -2.54)
          (xy 8.89 -3.3782)
        )
        (stroke (width 0.127) (type default) (color 0 0 0 0))
        (fill (type none))
      )
      (polyline
        (pts
          (xy 10.16 -2.54)
          (xy 8.89 -1.7018)
        )
        (stroke (width 0.127) (type default) (color 0 0 0 0))
        (fill (type none))
      )
      (polyline
        (pts
          (xy 10.16 0)
          (xy 5.08 0)
        )
        (stroke (width 0.127) (type default) (color 0 0 0 0))
        (fill (type none))
      )
      (polyline
        (pts
          (xy 10.16 0)
          (xy 8.89 -0.8382)
        )
        (stroke (width 0.127) (type default) (color 0 0 0 0))
        (fill (type none))
      )
      (polyline
        (pts
          (xy 10.16 0)
          (xy 8.89 0.8382)
        )
        (stroke (width 0.127) (type default) (color 0 0 0 0))
        (fill (type none))
      )
      (polyline
        (pts
          (xy 12.7 -20.32)
          (xy 12.7 2.54)
        )
        (stroke (width 0.127) (type default) (color 0 0 0 0))
        (fill (type none))
      )
      (polyline
        (pts
          (xy 12.7 2.54)
          (xy 5.08 2.54)
        )
        (stroke (width 0.127) (type default) (color 0 0 0 0))
        (fill (type none))
      )
      (pin unspecified line (at 0 0 0) (length 5.08)
        (name "1" (effects (font (size 1.4986 1.4986))))
        (number "1" (effects (font (size 1.4986 1.4986))))
      )
      (pin unspecified line (at 0 -2.54 0) (length 5.08)
        (name "2" (effects (font (size 1.4986 1.4986))))
        (number "2" (effects (font (size 1.4986 1.4986))))
      )
      (pin unspecified line (at 0 -5.08 0) (length 5.08)
        (name "3" (effects (font (size 1.4986 1.4986))))
        (number "3" (effects (font (size 1.4986 1.4986))))
      )
      (pin unspecified line (at 0 -7.62 0) (length 5.08)
        (name "4" (effects (font (size 1.4986 1.4986))))
        (number "4" (effects (font (size 1.4986 1.4986))))
      )
      (pin unspecified line (at 0 -10.16 0) (length 5.08)
        (name "5" (effects (font (size 1.4986 1.4986))))
        (number "5" (effects (font (size 1.4986 1.4986))))
      )
      (pin unspecified line (at 0 -12.7 0) (length 5.08)
        (name "6" (effects (font (size 1.4986 1.4986))))
        (number "6" (effects (font (size 1.4986 1.4986))))
      )
      (pin unspecified line (at 0 -15.24 0) (length 5.08)
        (name "7" (effects (font (size 1.4986 1.4986))))
        (number "7" (effects (font (size 1.4986 1.4986))))
      )
      (pin unspecified line (at 0 -17.78 0) (length 5.08)
        (name "8" (effects (font (size 1.4986 1.4986))))
        (number "8" (effects (font (size 1.4986 1.4986))))
      )
    )
  )
  (symbol "DF57H-3P-1.2V_21_" (pin_names (offset 0.762)) (in_bom yes) (on_board yes)
    (property "Reference" "J" (id 0) (at 19.05 7.62 0)
      (effects (font (size 1.27 1.27)) (justify left))
    )
    (property "Value" "DF57H-3P-1.2V_21_" (id 1) (at 19.05 5.08 0)
      (effects (font (size 1.27 1.27)) (justify left))
    )
    (property "Footprint" "DF57H3P12V21" (id 2) (at 19.05 2.54 0)
      (effects (font (size 1.27 1.27)) (justify left) hide)
    )
    (property "Datasheet" "https://datasheet.datasheetarchive.com/originals/distributors/Datasheets-DGA21/2082773.pdf" (id 3) (at 19.05 0 0)
      (effects (font (size 1.27 1.27)) (justify left) hide)
    )
    (property "Description" "HIROSE(HRS) - DF57H-3P-1.2V(21) - CONNECTOR, HEADER, 3POS, 1ROW, 1.2MM" (id 4) (at 19.05 -2.54 0)
      (effects (font (size 1.27 1.27)) (justify left) hide)
    )
    (property "Height" "1.55" (id 5) (at 19.05 -5.08 0)
      (effects (font (size 1.27 1.27)) (justify left) hide)
    )
    (property "Mouser Part Number" "798-DF57H-3P-1.2V21" (id 6) (at 19.05 -7.62 0)
      (effects (font (size 1.27 1.27)) (justify left) hide)
    )
    (property "Mouser Price/Stock" "https://www.mouser.co.uk/ProductDetail/Hirose-Connector/DF57H-3P-12V21?qs=Gufeu08L%2Fl2PQI%252ByibwXvg%3D%3D" (id 7) (at 19.05 -10.16 0)
      (effects (font (size 1.27 1.27)) (justify left) hide)
    )
    (property "Manufacturer_Name" "Hirose" (id 8) (at 19.05 -12.7 0)
      (effects (font (size 1.27 1.27)) (justify left) hide)
    )
    (property "Manufacturer_Part_Number" "DF57H-3P-1.2V(21)" (id 9) (at 19.05 -15.24 0)
      (effects (font (size 1.27 1.27)) (justify left) hide)
    )
    (property "ki_description" "HIROSE(HRS) - DF57H-3P-1.2V(21) - CONNECTOR, HEADER, 3POS, 1ROW, 1.2MM" (id 10) (at 0 0 0)
      (effects (font (size 1.27 1.27)) hide)
    )
    (symbol "DF57H-3P-1.2V_21__0_0"
      (pin passive line (at 22.86 0 180) (length 5.08)
        (name "1" (effects (font (size 1.27 1.27))))
        (number "1" (effects (font (size 1.27 1.27))))
      )
      (pin passive line (at 22.86 -2.54 180) (length 5.08)
        (name "2" (effects (font (size 1.27 1.27))))
        (number "2" (effects (font (size 1.27 1.27))))
      )
      (pin passive line (at 22.86 -5.08 180) (length 5.08)
        (name "3" (effects (font (size 1.27 1.27))))
        (number "3" (effects (font (size 1.27 1.27))))
      )
      (pin passive line (at 0 0 0) (length 5.08)
        (name "MP1" (effects (font (size 1.27 1.27))))
        (number "MP1" (effects (font (size 1.27 1.27))))
      )
      (pin passive line (at 0 -2.54 0) (length 5.08)
        (name "MP2" (effects (font (size 1.27 1.27))))
        (number "MP2" (effects (font (size 1.27 1.27))))
      )
    )
    (symbol "DF57H-3P-1.2V_21__0_1"
      (polyline
        (pts
          (xy 5.08 2.54)
          (xy 17.78 2.54)
          (xy 17.78 -7.62)
          (xy 5.08 -7.62)
          (xy 5.08 2.54)
        )
        (stroke (width 0.1524) (type default) (color 0 0 0 0))
        (fill (type none))
      )
    )
  )
  (symbol "DF58-4P-1.2V_21_" (pin_names (offset 0.762)) (in_bom yes) (on_board yes)
    (property "Reference" "J" (id 0) (at 16.51 7.62 0)
      (effects (font (size 1.27 1.27)) (justify left))
    )
    (property "Value" "DF58-4P-1.2V_21_" (id 1) (at 16.51 5.08 0)
      (effects (font (size 1.27 1.27)) (justify left))
    )
    (property "Footprint" "DF584P12V21" (id 2) (at 16.51 2.54 0)
      (effects (font (size 1.27 1.27)) (justify left) hide)
    )
    (property "Datasheet" "https://datasheet.datasheetarchive.com/originals/distributors/DKDS-30/591775.pdf" (id 3) (at 16.51 0 0)
      (effects (font (size 1.27 1.27)) (justify left) hide)
    )
    (property "Description" "Hirose DF58 58, 1.2mm Pitch, 4 Way, 1 Row, Straight PCB Header, Surface Mount" (id 4) (at 16.51 -2.54 0)
      (effects (font (size 1.27 1.27)) (justify left) hide)
    )
    (property "Height" "1.1" (id 5) (at 16.51 -5.08 0)
      (effects (font (size 1.27 1.27)) (justify left) hide)
    )
    (property "Mouser Part Number" "798-DF58-4P-1.2V21" (id 6) (at 16.51 -7.62 0)
      (effects (font (size 1.27 1.27)) (justify left) hide)
    )
    (property "Mouser Price/Stock" "https://www.mouser.co.uk/ProductDetail/Hirose-Connector/DF58-4P-12V21?qs=7bTaA%2FLYtSZD8VmLOAYe3A%3D%3D" (id 7) (at 16.51 -10.16 0)
      (effects (font (size 1.27 1.27)) (justify left) hide)
    )
    (property "Manufacturer_Name" "Hirose" (id 8) (at 16.51 -12.7 0)
      (effects (font (size 1.27 1.27)) (justify left) hide)
    )
    (property "Manufacturer_Part_Number" "DF58-4P-1.2V(21)" (id 9) (at 16.51 -15.24 0)
      (effects (font (size 1.27 1.27)) (justify left) hide)
    )
    (property "ki_description" "Hirose DF58 58, 1.2mm Pitch, 4 Way, 1 Row, Straight PCB Header, Surface Mount" (id 10) (at 0 0 0)
      (effects (font (size 1.27 1.27)) hide)
    )
    (symbol "DF58-4P-1.2V_21__0_0"
      (pin passive line (at 20.32 0 180) (length 5.08)
        (name "1" (effects (font (size 1.27 1.27))))
        (number "1" (effects (font (size 1.27 1.27))))
      )
      (pin passive line (at 20.32 -2.54 180) (length 5.08)
        (name "2" (effects (font (size 1.27 1.27))))
        (number "2" (effects (font (size 1.27 1.27))))
      )
      (pin passive line (at 20.32 -5.08 180) (length 5.08)
        (name "3" (effects (font (size 1.27 1.27))))
        (number "3" (effects (font (size 1.27 1.27))))
      )
      (pin passive line (at 20.32 -7.62 180) (length 5.08)
        (name "4" (effects (font (size 1.27 1.27))))
        (number "4" (effects (font (size 1.27 1.27))))
      )
      (pin passive line (at 0 0 0) (length 5.08)
        (name "5" (effects (font (size 1.27 1.27))))
        (number "5" (effects (font (size 1.27 1.27))))
      )
      (pin passive line (at 0 -2.54 0) (length 5.08)
        (name "6" (effects (font (size 1.27 1.27))))
        (number "6" (effects (font (size 1.27 1.27))))
      )
    )
    (symbol "DF58-4P-1.2V_21__0_1"
      (polyline
        (pts
          (xy 5.08 2.54)
          (xy 15.24 2.54)
          (xy 15.24 -10.16)
          (xy 5.08 -10.16)
          (xy 5.08 2.54)
        )
        (stroke (width 0.1524) (type default) (color 0 0 0 0))
        (fill (type none))
      )
    )
  )
  (symbol "DF58-6P-1.2V(21)" (pin_names (offset 1.016)) (in_bom yes) (on_board yes)
    (property "Reference" "J" (id 0) (at 0 8.89 0)
      (effects (font (size 1.27 1.27)) (justify left bottom))
    )
    (property "Value" "DF58-6P-1.2V(21)" (id 1) (at 0 -12.7 0)
      (effects (font (size 1.27 1.27)) (justify left bottom))
    )
    (property "Footprint" "HRS_DF58-6P-1.2V(21)" (id 2) (at 0 0 0)
      (effects (font (size 1.27 1.27)) (justify left bottom) hide)
    )
    (property "Datasheet" "" (id 3) (at 0 0 0)
      (effects (font (size 1.27 1.27)) (justify left bottom) hide)
    )
    (property "MANUFACTURER" "Hirose" (id 4) (at 0 0 0)
      (effects (font (size 1.27 1.27)) (justify left bottom) hide)
    )
    (property "STANDARD" "Manufacturer Recommendations" (id 5) (at 0 0 0)
      (effects (font (size 1.27 1.27)) (justify left bottom) hide)
    )
    (property "MAXIMUM_PACKAGE_HEIGHT" "1.1 mm" (id 6) (at 0 0 0)
      (effects (font (size 1.27 1.27)) (justify left bottom) hide)
    )
    (property "PARTREV" "Apr.1.2022" (id 7) (at 0 0 0)
      (effects (font (size 1.27 1.27)) (justify left bottom) hide)
    )
    (property "ki_locked" "" (id 8) (at 0 0 0)
      (effects (font (size 1.27 1.27)))
    )
    (symbol "DF58-6P-1.2V(21)_0_0"
      (polyline
        (pts
          (xy 0 -8.89)
          (xy 1.27 -10.16)
        )
        (stroke (width 0.254) (type default) (color 0 0 0 0))
        (fill (type none))
      )
      (polyline
        (pts
          (xy 0 -7.62)
          (xy 1.905 -7.62)
        )
        (stroke (width 0.254) (type default) (color 0 0 0 0))
        (fill (type none))
      )
      (polyline
        (pts
          (xy 0 -5.08)
          (xy 1.905 -5.08)
        )
        (stroke (width 0.254) (type default) (color 0 0 0 0))
        (fill (type none))
      )
      (polyline
        (pts
          (xy 0 -2.54)
          (xy 1.905 -2.54)
        )
        (stroke (width 0.254) (type default) (color 0 0 0 0))
        (fill (type none))
      )
      (polyline
        (pts
          (xy 0 0)
          (xy 1.905 0)
        )
        (stroke (width 0.254) (type default) (color 0 0 0 0))
        (fill (type none))
      )
      (polyline
        (pts
          (xy 0 2.54)
          (xy 1.905 2.54)
        )
        (stroke (width 0.254) (type default) (color 0 0 0 0))
        (fill (type none))
      )
      (polyline
        (pts
          (xy 0 5.08)
          (xy 0 -8.89)
        )
        (stroke (width 0.254) (type default) (color 0 0 0 0))
        (fill (type none))
      )
      (polyline
        (pts
          (xy 0 5.08)
          (xy 1.905 5.08)
        )
        (stroke (width 0.254) (type default) (color 0 0 0 0))
        (fill (type none))
      )
      (polyline
        (pts
          (xy 0 6.35)
          (xy 0 5.08)
        )
        (stroke (width 0.254) (type default) (color 0 0 0 0))
        (fill (type none))
      )
      (polyline
        (pts
          (xy 0 6.35)
          (xy 1.27 7.62)
        )
        (stroke (width 0.254) (type default) (color 0 0 0 0))
        (fill (type none))
      )
      (polyline
        (pts
          (xy 1.27 -10.16)
          (xy 7.62 -10.16)
        )
        (stroke (width 0.254) (type default) (color 0 0 0 0))
        (fill (type none))
      )
      (polyline
        (pts
          (xy 7.62 -10.16)
          (xy 7.62 7.62)
        )
        (stroke (width 0.254) (type default) (color 0 0 0 0))
        (fill (type none))
      )
      (polyline
        (pts
          (xy 7.62 7.62)
          (xy 1.27 7.62)
        )
        (stroke (width 0.254) (type default) (color 0 0 0 0))
        (fill (type none))
      )
      (rectangle (start 0.6096 -7.9248) (end 2.2098 -7.2898)
        (stroke (width 0) (type default) (color 0 0 0 0))
        (fill (type outline))
      )
      (rectangle (start 0.6096 -5.3848) (end 2.2098 -4.7498)
        (stroke (width 0) (type default) (color 0 0 0 0))
        (fill (type outline))
      )
      (rectangle (start 0.6096 -2.8448) (end 2.2098 -2.2098)
        (stroke (width 0) (type default) (color 0 0 0 0))
        (fill (type outline))
      )
      (rectangle (start 0.6096 -0.3048) (end 2.2098 0.3048)
        (stroke (width 0) (type default) (color 0 0 0 0))
        (fill (type outline))
      )
      (rectangle (start 0.6096 2.2098) (end 2.2098 2.8448)
        (stroke (width 0) (type default) (color 0 0 0 0))
        (fill (type outline))
      )
      (rectangle (start 0.6096 4.7498) (end 2.2098 5.3848)
        (stroke (width 0) (type default) (color 0 0 0 0))
        (fill (type outline))
      )
      (pin passive line (at -5.08 5.08 0) (length 5.08)
        (name "1" (effects (font (size 1.016 1.016))))
        (number "1" (effects (font (size 1.016 1.016))))
      )
      (pin passive line (at -5.08 2.54 0) (length 5.08)
        (name "2" (effects (font (size 1.016 1.016))))
        (number "2" (effects (font (size 1.016 1.016))))
      )
      (pin passive line (at -5.08 0 0) (length 5.08)
        (name "3" (effects (font (size 1.016 1.016))))
        (number "3" (effects (font (size 1.016 1.016))))
      )
      (pin passive line (at -5.08 -2.54 0) (length 5.08)
        (name "4" (effects (font (size 1.016 1.016))))
        (number "4" (effects (font (size 1.016 1.016))))
      )
      (pin passive line (at -5.08 -5.08 0) (length 5.08)
        (name "5" (effects (font (size 1.016 1.016))))
        (number "5" (effects (font (size 1.016 1.016))))
      )
      (pin passive line (at -5.08 -7.62 0) (length 5.08)
        (name "6" (effects (font (size 1.016 1.016))))
        (number "6" (effects (font (size 1.016 1.016))))
      )
    )
  )
  (symbol "FTSH-110-01-F-DV-007" (pin_names (offset 1.016)) (in_bom yes) (on_board yes)
    (property "Reference" "J" (id 0) (at -8.128 15.24 0)
      (effects (font (size 1.27 1.27)) (justify left bottom))
    )
    (property "Value" "FTSH-110-01-F-DV-007" (id 1) (at -7.62 -15.24 0)
      (effects (font (size 1.27 1.27)) (justify left bottom))
    )
    (property "Footprint" "SAMTEC_FTSH-110-01-F-DV-007" (id 2) (at 0 0 0)
      (effects (font (size 1.27 1.27)) (justify left bottom) hide)
    )
    (property "Datasheet" "" (id 3) (at 0 0 0)
      (effects (font (size 1.27 1.27)) (justify left bottom) hide)
    )
    (property "MANUFACTURER" "Samtec" (id 4) (at 0 0 0)
      (effects (font (size 1.27 1.27)) (justify left bottom) hide)
    )
    (property "STANDARD" "Manufacturer Recommendations" (id 5) (at 0 0 0)
      (effects (font (size 1.27 1.27)) (justify left bottom) hide)
    )
    (property "PARTREV" "R" (id 6) (at 0 0 0)
      (effects (font (size 1.27 1.27)) (justify left bottom) hide)
    )
    (property "ki_locked" "" (id 7) (at 0 0 0)
      (effects (font (size 1.27 1.27)))
    )
    (symbol "FTSH-110-01-F-DV-007_0_0"
      (rectangle (start -7.62 -12.7) (end 7.62 15.24)
        (stroke (width 0.254) (type default) (color 0 0 0 0))
        (fill (type background))
      )
      (pin passive line (at -12.7 12.7 0) (length 5.08)
        (name "01" (effects (font (size 1.016 1.016))))
        (number "01" (effects (font (size 1.016 1.016))))
      )
      (pin passive line (at 12.7 12.7 180) (length 5.08)
        (name "02" (effects (font (size 1.016 1.016))))
        (number "02" (effects (font (size 1.016 1.016))))
      )
      (pin passive line (at -12.7 10.16 0) (length 5.08)
        (name "03" (effects (font (size 1.016 1.016))))
        (number "03" (effects (font (size 1.016 1.016))))
      )
      (pin passive line (at 12.7 10.16 180) (length 5.08)
        (name "04" (effects (font (size 1.016 1.016))))
        (number "04" (effects (font (size 1.016 1.016))))
      )
      (pin passive line (at -12.7 7.62 0) (length 5.08)
        (name "05" (effects (font (size 1.016 1.016))))
        (number "05" (effects (font (size 1.016 1.016))))
      )
      (pin passive line (at 12.7 7.62 180) (length 5.08)
        (name "06" (effects (font (size 1.016 1.016))))
        (number "06" (effects (font (size 1.016 1.016))))
      )
      (pin passive line (at 12.7 5.08 180) (length 5.08)
        (name "08" (effects (font (size 1.016 1.016))))
        (number "08" (effects (font (size 1.016 1.016))))
      )
      (pin passive line (at -12.7 2.54 0) (length 5.08)
        (name "09" (effects (font (size 1.016 1.016))))
        (number "09" (effects (font (size 1.016 1.016))))
      )
      (pin passive line (at 12.7 2.54 180) (length 5.08)
        (name "10" (effects (font (size 1.016 1.016))))
        (number "10" (effects (font (size 1.016 1.016))))
      )
      (pin passive line (at -12.7 0 0) (length 5.08)
        (name "11" (effects (font (size 1.016 1.016))))
        (number "11" (effects (font (size 1.016 1.016))))
      )
      (pin passive line (at 12.7 0 180) (length 5.08)
        (name "12" (effects (font (size 1.016 1.016))))
        (number "12" (effects (font (size 1.016 1.016))))
      )
      (pin passive line (at -12.7 -2.54 0) (length 5.08)
        (name "13" (effects (font (size 1.016 1.016))))
        (number "13" (effects (font (size 1.016 1.016))))
      )
      (pin passive line (at 12.7 -2.54 180) (length 5.08)
        (name "14" (effects (font (size 1.016 1.016))))
        (number "14" (effects (font (size 1.016 1.016))))
      )
      (pin passive line (at -12.7 -5.08 0) (length 5.08)
        (name "15" (effects (font (size 1.016 1.016))))
        (number "15" (effects (font (size 1.016 1.016))))
      )
      (pin passive line (at 12.7 -5.08 180) (length 5.08)
        (name "16" (effects (font (size 1.016 1.016))))
        (number "16" (effects (font (size 1.016 1.016))))
      )
      (pin passive line (at -12.7 -7.62 0) (length 5.08)
        (name "17" (effects (font (size 1.016 1.016))))
        (number "17" (effects (font (size 1.016 1.016))))
      )
      (pin passive line (at 12.7 -7.62 180) (length 5.08)
        (name "18" (effects (font (size 1.016 1.016))))
        (number "18" (effects (font (size 1.016 1.016))))
      )
      (pin passive line (at -12.7 -10.16 0) (length 5.08)
        (name "19" (effects (font (size 1.016 1.016))))
        (number "19" (effects (font (size 1.016 1.016))))
      )
      (pin passive line (at 12.7 -10.16 180) (length 5.08)
        (name "20" (effects (font (size 1.016 1.016))))
        (number "20" (effects (font (size 1.016 1.016))))
      )
    )
  )
  (symbol "HD3SS3411IRWAR" (pin_names (offset 0.762)) (in_bom yes) (on_board yes)
    (property "Reference" "IC" (id 0) (at 26.67 17.78 0)
      (effects (font (size 1.27 1.27)) (justify left))
    )
    (property "Value" "HD3SS3411IRWAR" (id 1) (at 26.67 15.24 0)
      (effects (font (size 1.27 1.27)) (justify left))
    )
    (property "Footprint" "HD3SS3411IRWAR" (id 2) (at 26.67 12.7 0)
      (effects (font (size 1.27 1.27)) (justify left) hide)
    )
    (property "Datasheet" "http://www.ti.com/lit/gpn/hd3ss3411" (id 3) (at 26.67 10.16 0)
      (effects (font (size 1.27 1.27)) (justify left) hide)
    )
    (property "Description" "3.3V, PCI Express 3.0 1-Channel Analog Differential Switch" (id 4) (at 26.67 7.62 0)
      (effects (font (size 1.27 1.27)) (justify left) hide)
    )
    (property "Height" "0.8" (id 5) (at 26.67 5.08 0)
      (effects (font (size 1.27 1.27)) (justify left) hide)
    )
    (property "Mouser Part Number" "595-HD3SS3411IRWAR" (id 6) (at 26.67 2.54 0)
      (effects (font (size 1.27 1.27)) (justify left) hide)
    )
    (property "Mouser Price/Stock" "https://www.mouser.co.uk/ProductDetail/Texas-Instruments/HD3SS3411IRWAR?qs=8%2FmU9qzJpL8cn1EU%2Fiz3bA%3D%3D" (id 7) (at 26.67 0 0)
      (effects (font (size 1.27 1.27)) (justify left) hide)
    )
    (property "Manufacturer_Name" "Texas Instruments" (id 8) (at 26.67 -2.54 0)
      (effects (font (size 1.27 1.27)) (justify left) hide)
    )
    (property "Manufacturer_Part_Number" "HD3SS3411IRWAR" (id 9) (at 26.67 -5.08 0)
      (effects (font (size 1.27 1.27)) (justify left) hide)
    )
    (property "ki_description" "3.3V, PCI Express 3.0 1-Channel Analog Differential Switch" (id 10) (at 0 0 0)
      (effects (font (size 1.27 1.27)) hide)
    )
    (symbol "HD3SS3411IRWAR_0_0"
      (pin passive line (at 12.7 17.78 270) (length 5.08)
        (name "OEN" (effects (font (size 1.27 1.27))))
        (number "1" (effects (font (size 1.27 1.27))))
      )
      (pin passive line (at 30.48 -7.62 180) (length 5.08)
        (name "CP" (effects (font (size 1.27 1.27))))
        (number "10" (effects (font (size 1.27 1.27))))
      )
      (pin passive line (at 30.48 -5.08 180) (length 5.08)
        (name "GND_3" (effects (font (size 1.27 1.27))))
        (number "11" (effects (font (size 1.27 1.27))))
      )
      (pin passive line (at 30.48 -2.54 180) (length 5.08)
        (name "BN" (effects (font (size 1.27 1.27))))
        (number "12" (effects (font (size 1.27 1.27))))
      )
      (pin passive line (at 30.48 0 180) (length 5.08)
        (name "BP" (effects (font (size 1.27 1.27))))
        (number "13" (effects (font (size 1.27 1.27))))
      )
      (pin passive line (at 17.78 17.78 270) (length 5.08)
        (name "GND_4" (effects (font (size 1.27 1.27))))
        (number "14" (effects (font (size 1.27 1.27))))
      )
      (pin passive line (at 15.24 17.78 270) (length 5.08)
        (name "EP" (effects (font (size 1.27 1.27))))
        (number "15" (effects (font (size 1.27 1.27))))
      )
      (pin passive line (at 0 0 0) (length 5.08)
        (name "AP" (effects (font (size 1.27 1.27))))
        (number "2" (effects (font (size 1.27 1.27))))
      )
      (pin passive line (at 0 -2.54 0) (length 5.08)
        (name "AN" (effects (font (size 1.27 1.27))))
        (number "3" (effects (font (size 1.27 1.27))))
      )
      (pin passive line (at 0 -5.08 0) (length 5.08)
        (name "VCC" (effects (font (size 1.27 1.27))))
        (number "4" (effects (font (size 1.27 1.27))))
      )
      (pin passive line (at 0 -7.62 0) (length 5.08)
        (name "GND_1" (effects (font (size 1.27 1.27))))
        (number "5" (effects (font (size 1.27 1.27))))
      )
      (pin passive line (at 0 -10.16 0) (length 5.08)
        (name "RSVD" (effects (font (size 1.27 1.27))))
        (number "6" (effects (font (size 1.27 1.27))))
      )
      (pin passive line (at 12.7 -27.94 90) (length 5.08)
        (name "SEL" (effects (font (size 1.27 1.27))))
        (number "7" (effects (font (size 1.27 1.27))))
      )
      (pin passive line (at 15.24 -27.94 90) (length 5.08)
        (name "GND_2" (effects (font (size 1.27 1.27))))
        (number "8" (effects (font (size 1.27 1.27))))
      )
      (pin passive line (at 30.48 -10.16 180) (length 5.08)
        (name "CN" (effects (font (size 1.27 1.27))))
        (number "9" (effects (font (size 1.27 1.27))))
      )
    )
    (symbol "HD3SS3411IRWAR_0_1"
      (polyline
        (pts
          (xy 5.08 12.7)
          (xy 25.4 12.7)
          (xy 25.4 -22.86)
          (xy 5.08 -22.86)
          (xy 5.08 12.7)
        )
        (stroke (width 0.1524) (type default) (color 0 0 0 0))
        (fill (type none))
      )
    )
  )
  (symbol "M80-8530642" (pin_names (offset 0.762)) (in_bom yes) (on_board yes)
    (property "Reference" "J" (id 0) (at 16.51 7.62 0)
      (effects (font (size 1.27 1.27)) (justify left))
    )
    (property "Value" "M80-8530642" (id 1) (at 16.51 5.08 0)
      (effects (font (size 1.27 1.27)) (justify left))
    )
    (property "Footprint" "M80-85306YY" (id 2) (at 16.51 2.54 0)
      (effects (font (size 1.27 1.27)) (justify left) hide)
    )
    (property "Datasheet" "https://cdn.harwin.com/pdfs/M80-853.pdf" (id 3) (at 16.51 0 0)
      (effects (font (size 1.27 1.27)) (justify left) hide)
    )
    (property "Description" "6 Pos. Male DIL Vertical Throughboard Conn. Latches, 2.00mm Pitch High-Reliability Connector - Datamate L-Tek" (id 4) (at 16.51 -2.54 0)
      (effects (font (size 1.27 1.27)) (justify left) hide)
    )
    (property "Height" "" (id 5) (at 16.51 -5.08 0)
      (effects (font (size 1.27 1.27)) (justify left) hide)
    )
    (property "Mouser Part Number" "855-M80-8530642" (id 6) (at 16.51 -7.62 0)
      (effects (font (size 1.27 1.27)) (justify left) hide)
    )
    (property "Mouser Price/Stock" "https://www.mouser.co.uk/ProductDetail/Harwin/M80-8530642?qs=QGk6feVlqMLVPpNVA18I%2FA%3D%3D" (id 7) (at 16.51 -10.16 0)
      (effects (font (size 1.27 1.27)) (justify left) hide)
    )
    (property "Manufacturer_Name" "Harwin" (id 8) (at 16.51 -12.7 0)
      (effects (font (size 1.27 1.27)) (justify left) hide)
    )
    (property "Manufacturer_Part_Number" "M80-8530642" (id 9) (at 16.51 -15.24 0)
      (effects (font (size 1.27 1.27)) (justify left) hide)
    )
    (property "ki_description" "6 Pos. Male DIL Vertical Throughboard Conn. Latches, 2.00mm Pitch High-Reliability Connector - Datamate L-Tek" (id 10) (at 0 0 0)
      (effects (font (size 1.27 1.27)) hide)
    )
    (symbol "M80-8530642_0_0"
      (pin passive line (at 20.32 -5.08 180) (length 5.08)
        (name "1" (effects (font (size 1.27 1.27))))
        (number "1" (effects (font (size 1.27 1.27))))
      )
      (pin passive line (at 20.32 -2.54 180) (length 5.08)
        (name "2" (effects (font (size 1.27 1.27))))
        (number "2" (effects (font (size 1.27 1.27))))
      )
      (pin passive line (at 20.32 0 180) (length 5.08)
        (name "3" (effects (font (size 1.27 1.27))))
        (number "3" (effects (font (size 1.27 1.27))))
      )
      (pin passive line (at 0 -5.08 0) (length 5.08)
        (name "4" (effects (font (size 1.27 1.27))))
        (number "4" (effects (font (size 1.27 1.27))))
      )
      (pin passive line (at 0 -2.54 0) (length 5.08)
        (name "5" (effects (font (size 1.27 1.27))))
        (number "5" (effects (font (size 1.27 1.27))))
      )
      (pin passive line (at 0 0 0) (length 5.08)
        (name "6" (effects (font (size 1.27 1.27))))
        (number "6" (effects (font (size 1.27 1.27))))
      )
    )
    (symbol "M80-8530642_0_1"
      (polyline
        (pts
          (xy 5.08 2.54)
          (xy 15.24 2.54)
          (xy 15.24 -7.62)
          (xy 5.08 -7.62)
          (xy 5.08 2.54)
        )
        (stroke (width 0.1524) (type default) (color 0 0 0 0))
        (fill (type none))
      )
    )
  )
  (symbol "M80-8870805" (pin_names (offset 0.762)) (in_bom yes) (on_board yes)
    (property "Reference" "J" (id 0) (at 16.51 7.62 0)
      (effects (font (size 1.27 1.27)) (justify left))
    )
    (property "Value" "M80-8870805" (id 1) (at 16.51 5.08 0)
      (effects (font (size 1.27 1.27)) (justify left))
    )
    (property "Footprint" "M80-88708YY" (id 2) (at 16.51 2.54 0)
      (effects (font (size 1.27 1.27)) (justify left) hide)
    )
    (property "Datasheet" "https://cdn.harwin.com/pdfs/M80-541.pdf" (id 3) (at 16.51 0 0)
      (effects (font (size 1.27 1.27)) (justify left) hide)
    )
    (property "Description" "8 Pos. Male DIL Horizontal Throughboard Conn. Jackscrews, 2.00mm Pitch High-Reliability Connector - Datamate J-Tek" (id 4) (at 16.51 -2.54 0)
      (effects (font (size 1.27 1.27)) (justify left) hide)
    )
    (property "Height" "6.05" (id 5) (at 16.51 -5.08 0)
      (effects (font (size 1.27 1.27)) (justify left) hide)
    )
    (property "Mouser Part Number" "855-M80-8870805" (id 6) (at 16.51 -7.62 0)
      (effects (font (size 1.27 1.27)) (justify left) hide)
    )
    (property "Mouser Price/Stock" "https://www.mouser.co.uk/ProductDetail/Harwin/M80-8870805?qs=SevrRHiFoLhttX1H%2FGWiUA%3D%3D" (id 7) (at 16.51 -10.16 0)
      (effects (font (size 1.27 1.27)) (justify left) hide)
    )
    (property "Manufacturer_Name" "Harwin" (id 8) (at 16.51 -12.7 0)
      (effects (font (size 1.27 1.27)) (justify left) hide)
    )
    (property "Manufacturer_Part_Number" "M80-8870805" (id 9) (at 16.51 -15.24 0)
      (effects (font (size 1.27 1.27)) (justify left) hide)
    )
    (property "ki_description" "8 Pos. Male DIL Horizontal Throughboard Conn. Jackscrews, 2.00mm Pitch High-Reliability Connector - Datamate J-Tek" (id 10) (at 0 0 0)
      (effects (font (size 1.27 1.27)) hide)
    )
    (symbol "M80-8870805_0_0"
      (pin passive line (at 0 -7.62 0) (length 5.08)
        (name "1" (effects (font (size 1.27 1.27))))
        (number "1" (effects (font (size 1.27 1.27))))
      )
      (pin passive line (at 0 -5.08 0) (length 5.08)
        (name "2" (effects (font (size 1.27 1.27))))
        (number "2" (effects (font (size 1.27 1.27))))
      )
      (pin passive line (at 0 -2.54 0) (length 5.08)
        (name "3" (effects (font (size 1.27 1.27))))
        (number "3" (effects (font (size 1.27 1.27))))
      )
      (pin passive line (at 0 0 0) (length 5.08)
        (name "4" (effects (font (size 1.27 1.27))))
        (number "4" (effects (font (size 1.27 1.27))))
      )
      (pin passive line (at 20.32 -7.62 180) (length 5.08)
        (name "5" (effects (font (size 1.27 1.27))))
        (number "5" (effects (font (size 1.27 1.27))))
      )
      (pin passive line (at 20.32 -5.08 180) (length 5.08)
        (name "6" (effects (font (size 1.27 1.27))))
        (number "6" (effects (font (size 1.27 1.27))))
      )
      (pin passive line (at 20.32 -2.54 180) (length 5.08)
        (name "7" (effects (font (size 1.27 1.27))))
        (number "7" (effects (font (size 1.27 1.27))))
      )
      (pin passive line (at 20.32 0 180) (length 5.08)
        (name "8" (effects (font (size 1.27 1.27))))
        (number "8" (effects (font (size 1.27 1.27))))
      )
    )
    (symbol "M80-8870805_0_1"
      (polyline
        (pts
          (xy 5.08 2.54)
          (xy 15.24 2.54)
          (xy 15.24 -10.16)
          (xy 5.08 -10.16)
          (xy 5.08 2.54)
        )
        (stroke (width 0.1524) (type default) (color 0 0 0 0))
        (fill (type none))
      )
    )
  )
  (symbol "TCAN337GD" (pin_names (offset 0.762)) (in_bom yes) (on_board yes)
    (property "Reference" "IC" (id 0) (at 24.13 7.62 0)
      (effects (font (size 1.27 1.27)) (justify left))
    )
    (property "Value" "TCAN337GD" (id 1) (at 24.13 5.08 0)
      (effects (font (size 1.27 1.27)) (justify left))
    )
    (property "Footprint" "SOIC127P600X175-8N" (id 2) (at 24.13 2.54 0)
      (effects (font (size 1.27 1.27)) (justify left) hide)
    )
    (property "Datasheet" "https://www.arrow.com/en/products/tcan337gd/texas-instruments" (id 3) (at 24.13 0 0)
      (effects (font (size 1.27 1.27)) (justify left) hide)
    )
    (property "Description" "CAN Interface IC" (id 4) (at 24.13 -2.54 0)
      (effects (font (size 1.27 1.27)) (justify left) hide)
    )
    (property "Height" "1.75" (id 5) (at 24.13 -5.08 0)
      (effects (font (size 1.27 1.27)) (justify left) hide)
    )
    (property "Mouser Part Number" "595-TCAN337GD" (id 6) (at 24.13 -7.62 0)
      (effects (font (size 1.27 1.27)) (justify left) hide)
    )
    (property "Mouser Price/Stock" "https://www.mouser.co.uk/ProductDetail/Texas-Instruments/TCAN337GD?qs=gMfM3zrbS4qmjQESf%252BTgJw%3D%3D" (id 7) (at 24.13 -10.16 0)
      (effects (font (size 1.27 1.27)) (justify left) hide)
    )
    (property "Manufacturer_Name" "Texas Instruments" (id 8) (at 24.13 -12.7 0)
      (effects (font (size 1.27 1.27)) (justify left) hide)
    )
    (property "Manufacturer_Part_Number" "TCAN337GD" (id 9) (at 24.13 -15.24 0)
      (effects (font (size 1.27 1.27)) (justify left) hide)
    )
    (property "ki_description" "CAN Interface IC" (id 10) (at 0 0 0)
      (effects (font (size 1.27 1.27)) hide)
    )
    (symbol "TCAN337GD_0_0"
      (pin passive line (at 0 0 0) (length 5.08)
        (name "TXD" (effects (font (size 1.27 1.27))))
        (number "1" (effects (font (size 1.27 1.27))))
      )
      (pin passive line (at 0 -2.54 0) (length 5.08)
        (name "GND" (effects (font (size 1.27 1.27))))
        (number "2" (effects (font (size 1.27 1.27))))
      )
      (pin passive line (at 0 -5.08 0) (length 5.08)
        (name "VCC" (effects (font (size 1.27 1.27))))
        (number "3" (effects (font (size 1.27 1.27))))
      )
      (pin passive line (at 0 -7.62 0) (length 5.08)
        (name "RXD" (effects (font (size 1.27 1.27))))
        (number "4" (effects (font (size 1.27 1.27))))
      )
      (pin passive line (at 27.94 -7.62 180) (length 5.08)
        (name "FAULT" (effects (font (size 1.27 1.27))))
        (number "5" (effects (font (size 1.27 1.27))))
      )
      (pin passive line (at 27.94 -5.08 180) (length 5.08)
        (name "CANL" (effects (font (size 1.27 1.27))))
        (number "6" (effects (font (size 1.27 1.27))))
      )
      (pin passive line (at 27.94 -2.54 180) (length 5.08)
        (name "CANH" (effects (font (size 1.27 1.27))))
        (number "7" (effects (font (size 1.27 1.27))))
      )
      (pin passive line (at 27.94 0 180) (length 5.08)
        (name "S" (effects (font (size 1.27 1.27))))
        (number "8" (effects (font (size 1.27 1.27))))
      )
    )
    (symbol "TCAN337GD_0_1"
      (polyline
        (pts
          (xy 5.08 2.54)
          (xy 22.86 2.54)
          (xy 22.86 -10.16)
          (xy 5.08 -10.16)
          (xy 5.08 2.54)
        )
        (stroke (width 0.1524) (type default) (color 0 0 0 0))
        (fill (type none))
      )
    )
  )
  (symbol "TSW-104-14-F-S" (pin_names (offset 1.016)) (in_bom yes) (on_board yes)
    (property "Reference" "J" (id 0) (at -8.128 7.62 0)
      (effects (font (size 1.27 1.27)) (justify left bottom))
    )
    (property "Value" "TSW-104-14-F-S" (id 1) (at -7.62 -7.62 0)
      (effects (font (size 1.27 1.27)) (justify left bottom))
    )
    (property "Footprint" "SAMTEC_TSW-104-14-F-S" (id 2) (at 0 0 0)
      (effects (font (size 1.27 1.27)) (justify left bottom) hide)
    )
    (property "Datasheet" "" (id 3) (at 0 0 0)
      (effects (font (size 1.27 1.27)) (justify left bottom) hide)
    )
    (property "STANDARD" "Manufacturer Recommendations" (id 4) (at 0 0 0)
      (effects (font (size 1.27 1.27)) (justify left bottom) hide)
    )
    (property "MANUFACTURER" "Samtec Inc." (id 5) (at 0 0 0)
      (effects (font (size 1.27 1.27)) (justify left bottom) hide)
    )
    (property "PARTREV" "R" (id 6) (at 0 0 0)
      (effects (font (size 1.27 1.27)) (justify left bottom) hide)
    )
    (property "ki_locked" "" (id 7) (at 0 0 0)
      (effects (font (size 1.27 1.27)))
    )
    (symbol "TSW-104-14-F-S_0_0"
      (rectangle (start -7.62 -5.08) (end 7.62 7.62)
        (stroke (width 0.254) (type default) (color 0 0 0 0))
        (fill (type background))
      )
      (pin passive line (at -12.7 5.08 0) (length 5.08)
        (name "01" (effects (font (size 1.016 1.016))))
        (number "01" (effects (font (size 1.016 1.016))))
      )
      (pin passive line (at -12.7 2.54 0) (length 5.08)
        (name "02" (effects (font (size 1.016 1.016))))
        (number "02" (effects (font (size 1.016 1.016))))
      )
      (pin passive line (at -12.7 0 0) (length 5.08)
        (name "03" (effects (font (size 1.016 1.016))))
        (number "03" (effects (font (size 1.016 1.016))))
      )
      (pin passive line (at -12.7 -2.54 0) (length 5.08)
        (name "04" (effects (font (size 1.016 1.016))))
        (number "04" (effects (font (size 1.016 1.016))))
      )
    )
  )
  (symbol "TSW-107-24-L-S" (pin_names (offset 1.016)) (in_bom yes) (on_board yes)
    (property "Reference" "J" (id 0) (at -8.128 10.16 0)
      (effects (font (size 1.27 1.27)) (justify left bottom))
    )
    (property "Value" "TSW-107-24-L-S" (id 1) (at -7.62 -12.7 0)
      (effects (font (size 1.27 1.27)) (justify left bottom))
    )
    (property "Footprint" "SAMTEC_TSW-107-24-L-S" (id 2) (at 0 0 0)
      (effects (font (size 1.27 1.27)) (justify left bottom) hide)
    )
    (property "Datasheet" "" (id 3) (at 0 0 0)
      (effects (font (size 1.27 1.27)) (justify left bottom) hide)
    )
    (property "STANDARD" "Manufacturer Recommendations" (id 4) (at 0 0 0)
      (effects (font (size 1.27 1.27)) (justify left bottom) hide)
    )
    (property "MANUFACTURER" "Samtec" (id 5) (at 0 0 0)
      (effects (font (size 1.27 1.27)) (justify left bottom) hide)
    )
    (property "PARTREV" "R" (id 6) (at 0 0 0)
      (effects (font (size 1.27 1.27)) (justify left bottom) hide)
    )
    (property "ki_locked" "" (id 7) (at 0 0 0)
      (effects (font (size 1.27 1.27)))
    )
    (symbol "TSW-107-24-L-S_0_0"
      (rectangle (start -7.62 -10.16) (end 7.62 10.16)
        (stroke (width 0.254) (type default) (color 0 0 0 0))
        (fill (type background))
      )
      (pin passive line (at -12.7 7.62 0) (length 5.08)
        (name "01" (effects (font (size 1.016 1.016))))
        (number "01" (effects (font (size 1.016 1.016))))
      )
      (pin passive line (at -12.7 5.08 0) (length 5.08)
        (name "02" (effects (font (size 1.016 1.016))))
        (number "02" (effects (font (size 1.016 1.016))))
      )
      (pin passive line (at -12.7 2.54 0) (length 5.08)
        (name "03" (effects (font (size 1.016 1.016))))
        (number "03" (effects (font (size 1.016 1.016))))
      )
      (pin passive line (at -12.7 0 0) (length 5.08)
        (name "04" (effects (font (size 1.016 1.016))))
        (number "04" (effects (font (size 1.016 1.016))))
      )
      (pin passive line (at -12.7 -2.54 0) (length 5.08)
        (name "05" (effects (font (size 1.016 1.016))))
        (number "05" (effects (font (size 1.016 1.016))))
      )
      (pin passive line (at -12.7 -5.08 0) (length 5.08)
        (name "06" (effects (font (size 1.016 1.016))))
        (number "06" (effects (font (size 1.016 1.016))))
      )
      (pin passive line (at -12.7 -7.62 0) (length 5.08)
        (name "07" (effects (font (size 1.016 1.016))))
        (number "07" (effects (font (size 1.016 1.016))))
      )
    )
  )
)
