(footprint "SAMTEC_TFML-110-02-L-D-LC-TR" (version 20211014) (generator pcbnew)
  (layer "F.Cu")
  (tedit 629346E5)
  (attr through_hole)
  (fp_text reference "REF**" (at -5.765 -5.06) (layer "F.SilkS")
    (effects (font (size 1 1) (thickness 0.15)))
    (tstamp 98914cc3-56fe-40bb-820a-3d157225c145)
  )
  (fp_text value "SAMTEC_TFML-110-02-L-D-LC-TR" (at 8.84 5.04) (layer "F.Fab")
    (effects (font (size 1 1) (thickness 0.15)))
    (tstamp 3c5e5ea9-793d-46e3-86bc-5884c4490dc7)
  )
  (fp_line (start 6.435 2.86) (end 7.94 2.86) (layer "F.SilkS") (width 0.2) (tstamp 1f9ae101-c652-4998-a503-17aedf3d5746))
  (fp_line (start 7.94 2.86) (end 7.94 0.88108) (layer "F.SilkS") (width 0.2) (tstamp 4c843bdb-6c9e-40dd-85e2-0567846e18ba))
  (fp_line (start -6.435 2.86) (end -7.94 2.86) (layer "F.SilkS") (width 0.2) (tstamp 5c30b9b4-3014-4f50-9329-27a539b67e01))
  (fp_line (start 7.94 -0.88108) (end 7.94 -2.86) (layer "F.SilkS") (width 0.2) (tstamp 6ffdf05e-e119-49f9-85e9-13e4901df42a))
  (fp_line (start -7.94 -2.86) (end -6.435 -2.86) (layer "F.SilkS") (width 0.2) (tstamp 88cb65f4-7e9e-44eb-8692-3b6e2e788a94))
  (fp_line (start -7.94 -2.86) (end -7.94 -0.88108) (layer "F.SilkS") (width 0.2) (tstamp 9a2d648d-863a-4b7b-80f9-d537185c212b))
  (fp_line (start -7.94 0.88108) (end -7.94 2.86) (layer "F.SilkS") (width 0.2) (tstamp c4cab9c5-d6e5-4660-b910-603a51b56783))
  (fp_line (start 6.435 -2.86) (end 7.94 -2.86) (layer "F.SilkS") (width 0.2) (tstamp e5b328f6-dc69-4905-ae98-2dc3200a51d6))
  (fp_circle (center -8.725 1.715) (end -8.625 1.715) (layer "F.SilkS") (width 0.2) (fill none) (tstamp 36d783e7-096f-4c97-9672-7e08c083b87b))
  (fp_line (start 8.325 -3.425) (end 8.325 3.425) (layer "F.CrtYd") (width 0.05) (tstamp 29bb7297-26fb-4776-9266-2355d022bab0))
  (fp_line (start -8.325 3.425) (end -8.325 -3.425) (layer "F.CrtYd") (width 0.05) (tstamp 72b36951-3ec7-4569-9c88-cf9b4afe1cae))
  (fp_line (start 8.325 3.425) (end -8.325 3.425) (layer "F.CrtYd") (width 0.05) (tstamp cb6062da-8dcd-4826-92fd-4071e9e97213))
  (fp_line (start -8.325 -3.425) (end 8.325 -3.425) (layer "F.CrtYd") (width 0.05) (tstamp eb8d02e9-145c-465d-b6a8-bae84d47a94b))
  (fp_line (start 7.94 -2.86) (end 7.94 2.86) (layer "F.Fab") (width 0.1) (tstamp 30317bf0-88bb-49e7-bf8b-9f3883982225))
  (fp_line (start -7.94 -2.86) (end 7.94 -2.86) (layer "F.Fab") (width 0.1) (tstamp 3e915099-a18e-49f4-89bb-abe64c2dade5))
  (fp_line (start -7.94 2.86) (end -7.94 -2.86) (layer "F.Fab") (width 0.1) (tstamp cb721686-5255-4788-a3b0-ce4312e32eb7))
  (fp_line (start -7.94 -2.86) (end 7.94 -2.86) (layer "F.Fab") (width 0.1) (tstamp d4db7f11-8cfe-40d2-b021-b36f05241701))
  (fp_line (start -7.94 2.86) (end -7.94 -2.86) (layer "F.Fab") (width 0.1) (tstamp eab9c52c-3aa0-43a7-bc7f-7e234ff1e9f4))
  (fp_line (start 7.94 2.86) (end -7.94 2.86) (layer "F.Fab") (width 0.1) (tstamp f959907b-1cef-4760-b043-4260a660a2ae))
  (fp_line (start 7.94 -2.86) (end 7.94 2.86) (layer "F.Fab") (width 0.1) (tstamp faa1812c-fdf3-47ae-9cf4-ae06a263bfbd))
  (fp_circle (center -8.725 1.715) (end -8.625 1.715) (layer "F.Fab") (width 0.2) (fill none) (tstamp 0a1a4d88-972a-46ce-b25e-6cb796bd41f7))
  (pad "" np_thru_hole circle (at -7.305 0) (size 1.19 1.19) (drill 1.19) (layers *.Cu *.Mask) (tstamp 9dcdc92b-2219-4a4a-8954-45f02cc3ab25))
  (pad "" np_thru_hole circle (at 7.305 0) (size 1.19 1.19) (drill 1.19) (layers *.Cu *.Mask) (tstamp dae72997-44fc-4275-b36f-cd70bf46cfba))
  (pad "01" smd rect (at -5.715 1.715) (size 0.74 2.92) (layers "F.Cu" "F.Paste" "F.Mask") (tstamp 5d9921f1-08b3-4cc9-8cf7-e9a72ca2fdb7))
  (pad "02" smd rect (at -5.715 -1.715) (size 0.74 2.92) (layers "F.Cu" "F.Paste" "F.Mask") (tstamp c8b6b273-3d20-4a46-8069-f6d608563604))
  (pad "03" smd rect (at -4.445 1.715) (size 0.74 2.92) (layers "F.Cu" "F.Paste" "F.Mask") (tstamp 92035a88-6c95-4a61-bd8a-cb8dd9e5018a))
  (pad "04" smd rect (at -4.445 -1.715) (size 0.74 2.92) (layers "F.Cu" "F.Paste" "F.Mask") (tstamp 4ec618ae-096f-4256-9328-005ee04f13d6))
  (pad "05" smd rect (at -3.175 1.715) (size 0.74 2.92) (layers "F.Cu" "F.Paste" "F.Mask") (tstamp 3326423d-8df7-4a7e-a354-349430b8fbd7))
  (pad "06" smd rect (at -3.175 -1.715) (size 0.74 2.92) (layers "F.Cu" "F.Paste" "F.Mask") (tstamp 4d4fecdd-be4a-47e9-9085-2268d5852d8f))
  (pad "07" smd rect (at -1.905 1.715) (size 0.74 2.92) (layers "F.Cu" "F.Paste" "F.Mask") (tstamp 8458d41c-5d62-455d-b6e1-9f718c0faac9))
  (pad "08" smd rect (at -1.905 -1.715) (size 0.74 2.92) (layers "F.Cu" "F.Paste" "F.Mask") (tstamp 8de2d84c-ff45-4d4f-bc49-c166f6ae6b91))
  (pad "09" smd rect (at -0.635 1.715) (size 0.74 2.92) (layers "F.Cu" "F.Paste" "F.Mask") (tstamp 935057d5-6882-4c15-9a35-54677912ba12))
  (pad "10" smd rect (at -0.635 -1.715) (size 0.74 2.92) (layers "F.Cu" "F.Paste" "F.Mask") (tstamp e091e263-c616-48ef-a460-465c70218987))
  (pad "11" smd rect (at 0.635 1.715) (size 0.74 2.92) (layers "F.Cu" "F.Paste" "F.Mask") (tstamp 71c6e723-673c-45a9-a0e4-9742220c52a3))
  (pad "12" smd rect (at 0.635 -1.715) (size 0.74 2.92) (layers "F.Cu" "F.Paste" "F.Mask") (tstamp b4833916-7a3e-4498-86fb-ec6d13262ffe))
  (pad "13" smd rect (at 1.905 1.715) (size 0.74 2.92) (layers "F.Cu" "F.Paste" "F.Mask") (tstamp cc48dd41-7768-48d3-b096-2c4cc2126c9d))
  (pad "14" smd rect (at 1.905 -1.715) (size 0.74 2.92) (layers "F.Cu" "F.Paste" "F.Mask") (tstamp 4185c36c-c66e-4dbd-be5d-841e551f4885))
  (pad "15" smd rect (at 3.175 1.715) (size 0.74 2.92) (layers "F.Cu" "F.Paste" "F.Mask") (tstamp a8b4bc7e-da32-4fb8-b71a-d7b47c6f741f))
  (pad "16" smd rect (at 3.175 -1.715) (size 0.74 2.92) (layers "F.Cu" "F.Paste" "F.Mask") (tstamp 0fd35a3e-b394-4aae-875a-fac843f9cbb7))
  (pad "17" smd rect (at 4.445 1.715) (size 0.74 2.92) (layers "F.Cu" "F.Paste" "F.Mask") (tstamp c088f712-1abe-4cac-9a8b-d564931395aa))
  (pad "18" smd rect (at 4.445 -1.715) (size 0.74 2.92) (layers "F.Cu" "F.Paste" "F.Mask") (tstamp ea6fde00-59dc-4a79-a647-7e38199fae0e))
  (pad "19" smd rect (at 5.715 1.715) (size 0.74 2.92) (layers "F.Cu" "F.Paste" "F.Mask") (tstamp f73b5500-6337-4860-a114-6e307f65ec9f))
  (pad "20" smd rect (at 5.715 -1.715) (size 0.74 2.92) (layers "F.Cu" "F.Paste" "F.Mask") (tstamp d3d57924-54a6-421d-a3a0-a044fc909e88))
  (model "${KIPRJMOD}/3D/step/TFML-110-02-L-D-LC-P-TR.stp"
    (offset (xyz 0 0 0))
    (scale (xyz 1 1 1))
    (rotate (xyz -90 0 0))
  )
)
