(footprint "FCI_D09S13A4GX00LF" (version 20211014) (generator pcbnew)
  (layer "F.Cu")
  (tedit 63B71AAA)
  (attr through_hole)
  (fp_text reference "REF**" (at -16.409135 8.837925 180) (layer "F.SilkS")
    (effects (font (size 1.001472 1.001472) (thickness 0.15)))
    (tstamp b596ba86-4cb5-4e9d-ac9b-7f027b80eb27)
  )
  (fp_text value "FCI_D09S13A4GX00LF" (at 16.396865 0.57117 180) (layer "F.Fab")
    (effects (font (size 1.001945 1.001945) (thickness 0.15)))
    (tstamp c3d638ce-8f6c-47ad-8639-dfb54a24d311)
  )
  (fp_line (start -15.405 -2.98) (end -15.405 7.72) (layer "F.SilkS") (width 0.127) (tstamp 1923b6b6-65ae-4fe3-82ea-73f9ea17d2d2))
  (fp_line (start 15.405 7.72) (end 15.405 -2.98) (layer "F.SilkS") (width 0.127) (tstamp 39b17dcc-b579-48eb-99f3-8ad85f887840))
  (fp_line (start -15.405 7.72) (end 15.405 7.72) (layer "F.SilkS") (width 0.127) (tstamp 430e1872-d3f2-471c-9b9b-8b731320a2bb))
  (fp_line (start -15.405 7.72) (end -15.405 11.67) (layer "F.SilkS") (width 0.127) (tstamp 6ad8ee5c-6b0a-40c4-82c7-a44370bbcf5e))
  (fp_line (start -8.105 11.67) (end -8.105 17.84) (layer "F.SilkS") (width 0.127) (tstamp 78ea78a9-1b99-49ad-b593-2cdb51728f7c))
  (fp_line (start 15.405 11.67) (end 15.405 7.72) (layer "F.SilkS") (width 0.127) (tstamp 7f2ab0b1-108b-40d2-8120-132a3d8db186))
  (fp_line (start 8.105 11.67) (end 8.105 17.84) (layer "F.SilkS") (width 0.127) (tstamp 7f77b1b8-3d6d-422a-948c-7f7d1263de7a))
  (fp_line (start -8.105 17.84) (end 8.105 17.84) (layer "F.SilkS") (width 0.127) (tstamp 9c11599c-fe10-41f2-9777-47eb8f2e326f))
  (fp_line (start 8.105 11.67) (end 15.405 11.67) (layer "F.SilkS") (width 0.127) (tstamp bea6c448-22f8-486a-82ef-f2fbcf79fe0b))
  (fp_line (start 15.405 -2.98) (end -15.405 -2.98) (layer "F.SilkS") (width 0.127) (tstamp c64653a0-85b8-4b14-a519-bd241ce351f8))
  (fp_line (start -15.405 11.67) (end -8.105 11.67) (layer "F.SilkS") (width 0.127) (tstamp e2c579ff-de83-40c6-9a21-5f9bcc8d4dcb))
  (fp_line (start -8.105 11.67) (end 8.105 11.67) (layer "F.SilkS") (width 0.127) (tstamp fcdaebe1-c6e6-4fe0-b9bd-09c2f04bc73f))
  (fp_line (start 15.75 12) (end 8.5 12) (layer "F.CrtYd") (width 0.05) (tstamp 51364955-ec3a-4f4b-a958-146159da3f10))
  (fp_line (start -8.5 12) (end -15.75 12) (layer "F.CrtYd") (width 0.05) (tstamp 884a6cf8-be9c-4f38-92a1-42625861e3de))
  (fp_line (start -15.75 12) (end -15.75 -3.25) (layer "F.CrtYd") (width 0.05) (tstamp 9ce618fc-41c4-470c-8623-963da1742f06))
  (fp_line (start -8.5 18.25) (end -8.5 12) (layer "F.CrtYd") (width 0.05) (tstamp c2b003fc-20c4-4346-a9fb-600101540d0a))
  (fp_line (start 8.5 12) (end 8.5 18.25) (layer "F.CrtYd") (width 0.05) (tstamp ccdce744-e43b-4071-b0ad-d633eb71a5a9))
  (fp_line (start -15.75 -3.25) (end 15.75 -3.25) (layer "F.CrtYd") (width 0.05) (tstamp d7b6c201-8fab-494b-902b-62d996ed090f))
  (fp_line (start 15.75 -3.25) (end 15.75 12) (layer "F.CrtYd") (width 0.05) (tstamp e01230b2-22c1-410e-96b4-1342af192153))
  (fp_line (start 8.5 18.25) (end -8.5 18.25) (layer "F.CrtYd") (width 0.05) (tstamp eacb3a51-ab93-495d-b19c-268b266a99b1))
  (pad "0" thru_hole circle (at -12.495 0) (size 4.116 4.116) (drill 3.1) (layers *.Cu *.Mask) (tstamp 7ab0fb35-262e-44b5-a164-6083b7f5912b))
  (pad "0" thru_hole circle (at 12.495 0) (size 4.116 4.116) (drill 3.1) (layers *.Cu *.Mask) (tstamp 87ed844b-564d-4d28-b89a-193daf8f287d))
  (pad "1" thru_hole rect (at 5.48 -1.27) (size 1.458 1.458) (drill 0.95) (layers *.Cu *.Mask) (tstamp b9261154-5c30-4dc0-b4ea-0609d7791f0e))
  (pad "2" thru_hole circle (at 2.74 -1.27) (size 1.458 1.458) (drill 0.95) (layers *.Cu *.Mask) (tstamp 75ff83f9-3b53-4494-b440-257c95200e6d))
  (pad "3" thru_hole circle (at 0 -1.27) (size 1.458 1.458) (drill 0.95) (layers *.Cu *.Mask) (tstamp 481e5c9f-c652-4b72-8a20-1a4bb1d2e073))
  (pad "4" thru_hole circle (at -2.74 -1.27) (size 1.458 1.458) (drill 0.95) (layers *.Cu *.Mask) (tstamp 0bcf3a0a-2ce2-4572-9ff4-75923dc963ef))
  (pad "5" thru_hole circle (at -5.48 -1.27) (size 1.458 1.458) (drill 0.95) (layers *.Cu *.Mask) (tstamp e4676d56-61a3-4625-a913-2c758ac0c2a4))
  (pad "6" thru_hole circle (at 4.11 1.27) (size 1.458 1.458) (drill 0.95) (layers *.Cu *.Mask) (tstamp 448033ee-f6a2-43f2-ba71-462e079024b4))
  (pad "7" thru_hole circle (at 1.37 1.27) (size 1.458 1.458) (drill 0.95) (layers *.Cu *.Mask) (tstamp 95c13f7d-47f6-4d44-9f4d-ee47c34d3d28))
  (pad "8" thru_hole circle (at -1.37 1.27) (size 1.458 1.458) (drill 0.95) (layers *.Cu *.Mask) (tstamp 14c24c9e-adca-4316-8a38-ca44f7343c97))
  (pad "9" thru_hole circle (at -4.11 1.27) (size 1.458 1.458) (drill 0.95) (layers *.Cu *.Mask) (tstamp 8864b18c-c330-45bb-a80d-50d69709ff05))
  (model "${KIPRJMOD}/3D/D09S13A4GX00LF.step"
    (offset (xyz 0 -11.3 0))
    (scale (xyz 1 1 1))
    (rotate (xyz 0 0 0))
  )
)
