(kicad_pcb (version 20211014) (generator pcbnew)

  (general
    (thickness 1.6)
  )

  (paper "A4")
  (layers
    (0 "F.Cu" signal)
    (31 "B.Cu" signal)
    (32 "B.Adhes" user "B.Adhesive")
    (33 "F.Adhes" user "F.Adhesive")
    (34 "B.Paste" user)
    (35 "F.Paste" user)
    (36 "B.SilkS" user "B.Silkscreen")
    (37 "F.SilkS" user "F.Silkscreen")
    (38 "B.Mask" user)
    (39 "F.Mask" user)
    (40 "Dwgs.User" user "User.Drawings")
    (41 "Cmts.User" user "User.Comments")
    (42 "Eco1.User" user "User.Eco1")
    (43 "Eco2.User" user "User.Eco2")
    (44 "Edge.Cuts" user)
    (45 "Margin" user)
    (46 "B.CrtYd" user "B.Courtyard")
    (47 "F.CrtYd" user "F.Courtyard")
    (48 "B.Fab" user)
    (49 "F.Fab" user)
    (50 "User.1" user)
    (51 "User.2" user)
    (52 "User.3" user)
    (53 "User.4" user)
    (54 "User.5" user)
    (55 "User.6" user)
    (56 "User.7" user)
    (57 "User.8" user)
    (58 "User.9" user)
  )

  (setup
    (pad_to_mask_clearance 0)
    (aux_axis_origin 44.5 130.5)
    (pcbplotparams
      (layerselection 0x00010fc_ffffffff)
      (disableapertmacros false)
      (usegerberextensions false)
      (usegerberattributes true)
      (usegerberadvancedattributes false)
      (creategerberjobfile true)
      (svguseinch false)
      (svgprecision 6)
      (excludeedgelayer false)
      (plotframeref false)
      (viasonmask false)
      (mode 1)
      (useauxorigin true)
      (hpglpennumber 1)
      (hpglpenspeed 20)
      (hpglpendiameter 15.000000)
      (dxfpolygonmode true)
      (dxfimperialunits true)
      (dxfusepcbnewfont true)
      (psnegative false)
      (psa4output false)
      (plotreference true)
      (plotvalue true)
      (plotinvisibletext false)
      (sketchpadsonfab false)
      (subtractmaskfromsilk false)
      (outputformat 1)
      (mirror false)
      (drillshape 0)
      (scaleselection 1)
      (outputdirectory "")
    )
  )

  (net 0 "")

  (footprint "Resistor_SMD:R_0603_1608Metric" (layer "F.Cu")
    (tedit 5F68FEEE) (tstamp 058be38a-4c13-49a4-98ad-62c90c354205)
    (at 118 64 90)
    (descr "Resistor SMD 0603 (1608 Metric), square (rectangular) end terminal, IPC_7351 nominal, (Body size source: IPC-SM-782 page 72, https://www.pcb-3d.com/wordpress/wp-content/uploads/ipc-sm-782a_amendment_1_and_2.pdf), generated with kicad-footprint-generator")
    (tags "resistor")
    (attr smd)
    (fp_text reference "REF**" (at 0 -1.43 90) (layer "F.SilkS")
      (effects (font (size 1 1) (thickness 0.15)))
      (tstamp 6d3e3dcf-e4b3-4522-8f2d-51249736a64c)
    )
    (fp_text value "R_0603_1608Metric" (at 0 1.43 90) (layer "F.Fab")
      (effects (font (size 1 1) (thickness 0.15)))
      (tstamp 1ecb95c1-b39b-450f-a6a0-1e398a51b556)
    )
    (fp_text user "${REFERENCE}" (at 0 0 90) (layer "F.Fab")
      (effects (font (size 0.4 0.4) (thickness 0.06)))
      (tstamp ec7d07d3-e049-4da5-9c0f-34c5d1ce1c4e)
    )
    (fp_line (start -0.237258 -0.5225) (end 0.237258 -0.5225) (layer "F.SilkS") (width 0.12) (tstamp 4b42ac17-a5c5-4f62-82eb-8abaa83a19a4))
    (fp_line (start -0.237258 0.5225) (end 0.237258 0.5225) (layer "F.SilkS") (width 0.12) (tstamp 819f2ba8-e5f4-463c-886c-4a22fa46ee04))
    (fp_line (start -1.48 0.73) (end -1.48 -0.73) (layer "F.CrtYd") (width 0.05) (tstamp 2b064bd5-c417-4349-ac75-c5e46717b84c))
    (fp_line (start 1.48 0.73) (end -1.48 0.73) (layer "F.CrtYd") (width 0.05) (tstamp 49054ae9-bea8-4508-bd8b-7e38b600cc4d))
    (fp_line (start 1.48 -0.73) (end 1.48 0.73) (layer "F.CrtYd") (width 0.05) (tstamp 62826662-730e-4a75-8341-78fc6b452b99))
    (fp_line (start -1.48 -0.73) (end 1.48 -0.73) (layer "F.CrtYd") (width 0.05) (tstamp 78c0924b-2bee-42c0-81c2-675e7054a612))
    (fp_line (start 0.8 -0.4125) (end 0.8 0.4125) (layer "F.Fab") (width 0.1) (tstamp 289ac705-e679-4f07-a961-e540ee97f804))
    (fp_line (start -0.8 -0.4125) (end 0.8 -0.4125) (layer "F.Fab") (width 0.1) (tstamp 5740fcc2-56ed-4469-975a-00c21cca8cca))
    (fp_line (start -0.8 0.4125) (end -0.8 -0.4125) (layer "F.Fab") (width 0.1) (tstamp 793d40fe-9d2f-436b-924a-cbad90d23d83))
    (fp_line (start 0.8 0.4125) (end -0.8 0.4125) (layer "F.Fab") (width 0.1) (tstamp e34f63dd-d0be-4108-90ab-98143fddc4bd))
    (pad "1" smd roundrect (at -0.825 0 90) (size 0.8 0.95) (layers "F.Cu" "F.Paste" "F.Mask") (roundrect_rratio 0.25) (tstamp 88c33e8f-f108-4274-bd2c-0e89df17b9e9))
    (pad "2" smd roundrect (at 0.825 0 90) (size 0.8 0.95) (layers "F.Cu" "F.Paste" "F.Mask") (roundrect_rratio 0.25) (tstamp 077b4ac8-d887-4313-8cb6-55afd38e8efa))
    (model "${KICAD6_3DMODEL_DIR}/Resistor_SMD.3dshapes/R_0603_1608Metric.wrl"
      (offset (xyz 0 0 0))
      (scale (xyz 1 1 1))
      (rotate (xyz 0 0 0))
    )
  )

  (footprint "Stencils-FPs:MR4A08BUYS45" (layer "F.Cu")
    (tedit 5D9F72B2) (tstamp 2769458d-77f6-45e8-a777-602a2b67b5ca)
    (at 71 87.5)
    (descr "TSOP-II, 44 Pin (http://www.issi.com/WW/pdf/61-64C5128AL.pdf), generated with kicad-footprint-generator ipc_gullwing_generator.py")
    (tags "TSOP-II SO")
    (attr smd)
    (fp_text reference "REF**" (at 0 -10.16) (layer "F.SilkS")
      (effects (font (size 1 1) (thickness 0.15)))
      (tstamp b0fad7e7-33de-42df-ae60-879d28d881ad)
    )
    (fp_text value "MR4A08BUYS45" (at 0 10.16) (layer "F.Fab")
      (effects (font (size 1 1) (thickness 0.15)))
      (tstamp 06e0353b-b6ac-4ec4-8c6a-8819a9b85882)
    )
    (fp_text user "${REFERENCE}" (at 0 0) (layer "F.Fab")
      (effects (font (size 1 1) (thickness 0.15)))
      (tstamp 51a23956-04f4-42f4-9167-cc739b417093)
    )
    (fp_line (start 0 9.315) (end -5.19 9.315) (layer "F.SilkS") (width 0.12) (tstamp 1a73e793-f539-4e93-8602-a17f840fa641))
    (fp_line (start 0 -9.315) (end -5.19 -9.315) (layer "F.SilkS") (width 0.12) (tstamp 1e268834-a9e1-42bd-860c-205a6c4419f8))
    (fp_line (start 5.19 -9.315) (end 5.19 -8.935) (layer "F.SilkS") (width 0.12) (tstamp 25778a94-1b75-4a2c-bab7-83666950a0f1))
    (fp_line (start 5.19 9.315) (end 5.19 8.935) (layer "F.SilkS") (width 0.12) (tstamp 2d7bec7f-2ddd-4f54-8dc4-ac8a7bef7686))
    (fp_line (start -5.19 -8.935) (end -6.35 -8.935) (layer "F.SilkS") (width 0.12) (tstamp 7402a4e9-e00e-4188-9a39-a4ff932b7b82))
    (fp_line (start -5.19 9.315) (end -5.19 8.935) (layer "F.SilkS") (width 0.12) (tstamp 88342345-34b7-48aa-b01c-a6efb7a4cedf))
    (fp_line (start -5.19 -9.315) (end -5.19 -8.935) (layer "F.SilkS") (width 0.12) (tstamp 908f2ac0-e252-410a-83a2-78388d151b79))
    (fp_line (start 0 -9.315) (end 5.19 -9.315) (layer "F.SilkS") (width 0.12) (tstamp 91e7074f-eb18-491d-8c51-fc4a5bf978ac))
    (fp_line (start 0 9.315) (end 5.19 9.315) (layer "F.SilkS") (width 0.12) (tstamp a91c70fd-56b4-43a7-988b-b4cda339d1c2))
    (fp_line (start -6.6 -9.46) (end -6.6 9.46) (layer "F.CrtYd") (width 0.05) (tstamp 299b6476-1d2e-4c1d-b6ab-197129b811b0))
    (fp_line (start -6.6 9.46) (end 6.6 9.46) (layer "F.CrtYd") (width 0.05) (tstamp 6f861fae-fe97-48b7-953a-4e53058f628d))
    (fp_line (start 6.6 9.46) (end 6.6 -9.46) (layer "F.CrtYd") (width 0.05) (tstamp cdbe30e4-87f3-443e-8ff1-6a6ec3695b1b))
    (fp_line (start 6.6 -9.46) (end -6.6 -9.46) (layer "F.CrtYd") (width 0.05) (tstamp f18fd43f-e5e8-4c3c-bc23-a87ce9feb3fd))
    (fp_line (start 5.08 -9.205) (end 5.08 9.205) (layer "F.Fab") (width 0.1) (tstamp 3fd8d4e2-4407-4980-9be8-01dab66ece20))
    (fp_line (start -5.08 9.205) (end -5.08 -8.205) (layer "F.Fab") (width 0.1) (tstamp 4a4d9e44-55cf-44c7-8b38-621477aeb05d))
    (fp_line (start -5.08 -8.205) (end -4.08 -9.205) (layer "F.Fab") (width 0.1) (tstamp 6e5bb1a8-a75d-46a0-b70b-5c49d883feb3))
    (fp_line (start -4.08 -9.205) (end 5.08 -9.205) (layer "F.Fab") (width 0.1) (tstamp 8f347258-dbfd-4fd6-99c7-dc850b892dc3))
    (fp_line (start 5.08 9.205) (end -5.08 9.205) (layer "F.Fab") (width 0.1) (tstamp ee16be75-0d01-4255-be95-720704511890))
    (pad "1" smd roundrect (at -5.5875 -8.4) (size 1.525 0.55) (layers "F.Cu" "F.Paste" "F.Mask") (roundrect_rratio 0.25) (tstamp 6eef3eb2-e033-4983-96cb-5bfb125f2dbd))
    (pad "2" smd roundrect (at -5.5875 -7.6) (size 1.525 0.55) (layers "F.Cu" "F.Paste" "F.Mask") (roundrect_rratio 0.25) (tstamp a961e9e4-85ae-42e7-b31f-77cdead479e5))
    (pad "3" smd roundrect (at -5.5875 -6.8) (size 1.525 0.55) (layers "F.Cu" "F.Paste" "F.Mask") (roundrect_rratio 0.25) (tstamp 0e1a5fca-5a21-48ff-bfdf-9bd1ce8ebd02))
    (pad "4" smd roundrect (at -5.5875 -6) (size 1.525 0.55) (layers "F.Cu" "F.Paste" "F.Mask") (roundrect_rratio 0.25) (tstamp 25363df2-175d-4c44-9fc2-e58adcc30942))
    (pad "5" smd roundrect (at -5.5875 -5.2) (size 1.525 0.55) (layers "F.Cu" "F.Paste" "F.Mask") (roundrect_rratio 0.25) (tstamp 3b21139a-215d-492e-a6a7-cabfbac8d96d))
    (pad "6" smd roundrect (at -5.5875 -4.4) (size 1.525 0.55) (layers "F.Cu" "F.Paste" "F.Mask") (roundrect_rratio 0.25) (tstamp ffd20891-e65f-4f91-ad5d-3384085c4f58))
    (pad "7" smd roundrect (at -5.5875 -3.6) (size 1.525 0.55) (layers "F.Cu" "F.Paste" "F.Mask") (roundrect_rratio 0.25) (tstamp d4bc019c-9486-4699-906c-36383800439d))
    (pad "8" smd roundrect (at -5.5875 -2.8) (size 1.525 0.55) (layers "F.Cu" "F.Paste" "F.Mask") (roundrect_rratio 0.25) (tstamp 38f2cb1c-a32e-4215-956c-9d331aab6e63))
    (pad "9" smd roundrect (at -5.5875 -2) (size 1.525 0.55) (layers "F.Cu" "F.Paste" "F.Mask") (roundrect_rratio 0.25) (tstamp fadd7696-e476-4af9-be07-e65ff33dac66))
    (pad "10" smd roundrect (at -5.5875 -1.2) (size 1.525 0.55) (layers "F.Cu" "F.Paste" "F.Mask") (roundrect_rratio 0.25) (tstamp 281e9748-468a-4501-b016-abd59aa74460))
    (pad "11" smd roundrect (at -5.5875 -0.4) (size 1.525 0.55) (layers "F.Cu" "F.Paste" "F.Mask") (roundrect_rratio 0.25) (tstamp 8039981f-35df-421b-92ac-0df65be24d12))
    (pad "12" smd roundrect (at -5.5875 0.4) (size 1.525 0.55) (layers "F.Cu" "F.Paste" "F.Mask") (roundrect_rratio 0.25) (tstamp 63fde72d-f742-45b2-82e9-251d39c0786d))
    (pad "13" smd roundrect (at -5.5875 1.2) (size 1.525 0.55) (layers "F.Cu" "F.Paste" "F.Mask") (roundrect_rratio 0.25) (tstamp 45cd58e5-a996-4317-b6e4-d7baaf57c7be))
    (pad "14" smd roundrect (at -5.5875 2) (size 1.525 0.55) (layers "F.Cu" "F.Paste" "F.Mask") (roundrect_rratio 0.25) (tstamp e2e79660-2bbd-4e22-8e8f-fe350a240241))
    (pad "15" smd roundrect (at -5.5875 2.8) (size 1.525 0.55) (layers "F.Cu" "F.Paste" "F.Mask") (roundrect_rratio 0.25) (tstamp accc3c49-b1c4-404f-b929-f88d6354289b))
    (pad "16" smd roundrect (at -5.5875 3.6) (size 1.525 0.55) (layers "F.Cu" "F.Paste" "F.Mask") (roundrect_rratio 0.25) (tstamp 7d3b74ea-fd5f-46a8-8c51-b495e10b2658))
    (pad "17" smd roundrect (at -5.5875 4.4) (size 1.525 0.55) (layers "F.Cu" "F.Paste" "F.Mask") (roundrect_rratio 0.25) (tstamp 47f17638-4a8a-4fca-be5e-e2a457eb4673))
    (pad "18" smd roundrect (at -5.5875 5.2) (size 1.525 0.55) (layers "F.Cu" "F.Paste" "F.Mask") (roundrect_rratio 0.25) (tstamp ae57184d-e178-4feb-95aa-82a4968d70cb))
    (pad "19" smd roundrect (at -5.5875 6) (size 1.525 0.55) (layers "F.Cu" "F.Paste" "F.Mask") (roundrect_rratio 0.25) (tstamp 9d8ca191-f695-40b9-a9c0-e72d68f75688))
    (pad "20" smd roundrect (at -5.5875 6.8) (size 1.525 0.55) (layers "F.Cu" "F.Paste" "F.Mask") (roundrect_rratio 0.25) (tstamp c8a5fdb3-c002-40ee-aaf6-25a6f7f99fc6))
    (pad "21" smd roundrect (at -5.5875 7.6) (size 1.525 0.55) (layers "F.Cu" "F.Paste" "F.Mask") (roundrect_rratio 0.25) (tstamp 9abd3c24-3398-47be-bbd5-e7c2d132963b))
    (pad "22" smd roundrect (at -5.5875 8.4) (size 1.525 0.55) (layers "F.Cu" "F.Paste" "F.Mask") (roundrect_rratio 0.25) (tstamp e7e9290b-8128-4120-ab34-d24679c18c77))
    (pad "23" smd roundrect (at 5.5875 8.4) (size 1.525 0.55) (layers "F.Cu" "F.Paste" "F.Mask") (roundrect_rratio 0.25) (tstamp 59ddc391-fb52-4519-a1b1-819c7562851d))
    (pad "24" smd roundrect (at 5.5875 7.6) (size 1.525 0.55) (layers "F.Cu" "F.Paste" "F.Mask") (roundrect_rratio 0.25) (tstamp b66ebe7f-fb89-45e0-b1fa-60868508a75d))
    (pad "25" smd roundrect (at 5.5875 6.8) (size 1.525 0.55) (layers "F.Cu" "F.Paste" "F.Mask") (roundrect_rratio 0.25) (tstamp 7c69d8f0-4c81-4c26-b90c-9468788ae22b))
    (pad "26" smd roundrect (at 5.5875 6) (size 1.525 0.55) (layers "F.Cu" "F.Paste" "F.Mask") (roundrect_rratio 0.25) (tstamp 6f745913-564f-4da2-9338-e236917e6c97))
    (pad "27" smd roundrect (at 5.5875 5.2) (size 1.525 0.55) (layers "F.Cu" "F.Paste" "F.Mask") (roundrect_rratio 0.25) (tstamp e82f12b8-b19f-4020-a5aa-8b5af916f910))
    (pad "28" smd roundrect (at 5.5875 4.4) (size 1.525 0.55) (layers "F.Cu" "F.Paste" "F.Mask") (roundrect_rratio 0.25) (tstamp 2dfba7ab-f239-4584-85b0-f55e13922e60))
    (pad "29" smd roundrect (at 5.5875 3.6) (size 1.525 0.55) (layers "F.Cu" "F.Paste" "F.Mask") (roundrect_rratio 0.25) (tstamp e0e1539e-8863-4739-9059-0e64d6e9b1a9))
    (pad "30" smd roundrect (at 5.5875 2.8) (size 1.525 0.55) (layers "F.Cu" "F.Paste" "F.Mask") (roundrect_rratio 0.25) (tstamp d3f77409-14fa-4f46-9d6f-4ee8b9a645b0))
    (pad "31" smd roundrect (at 5.5875 2) (size 1.525 0.55) (layers "F.Cu" "F.Paste" "F.Mask") (roundrect_rratio 0.25) (tstamp a964af46-20f6-4c27-ba17-30fd74c45fb0))
    (pad "32" smd roundrect (at 5.5875 1.2) (size 1.525 0.55) (layers "F.Cu" "F.Paste" "F.Mask") (roundrect_rratio 0.25) (tstamp 6e5b8a36-5eba-43e1-9655-fe65c9e4179b))
    (pad "33" smd roundrect (at 5.5875 0.4) (size 1.525 0.55) (layers "F.Cu" "F.Paste" "F.Mask") (roundrect_rratio 0.25) (tstamp 53155b5d-e6ff-481a-95e7-8ca844146e23))
    (pad "34" smd roundrect (at 5.5875 -0.4) (size 1.525 0.55) (layers "F.Cu" "F.Paste" "F.Mask") (roundrect_rratio 0.25) (tstamp 818ea8eb-63c2-4600-b222-88af2f938040))
    (pad "35" smd roundrect (at 5.5875 -1.2) (size 1.525 0.55) (layers "F.Cu" "F.Paste" "F.Mask") (roundrect_rratio 0.25) (tstamp 8b59cff7-cb26-4db8-9a4e-7227f90650a3))
    (pad "36" smd roundrect (at 5.5875 -2) (size 1.525 0.55) (layers "F.Cu" "F.Paste" "F.Mask") (roundrect_rratio 0.25) (tstamp d7b5d97a-9ec3-4218-bf38-4069fc7f3ed9))
    (pad "37" smd roundrect (at 5.5875 -2.8) (size 1.525 0.55) (layers "F.Cu" "F.Paste" "F.Mask") (roundrect_rratio 0.25) (tstamp 445fd5a4-dc04-4538-ae72-f77d890ec35e))
    (pad "38" smd roundrect (at 5.5875 -3.6) (size 1.525 0.55) (layers "F.Cu" "F.Paste" "F.Mask") (roundrect_rratio 0.25) (tstamp 008f01c5-df32-42ae-84e2-5269d6d8b983))
    (pad "39" smd roundrect (at 5.5875 -4.4) (size 1.525 0.55) (layers "F.Cu" "F.Paste" "F.Mask") (roundrect_rratio 0.25) (tstamp a9848040-a4ee-4147-ad24-bda3cec45548))
    (pad "40" smd roundrect (at 5.5875 -5.2) (size 1.525 0.55) (layers "F.Cu" "F.Paste" "F.Mask") (roundrect_rratio 0.25) (tstamp 7b0a0fd2-f470-4416-934b-4706461be566))
    (pad "41" smd roundrect (at 5.5875 -6) (size 1.525 0.55) (layers "F.Cu" "F.Paste" "F.Mask") (roundrect_rratio 0.25) (tstamp 213b960b-7195-4efc-b684-de65a3532e98))
    (pad "42" smd roundrect (at 5.5875 -6.8) (size 1.525 0.55) (layers "F.Cu" "F.Paste" "F.Mask") (roundrect_rratio 0.25) (tstamp a47288b9-6b37-40a0-8e84-c470c7f17728))
    (pad "43" smd roundrect (at 5.5875 -7.6) (size 1.525 0.55) (layers "F.Cu" "F.Paste" "F.Mask") (roundrect_rratio 0.25) (tstamp 617be5b0-bf64-42df-9b47-42e1c4292743))
    (pad "44" smd roundrect (at 5.5875 -8.4) (size 1.525 0.55) (layers "F.Cu" "F.Paste" "F.Mask") (roundrect_rratio 0.25) (tstamp d029e44e-c5c3-47d5-8ddb-788ebc51b34c))
    (model "${KIPRJMOD}/3D/step/MR4A08BUYS45.stp"
      (offset (xyz 0 0 0))
      (scale (xyz 1 1 1))
      (rotate (xyz 0 0 0))
    )
    (model "${KIPRJMOD}/3D/wrl/MR4A08BUYS45.wrl"
      (offset (xyz 0 0 0))
      (scale (xyz 1 1 1))
      (rotate (xyz 0 0 0))
    )
  )

  (footprint "Stencils-FPs:RM3100_SEN_Z" (layer "F.Cu")
    (tedit 604C14F5) (tstamp 3cba7fd4-484f-4a32-93bd-ef7f987bddfb)
    (at 133.5 85.5 90)
    (attr through_hole)
    (fp_text reference "REF**" (at 0 -2.7 90) (layer "F.SilkS")
      (effects (font (size 1 1) (thickness 0.15)))
      (tstamp 7636e8df-2d73-43b7-bb0b-79523c4c671c)
    )
    (fp_text value "RM3100_SEN_Z" (at 0 2.9 90) (layer "F.Fab")
      (effects (font (size 1 1) (thickness 0.15)))
      (tstamp 6b2d4145-40c7-4213-ac5b-65dd85024f84)
    )
    (fp_line (start -2.9 -1.2) (end 2.9 -1.2) (layer "F.SilkS") (width 0.12) (tstamp 10bc02f6-dec5-4644-aee4-d0d3ddb16a4d))
    (fp_line (start 2.9 -1.2) (end 2.9 1.2) (layer "F.SilkS") (width 0.12) (tstamp 914e44e1-cc33-4697-999b-eb21cf655a86))
    (fp_line (start -2.9 1) (end -2.9 -1.2) (layer "F.SilkS") (width 0.12) (tstamp a1e26079-1437-484a-af12-0ef671e868fe))
    (fp_line (start 2.9 1.2) (end -2.9 1.2) (layer "F.SilkS") (width 0.12) (tstamp be098e8c-65dd-47f2-bc5b-37e8b113ae40))
    (fp_circle (center -3.3 -1.2) (end -3.25 -1.2) (layer "F.SilkS") (width 0.12) (fill none) (tstamp 01446099-ffbb-4bf5-a37d-4c46f4b3cf25))
    (fp_circle (center -3.3 -1.25) (end -3.3 -1.25) (layer "F.SilkS") (width 0.12) (fill none) (tstamp 1956cbef-5ad7-429d-8134-de2437e0b138))
    (fp_line (start -3.1 1.4) (end 3.1 1.4) (layer "F.CrtYd") (width 0.12) (tstamp 2429cdfb-db15-4f25-9eb2-3e78238bb5e4))
    (fp_line (start 3.1 -1.4) (end 3.1 1.4) (layer "F.CrtYd") (width 0.12) (tstamp 7edc8598-a367-4cc0-b08f-ae64da1c22ae))
    (fp_line (start -3.1 1.4) (end -3.1 -1.4) (layer "F.CrtYd") (width 0.12) (tstamp b3e7d457-87a8-46bb-88a8-a3bde290288d))
    (fp_line (start 3.1 -1.4) (end -3.1 -1.4) (layer "F.CrtYd") (width 0.12) (tstamp b626bb4e-3ea2-4a05-98bd-efe656217b9c))
    (pad "1" smd rect (at -1.4 0 90) (size 2.4 1.95) (layers "F.Cu" "F.Paste" "F.Mask") (tstamp 721d82b7-9e28-427b-a0c3-edae160dfacf))
    (pad "2" smd rect (at 1.4 0 90) (size 2.4 1.95) (layers "F.Cu" "F.Paste" "F.Mask") (tstamp 363cb54b-219d-4086-ba17-c42307294ead))
  )

  (footprint "Stencils-FPs:TVL2254AIDR" (layer "F.Cu")
    (tedit 0) (tstamp 44e981dc-baaf-4bd8-bc95-9672d29e4bd8)
    (at 106.5 113.5 90)
    (descr "TLV2254AIDR")
    (tags "Integrated Circuit")
    (attr smd)
    (fp_text reference "IC**" (at 0 0 90) (layer "F.SilkS")
      (effects (font (size 1.27 1.27) (thickness 0.254)))
      (tstamp 4af89475-fc9d-435d-a9eb-e40ead428390)
    )
    (fp_text value "TVL2254AIDR" (at 0 0 90) (layer "F.SilkS") hide
      (effects (font (size 1.27 1.27) (thickness 0.254)))
      (tstamp 51381d20-0d09-4b7f-bc67-6280f880361a)
    )
    (fp_text user "${REFERENCE}" (at 0 0 90) (layer "F.Fab")
      (effects (font (size 1.27 1.27) (thickness 0.254)))
      (tstamp 0f08c4df-d1c9-467e-bd2a-f93a9b540bfe)
    )
    (fp_line (start 1.6 4.325) (end -1.6 4.325) (layer "F.SilkS") (width 0.2) (tstamp 0b67da41-2c2e-4fab-abf3-8f5c5e2ac8f4))
    (fp_line (start 1.6 -4.325) (end 1.6 4.325) (layer "F.SilkS") (width 0.2) (tstamp 0d38adf1-35f7-4867-9ca0-c8db9531171e))
    (fp_line (start -1.6 -4.325) (end 1.6 -4.325) (layer "F.SilkS") (width 0.2) (tstamp 12c34ced-b152-4f38-ba4c-5df5972f9927))
    (fp_line (start -3.475 -4.485) (end -1.95 -4.485) (layer "F.SilkS") (width 0.2) (tstamp 9ef17913-d8ec-4184-94c5-a23de9a3d559))
    (fp_line (start -1.6 4.325) (end -1.6 -4.325) (layer "F.SilkS") (width 0.2) (tstamp ad522c39-6da4-4839-99d9-d7ee1275537a))
    (fp_line (start -3.725 -4.625) (end 3.725 -4.625) (layer "F.CrtYd") (width 0.05) (tstamp 2da1af97-342f-4c12-9ded-80bf8c55b35d))
    (fp_line (start -3.725 4.625) (end -3.725 -4.625) (layer "F.CrtYd") (width 0.05) (tstamp 48ecd62e-c1dc-4a7d-ab6f-c5155c61a2aa))
    (fp_line (start 3.725 -4.625) (end 3.725 4.625) (layer "F.CrtYd") (width 0.05) (tstamp 4d0f74f7-ae1a-4704-b7e2-38cf423df571))
    (fp_line (start 3.725 4.625) (end -3.725 4.625) (layer "F.CrtYd") (width 0.05) (tstamp 6577fbfb-0c1a-4610-bc97-6a0d7444f038))
    (fp_line (start 1.95 4.325) (end -1.95 4.325) (layer "F.Fab") (width 0.1) (tstamp 0775eb39-5477-4454-bfb0-c3cd619ad368))
    (fp_line (start 1.95 -4.325) (end 1.95 4.325) (layer "F.Fab") (width 0.1) (tstamp 5f6db749-ff96-4468-8b8e-44b36c700fd4))
    (fp_line (start -1.95 -4.325) (end 1.95 -4.325) (layer "F.Fab") (width 0.1) (tstamp 604b65a1-8729-420c-a1a5-2f7237ca434f))
    (fp_line (start -1.95 4.325) (end -1.95 -4.325) (layer "F.Fab") (width 0.1) (tstamp a39ed168-feed-49f2-9852-9d4e09b6796d))
    (fp_line (start -1.95 -3.055) (end -0.68 -4.325) (layer "F.Fab") (width 0.1) (tstamp aa456fdc-68be-4d05-b9da-d7f7ec8c0683))
    (pad "1" smd rect (at -2.712 -3.81 180) (size 0.65 1.525) (layers "F.Cu" "F.Paste" "F.Mask") (tstamp c9d66ede-b8a5-4540-b93a-561451ce08f6))
    (pad "2" smd rect (at -2.712 -2.54 180) (size 0.65 1.525) (layers "F.Cu" "F.Paste" "F.Mask") (tstamp f9868938-8ce6-40fe-9f74-4420a5053638))
    (pad "3" smd rect (at -2.712 -1.27 180) (size 0.65 1.525) (layers "F.Cu" "F.Paste" "F.Mask") (tstamp a4422405-6b11-4e54-b984-c3727c144acd))
    (pad "4" smd rect (at -2.712 0 180) (size 0.65 1.525) (layers "F.Cu" "F.Paste" "F.Mask") (tstamp 7902bf32-7212-4376-875c-76bb67e14078))
    (pad "5" smd rect (at -2.712 1.27 180) (size 0.65 1.525) (layers "F.Cu" "F.Paste" "F.Mask") (tstamp a505287d-1c9a-4774-aee2-54a9c72b692b))
    (pad "6" smd rect (at -2.712 2.54 180) (size 0.65 1.525) (layers "F.Cu" "F.Paste" "F.Mask") (tstamp 4b4aa035-91e4-47d2-ab03-80767c6ae6b1))
    (pad "7" smd rect (at -2.712 3.81 180) (size 0.65 1.525) (layers "F.Cu" "F.Paste" "F.Mask") (tstamp d13bf022-632f-45e9-80b1-c5ddf778bd5f))
    (pad "8" smd rect (at 2.712 3.81 180) (size 0.65 1.525) (layers "F.Cu" "F.Paste" "F.Mask") (tstamp 44731132-52cd-4417-8c60-eb6254ae5963))
    (pad "9" smd rect (at 2.712 2.54 180) (size 0.65 1.525) (layers "F.Cu" "F.Paste" "F.Mask") (tstamp 0a15ffed-095d-4c35-b031-e495f2392057))
    (pad "10" smd rect (at 2.712 1.27 180) (size 0.65 1.525) (layers "F.Cu" "F.Paste" "F.Mask") (tstamp 57d43470-496c-4ef0-a965-21440e6a90ad))
    (pad "11" smd rect (at 2.712 0 180) (size 0.65 1.525) (layers "F.Cu" "F.Paste" "F.Mask") (tstamp 8af195f9-61cd-498b-91c7-bdba12611854))
    (pad "12" smd rect (at 2.712 -1.27 180) (size 0.65 1.525) (layers "F.Cu" "F.Paste" "F.Mask") (tstamp 5c527ff8-3506-483f-a49d-1a5304ce78a2))
    (pad "13" smd rect (at 2.712 -2.54 180) (size 0.65 1.525) (layers "F.Cu" "F.Paste" "F.Mask") (tstamp c96d6529-dd59-44d6-9efa-05b2cadfd34a))
    (pad "14" smd rect (at 2.712 -3.81 180) (size 0.65 1.525) (layers "F.Cu" "F.Paste" "F.Mask") (tstamp 215119ed-6920-4ac7-9d11-810d59eed3a1))
    (model "${KIPRJMOD}/3D/wrl/TLV2254AIDR.wrl"
      (offset (xyz 0 0 0))
      (scale (xyz 1 1 1))
      (rotate (xyz 0 0 0))
    )
    (model "${KIPRJMOD}/3D/step/TLV2254AIDR.stp"
      (offset (xyz 0 0 0))
      (scale (xyz 1 1 1))
      (rotate (xyz 0 0 0))
    )
  )

  (footprint "Stencils-FPs:TCAN337GDR" (layer "F.Cu")
    (tedit 0) (tstamp 4d7b8512-15a0-4906-bf9a-16f395cdd26f)
    (at 132 112.5)
    (descr "D000")
    (tags "Integrated Circuit")
    (attr smd)
    (fp_text reference "IC**" (at 0 0) (layer "F.SilkS")
      (effects (font (size 1.27 1.27) (thickness 0.254)))
      (tstamp 20785e10-51cb-44f5-8534-ada4c10f1c52)
    )
    (fp_text value "TCAN337GDR" (at 0 0) (layer "F.SilkS") hide
      (effects (font (size 1.27 1.27) (thickness 0.254)))
      (tstamp 6580c7f8-1e81-4fe4-8ef5-8fd3c8e62128)
    )
    (fp_text user "${REFERENCE}" (at 0 0) (layer "F.Fab")
      (effects (font (size 1.27 1.27) (thickness 0.254)))
      (tstamp b4b82fca-8d62-40f4-ae6b-d95ab0068c5f)
    )
    (fp_line (start 1.598 2.452) (end -1.598 2.452) (layer "F.SilkS") (width 0.2) (tstamp 688cb1a0-ac2e-45e0-8aef-fe6fc3ba2cfb))
    (fp_line (start -1.598 2.452) (end -1.598 -2.452) (layer "F.SilkS") (width 0.2) (tstamp 729bea55-a238-434b-a1f8-e1cd525efbf6))
    (fp_line (start 1.598 -2.452) (end 1.598 2.452) (layer "F.SilkS") (width 0.2) (tstamp 972f816c-1422-46e7-98ab-a59edf51e340))
    (fp_line (start -3.475 -2.58) (end -1.948 -2.58) (layer "F.SilkS") (width 0.2) (tstamp 9d50ffb4-3c4d-427f-9004-1bca7a345964))
    (fp_line (start -1.598 -2.452) (end 1.598 -2.452) (layer "F.SilkS") (width 0.2) (tstamp ffd86677-a3c0-41ce-8d49-b5944139bbfd))
    (fp_line (start 3.725 -2.75) (end 3.725 2.75) (layer "F.CrtYd") (width 0.05) (tstamp 1d84ab3e-dce3-4066-9925-9f73c81607bc))
    (fp_line (start 3.725 2.75) (end -3.725 2.75) (layer "F.CrtYd") (width 0.05) (tstamp 884d0ac8-3a04-41db-b30c-456547bd53dc))
    (fp_line (start -3.725 2.75) (end -3.725 -2.75) (layer "F.CrtYd") (width 0.05) (tstamp b6e140bd-65de-4875-b0db-9d1c88ca24d1))
    (fp_line (start -3.725 -2.75) (end 3.725 -2.75) (layer "F.CrtYd") (width 0.05) (tstamp f3e0342d-2f72-4e51-9acd-dd8318a9ac6e))
    (fp_line (start 1.948 2.452) (end -1.948 2.452) (layer "F.Fab") (width 0.1) (tstamp 2c4910fb-fca6-44f0-baa3-7c25617b1d7d))
    (fp_line (start -1.948 -1.182) (end -0.678 -2.452) (layer "F.Fab") (width 0.1) (tstamp 71d87ab0-6952-4ec6-b439-e8a9c0827014))
    (fp_line (start 1.948 -2.452) (end 1.948 2.452) (layer "F.Fab") (width 0.1) (tstamp 880bdcc2-7c18-4961-947a-af1d2d66a070))
    (fp_line (start -1.948 -2.452) (end 1.948 -2.452) (layer "F.Fab") (width 0.1) (tstamp c9798186-3dec-4d9d-ae26-fe10ae553737))
    (fp_line (start -1.948 2.452) (end -1.948 -2.452) (layer "F.Fab") (width 0.1) (tstamp de8983df-bf53-434c-9130-e2140dfe5734))
    (pad "1" smd rect (at -2.711 -1.905 90) (size 0.65 1.528) (layers "F.Cu" "F.Paste" "F.Mask") (tstamp 2b6856a4-2997-49f2-9821-15f9f3010f0e))
    (pad "2" smd rect (at -2.711 -0.635 90) (size 0.65 1.528) (layers "F.Cu" "F.Paste" "F.Mask") (tstamp 55553d15-563a-498e-9fa5-2b2313929693))
    (pad "3" smd rect (at -2.711 0.635 90) (size 0.65 1.528) (layers "F.Cu" "F.Paste" "F.Mask") (tstamp 98a072eb-e8a6-4fd6-b4d3-cc406dcc2bfe))
    (pad "4" smd rect (at -2.711 1.905 90) (size 0.65 1.528) (layers "F.Cu" "F.Paste" "F.Mask") (tstamp af95bdc7-ad4d-4c36-b388-ce64ed537034))
    (pad "5" smd rect (at 2.711 1.905 90) (size 0.65 1.528) (layers "F.Cu" "F.Paste" "F.Mask") (tstamp 045a06d6-81ab-4842-9518-88d52a2b8d2e))
    (pad "6" smd rect (at 2.711 0.635 90) (size 0.65 1.528) (layers "F.Cu" "F.Paste" "F.Mask") (tstamp 8945e2fc-0ea3-46fa-92ec-5ad13aed8719))
    (pad "7" smd rect (at 2.711 -0.635 90) (size 0.65 1.528) (layers "F.Cu" "F.Paste" "F.Mask") (tstamp 0c82e4db-be83-4d4b-8e0d-e41bc217eddc))
    (pad "8" smd rect (at 2.711 -1.905 90) (size 0.65 1.528) (layers "F.Cu" "F.Paste" "F.Mask") (tstamp 5346eed0-2539-4eba-9d6d-8113926d7653))
    (model "${KIPRJMOD}/3D/step/TCAN337GDR.stp"
      (offset (xyz 0 0 0))
      (scale (xyz 1 1 1))
      (rotate (xyz 0 0 0))
    )
    (model "${KIPRJMOD}/3D/wrl/TCAN337GDR.wrl"
      (offset (xyz 0 0 0))
      (scale (xyz 1 1 1))
      (rotate (xyz 0 0 0))
    )
  )

  (footprint "Resistor_SMD:R_0402_1005Metric" (layer "F.Cu")
    (tedit 5F68FEEE) (tstamp 58416b3c-f031-4a3b-9b94-dc704cd13dbb)
    (at 125 64 90)
    (descr "Resistor SMD 0402 (1005 Metric), square (rectangular) end terminal, IPC_7351 nominal, (Body size source: IPC-SM-782 page 72, https://www.pcb-3d.com/wordpress/wp-content/uploads/ipc-sm-782a_amendment_1_and_2.pdf), generated with kicad-footprint-generator")
    (tags "resistor")
    (attr smd)
    (fp_text reference "REF**" (at 0 -1.17 90) (layer "F.SilkS")
      (effects (font (size 1 1) (thickness 0.15)))
      (tstamp 2ceb84e7-91f8-4df4-bebc-61d9dcf5cb20)
    )
    (fp_text value "R_0402_1005Metric" (at 0 1.17 90) (layer "F.Fab")
      (effects (font (size 1 1) (thickness 0.15)))
      (tstamp c199f3ce-bd75-44de-b302-7547720f408a)
    )
    (fp_text user "${REFERENCE}" (at 0 0 90) (layer "F.Fab")
      (effects (font (size 0.26 0.26) (thickness 0.04)))
      (tstamp 1b0cfee6-4fa4-49b9-ba81-50c00c626299)
    )
    (fp_line (start -0.153641 0.38) (end 0.153641 0.38) (layer "F.SilkS") (width 0.12) (tstamp ac280b3a-c967-4a8f-8f0e-9b73614fb0cc))
    (fp_line (start -0.153641 -0.38) (end 0.153641 -0.38) (layer "F.SilkS") (width 0.12) (tstamp eb000f73-aa13-4bd4-89ad-0edf3fcdeb92))
    (fp_line (start -0.93 -0.47) (end 0.93 -0.47) (layer "F.CrtYd") (width 0.05) (tstamp 0e232ba4-b566-4f9d-a597-cb8d4cc00768))
    (fp_line (start 0.93 0.47) (end -0.93 0.47) (layer "F.CrtYd") (width 0.05) (tstamp 18e9e000-5d25-4303-8655-da2f84022f1f))
    (fp_line (start -0.93 0.47) (end -0.93 -0.47) (layer "F.CrtYd") (width 0.05) (tstamp 53940e92-1194-4bd4-a85d-7af05af3c97c))
    (fp_line (start 0.93 -0.47) (end 0.93 0.47) (layer "F.CrtYd") (width 0.05) (tstamp 8f968d93-ec6e-41d2-8005-10e1a5dc9cd9))
    (fp_line (start 0.525 0.27) (end -0.525 0.27) (layer "F.Fab") (width 0.1) (tstamp 1914f4db-4983-4ed6-8511-89933b8e6c4d))
    (fp_line (start 0.525 -0.27) (end 0.525 0.27) (layer "F.Fab") (width 0.1) (tstamp d814ac85-5392-4b78-b44e-8de48b7d5b54))
    (fp_line (start -0.525 -0.27) (end 0.525 -0.27) (layer "F.Fab") (width 0.1) (tstamp f166113e-160a-4960-9762-fdede830bc91))
    (fp_line (start -0.525 0.27) (end -0.525 -0.27) (layer "F.Fab") (width 0.1) (tstamp f1893eba-d7d2-4fad-94b7-d56ab72e3d3f))
    (pad "1" smd roundrect (at -0.51 0 90) (size 0.54 0.64) (layers "F.Cu" "F.Paste" "F.Mask") (roundrect_rratio 0.25) (tstamp a62a75e4-44a0-4a65-aa8c-576b84deee2b))
    (pad "2" smd roundrect (at 0.51 0 90) (size 0.54 0.64) (layers "F.Cu" "F.Paste" "F.Mask") (roundrect_rratio 0.25) (tstamp 27e2571e-bd79-4c98-9774-7a30ce765381))
    (model "${KICAD6_3DMODEL_DIR}/Resistor_SMD.3dshapes/R_0402_1005Metric.wrl"
      (offset (xyz 0 0 0))
      (scale (xyz 1 1 1))
      (rotate (xyz 0 0 0))
    )
  )

  (footprint "Resistor_SMD:R_0805_2012Metric" (layer "F.Cu")
    (tedit 5F68FEEE) (tstamp 5f0c076d-f319-4578-a008-b36828309679)
    (at 110.5 64 90)
    (descr "Resistor SMD 0805 (2012 Metric), square (rectangular) end terminal, IPC_7351 nominal, (Body size source: IPC-SM-782 page 72, https://www.pcb-3d.com/wordpress/wp-content/uploads/ipc-sm-782a_amendment_1_and_2.pdf), generated with kicad-footprint-generator")
    (tags "resistor")
    (attr smd)
    (fp_text reference "REF**" (at 0 -1.65 90) (layer "F.SilkS")
      (effects (font (size 1 1) (thickness 0.15)))
      (tstamp e13ef068-8fb9-45e4-95bd-fbff04153e8e)
    )
    (fp_text value "R_0805_2012Metric" (at 0 1.65 90) (layer "F.Fab")
      (effects (font (size 1 1) (thickness 0.15)))
      (tstamp a52ede84-3ae6-47b1-a423-0990182a8efc)
    )
    (fp_text user "${REFERENCE}" (at 0 0 90) (layer "F.Fab")
      (effects (font (size 0.5 0.5) (thickness 0.08)))
      (tstamp 8df105c3-f456-44fb-a954-9e6bea6adbf9)
    )
    (fp_line (start -0.227064 0.735) (end 0.227064 0.735) (layer "F.SilkS") (width 0.12) (tstamp bb4b1ac5-fff7-4f65-8fd1-a54efa9e8b3c))
    (fp_line (start -0.227064 -0.735) (end 0.227064 -0.735) (layer "F.SilkS") (width 0.12) (tstamp d6665f11-b781-403a-b4df-5488fed7fbfd))
    (fp_line (start 1.68 0.95) (end -1.68 0.95) (layer "F.CrtYd") (width 0.05) (tstamp 2433d11d-86c3-4c61-87ad-1a648d94d139))
    (fp_line (start -1.68 0.95) (end -1.68 -0.95) (layer "F.CrtYd") (width 0.05) (tstamp ed26b48a-b2df-4186-b4b8-4904a2946309))
    (fp_line (start -1.68 -0.95) (end 1.68 -0.95) (layer "F.CrtYd") (width 0.05) (tstamp efca4fce-469d-4a46-bc64-aaff9f6559c4))
    (fp_line (start 1.68 -0.95) (end 1.68 0.95) (layer "F.CrtYd") (width 0.05) (tstamp f509d44a-0a8a-4ec0-8808-12a1488619f7))
    (fp_line (start 1 -0.625) (end 1 0.625) (layer "F.Fab") (width 0.1) (tstamp 021201a3-0c51-47e6-8eed-60bb862e8ea3))
    (fp_line (start -1 0.625) (end -1 -0.625) (layer "F.Fab") (width 0.1) (tstamp 4ef6ea5a-cf34-4055-bbb2-c5dbbb584838))
    (fp_line (start 1 0.625) (end -1 0.625) (layer "F.Fab") (width 0.1) (tstamp 9a53cc22-4060-4d17-8512-2f012f5bfb17))
    (fp_line (start -1 -0.625) (end 1 -0.625) (layer "F.Fab") (width 0.1) (tstamp c8a66605-43d1-4817-bf63-f24336697491))
    (pad "1" smd roundrect (at -0.9125 0 90) (size 1.025 1.4) (layers "F.Cu" "F.Paste" "F.Mask") (roundrect_rratio 0.243902439) (tstamp 5e7aba8a-2734-4107-ad14-a5ff9e86d59a))
    (pad "2" smd roundrect (at 0.9125 0 90) (size 1.025 1.4) (layers "F.Cu" "F.Paste" "F.Mask") (roundrect_rratio 0.243902439) (tstamp 5f4ec3c1-2fcc-481f-b55c-e5b3b4a04212))
    (model "${KICAD6_3DMODEL_DIR}/Resistor_SMD.3dshapes/R_0805_2012Metric.wrl"
      (offset (xyz 0 0 0))
      (scale (xyz 1 1 1))
      (rotate (xyz 0 0 0))
    )
  )

  (footprint "Stencils-FPs:ECSTXO252033160ANTR" (layer "F.Cu")
    (tedit 0) (tstamp 99a50d06-5e08-40f2-bc54-63d4050a685b)
    (at 86 61.5)
    (descr "2.5x2.0x0.9mm")
    (tags "Crystal or Oscillator")
    (attr smd)
    (fp_text reference "Y**" (at 0 0) (layer "F.SilkS")
      (effects (font (size 1.27 1.27) (thickness 0.254)))
      (tstamp fea685c7-ea35-49a1-adb7-102c54e2e7fd)
    )
    (fp_text value "ECSTXO252033160ANTR" (at 0 0) (layer "F.SilkS") hide
      (effects (font (size 1.27 1.27) (thickness 0.254)))
      (tstamp e7a76b20-12e4-42ba-b95c-4a9b6a360646)
    )
    (fp_text user "${REFERENCE}" (at 0 0) (layer "F.Fab")
      (effects (font (size 1.27 1.27) (thickness 0.254)))
      (tstamp ab9bb727-3e78-4543-996a-990b3e4b5881)
    )
    (fp_line (start -1.8 0.7) (end -1.8 0.7) (layer "F.SilkS") (width 0.1) (tstamp 44300423-9469-41af-a6b8-3175c145bca2))
    (fp_line (start -1.8 0.8) (end -1.8 0.8) (layer "F.SilkS") (width 0.1) (tstamp 98867100-7e08-47b6-8a25-baea2d642ca2))
    (fp_line (start -0.2 1) (end 0.2 1) (layer "F.SilkS") (width 0.2) (tstamp ba937f3a-931f-4691-a849-2e847673fae2))
    (fp_line (start -0.2 -1) (end 0.2 -1) (layer "F.SilkS") (width 0.2) (tstamp da6dfccd-26c0-4e0b-87d7-b9d43cd70ef0))
    (fp_arc (start -1.8 0.7) (mid -1.75 0.75) (end -1.8 0.8) (layer "F.SilkS") (width 0.1) (tstamp 25638062-4af2-4f8f-921c-483611cb669a))
    (fp_arc (start -1.8 0.8) (mid -1.85 0.75) (end -1.8 0.7) (layer "F.SilkS") (width 0.1) (tstamp afd53bf1-2ea1-4094-83a1-af98987299d9))
    (fp_line (start 2.375 -2.125) (end 2.375 2.125) (layer "F.CrtYd") (width 0.1) (tstamp 157a6ab6-4e6a-448c-a816-a1cf69739643))
    (fp_line (start 2.375 2.125) (end -2.375 2.125) (layer "F.CrtYd") (width 0.1) (tstamp 597d463e-aa32-4716-912f-048a29fc1630))
    (fp_line (start -2.375 -2.125) (end 2.375 -2.125) (layer "F.CrtYd") (width 0.1) (tstamp 9345b832-401e-434d-b363-7dd72cbe3a56))
    (fp_line (start -2.375 2.125) (end -2.375 -2.125) (layer "F.CrtYd") (width 0.1) (tstamp a2ab706c-2d08-4026-8a96-5e5a0f0157a1))
    (fp_line (start 1.25 1) (end -1.25 1) (layer "F.Fab") (width 0.1) (tstamp 240d61d5-b2bb-4ec2-823e-33d2a59114e6))
    (fp_line (start -1.25 -1) (end 1.25 -1) (layer "F.Fab") (width 0.1) (tstamp 373a3dad-4012-4b82-9ed6-07385a97403f))
    (fp_line (start 1.25 -1) (end 1.25 1) (layer "F.Fab") (width 0.1) (tstamp dac6f5e2-6570-4e67-aec7-dabeeb41e885))
    (fp_line (start -1.25 1) (end -1.25 -1) (layer "F.Fab") (width 0.1) (tstamp eb56cd03-926b-4426-b72c-e41d3a489408))
    (pad "1" smd rect (at -0.925 0.725 90) (size 0.8 0.9) (layers "F.Cu" "F.Paste" "F.Mask") (tstamp 58044487-8ed6-4636-8170-2c20644fa833))
    (pad "2" smd rect (at 0.925 0.725 90) (size 0.8 0.9) (layers "F.Cu" "F.Paste" "F.Mask") (tstamp 7879de66-c787-476e-824b-ccce1a838ce4))
    (pad "3" smd rect (at 0.925 -0.725 90) (size 0.8 0.9) (layers "F.Cu" "F.Paste" "F.Mask") (tstamp 337fab3f-ac82-4a6b-a267-5bcd05bca7eb))
    (pad "4" smd rect (at -0.925 -0.725 90) (size 0.8 0.9) (layers "F.Cu" "F.Paste" "F.Mask") (tstamp 79a2d55b-b72c-4353-aee3-0e25bc8b17c2))
    (model "${KIPRJMOD}/3D/step/ECS-TXO-2520-33-160-AN-TR.STEP"
      (offset (xyz 0 0 0))
      (scale (xyz 1 1 1))
      (rotate (xyz -90 0 0))
    )
  )

  (footprint "Stencils-FPs:BLM18PG471SH1D" (layer "F.Cu")
    (tedit 0) (tstamp bb9eedc3-a309-4998-ad04-b1f5a1b329ac)
    (at 75 65.5 90)
    (descr "BLM18_1 L=1.6 W=0.8 T=0.8")
    (tags "Filter")
    (attr smd)
    (fp_text reference "FL**" (at 0 0 90) (layer "F.SilkS")
      (effects (font (size 1.27 1.27) (thickness 0.254)))
      (tstamp 6f54333e-3021-4231-a653-e65aaed3ca2b)
    )
    (fp_text value "BLM18AG102BH1D" (at 0 0 90) (layer "F.SilkS") hide
      (effects (font (size 1.27 1.27) (thickness 0.254)))
      (tstamp 40fe446e-9bb5-43f8-9359-02de2192472c)
    )
    (fp_text user "${REFERENCE}" (at 0 0 90) (layer "F.Fab")
      (effects (font (size 1.27 1.27) (thickness 0.254)))
      (tstamp f343b708-3544-4bfc-b555-671b6441027e)
    )
    (fp_line (start 0 -0.3) (end 0 0.3) (layer "F.SilkS") (width 0.2) (tstamp faa635c0-d1be-4a86-a31c-1d2a84256042))
    (fp_line (start -1.5 0.75) (end -1.5 -0.75) (layer "F.CrtYd") (width 0.05) (tstamp 32ba08f9-3d47-4e64-8752-aa6d39fec0c9))
    (fp_line (start 1.5 -0.75) (end 1.5 0.75) (layer "F.CrtYd") (width 0.05) (tstamp 606ea212-f009-49d2-8697-b8c6c256d988))
    (fp_line (start 1.5 0.75) (end -1.5 0.75) (layer "F.CrtYd") (width 0.05) (tstamp d8806980-510f-4bb4-8b43-1027e0db762a))
    (fp_line (start -1.5 -0.75) (end 1.5 -0.75) (layer "F.CrtYd") (width 0.05) (tstamp e809ef2f-7e9e-499c-8683-38aca08f35c1))
    (fp_line (start -0.8 0.4) (end -0.8 -0.4) (layer "F.Fab") (width 0.1) (tstamp 66232e83-a9d6-4665-a8c3-21d455157aad))
    (fp_line (start -0.8 -0.4) (end 0.8 -0.4) (layer "F.Fab") (width 0.1) (tstamp 7db91439-9c2a-45ea-88d6-342692fc6f31))
    (fp_line (start 0.8 0.4) (end -0.8 0.4) (layer "F.Fab") (width 0.1) (tstamp f86c41e3-ac44-49c7-bde6-bd43f90292f9))
    (fp_line (start 0.8 -0.4) (end 0.8 0.4) (layer "F.Fab") (width 0.1) (tstamp fbaad8ae-2b3a-4b72-b26f-af1d20c21956))
    (pad "1" smd rect (at -0.675 0 90) (size 0.65 0.7) (layers "F.Cu" "F.Paste" "F.Mask") (tstamp c9d99697-5284-4312-913b-3277a4da12c1))
    (pad "2" smd rect (at 0.675 0 90) (size 0.65 0.7) (layers "F.Cu" "F.Paste" "F.Mask") (tstamp c877dbda-a035-4bed-84c1-7dedb25a7821))
    (model "${KIPRJMOD}/3D/step/BLM18PG471SH1D.stp"
      (offset (xyz 0 0 0))
      (scale (xyz 1 1 1))
      (rotate (xyz 0 0 0))
    )
    (model "${KIPRJMOD}/3D/wrl/BLM18PG471SH1D.wrl"
      (offset (xyz 0 0 0))
      (scale (xyz 1 1 1))
      (rotate (xyz 0 0 0))
    )
  )

  (footprint "Stencils-FPs:RM3100_SEN_XY" (layer "F.Cu")
    (tedit 604C13BD) (tstamp e9656ddc-03aa-49d5-a999-26ec8b332004)
    (at 136.5 97.5 180)
    (attr through_hole)
    (fp_text reference "REF**" (at 0 -3.5) (layer "F.SilkS")
      (effects (font (size 1 1) (thickness 0.15)))
      (tstamp 5d69c14c-09fa-42a6-98c0-6f1802fa9069)
    )
    (fp_text value "RM3100_SEN_XY" (at 0 3.5) (layer "F.Fab")
      (effects (font (size 1 1) (thickness 0.15)))
      (tstamp bebcfe7d-6065-4a6e-8fa7-704353d27c53)
    )
    (fp_line (start 3.9 1.2) (end -3.9 1.2) (layer "F.SilkS") (width 0.12) (tstamp 644b3537-2954-4d2b-9f1c-48a800b3bc38))
    (fp_line (start 3.9 -1.2) (end 3.9 1.2) (layer "F.SilkS") (width 0.12) (tstamp c9b335a9-8353-4efc-86bd-e4042d775f1e))
    (fp_line (start -3.9 -1.2) (end 3.9 -1.2) (layer "F.SilkS") (width 0.12) (tstamp fc693842-b327-46a0-bf1a-b44bc356b4f7))
    (fp_line (start -3.9 1.2) (end -3.9 -1.2) (layer "F.SilkS") (width 0.12) (tstamp fe789c2e-0fc0-444c-a69b-017fe5c3dee3))
    (fp_circle (center -4.3 -1.1) (end -4.3 -1.1) (layer "F.SilkS") (width 0.12) (fill none) (tstamp f3614d53-9146-428c-8d7e-1e1516a96115))
    (fp_circle (center -4.3 -1.1) (end -4.25 -1.1) (layer "F.SilkS") (width 0.12) (fill none) (tstamp ffc73196-ec51-439e-afad-77c96fd70928))
    (fp_line (start -3.6 1.4) (end -4.1 1.4) (layer "F.CrtYd") (width 0.12) (tstamp 1d9854de-b5c4-4dbb-bd9d-b6d4d548080e))
    (fp_line (start -4.1 1.4) (end -4.1 -1.4) (layer "F.CrtYd") (width 0.12) (tstamp 20cae13f-9b1b-4eeb-9e6a-3f120dbc96bb))
    (fp_line (start 4.1 1.4) (end -3.6 1.4) (layer "F.CrtYd") (width 0.12) (tstamp 269bfcb6-af8e-4b49-892d-7e7bcdf0c02a))
    (fp_line (start -4.1 -1.4) (end -3.6 -1.4) (layer "F.CrtYd") (width 0.12) (tstamp 6442eb2f-4858-4c8e-a5f2-cc6d701ff356))
    (fp_line (start -3.6 -1.4) (end 4.1 -1.4) (layer "F.CrtYd") (width 0.12) (tstamp 9817ed79-bfc9-478f-b64d-952e1e6938ca))
    (fp_line (start 4.1 -1.4) (end 4.1 1.4) (layer "F.CrtYd") (width 0.12) (tstamp 9b83ad27-de89-43ea-88c7-a3e9f7bf3305))
    (pad "1" smd rect (at -2.9 0 180) (size 1.4 1.7) (layers "F.Cu" "F.Paste" "F.Mask") (tstamp 47d4e360-ef2e-4b8f-95cb-30b4e3311d38))
    (pad "2" smd rect (at 2.9 0 180) (size 1.4 1.7) (layers "F.Cu" "F.Paste" "F.Mask") (tstamp 5055857b-435a-4637-a192-1c8d6ac260df))
  )

  (footprint "Stencils-FPs:ATSAMV71Q21B-AAB" (layer "F.Cu")
    (tedit 5FD7EAC1) (tstamp ea0497a9-3002-4964-8291-262b5f44a04a)
    (at 103.5 88.5)
    (descr "144-Lead Plastic Low Profile Quad Flatpack (PL) 20x20x1.40 mm Body")
    (tags "Integrated Circuit")
    (attr smd)
    (fp_text reference "REF**" (at 0 0) (layer "F.SilkS")
      (effects (font (size 1.27 1.27) (thickness 0.254)))
      (tstamp ddf47769-fe9a-45ae-b939-8188790067d9)
    )
    (fp_text value "ATSAMV71Q21B-AAB" (at 0 0) (layer "F.SilkS") hide
      (effects (font (size 1.27 1.27) (thickness 0.254)))
      (tstamp 2fbaf3f4-3796-4bab-aaf4-06ed7fc61230)
    )
    (fp_text user "${REFERENCE}" (at 0 0) (layer "F.Fab")
      (effects (font (size 1.27 1.27) (thickness 0.254)))
      (tstamp 0ae960a5-0477-43e0-9527-ec4d9767243d)
    )
    (fp_line (start -9.65 -9.65) (end 9.65 -9.65) (layer "F.SilkS") (width 0.2) (tstamp 1c44bf59-7504-4067-9a21-4fd8d05322b7))
    (fp_line (start -9.65 9.65) (end -9.65 -9.65) (layer "F.SilkS") (width 0.2) (tstamp 93bec99f-85f1-4c75-91bb-c56a640b6a82))
    (fp_line (start 9.65 -9.65) (end 9.65 9.65) (layer "F.SilkS") (width 0.2) (tstamp 9409696f-d6ee-4d77-8b91-677e100fa11f))
    (fp_line (start 9.65 9.65) (end -9.65 9.65) (layer "F.SilkS") (width 0.2) (tstamp c8825186-5ef7-4bc1-b3be-826b2f77f830))
    (fp_circle (center -11.225 -9.5) (end -11.225 -9.375) (layer "F.SilkS") (width 0.25) (fill none) (tstamp 8c6ba4b4-1c36-436e-bd5d-c8e0f677c92b))
    (fp_line (start 11.725 11.725) (end -11.725 11.725) (layer "F.CrtYd") (width 0.05) (tstamp 0d666d24-35e7-4f11-8743-ef7cec78b21f))
    (fp_line (start 11.725 -11.725) (end 11.725 11.725) (layer "F.CrtYd") (width 0.05) (tstamp 65d474d8-d46b-415b-b261-4fe0e8ae28f3))
    (fp_line (start -11.725 -11.725) (end 11.725 -11.725) (layer "F.CrtYd") (width 0.05) (tstamp d88fdac3-4824-460b-9796-9cd9d7c2ca60))
    (fp_line (start -11.725 11.725) (end -11.725 -11.725) (layer "F.CrtYd") (width 0.05) (tstamp ebfcf6a2-c254-44ab-81a6-28fdd44da725))
    (fp_line (start 10 10) (end -10 10) (layer "F.Fab") (width 0.1) (tstamp 56a19e26-ecca-4f3e-89b7-5c6f94248cd7))
    (fp_line (start -10 -9.5) (end -9.5 -10) (layer "F.Fab") (width 0.1) (tstamp 702f5159-8114-49bc-9449-117e7719fab3))
    (fp_line (start -10 10) (end -10 -10) (layer "F.Fab") (width 0.1) (tstamp 725ce2b8-f1c0-40c6-83b6-4acefed52521))
    (fp_line (start 10 -10) (end 10 10) (layer "F.Fab") (width 0.1) (tstamp 7df6f178-31e2-48ca-9f79-c19c25694e14))
    (fp_line (start -10 -10) (end 10 -10) (layer "F.Fab") (width 0.1) (tstamp 85a04188-5ac9-4655-9e56-ac4fac531cdb))
    (pad "1" smd rect (at -10.738 -8.75 90) (size 0.3 1.475) (layers "F.Cu" "F.Paste" "F.Mask") (tstamp a440e167-07a1-4e04-94ff-bdefecf4c09d))
    (pad "2" smd rect (at -10.738 -8.25 90) (size 0.3 1.475) (layers "F.Cu" "F.Paste" "F.Mask") (tstamp d8a7d4fe-83d3-44f9-8199-bca225e5e12e))
    (pad "3" smd rect (at -10.738 -7.75 90) (size 0.3 1.475) (layers "F.Cu" "F.Paste" "F.Mask") (tstamp 3ad14491-50f6-41c8-9f50-22255e7e3763))
    (pad "4" smd rect (at -10.738 -7.25 90) (size 0.3 1.475) (layers "F.Cu" "F.Paste" "F.Mask") (tstamp 9e021ccd-631b-4821-841a-872054ff85aa))
    (pad "5" smd rect (at -10.738 -6.75 90) (size 0.3 1.475) (layers "F.Cu" "F.Paste" "F.Mask") (tstamp 3e2c9290-7769-40ac-bdae-e392272b5e90))
    (pad "6" smd rect (at -10.738 -6.25 90) (size 0.3 1.475) (layers "F.Cu" "F.Paste" "F.Mask") (tstamp 3fe01ec9-e0bf-4416-a15a-5f2eb5dd6b0d))
    (pad "7" smd rect (at -10.738 -5.75 90) (size 0.3 1.475) (layers "F.Cu" "F.Paste" "F.Mask") (tstamp 87072898-188f-4041-aa38-da671a005f84))
    (pad "8" smd rect (at -10.738 -5.25 90) (size 0.3 1.475) (layers "F.Cu" "F.Paste" "F.Mask") (tstamp 5dc566a3-c7a5-4ad9-b186-7f72a901cb52))
    (pad "9" smd rect (at -10.738 -4.75 90) (size 0.3 1.475) (layers "F.Cu" "F.Paste" "F.Mask") (tstamp 07f797e1-2fc9-493a-b385-a8065bc107c4))
    (pad "10" smd rect (at -10.738 -4.25 90) (size 0.3 1.475) (layers "F.Cu" "F.Paste" "F.Mask") (tstamp 53d3fa71-b316-4df5-807a-7f60a3afd0f6))
    (pad "11" smd rect (at -10.738 -3.75 90) (size 0.3 1.475) (layers "F.Cu" "F.Paste" "F.Mask") (tstamp c90d4a30-6d8b-41f3-a01f-babf7a54f346))
    (pad "12" smd rect (at -10.738 -3.25 90) (size 0.3 1.475) (layers "F.Cu" "F.Paste" "F.Mask") (tstamp feff416b-88fe-4926-9202-e754f93c10d5))
    (pad "13" smd rect (at -10.738 -2.75 90) (size 0.3 1.475) (layers "F.Cu" "F.Paste" "F.Mask") (tstamp 3a27be53-af2f-4928-b39e-aa54938394ab))
    (pad "14" smd rect (at -10.738 -2.25 90) (size 0.3 1.475) (layers "F.Cu" "F.Paste" "F.Mask") (tstamp 4875e1a0-8897-4bde-a63c-51860fcd2cf3))
    (pad "15" smd rect (at -10.738 -1.75 90) (size 0.3 1.475) (layers "F.Cu" "F.Paste" "F.Mask") (tstamp 6d8da783-233e-4537-871f-f61218656e89))
    (pad "16" smd rect (at -10.738 -1.25 90) (size 0.3 1.475) (layers "F.Cu" "F.Paste" "F.Mask") (tstamp 71e8e5c4-3056-48d8-9fc8-868eaf1d0a51))
    (pad "17" smd rect (at -10.738 -0.75 90) (size 0.3 1.475) (layers "F.Cu" "F.Paste" "F.Mask") (tstamp 89eb8c8d-cedc-433a-93c3-627ea2ea0e17))
    (pad "18" smd rect (at -10.738 -0.25 90) (size 0.3 1.475) (layers "F.Cu" "F.Paste" "F.Mask") (tstamp da9a1330-8d7c-4bdf-8b2c-0ab2866afe9e))
    (pad "19" smd rect (at -10.738 0.25 90) (size 0.3 1.475) (layers "F.Cu" "F.Paste" "F.Mask") (tstamp 47b17cac-a2c0-4323-a344-d55fd51a0d0b))
    (pad "20" smd rect (at -10.738 0.75 90) (size 0.3 1.475) (layers "F.Cu" "F.Paste" "F.Mask") (tstamp 308ab98c-42cb-48c7-a19d-058c1dc7ae56))
    (pad "21" smd rect (at -10.738 1.25 90) (size 0.3 1.475) (layers "F.Cu" "F.Paste" "F.Mask") (tstamp 918d3d13-ddbe-42f2-97c2-d5ce090db6b2))
    (pad "22" smd rect (at -10.738 1.75 90) (size 0.3 1.475) (layers "F.Cu" "F.Paste" "F.Mask") (tstamp cc0341e0-7d79-4424-b2d8-a91b76b8a8ae))
    (pad "23" smd rect (at -10.738 2.25 90) (size 0.3 1.475) (layers "F.Cu" "F.Paste" "F.Mask") (tstamp c906d588-392b-4818-8a43-392d0b925461))
    (pad "24" smd rect (at -10.738 2.75 90) (size 0.3 1.475) (layers "F.Cu" "F.Paste" "F.Mask") (tstamp 26f9baae-3ad5-4ebe-9c0e-d3049ae4a498))
    (pad "25" smd rect (at -10.738 3.25 90) (size 0.3 1.475) (layers "F.Cu" "F.Paste" "F.Mask") (tstamp 43d38e00-7c09-46c0-890f-5435d56d8033))
    (pad "26" smd rect (at -10.738 3.75 90) (size 0.3 1.475) (layers "F.Cu" "F.Paste" "F.Mask") (tstamp 6154fe28-743f-4cd0-8cd9-fe450c7dbfcd))
    (pad "27" smd rect (at -10.738 4.25 90) (size 0.3 1.475) (layers "F.Cu" "F.Paste" "F.Mask") (tstamp 4cde4c81-041d-406a-91e2-55b81cec1442))
    (pad "28" smd rect (at -10.738 4.75 90) (size 0.3 1.475) (layers "F.Cu" "F.Paste" "F.Mask") (tstamp 501cc7d4-1ebc-4820-bd2a-8340e89dc355))
    (pad "29" smd rect (at -10.738 5.25 90) (size 0.3 1.475) (layers "F.Cu" "F.Paste" "F.Mask") (tstamp 7b0f755a-17f1-4a9d-a3c0-a85df48e8f63))
    (pad "30" smd rect (at -10.738 5.75 90) (size 0.3 1.475) (layers "F.Cu" "F.Paste" "F.Mask") (tstamp 06dce067-b59d-4b4e-b6b2-3587227f3894))
    (pad "31" smd rect (at -10.738 6.25 90) (size 0.3 1.475) (layers "F.Cu" "F.Paste" "F.Mask") (tstamp 19756a76-9b5b-442f-bf43-1d6639df1b2c))
    (pad "32" smd rect (at -10.738 6.75 90) (size 0.3 1.475) (layers "F.Cu" "F.Paste" "F.Mask") (tstamp d3e0146e-ecb6-4f44-aeeb-c2e967507f9f))
    (pad "33" smd rect (at -10.738 7.25 90) (size 0.3 1.475) (layers "F.Cu" "F.Paste" "F.Mask") (tstamp 9c46d013-1ed2-4987-983f-e5fedee86ded))
    (pad "34" smd rect (at -10.738 7.75 90) (size 0.3 1.475) (layers "F.Cu" "F.Paste" "F.Mask") (tstamp c58d3614-30c5-494c-bd3c-4cbd73a65956))
    (pad "35" smd rect (at -10.738 8.25 90) (size 0.3 1.475) (layers "F.Cu" "F.Paste" "F.Mask") (tstamp 8e0d3b13-725c-4b1f-8f67-9ce2c56b812e))
    (pad "36" smd rect (at -10.738 8.75 90) (size 0.3 1.475) (layers "F.Cu" "F.Paste" "F.Mask") (tstamp 944bb616-c3ec-44f5-aa80-db0418a8d743))
    (pad "37" smd rect (at -8.75 10.738) (size 0.3 1.475) (layers "F.Cu" "F.Paste" "F.Mask") (tstamp 3e2c386c-d0b7-4299-925d-9c26572bf351))
    (pad "38" smd rect (at -8.25 10.738) (size 0.3 1.475) (layers "F.Cu" "F.Paste" "F.Mask") (tstamp 3862d648-83d0-4c39-9ee5-ba907f637aad))
    (pad "39" smd rect (at -7.75 10.738) (size 0.3 1.475) (layers "F.Cu" "F.Paste" "F.Mask") (tstamp 07151845-0160-4870-992f-1fae57f1514a))
    (pad "40" smd rect (at -7.25 10.738) (size 0.3 1.475) (layers "F.Cu" "F.Paste" "F.Mask") (tstamp 65fce88b-bae6-457d-a9a6-86f4cf974ea4))
    (pad "41" smd rect (at -6.75 10.738) (size 0.3 1.475) (layers "F.Cu" "F.Paste" "F.Mask") (tstamp ef00c449-5785-4ecf-b1d0-81540fa470b7))
    (pad "42" smd rect (at -6.25 10.738) (size 0.3 1.475) (layers "F.Cu" "F.Paste" "F.Mask") (tstamp a1e254c5-7bd6-4317-acf8-0e0a8c864670))
    (pad "43" smd rect (at -5.75 10.738) (size 0.3 1.475) (layers "F.Cu" "F.Paste" "F.Mask") (tstamp de18f677-5fcc-41fb-bdce-32996cc82ef7))
    (pad "44" smd rect (at -5.25 10.738) (size 0.3 1.475) (layers "F.Cu" "F.Paste" "F.Mask") (tstamp 9ac55451-cbe9-4bef-8570-1555b38ba6fb))
    (pad "45" smd rect (at -4.75 10.738) (size 0.3 1.475) (layers "F.Cu" "F.Paste" "F.Mask") (tstamp e25c9cef-33f8-42fd-8699-bbf86c9a36bd))
    (pad "46" smd rect (at -4.25 10.738) (size 0.3 1.475) (layers "F.Cu" "F.Paste" "F.Mask") (tstamp 44b87cb5-9fe1-4c56-90cb-142fb98612d9))
    (pad "47" smd rect (at -3.75 10.738) (size 0.3 1.475) (layers "F.Cu" "F.Paste" "F.Mask") (tstamp 7ed8f038-8c52-48b9-8181-f31cbb0b6621))
    (pad "48" smd rect (at -3.25 10.738) (size 0.3 1.475) (layers "F.Cu" "F.Paste" "F.Mask") (tstamp 35158223-6953-4eef-8c22-04574e9008f8))
    (pad "49" smd rect (at -2.75 10.738) (size 0.3 1.475) (layers "F.Cu" "F.Paste" "F.Mask") (tstamp 70c28d32-0946-46b6-823d-216ab45afb7e))
    (pad "50" smd rect (at -2.25 10.738) (size 0.3 1.475) (layers "F.Cu" "F.Paste" "F.Mask") (tstamp 85d1926a-de5e-4c9d-894b-cf816be6633a))
    (pad "51" smd rect (at -1.75 10.738) (size 0.3 1.475) (layers "F.Cu" "F.Paste" "F.Mask") (tstamp 9ec64027-f7ad-4246-876a-23874e2159a8))
    (pad "52" smd rect (at -1.25 10.738) (size 0.3 1.475) (layers "F.Cu" "F.Paste" "F.Mask") (tstamp 75da2850-6ef6-489a-894b-fe3e4ff652be))
    (pad "53" smd rect (at -0.75 10.738) (size 0.3 1.475) (layers "F.Cu" "F.Paste" "F.Mask") (tstamp 7b74dfaa-cf3b-4b26-a6cb-8927e3c58163))
    (pad "54" smd rect (at -0.25 10.738) (size 0.3 1.475) (layers "F.Cu" "F.Paste" "F.Mask") (tstamp 7af197ef-c343-444d-98f0-2000071eae00))
    (pad "55" smd rect (at 0.25 10.738) (size 0.3 1.475) (layers "F.Cu" "F.Paste" "F.Mask") (tstamp 24afbb30-ae5e-4c09-a2c9-de621cece251))
    (pad "56" smd rect (at 0.75 10.738) (size 0.3 1.475) (layers "F.Cu" "F.Paste" "F.Mask") (tstamp 76c895be-f5b5-43ec-8b4e-c3a305cce491))
    (pad "57" smd rect (at 1.25 10.738) (size 0.3 1.475) (layers "F.Cu" "F.Paste" "F.Mask") (tstamp 7cd5e5c2-210e-4666-9b5f-ba42105e4ba7))
    (pad "58" smd rect (at 1.75 10.738) (size 0.3 1.475) (layers "F.Cu" "F.Paste" "F.Mask") (tstamp 5c64295a-fe49-41c3-9235-2fae4084e94b))
    (pad "59" smd rect (at 2.25 10.738) (size 0.3 1.475) (layers "F.Cu" "F.Paste" "F.Mask") (tstamp 57d3a7a6-52cd-4ee6-9848-15e6ec15133b))
    (pad "60" smd rect (at 2.75 10.738) (size 0.3 1.475) (layers "F.Cu" "F.Paste" "F.Mask") (tstamp ab16bd89-47b0-45d6-9dac-af8469c1b2b6))
    (pad "61" smd rect (at 3.25 10.738) (size 0.3 1.475) (layers "F.Cu" "F.Paste" "F.Mask") (tstamp 054bf1d7-6ec1-489e-a924-0e2e322aa5d3))
    (pad "62" smd rect (at 3.75 10.738) (size 0.3 1.475) (layers "F.Cu" "F.Paste" "F.Mask") (tstamp 95c98b40-3e97-492c-ae8d-f02eb007b471))
    (pad "63" smd rect (at 4.25 10.738) (size 0.3 1.475) (layers "F.Cu" "F.Paste" "F.Mask") (tstamp 64dbbeb0-6a06-4b1c-80a8-87f073d11e1b))
    (pad "64" smd rect (at 4.75 10.738) (size 0.3 1.475) (layers "F.Cu" "F.Paste" "F.Mask") (tstamp 092cc123-342f-4c50-96f5-85024749fb8f))
    (pad "65" smd rect (at 5.25 10.738) (size 0.3 1.475) (layers "F.Cu" "F.Paste" "F.Mask") (tstamp 13d1f275-1ed6-433e-a219-7344743f5673))
    (pad "66" smd rect (at 5.75 10.738) (size 0.3 1.475) (layers "F.Cu" "F.Paste" "F.Mask") (tstamp 26b3c838-7127-4c93-a9b8-b527186892ca))
    (pad "67" smd rect (at 6.25 10.738) (size 0.3 1.475) (layers "F.Cu" "F.Paste" "F.Mask") (tstamp fd94ebea-79a7-4d26-bcf3-a0f17a626b87))
    (pad "68" smd rect (at 6.75 10.738) (size 0.3 1.475) (layers "F.Cu" "F.Paste" "F.Mask") (tstamp e9ee630c-a753-4756-8a63-8730d1a670cd))
    (pad "69" smd rect (at 7.25 10.738) (size 0.3 1.475) (layers "F.Cu" "F.Paste" "F.Mask") (tstamp 384ea20e-6753-49f3-87dc-afb152178524))
    (pad "70" smd rect (at 7.75 10.738) (size 0.3 1.475) (layers "F.Cu" "F.Paste" "F.Mask") (tstamp 28eb39e3-bc2e-4b08-bfbc-994f090879c8))
    (pad "71" smd rect (at 8.25 10.738) (size 0.3 1.475) (layers "F.Cu" "F.Paste" "F.Mask") (tstamp c80910a5-6306-41c5-9bac-428c13992c4e))
    (pad "72" smd rect (at 8.75 10.738) (size 0.3 1.475) (layers "F.Cu" "F.Paste" "F.Mask") (tstamp db44587e-69c0-464f-a105-0a4beed12a8d))
    (pad "73" smd rect (at 10.738 8.75 90) (size 0.3 1.475) (layers "F.Cu" "F.Paste" "F.Mask") (tstamp 3146d732-c6e5-49e7-b99d-4d683be37fd5))
    (pad "74" smd rect (at 10.738 8.25 90) (size 0.3 1.475) (layers "F.Cu" "F.Paste" "F.Mask") (tstamp 685b8076-554f-4527-994e-79734ab194ad))
    (pad "75" smd rect (at 10.738 7.75 90) (size 0.3 1.475) (layers "F.Cu" "F.Paste" "F.Mask") (tstamp 84b7c205-e19c-41b0-bd63-7397cbdf1382))
    (pad "76" smd rect (at 10.738 7.25 90) (size 0.3 1.475) (layers "F.Cu" "F.Paste" "F.Mask") (tstamp bd3a9a10-8dbd-433c-8c7e-16457e7dc670))
    (pad "77" smd rect (at 10.738 6.75 90) (size 0.3 1.475) (layers "F.Cu" "F.Paste" "F.Mask") (tstamp cf21f949-1d30-4c8e-bcc6-790bb1c2949a))
    (pad "78" smd rect (at 10.738 6.25 90) (size 0.3 1.475) (layers "F.Cu" "F.Paste" "F.Mask") (tstamp 93fbfe95-a333-4f6a-990a-0d8e666424c3))
    (pad "79" smd rect (at 10.738 5.75 90) (size 0.3 1.475) (layers "F.Cu" "F.Paste" "F.Mask") (tstamp 80a2a5b3-cd29-4095-832a-7af018858bef))
    (pad "80" smd rect (at 10.738 5.25 90) (size 0.3 1.475) (layers "F.Cu" "F.Paste" "F.Mask") (tstamp b369144c-9309-406a-b5fb-818ff3595e69))
    (pad "81" smd rect (at 10.738 4.75 90) (size 0.3 1.475) (layers "F.Cu" "F.Paste" "F.Mask") (tstamp ea2b2574-6a75-4605-86dc-92186befb36c))
    (pad "82" smd rect (at 10.738 4.25 90) (size 0.3 1.475) (layers "F.Cu" "F.Paste" "F.Mask") (tstamp f4d12df9-f475-4bc8-8229-e8c2b3092574))
    (pad "83" smd rect (at 10.738 3.75 90) (size 0.3 1.475) (layers "F.Cu" "F.Paste" "F.Mask") (tstamp 8ebe2166-82be-4af3-b7d8-55a1b8f1f496))
    (pad "84" smd rect (at 10.738 3.25 90) (size 0.3 1.475) (layers "F.Cu" "F.Paste" "F.Mask") (tstamp 2f9e7ec2-7ae3-490c-b468-1cb355ffac1d))
    (pad "85" smd rect (at 10.738 2.75 90) (size 0.3 1.475) (layers "F.Cu" "F.Paste" "F.Mask") (tstamp dc2b4bee-4ddf-48c0-9ffe-69eb87911d6d))
    (pad "86" smd rect (at 10.738 2.25 90) (size 0.3 1.475) (layers "F.Cu" "F.Paste" "F.Mask") (tstamp a9bac5ef-b70d-43a1-bf40-3a3b6c3847f3))
    (pad "87" smd rect (at 10.738 1.75 90) (size 0.3 1.475) (layers "F.Cu" "F.Paste" "F.Mask") (tstamp a753da91-c8a3-4d41-8efb-5c54304d365c))
    (pad "88" smd rect (at 10.738 1.25 90) (size 0.3 1.475) (layers "F.Cu" "F.Paste" "F.Mask") (tstamp 050ea729-c6d8-4667-8ed4-6e3e401319d0))
    (pad "89" smd rect (at 10.738 0.75 90) (size 0.3 1.475) (layers "F.Cu" "F.Paste" "F.Mask") (tstamp a73a4302-1198-4867-a8d2-6aa97c59179e))
    (pad "90" smd rect (at 10.738 0.25 90) (size 0.3 1.475) (layers "F.Cu" "F.Paste" "F.Mask") (tstamp 578dc816-d37e-40f6-a7c5-e90c284b431e))
    (pad "91" smd rect (at 10.738 -0.25 90) (size 0.3 1.475) (layers "F.Cu" "F.Paste" "F.Mask") (tstamp 675876d1-10e2-4290-96e3-312c80fdec1e))
    (pad "92" smd rect (at 10.738 -0.75 90) (size 0.3 1.475) (layers "F.Cu" "F.Paste" "F.Mask") (tstamp de24a2fc-f062-4bd1-a366-4d12db26db5e))
    (pad "93" smd rect (at 10.738 -1.25 90) (size 0.3 1.475) (layers "F.Cu" "F.Paste" "F.Mask") (tstamp 0c4135f3-f830-421e-b891-dca93d67da2b))
    (pad "94" smd rect (at 10.738 -1.75 90) (size 0.3 1.475) (layers "F.Cu" "F.Paste" "F.Mask") (tstamp 80623eaf-9b95-4036-adf5-8edeb30ea02e))
    (pad "95" smd rect (at 10.738 -2.25 90) (size 0.3 1.475) (layers "F.Cu" "F.Paste" "F.Mask") (tstamp 7de52d58-326d-4423-b663-1cb0a458aabc))
    (pad "96" smd rect (at 10.738 -2.75 90) (size 0.3 1.475) (layers "F.Cu" "F.Paste" "F.Mask") (tstamp ad9f6ca0-8720-4260-96ce-592d3dc769cc))
    (pad "97" smd rect (at 10.738 -3.25 90) (size 0.3 1.475) (layers "F.Cu" "F.Paste" "F.Mask") (tstamp 614ec3a3-43a4-4553-836d-e1ee49ed1505))
    (pad "98" smd rect (at 10.738 -3.75 90) (size 0.3 1.475) (layers "F.Cu" "F.Paste" "F.Mask") (tstamp 1f5d2f66-5523-4d7e-bcb7-88b51750c7fe))
    (pad "99" smd rect (at 10.738 -4.25 90) (size 0.3 1.475) (layers "F.Cu" "F.Paste" "F.Mask") (tstamp 91ebfc11-86d3-4ec3-8420-fcefc34edd6b))
    (pad "100" smd rect (at 10.738 -4.75 90) (size 0.3 1.475) (layers "F.Cu" "F.Paste" "F.Mask") (tstamp 20e61da8-c128-45ac-a52b-fc646b6441b4))
    (pad "101" smd rect (at 10.738 -5.25 90) (size 0.3 1.475) (layers "F.Cu" "F.Paste" "F.Mask") (tstamp a0c4d207-c114-4b8a-89ff-a7b9c8b9a655))
    (pad "102" smd rect (at 10.738 -5.75 90) (size 0.3 1.475) (layers "F.Cu" "F.Paste" "F.Mask") (tstamp 60518cfc-15bc-47c5-8f5f-f14bd12e2570))
    (pad "103" smd rect (at 10.738 -6.25 90) (size 0.3 1.475) (layers "F.Cu" "F.Paste" "F.Mask") (tstamp 7a9c8735-0652-4524-b6d4-5841d4b1de76))
    (pad "104" smd rect (at 10.738 -6.75 90) (size 0.3 1.475) (layers "F.Cu" "F.Paste" "F.Mask") (tstamp b9d977e9-2b66-4982-8970-492318a0af93))
    (pad "105" smd rect (at 10.738 -7.25 90) (size 0.3 1.475) (layers "F.Cu" "F.Paste" "F.Mask") (tstamp 4f8c21cc-bba0-44c8-99ef-33c6ec4140b3))
    (pad "106" smd rect (at 10.738 -7.75 90) (size 0.3 1.475) (layers "F.Cu" "F.Paste" "F.Mask") (tstamp 142995b9-14cb-4049-bc6b-06a04d0aab4c))
    (pad "107" smd rect (at 10.738 -8.25 90) (size 0.3 1.475) (layers "F.Cu" "F.Paste" "F.Mask") (tstamp 59e5ad2e-db76-4c7e-9a6a-c7e06b653010))
    (pad "108" smd rect (at 10.738 -8.75 90) (size 0.3 1.475) (layers "F.Cu" "F.Paste" "F.Mask") (tstamp 56ea41c6-18bd-4728-acd2-cfb51a890e22))
    (pad "109" smd rect (at 8.75 -10.738) (size 0.3 1.475) (layers "F.Cu" "F.Paste" "F.Mask") (tstamp f4f84826-982e-451c-a85a-c118ca0ae443))
    (pad "110" smd rect (at 8.25 -10.738) (size 0.3 1.475) (layers "F.Cu" "F.Paste" "F.Mask") (tstamp fa11d760-50d1-4874-a13c-e82c82515bbe))
    (pad "111" smd rect (at 7.75 -10.738) (size 0.3 1.475) (layers "F.Cu" "F.Paste" "F.Mask") (tstamp 862d38dd-b105-4cdd-9a54-627da5bbf0b9))
    (pad "112" smd rect (at 7.25 -10.738) (size 0.3 1.475) (layers "F.Cu" "F.Paste" "F.Mask") (tstamp 0fc287e2-2e7c-4dc4-8b7c-f7f9000c9f60))
    (pad "113" smd rect (at 6.75 -10.738) (size 0.3 1.475) (layers "F.Cu" "F.Paste" "F.Mask") (tstamp aab578ac-95bf-4adb-a1f4-3919696d5fa0))
    (pad "114" smd rect (at 6.25 -10.738) (size 0.3 1.475) (layers "F.Cu" "F.Paste" "F.Mask") (tstamp e174c56e-5c8e-45e1-8b0f-2acc3cbadc34))
    (pad "115" smd rect (at 5.75 -10.738) (size 0.3 1.475) (layers "F.Cu" "F.Paste" "F.Mask") (tstamp 816e76cc-407c-44fe-a920-5b6b48b0d623))
    (pad "116" smd rect (at 5.25 -10.738) (size 0.3 1.475) (layers "F.Cu" "F.Paste" "F.Mask") (tstamp 1cb50887-58bc-41bf-959c-df1f83482a88))
    (pad "117" smd rect (at 4.75 -10.738) (size 0.3 1.475) (layers "F.Cu" "F.Paste" "F.Mask") (tstamp 378f3318-69b1-4b2c-9962-544b95f4a910))
    (pad "118" smd rect (at 4.25 -10.738) (size 0.3 1.475) (layers "F.Cu" "F.Paste" "F.Mask") (tstamp 2c2fae1d-e99a-489f-9934-c4f09982fc02))
    (pad "119" smd rect (at 3.75 -10.738) (size 0.3 1.475) (layers "F.Cu" "F.Paste" "F.Mask") (tstamp 08110e02-abcf-4b3e-9107-b96c0f38f568))
    (pad "120" smd rect (at 3.25 -10.738) (size 0.3 1.475) (layers "F.Cu" "F.Paste" "F.Mask") (tstamp 7f9382b2-4522-4227-991c-2b89dd44202d))
    (pad "121" smd rect (at 2.75 -10.738) (size 0.3 1.475) (layers "F.Cu" "F.Paste" "F.Mask") (tstamp 79a8102d-0df6-4efc-be45-f69d8a2c8a69))
    (pad "122" smd rect (at 2.25 -10.738) (size 0.3 1.475) (layers "F.Cu" "F.Paste" "F.Mask") (tstamp fff96d4b-c275-4ac6-ac01-cbe2f67abcc9))
    (pad "123" smd rect (at 1.75 -10.738) (size 0.3 1.475) (layers "F.Cu" "F.Paste" "F.Mask") (tstamp 7516175c-16ce-41ee-8982-849337afea18))
    (pad "124" smd rect (at 1.25 -10.738) (size 0.3 1.475) (layers "F.Cu" "F.Paste" "F.Mask") (tstamp a6ac0efa-d456-4fc8-a1e7-9633afaa2278))
    (pad "125" smd rect (at 0.75 -10.738) (size 0.3 1.475) (layers "F.Cu" "F.Paste" "F.Mask") (tstamp 085ad65f-3db7-4618-947c-4bc12b789610))
    (pad "126" smd rect (at 0.25 -10.738) (size 0.3 1.475) (layers "F.Cu" "F.Paste" "F.Mask") (tstamp a7e7ae63-ab87-46de-97d7-f543a36bac51))
    (pad "127" smd rect (at -0.25 -10.738) (size 0.3 1.475) (layers "F.Cu" "F.Paste" "F.Mask") (tstamp 23802c31-b398-4713-a254-98e90bc76860))
    (pad "128" smd rect (at -0.75 -10.738) (size 0.3 1.475) (layers "F.Cu" "F.Paste" "F.Mask") (tstamp 328cf263-8ab2-402a-bf84-3137afafdcb1))
    (pad "129" smd rect (at -1.25 -10.738) (size 0.3 1.475) (layers "F.Cu" "F.Paste" "F.Mask") (tstamp d12240fe-3808-47cb-a197-2f944b5f7181))
    (pad "130" smd rect (at -1.75 -10.738) (size 0.3 1.475) (layers "F.Cu" "F.Paste" "F.Mask") (tstamp 229212c0-8cd3-4d17-b7e4-2f02ae2d6926))
    (pad "131" smd rect (at -2.25 -10.738) (size 0.3 1.475) (layers "F.Cu" "F.Paste" "F.Mask") (tstamp d9bb598d-4f52-4534-8349-11f9f20772ea))
    (pad "132" smd rect (at -2.75 -10.738) (size 0.3 1.475) (layers "F.Cu" "F.Paste" "F.Mask") (tstamp d27a0f9f-62cc-44b7-8bdf-a9bc42e52096))
    (pad "133" smd rect (at -3.25 -10.738) (size 0.3 1.475) (layers "F.Cu" "F.Paste" "F.Mask") (tstamp 233b7323-13a9-42fd-9442-931768d3331a))
    (pad "134" smd rect (at -3.75 -10.738) (size 0.3 1.475) (layers "F.Cu" "F.Paste" "F.Mask") (tstamp 51c96a04-66aa-4590-a5da-d2cb46773424))
    (pad "135" smd rect (at -4.25 -10.738) (size 0.3 1.475) (layers "F.Cu" "F.Paste" "F.Mask") (tstamp 57c754c7-c9e9-4de6-b27a-1566e4651e55))
    (pad "136" smd rect (at -4.75 -10.738) (size 0.3 1.475) (layers "F.Cu" "F.Paste" "F.Mask") (tstamp a0b4b58e-dc46-4317-9dd6-bf037157c70a))
    (pad "137" smd rect (at -5.25 -10.738) (size 0.3 1.475) (layers "F.Cu" "F.Paste" "F.Mask") (tstamp c1fb6005-4663-412f-822f-d689c72c2a70))
    (pad "138" smd rect (at -5.75 -10.738) (size 0.3 1.475) (layers "F.Cu" "F.Paste" "F.Mask") (tstamp 800d7411-03cd-46fe-a775-4db648eca6c1))
    (pad "139" smd rect (at -6.25 -10.738) (size 0.3 1.475) (layers "F.Cu" "F.Paste" "F.Mask") (tstamp 1027a2fa-f53b-4e65-a92b-7944a3ac5bda))
    (pad "140" smd rect (at -6.75 -10.738) (size 0.3 1.475) (layers "F.Cu" "F.Paste" "F.Mask") (tstamp f9c770d4-c8fb-40f5-a71b-91fd49839825))
    (pad "141" smd rect (at -7.25 -10.738) (size 0.3 1.475) (layers "F.Cu" "F.Paste" "F.Mask") (tstamp a80332f9-52c4-4ecc-87aa-317a387b4623))
    (pad "142" smd rect (at -7.75 -10.738) (size 0.3 1.475) (layers "F.Cu" "F.Paste" "F.Mask") (tstamp 667a1f21-4bb4-449e-9448-99f02edf1559))
    (pad "143" smd rect (at -8.25 -10.738) (size 0.3 1.475) (layers "F.Cu" "F.Paste" "F.Mask") (tstamp 58bf4629-426e-48e0-8c37-a2ce3e7ab17a))
    (pad "144" smd rect (at -8.75 -10.738) (size 0.3 1.475) (layers "F.Cu" "F.Paste" "F.Mask") (tstamp e4352009-143e-48bd-b3d6-bf5a94e65de8))
    (model "${KIPRJMOD}/3D/step/ATSAMV71Q21B-AAB.stp"
      (offset (xyz 0 0 0))
      (scale (xyz 1 1 1))
      (rotate (xyz 0 0 0))
    )
    (model "${KIPRJMOD}/3D/wrl/ATSAMV71Q21B-AAB.wrl"
      (offset (xyz 0 0 0))
      (scale (xyz 1 1 1))
      (rotate (xyz 0 0 0))
    )
  )

  (footprint "Stencils-FPs:RM3100_MAGI2C" (layer "F.Cu")
    (tedit 604C154B) (tstamp ebfeda62-e166-4a89-8610-43c51e798522)
    (at 135 75)
    (attr through_hole)
    (fp_text reference "REF**" (at 0 -3.52) (layer "F.SilkS")
      (effects (font (size 1 1) (thickness 0.15)))
      (tstamp 27a17dd6-784d-4b51-9784-c246a8c99322)
    )
    (fp_text value "RM3100_MAGI2C" (at 0.12 3.65) (layer "F.Fab")
      (effects (font (size 1 1) (thickness 0.15)))
      (tstamp e27c708e-2970-49ad-8d55-de1776f0349c)
    )
    (fp_text user "${REFERENCE}" (at 0 0) (layer "F.Fab") hide
      (effects (font (size 1 1) (thickness 0.15)))
      (tstamp e137a84b-b07f-47b1-97b7-cfd69c4a8527)
    )
    (fp_line (start -1.56 2.11) (end -2.11 2.11) (layer "F.SilkS") (width 0.12) (tstamp 142b1965-4eae-4056-8f80-c07701480a69))
    (fp_line (start 1.56 2.11) (end 2.11 2.11) (layer "F.SilkS") (width 0.12) (tstamp 3533e14b-3ebd-4aa0-9731-d77b08f0c5c0))
    (fp_line (start 1.56 -2.11) (end 2.11 -2.11) (layer "F.SilkS") (width 0.12) (tstamp 757f86e4-b191-4f57-857e-8deb6e7df888))
    (fp_line (start 2.11 -2.11) (end 2.11 -1.56) (layer "F.SilkS") (width 0.12) (tstamp a30bc47f-a8b7-43b8-881f-c8b14c6e8b06))
    (fp_line (start 2.11 2.11) (end 2.11 1.56) (layer "F.SilkS") (width 0.12) (tstamp c059a4da-3bca-4223-b06c-a79c1b2bba82))
    (fp_line (start -1.56 -2.11) (end -2.11 -2.11) (layer "F.SilkS") (width 0.12) (tstamp d6bc9d70-fe72-487c-9ac7-e1e612d5a62c))
    (fp_line (start -2.11 2.11) (end -2.11 1.56) (layer "F.SilkS") (width 0.12) (tstamp dd9567b3-c5c8-481a-8c5a-99aa1a15d1ed))
    (fp_line (start 2.62 2.62) (end 2.62 -2.62) (layer "F.CrtYd") (width 0.05) (tstamp 02dc0f39-9c14-48be-9310-45028c70c42c))
    (fp_line (start -2.62 2.62) (end 2.62 2.62) (layer "F.CrtYd") (width 0.05) (tstamp 5a0d5f89-9bd0-4b42-b9ba-36d029da9b46))
    (fp_line (start -2.62 -2.62) (end -2.62 2.62) (layer "F.CrtYd") (width 0.05) (tstamp 9ad0c328-99b0-4249-96c6-99529c0ed632))
    (fp_line (start 2.62 -2.62) (end -2.62 -2.62) (layer "F.CrtYd") (width 0.05) (tstamp eb039ef5-0652-472f-9cdc-505e5ccc7522))
    (fp_line (start -1 -2) (end 2 -2) (layer "F.Fab") (width 0.1) (tstamp 20ca410a-d8cf-4cca-b123-762b2c367d27))
    (fp_line (start 2 -2) (end 2 2) (layer "F.Fab") (width 0.1) (tstamp 31fdd708-2227-4366-a7a8-05aad841aa31))
    (fp_line (start 2 2) (end -2 2) (layer "F.Fab") (width 0.1) (tstamp 688f0ecc-34b9-4c1f-8231-8a143092e4ac))
    (fp_line (start -2 2) (end -2 -1) (layer "F.Fab") (width 0.1) (tstamp 71e71e9c-6472-43ae-910f-014d1210d4c9))
    (fp_line (start -2 -1) (end -1 -2) (layer "F.Fab") (width 0.1) (tstamp 80aa22d8-8467-49e3-a48f-7b80c62a49ee))
    (pad "" smd roundrect (at -0.65 -0.65) (size 1.05 1.05) (layers "F.Paste") (roundrect_rratio 0.2380952381) (tstamp 0dd55d12-0bcb-45c7-b4c0-66b8192a4eab))
    (pad "" smd roundrect (at 0.65 -0.65) (size 1.05 1.05) (layers "F.Paste") (roundrect_rratio 0.2380952381) (tstamp 721f3dc4-0939-4461-933b-9e385df4d63b))
    (pad "" smd roundrect (at 0.65 0.65) (size 1.05 1.05) (layers "F.Paste") (roundrect_rratio 0.2380952381) (tstamp 7f160a23-5767-4ac2-9136-967c8f0444d6))
    (pad "" smd roundrect (at -0.65 0.65) (size 1.05 1.05) (layers "F.Paste") (roundrect_rratio 0.2380952381) (tstamp dd4d2d44-ca52-4192-8e9f-9cf6b902c99d))
    (pad "1" smd roundrect (at -1.9375 -1.2) (size 0.875 0.2) (layers "F.Cu" "F.Paste" "F.Mask") (roundrect_rratio 0.25) (tstamp aece921b-c9c4-4fd8-b7de-8a0095847e43))
    (pad "2" smd roundrect (at -1.9375 -0.8) (size 0.875 0.2) (layers "F.Cu" "F.Paste" "F.Mask") (roundrect_rratio 0.25) (tstamp dd244585-c820-434b-b607-da429abd1c41))
    (pad "3" smd roundrect (at -1.9375 -0.4) (size 0.875 0.2) (layers "F.Cu" "F.Paste" "F.Mask") (roundrect_rratio 0.25) (tstamp fa17f7bc-674e-4579-8994-2ebb3d51ebf4))
    (pad "4" smd roundrect (at -1.9375 0) (size 0.875 0.2) (layers "F.Cu" "F.Paste" "F.Mask") (roundrect_rratio 0.25) (tstamp 17bb17b0-f65f-469d-8942-e58ed623423c))
    (pad "5" smd roundrect (at -1.9375 0.4) (size 0.875 0.2) (layers "F.Cu" "F.Paste" "F.Mask") (roundrect_rratio 0.25) (tstamp 90eee1ef-6c97-46e5-8048-ce7b98efd7ba))
    (pad "6" smd roundrect (at -1.9375 0.8) (size 0.875 0.2) (layers "F.Cu" "F.Paste" "F.Mask") (roundrect_rratio 0.25) (tstamp 60d5181c-8106-4b34-8b1e-21573aca4a57))
    (pad "7" smd roundrect (at -1.9375 1.2) (size 0.875 0.2) (layers "F.Cu" "F.Paste" "F.Mask") (roundrect_rratio 0.25) (tstamp df2675b7-4640-4777-8439-23fcb4e12cb1))
    (pad "8" smd roundrect (at -1.2 1.9375) (size 0.2 0.875) (layers "F.Cu" "F.Paste" "F.Mask") (roundrect_rratio 0.25) (tstamp 649c394c-a646-40e0-a73e-6383dea464a8))
    (pad "9" smd roundrect (at -0.8 1.9375) (size 0.2 0.875) (layers "F.Cu" "F.Paste" "F.Mask") (roundrect_rratio 0.25) (tstamp f579e77e-ad64-4944-a07c-2cfc247d8cd9))
    (pad "10" smd roundrect (at -0.4 1.9375) (size 0.2 0.875) (layers "F.Cu" "F.Paste" "F.Mask") (roundrect_rratio 0.25) (tstamp e7c5e0f3-055b-4389-87f1-3defa3c03fdd))
    (pad "11" smd roundrect (at 0 1.9375) (size 0.2 0.875) (layers "F.Cu" "F.Paste" "F.Mask") (roundrect_rratio 0.25) (tstamp de6a42d8-c191-4539-8abb-570c6f8c6faa))
    (pad "12" smd roundrect (at 0.4 1.9375) (size 0.2 0.875) (layers "F.Cu" "F.Paste" "F.Mask") (roundrect_rratio 0.25) (tstamp 74583a4f-0050-4155-87f9-5328d3ad6559))
    (pad "13" smd roundrect (at 0.8 1.9375) (size 0.2 0.875) (layers "F.Cu" "F.Paste" "F.Mask") (roundrect_rratio 0.25) (tstamp 9c92f1cb-a731-480b-80cd-f57813ce733a))
    (pad "14" smd roundrect (at 1.2 1.9375) (size 0.2 0.875) (layers "F.Cu" "F.Paste" "F.Mask") (roundrect_rratio 0.25) (tstamp f0477057-782d-4c98-bd37-1f4bd2a61d6a))
    (pad "15" smd roundrect (at 1.9375 1.2) (size 0.875 0.2) (layers "F.Cu" "F.Paste" "F.Mask") (roundrect_rratio 0.25) (tstamp e190e2c7-119e-4bac-9e06-3cbce2bfdf63))
    (pad "16" smd roundrect (at 1.9375 0.8) (size 0.875 0.2) (layers "F.Cu" "F.Paste" "F.Mask") (roundrect_rratio 0.25) (tstamp e42fdacc-75ef-4928-8619-8dd56ce81fe2))
    (pad "17" smd roundrect (at 1.9375 0.4) (size 0.875 0.2) (layers "F.Cu" "F.Paste" "F.Mask") (roundrect_rratio 0.25) (tstamp c5c671ff-918f-4726-8e96-8ea57b0b4712))
    (pad "18" smd roundrect (at 1.9375 0) (size 0.875 0.2) (layers "F.Cu" "F.Paste" "F.Mask") (roundrect_rratio 0.25) (tstamp c6d8e611-39b2-4fca-bcb8-c7caef636f1a))
    (pad "19" smd roundrect (at 1.9375 -0.4) (size 0.875 0.2) (layers "F.Cu" "F.Paste" "F.Mask") (roundrect_rratio 0.25) (tstamp d2dca9ac-9a73-42a3-b268-601021b2b6cf))
    (pad "20" smd roundrect (at 1.9375 -0.8) (size 0.875 0.2) (layers "F.Cu" "F.Paste" "F.Mask") (roundrect_rratio 0.25) (tstamp e368a8ab-4d46-44f0-a414-d3c19ec97d08))
    (pad "21" smd roundrect (at 1.9375 -1.2) (size 0.875 0.2) (layers "F.Cu" "F.Paste" "F.Mask") (roundrect_rratio 0.25) (tstamp d25bdfb4-9210-4b89-9882-e8da920e1858))
    (pad "22" smd roundrect (at 1.2 -1.9375) (size 0.2 0.875) (layers "F.Cu" "F.Paste" "F.Mask") (roundrect_rratio 0.25) (tstamp 081a909f-7fa5-4895-bbf3-22c226dfefd1))
    (pad "23" smd roundrect (at 0.8 -1.9375) (size 0.2 0.875) (layers "F.Cu" "F.Paste" "F.Mask") (roundrect_rratio 0.25) (tstamp d65c3298-0b30-4ae2-a6e0-24eebc359367))
    (pad "24" smd roundrect (at 0.4 -1.9375) (size 0.2 0.875) (layers "F.Cu" "F.Paste" "F.Mask") (roundrect_rratio 0.25) (tstamp 857fb902-d8cf-4edc-b000-7e598f0e98ad))
    (pad "25" smd roundrect (at 0 -1.9375) (size 0.2 0.875) (layers "F.Cu" "F.Paste" "F.Mask") (roundrect_rratio 0.25) (tstamp e6d84e29-589d-44b5-800b-0370359f6f04))
    (pad "26" smd roundrect (at -0.4 -1.9375) (size 0.2 0.875) (layers "F.Cu" "F.Paste" "F.Mask") (roundrect_rratio 0.25) (tstamp 8d3ab6d0-ce23-436c-a066-6619295bffaa))
    (pad "27" smd roundrect (at -0.8 -1.9375) (size 0.2 0.875) (layers "F.Cu" "F.Paste" "F.Mask") (roundrect_rratio 0.25) (tstamp 34759909-1213-4149-b5c2-3e3cd1572654))
    (pad "28" smd roundrect (at -1.2 -1.9375) (size 0.2 0.875) (layers "F.Cu" "F.Paste" "F.Mask") (roundrect_rratio 0.25) (tstamp a51be520-d2be-4d71-911a-5fbd3174322c))
    (pad "29" smd rect (at 0 0) (size 2.6 2.6) (layers "F.Cu" "F.Mask") (tstamp 85185994-123f-4a9a-bba1-6da97ee605a3))
    (model "${KIPRJMOD}/3D/step/MagI2C.STEP"
      (offset (xyz 0 0 0))
      (scale (xyz 1 1 1))
      (rotate (xyz -90 0 0))
    )
  )

  (footprint "Stencils-FPs:2N7002NXAKR" (layer "F.Cu")
    (tedit 0) (tstamp ec3b0ded-ea29-40cd-ac48-19f6f4a15c21)
    (at 99 61.5)
    (descr "SOT23 (TO-236AB)")
    (tags "MOSFET (N-Channel)")
    (attr smd)
    (fp_text reference "Q**" (at 0 0) (layer "F.SilkS")
      (effects (font (size 1.27 1.27) (thickness 0.254)))
      (tstamp 4ee39c3e-c5ad-4ad9-8fc4-d31088e0c070)
    )
    (fp_text value "2N7002NXAKR" (at 0 0) (layer "F.SilkS") hide
      (effects (font (size 1.27 1.27) (thickness 0.254)))
      (tstamp 6cb334fb-0bf8-44df-9f3e-8fba308f1902)
    )
    (fp_text user "${REFERENCE}" (at 0 0) (layer "F.Fab")
      (effects (font (size 1.27 1.27) (thickness 0.254)))
      (tstamp d6a66c99-b3cf-4eb4-99a6-9fd44024bff3)
    )
    (fp_line (start -0.225 -1.45) (end 0.225 -1.45) (layer "F.SilkS") (width 0.2) (tstamp 01f9b6f3-39b6-4247-a1b2-c14aba68286b))
    (fp_line (start -0.225 1.45) (end -0.225 -1.45) (layer "F.SilkS") (width 0.2) (tstamp 8b0e3d31-d49f-4b89-ab19-1ac111a80915))
    (fp_line (start 0.225 1.45) (end -0.225 1.45) (layer "F.SilkS") (width 0.2) (tstamp aa9d3c1a-ac59-4192-aae6-c071b4e118bf))
    (fp_line (start -1.625 -1.5) (end -0.575 -1.5) (layer "F.SilkS") (width 0.2) (tstamp dbbf6cec-a0a2-4e16-a6df-e0895a387df8))
    (fp_line (start 0.225 -1.45) (end 0.225 1.45) (layer "F.SilkS") (width 0.2) (tstamp f7c55cfe-0e05-406d-a7f4-c424a5d4cf05))
    (fp_line (start -1.875 -1.75) (end 1.875 -1.75) (layer "F.CrtYd") (width 0.05) (tstamp 08c01499-a4fb-433a-8c7c-4bdcf979f9d6))
    (fp_line (start -1.875 1.75) (end -1.875 -1.75) (layer "F.CrtYd") (width 0.05) (tstamp 0b97c11d-5e16-4412-a8a4-240070e54822))
    (fp_line (start 1.875 -1.75) (end 1.875 1.75) (layer "F.CrtYd") (width 0.05) (tstamp 6ac9ad5b-27ed-4821-ac9b-264e42a8082a))
    (fp_line (start 1.875 1.75) (end -1.875 1.75) (layer "F.CrtYd") (width 0.05) (tstamp eb7d2c65-e199-49bb-816f-943f9ed98a73))
    (fp_line (start -0.65 1.45) (end -0.65 -1.45) (layer "F.Fab") (width 0.1) (tstamp 24435759-7e1b-41fa-a06a-8538ae4952d9))
    (fp_line (start 0.65 -1.45) (end 0.65 1.45) (layer "F.Fab") (width 0.1) (tstamp 5971c956-11d6-458b-beb4-1398927608c4))
    (fp_line (start -0.65 -1.45) (end 0.65 -1.45) (layer "F.Fab") (width 0.1) (tstamp 7edae937-01ef-4778-83bf-94d783fce7d6))
    (fp_line (start -0.65 -0.5) (end 0.3 -1.45) (layer "F.Fab") (width 0.1) (tstamp eb4f01d3-86de-44b9-83eb-86ef92995c53))
    (fp_line (start 0.65 1.45) (end -0.65 1.45) (layer "F.Fab") (width 0.1) (tstamp f84803a1-eec6-4a25-804b-ffefc7bda362))
    (pad "1" smd rect (at -1.1 -0.95 90) (size 0.6 1.05) (layers "F.Cu" "F.Paste" "F.Mask") (tstamp 6b6644d7-813f-41f4-bbc4-73ed2af067ef))
    (pad "2" smd rect (at -1.1 0.95 90) (size 0.6 1.05) (layers "F.Cu" "F.Paste" "F.Mask") (tstamp c1dfd471-3f99-4981-9f04-a6e77ef5b828))
    (pad "3" smd rect (at 1.1 0 90) (size 0.6 1.05) (layers "F.Cu" "F.Paste" "F.Mask") (tstamp 4ad577b8-f49d-4d91-8525-c7142795722f))
    (model "${KIPRJMOD}/3D/wrl/2N7002NXAKR.wrl"
      (offset (xyz -2.109999863 -1.330000023 -1.159999949))
      (scale (xyz 1 1 1))
      (rotate (xyz -90 0 -90))
    )
    (model "${KIPRJMOD}/3D/step/2N7002NXAKR.stp"
      (offset (xyz -2.1 -1.34 -1.2))
      (scale (xyz 1 1 1))
      (rotate (xyz -90 0 -90))
    )
  )

  (footprint "Stencils-FPs:MT29F32G08ABAAAWP-ITZ_A" (layer "F.Cu")
    (tedit 5FD7EA66) (tstamp f5adb69d-095b-4fb7-afa5-31d69b8ddcf8)
    (at 69.5 116)
    (descr "48 PIN TSOP TYPE 1 CPL (PACKAGE WP)_2")
    (tags "Integrated Circuit")
    (attr smd)
    (fp_text reference "REF**" (at 0 0) (layer "F.SilkS")
      (effects (font (size 1.27 1.27) (thickness 0.254)))
      (tstamp 351a6359-98b0-4489-89fa-15ab9fde841f)
    )
    (fp_text value "MT29F32G08ABAAAWP-ITZ_A" (at 0 0) (layer "F.SilkS") hide
      (effects (font (size 1.27 1.27) (thickness 0.254)))
      (tstamp 8cce5593-8357-4c86-a35d-9a803d7e0457)
    )
    (fp_text user "${REFERENCE}" (at 0 0) (layer "F.Fab")
      (effects (font (size 1.27 1.27) (thickness 0.254)))
      (tstamp 86f0199a-daa9-4504-9fcf-e4a3e9260f40)
    )
    (fp_line (start 8.85 6) (end -8.85 6) (layer "F.SilkS") (width 0.2) (tstamp 089a4b0f-5dd9-465d-8e0d-9e94ebdc6250))
    (fp_line (start -10.5 -6.25) (end -9.2 -6.25) (layer "F.SilkS") (width 0.2) (tstamp 35b3ade8-a777-49ef-93c9-aec29249237c))
    (fp_line (start -8.85 6) (end -8.85 -6) (layer "F.SilkS") (width 0.2) (tstamp 8c205213-d466-4389-b65c-1f4a4f867bd2))
    (fp_line (start -8.85 -6) (end 8.85 -6) (layer "F.SilkS") (width 0.2) (tstamp c9cf4a58-e2a5-4a7e-969e-a616690ccf4e))
    (fp_line (start 8.85 -6) (end 8.85 6) (layer "F.SilkS") (width 0.2) (tstamp cb29c9b9-1769-4a99-b581-8c180d431922))
    (fp_line (start 10.75 -6.29) (end 10.75 6.29) (layer "F.CrtYd") (width 0.05) (tstamp 02f1266f-d0fe-4fb4-91f7-8ebf63bb9db6))
    (fp_line (start -10.75 6.29) (end -10.75 -6.29) (layer "F.CrtYd") (width 0.05) (tstamp 454cf479-a16c-44a6-bbae-5019f83ee639))
    (fp_line (start 10.75 6.29) (end -10.75 6.29) (layer "F.CrtYd") (width 0.05) (tstamp 4c235f04-6c7a-4a02-bb6b-e8e0fa596e32))
    (fp_line (start -10.75 -6.29) (end 10.75 -6.29) (layer "F.CrtYd") (width 0.05) (tstamp ee3ed4a0-95a8-4fb6-813c-b846a16be4af))
    (fp_line (start -9.2 -5.5) (end -8.7 -6) (layer "F.Fab") (width 0.1) (tstamp 0461459b-36b0-425b-ac73-d2b67d760316))
    (fp_line (start -9.2 6) (end -9.2 -6) (layer "F.Fab") (width 0.1) (tstamp 266acaf2-b616-4473-a5a6-a2a08b3cf033))
    (fp_line (start 9.2 -6) (end 9.2 6) (layer "F.Fab") (width 0.1) (tstamp 45d42871-b16d-44c2-8cf3-d92e65c73c1d))
    (fp_line (start 9.2 6) (end -9.2 6) (layer "F.Fab") (width 0.1) (tstamp 53c8275c-e7f7-44fe-9543-bc4685526397))
    (fp_line (start -9.2 -6) (end 9.2 -6) (layer "F.Fab") (width 0.1) (tstamp d574b970-5346-4f44-bf20-e581dad8943f))
    (pad "1" smd rect (at -9.85 -5.75 90) (size 0.3 1.3) (layers "F.Cu" "F.Paste" "F.Mask") (tstamp c2bca357-9e06-4006-8a7d-5fb794862ca7))
    (pad "2" smd rect (at -9.85 -5.25 90) (size 0.3 1.3) (layers "F.Cu" "F.Paste" "F.Mask") (tstamp 1fc6446c-4396-4f63-98d9-994b7616eae4))
    (pad "3" smd rect (at -9.85 -4.75 90) (size 0.3 1.3) (layers "F.Cu" "F.Paste" "F.Mask") (tstamp 7504554f-0e4d-4e03-b520-21c8baf0b109))
    (pad "4" smd rect (at -9.85 -4.25 90) (size 0.3 1.3) (layers "F.Cu" "F.Paste" "F.Mask") (tstamp 06db972c-0402-42d2-a67d-73cfa24887ae))
    (pad "5" smd rect (at -9.85 -3.75 90) (size 0.3 1.3) (layers "F.Cu" "F.Paste" "F.Mask") (tstamp 25b3a06c-63b6-47c8-b6bd-392bb3d6174f))
    (pad "6" smd rect (at -9.85 -3.25 90) (size 0.3 1.3) (layers "F.Cu" "F.Paste" "F.Mask") (tstamp 10e40571-895f-4792-a58d-10a664a9f821))
    (pad "7" smd rect (at -9.85 -2.75 90) (size 0.3 1.3) (layers "F.Cu" "F.Paste" "F.Mask") (tstamp dd1e0117-1216-413c-9d16-0b83655bbe50))
    (pad "8" smd rect (at -9.85 -2.25 90) (size 0.3 1.3) (layers "F.Cu" "F.Paste" "F.Mask") (tstamp 644013b9-efbf-4704-87e7-c05969675220))
    (pad "9" smd rect (at -9.85 -1.75 90) (size 0.3 1.3) (layers "F.Cu" "F.Paste" "F.Mask") (tstamp 485c7d7a-49c3-4bfd-beb6-511e3a5a2e68))
    (pad "10" smd rect (at -9.85 -1.25 90) (size 0.3 1.3) (layers "F.Cu" "F.Paste" "F.Mask") (tstamp de4627f3-9499-41ba-b90b-d35c7325241e))
    (pad "11" smd rect (at -9.85 -0.75 90) (size 0.3 1.3) (layers "F.Cu" "F.Paste" "F.Mask") (tstamp ea67c043-94bf-4396-aa72-450228aedcd6))
    (pad "12" smd rect (at -9.85 -0.25 90) (size 0.3 1.3) (layers "F.Cu" "F.Paste" "F.Mask") (tstamp 6207b0a0-cf85-402d-9c27-5710a30ffe5e))
    (pad "13" smd rect (at -9.85 0.25 90) (size 0.3 1.3) (layers "F.Cu" "F.Paste" "F.Mask") (tstamp d2e9861a-ea93-49f1-b89f-aa51fa0e5a2d))
    (pad "14" smd rect (at -9.85 0.75 90) (size 0.3 1.3) (layers "F.Cu" "F.Paste" "F.Mask") (tstamp c42da315-f8f8-4855-afab-eefc1da9703b))
    (pad "15" smd rect (at -9.85 1.25 90) (size 0.3 1.3) (layers "F.Cu" "F.Paste" "F.Mask") (tstamp 46b3c056-c3c0-46b5-a689-20d9b32c3d40))
    (pad "16" smd rect (at -9.85 1.75 90) (size 0.3 1.3) (layers "F.Cu" "F.Paste" "F.Mask") (tstamp d90ef2bc-1f38-42d9-9c3d-4ae6639a372d))
    (pad "17" smd rect (at -9.85 2.25 90) (size 0.3 1.3) (layers "F.Cu" "F.Paste" "F.Mask") (tstamp 6e901fe5-0363-49bb-989f-adbe52ee6c16))
    (pad "18" smd rect (at -9.85 2.75 90) (size 0.3 1.3) (layers "F.Cu" "F.Paste" "F.Mask") (tstamp c49dcd61-8154-49d7-ba74-d74910080476))
    (pad "19" smd rect (at -9.85 3.25 90) (size 0.3 1.3) (layers "F.Cu" "F.Paste" "F.Mask") (tstamp faec8e1e-31e8-4f7d-ae20-f050d8836302))
    (pad "20" smd rect (at -9.85 3.75 90) (size 0.3 1.3) (layers "F.Cu" "F.Paste" "F.Mask") (tstamp 08f92dbd-cd41-492b-b0cc-27052c611924))
    (pad "21" smd rect (at -9.85 4.25 90) (size 0.3 1.3) (layers "F.Cu" "F.Paste" "F.Mask") (tstamp f72223d0-5424-4cfa-b4bd-28c37678a2e6))
    (pad "22" smd rect (at -9.85 4.75 90) (size 0.3 1.3) (layers "F.Cu" "F.Paste" "F.Mask") (tstamp 4615947e-b6b8-4c9e-a1e9-0dc8854a36a8))
    (pad "23" smd rect (at -9.85 5.25 90) (size 0.3 1.3) (layers "F.Cu" "F.Paste" "F.Mask") (tstamp 799e373c-4866-42dd-878b-a93b9e956a9c))
    (pad "24" smd rect (at -9.85 5.75 90) (size 0.3 1.3) (layers "F.Cu" "F.Paste" "F.Mask") (tstamp 323bf134-ec8e-452d-98f3-209b03241f6b))
    (pad "25" smd rect (at 9.85 5.75 90) (size 0.3 1.3) (layers "F.Cu" "F.Paste" "F.Mask") (tstamp b3a89b9b-e0ce-475e-b0a7-dde143d6fee1))
    (pad "26" smd rect (at 9.85 5.25 90) (size 0.3 1.3) (layers "F.Cu" "F.Paste" "F.Mask") (tstamp 5952af37-b2fc-43be-ae6b-19b4c34288bb))
    (pad "27" smd rect (at 9.85 4.75 90) (size 0.3 1.3) (layers "F.Cu" "F.Paste" "F.Mask") (tstamp 472aeb0a-6371-481e-af52-3da84990929d))
    (pad "28" smd rect (at 9.85 4.25 90) (size 0.3 1.3) (layers "F.Cu" "F.Paste" "F.Mask") (tstamp 4fabd887-e194-4ddb-ba70-97493d22799a))
    (pad "29" smd rect (at 9.85 3.75 90) (size 0.3 1.3) (layers "F.Cu" "F.Paste" "F.Mask") (tstamp ddd81a8a-0f3b-4803-bfdb-5083ed3324de))
    (pad "30" smd rect (at 9.85 3.25 90) (size 0.3 1.3) (layers "F.Cu" "F.Paste" "F.Mask") (tstamp f42cfe63-4cc3-4652-8135-f7222446ba25))
    (pad "31" smd rect (at 9.85 2.75 90) (size 0.3 1.3) (layers "F.Cu" "F.Paste" "F.Mask") (tstamp a42068a3-dfd4-44ac-8264-42768f01b90b))
    (pad "32" smd rect (at 9.85 2.25 90) (size 0.3 1.3) (layers "F.Cu" "F.Paste" "F.Mask") (tstamp eb5d22ca-8733-4582-be0b-3c7071a0f2c4))
    (pad "33" smd rect (at 9.85 1.75 90) (size 0.3 1.3) (layers "F.Cu" "F.Paste" "F.Mask") (tstamp f5e065a8-0040-4610-a286-50bd191aacef))
    (pad "34" smd rect (at 9.85 1.25 90) (size 0.3 1.3) (layers "F.Cu" "F.Paste" "F.Mask") (tstamp b3570cbb-cd78-4871-83b7-b4a67ce1c50e))
    (pad "35" smd rect (at 9.85 0.75 90) (size 0.3 1.3) (layers "F.Cu" "F.Paste" "F.Mask") (tstamp d9878438-0d92-4365-83dc-7ea5c9a1de01))
    (pad "36" smd rect (at 9.85 0.25 90) (size 0.3 1.3) (layers "F.Cu" "F.Paste" "F.Mask") (tstamp 30734055-8b4c-441a-9998-568cb5bb0a13))
    (pad "37" smd rect (at 9.85 -0.25 90) (size 0.3 1.3) (layers "F.Cu" "F.Paste" "F.Mask") (tstamp b3b3b8d1-7c42-4700-9372-55340dc87238))
    (pad "38" smd rect (at 9.85 -0.75 90) (size 0.3 1.3) (layers "F.Cu" "F.Paste" "F.Mask") (tstamp 6d451413-7d2c-4add-b493-2c64657f5ece))
    (pad "39" smd rect (at 9.85 -1.25 90) (size 0.3 1.3) (layers "F.Cu" "F.Paste" "F.Mask") (tstamp fd5c148b-3f67-41f0-b13b-6f16ab52e036))
    (pad "40" smd rect (at 9.85 -1.75 90) (size 0.3 1.3) (layers "F.Cu" "F.Paste" "F.Mask") (tstamp 4d997c3c-9bb7-46a9-84ac-2cf2b57ec665))
    (pad "41" smd rect (at 9.85 -2.25 90) (size 0.3 1.3) (layers "F.Cu" "F.Paste" "F.Mask") (tstamp a1d71813-5951-40c3-9582-eaf7d30abf38))
    (pad "42" smd rect (at 9.85 -2.75 90) (size 0.3 1.3) (layers "F.Cu" "F.Paste" "F.Mask") (tstamp d365a06c-0939-402f-8133-0f2ca469bd6d))
    (pad "43" smd rect (at 9.85 -3.25 90) (size 0.3 1.3) (layers "F.Cu" "F.Paste" "F.Mask") (tstamp fe30a233-f562-4996-9c04-f1f9bf6b626b))
    (pad "44" smd rect (at 9.85 -3.75 90) (size 0.3 1.3) (layers "F.Cu" "F.Paste" "F.Mask") (tstamp c53c7331-481a-46f5-8411-e34f177b07c2))
    (pad "45" smd rect (at 9.85 -4.25 90) (size 0.3 1.3) (layers "F.Cu" "F.Paste" "F.Mask") (tstamp b6d82429-4369-4177-9c58-75c0747b9cf1))
    (pad "46" smd rect (at 9.85 -4.75 90) (size 0.3 1.3) (layers "F.Cu" "F.Paste" "F.Mask") (tstamp 80c8415e-10d5-4ccb-bc90-9ca7029f3495))
    (pad "47" smd rect (at 9.85 -5.25 90) (size 0.3 1.3) (layers "F.Cu" "F.Paste" "F.Mask") (tstamp 4884ac62-9d13-446e-ae58-2f3ef68c730f))
    (pad "48" smd rect (at 9.85 -5.75 90) (size 0.3 1.3) (layers "F.Cu" "F.Paste" "F.Mask") (tstamp b475bd74-8d4d-42b4-a5c0-7806029b694a))
    (model "${KIPRJMOD}/3D/step/MT29F32G08ABAAAWP-ITZ_A.stp"
      (offset (xyz 0 0 0))
      (scale (xyz 1 1 1))
      (rotate (xyz 0 0 0))
    )
  )

  (gr_arc (start 45 50.5) (mid 45.146447 50.146447) (end 45.5 50) (layer "Edge.Cuts") (width 0.1) (tstamp 0484fb5a-6e22-496a-89f8-00fe1c3e2feb))
  (gr_line (start 149.5 50) (end 45.5 50) (layer "Edge.Cuts") (width 0.1) (tstamp 1169c2ef-2c91-4124-a562-e77cf3b37da6))
  (gr_line (start 45 50.5) (end 45 129.5) (layer "Edge.Cuts") (width 0.1) (tstamp 13c79c32-8181-4999-b5a5-238c9ddc0e9d))
  (gr_line (start 45.5 130) (end 149.5 130) (layer "Edge.Cuts") (width 0.1) (tstamp 8f1868c5-8296-4005-9ea7-9c176f48efbe))
  (gr_arc (start 149.5 50) (mid 149.853553 50.146447) (end 150 50.5) (layer "Edge.Cuts") (width 0.1) (tstamp 927076bb-a074-449f-b1ef-8a0d255e18dd))
  (gr_arc (start 150 129.5) (mid 149.853553 129.853553) (end 149.5 130) (layer "Edge.Cuts") (width 0.1) (tstamp b7491100-530a-4e53-a8de-829eccb04f16))
  (gr_arc (start 45.5 130) (mid 45.146447 129.853553) (end 45 129.5) (layer "Edge.Cuts") (width 0.1) (tstamp cdae5ac2-6d10-4796-ae3f-aadcfd38e26d))
  (gr_line (start 150 129.5) (end 150 50.5) (layer "Edge.Cuts") (width 0.1) (tstamp fa1581f0-0e42-4d2d-8462-bb217a840cb3))

)
