M48
; DRILL file {KiCad (5.1.10)-1} date 12/24/21 05:48:54
; FORMAT={-:-/ absolute / metric / decimal}
; #@! TF.CreationDate,2021-12-24T05:48:54+02:00
; #@! TF.GenerationSoftware,Kicad,Pcbnew,(5.1.10)-1
FMAT,2
METRIC
T1C0.400
T2C0.550
T3C0.800
T4C1.020
T5C1.200
T6C2.500
T7C3.200
%
G90
G05
T1
X147.32Y-101.6
X147.32Y-104.14
X147.32Y-106.68
X147.32Y-109.22
X149.187Y-101.663
X149.187Y-103.569
X149.187Y-105.474
X149.187Y-107.505
X152.108Y-114.617
X152.133Y-116.002
X153.352Y-116.002
X153.378Y-114.617
X154.94Y-67.31
X157.48Y-64.77
X160.02Y-67.31
X162.56Y-74.93
X162.687Y-118.364
X163.83Y-73.66
X164.719Y-115.697
X165.265Y-120.637
X165.316Y-107.836
X166.04Y-102.197
X166.357Y-120.65
X166.446Y-105.448
X167.678Y-123.52
X168.148Y-101.346
X168.64Y-124.27
X168.91Y-110.236
X169.073Y-111.386
X169.83Y-125.29
X170.18Y-117.729
X171.069Y-104.775
X173.571Y-124.117
X173.672Y-119.215
X173.99Y-100.33
X174.625Y-124.079
X175.133Y-120.777
X175.641Y-124.079
X176.657Y-106.934
X176.657Y-116.624
X176.67Y-124.054
X178.27Y-114.275
X178.537Y-112.217
X179.01Y-108.46
X179.324Y-113.03
X179.705Y-118.25
X180.34Y-100.33
X180.34Y-114.3
X186.055Y-125.984
X190.373Y-106.172
X191.643Y-112.395
X192.405Y-106.172
X192.659Y-113.157
X193.299Y-113.925
X194.183Y-114.554
X195.961Y-115.57
X196.088Y-116.84
X196.596Y-123.444
X197.104Y-117.221
X197.612Y-118.11
X199.009Y-118.11
X207.01Y-116.84
X207.01Y-119.38
X209.55Y-118.11
X215.9Y-121.92
X215.9Y-125.73
X218.44Y-124.46
T2
X171.603Y-113.666
T3
X150.383Y-77.174
X152.633Y-79.484
X157.567Y-69.99
X159.817Y-72.3
X202.705Y-128.325
X204.966Y-130.637
X209.889Y-121.141
X212.15Y-123.452
T4
X170.51Y-95.885
X174.955Y-102.921
T5
X149.796Y-73.854
X152.696Y-70.694
X159.223Y-80.154
X160.703Y-78.744
X201.833Y-121.874
X203.313Y-120.464
X209.806Y-130.224
X212.666Y-127.174
T6
X145.746Y-121.736
X149.458Y-83.753
X159.92Y-135.909
X164.697Y-68.514
X166.438Y-94.639
X175.582Y-85.493
X181.301Y-142.723
X181.301Y-57.963
X187.016Y-115.218
X196.162Y-106.072
X197.902Y-132.198
X202.68Y-64.802
X213.142Y-116.958
X216.854Y-78.976
T7
X146.48Y-70.521
X151.123Y-65.898
X211.476Y-134.798
X216.12Y-130.175
T0
M30
