(module "RESAD1526W69L610D229" (layer F.Cu)
  (descr "CPF1")
  (tags "Resistor")
  (fp_text reference R** (at 0 0) (layer F.SilkS)
    (effects (font (size 1.27 1.27) (thickness 0.254)))
  )
  (fp_text user %R (at 0 0) (layer F.Fab)
    (effects (font (size 1.27 1.27) (thickness 0.254)))
  )
  (fp_text value "RESAD1526W69L610D229" (at 0 0) (layer F.SilkS) hide
    (effects (font (size 1.27 1.27) (thickness 0.254)))
  )
  (fp_line (start -0.925 -1.495) (end 16.225 -1.495) (layer F.CrtYd) (width 0.05))
  (fp_line (start 16.225 -1.495) (end 16.225 1.495) (layer F.CrtYd) (width 0.05))
  (fp_line (start 16.225 1.495) (end -0.925 1.495) (layer F.CrtYd) (width 0.05))
  (fp_line (start -0.925 1.495) (end -0.925 -1.495) (layer F.CrtYd) (width 0.05))
  (fp_line (start 4.6 -1.145) (end 10.7 -1.145) (layer F.Fab) (width 0.1))
  (fp_line (start 10.7 -1.145) (end 10.7 1.145) (layer F.Fab) (width 0.1))
  (fp_line (start 10.7 1.145) (end 4.6 1.145) (layer F.Fab) (width 0.1))
  (fp_line (start 4.6 1.145) (end 4.6 -1.145) (layer F.Fab) (width 0.1))
  (fp_line (start 0 0) (end 4.6 0) (layer F.Fab) (width 0.1))
  (fp_line (start 10.7 0) (end 15.3 0) (layer F.Fab) (width 0.1))
  (fp_line (start 4.6 -1.145) (end 10.7 -1.145) (layer F.SilkS) (width 0.2))
  (fp_line (start 10.7 -1.145) (end 10.7 1.145) (layer F.SilkS) (width 0.2))
  (fp_line (start 10.7 1.145) (end 4.6 1.145) (layer F.SilkS) (width 0.2))
  (fp_line (start 4.6 1.145) (end 4.6 -1.145) (layer F.SilkS) (width 0.2))
  (fp_line (start 1.025 0) (end 4.6 0) (layer F.SilkS) (width 0.2))
  (fp_line (start 10.7 0) (end 14.275 0) (layer F.SilkS) (width 0.2))
  (pad 1 thru_hole circle (at 0 0) (size 1.35 1.35) (drill 0.9) (layers *.Cu *.Mask))
  (pad 2 thru_hole circle (at 15.3 0) (size 1.35 1.35) (drill 0.9) (layers *.Cu *.Mask))
  (model "C:\\Users\\wmaker\\Desktop\\kicadlib\\SamacSys_Parts.3dshapes\\CPF168R000FKB14.stp"
    (at (xyz 0 0 0))
    (scale (xyz 1 1 1))
    (rotate (xyz 0 0 0))
  )
)
