%TF.GenerationSoftware,KiCad,Pcbnew,(5.1.6)-1*%
%TF.CreationDate,2021-07-08T16:03:47+03:00*%
%TF.ProjectId,bottom_pcb,626f7474-6f6d-45f7-9063-622e6b696361,2*%
%TF.SameCoordinates,Original*%
%TF.FileFunction,Copper,L1,Top*%
%TF.FilePolarity,Positive*%
%FSLAX46Y46*%
G04 Gerber Fmt 4.6, Leading zero omitted, Abs format (unit mm)*
G04 Created by KiCad (PCBNEW (5.1.6)-1) date 2021-07-08 16:03:47*
%MOMM*%
%LPD*%
G01*
G04 APERTURE LIST*
%TA.AperFunction,ComponentPad*%
%ADD10C,5.600000*%
%TD*%
%TA.AperFunction,SMDPad,CuDef*%
%ADD11C,0.100000*%
%TD*%
%TA.AperFunction,ViaPad*%
%ADD12C,0.800000*%
%TD*%
%TA.AperFunction,Conductor*%
%ADD13C,0.250000*%
%TD*%
%TA.AperFunction,NonConductor*%
%ADD14C,0.254000*%
%TD*%
G04 APERTURE END LIST*
D10*
%TO.P,,1*%
%TO.N,N/C*%
X77613547Y-180923546D03*
%TD*%
%TO.P,,1*%
%TO.N,N/C*%
X77613783Y-96163801D03*
%TD*%
%TA.AperFunction,SMDPad,CuDef*%
D11*
%TO.P,J\u002A\u002A,MP2*%
%TO.N,N/C*%
G36*
X66644633Y-128299608D02*
G01*
X67917425Y-127026816D01*
X68518465Y-127627856D01*
X67245673Y-128900648D01*
X66644633Y-128299608D01*
G37*
%TD.AperFunction*%
%TA.AperFunction,SMDPad,CuDef*%
%TO.P,J\u002A\u002A,MP1*%
G36*
X58159352Y-119814327D02*
G01*
X59432144Y-118541535D01*
X60033184Y-119142575D01*
X58760392Y-120415367D01*
X58159352Y-119814327D01*
G37*
%TD.AperFunction*%
%TA.AperFunction,SMDPad,CuDef*%
%TO.P,J\u002A\u002A,20*%
G36*
X67440129Y-125559569D02*
G01*
X68571499Y-124428199D01*
X68995763Y-124852463D01*
X67864393Y-125983833D01*
X67440129Y-125559569D01*
G37*
%TD.AperFunction*%
%TA.AperFunction,SMDPad,CuDef*%
%TO.P,J\u002A\u002A,19*%
G36*
X63480331Y-129519366D02*
G01*
X64611701Y-128387996D01*
X65035965Y-128812260D01*
X63904595Y-129943630D01*
X63480331Y-129519366D01*
G37*
%TD.AperFunction*%
%TA.AperFunction,SMDPad,CuDef*%
%TO.P,J\u002A\u002A,18*%
G36*
X66733022Y-124852462D02*
G01*
X67864392Y-123721092D01*
X68288656Y-124145356D01*
X67157286Y-125276726D01*
X66733022Y-124852462D01*
G37*
%TD.AperFunction*%
%TA.AperFunction,SMDPad,CuDef*%
%TO.P,J\u002A\u002A,17*%
G36*
X62773224Y-128812260D02*
G01*
X63904594Y-127680890D01*
X64328858Y-128105154D01*
X63197488Y-129236524D01*
X62773224Y-128812260D01*
G37*
%TD.AperFunction*%
%TA.AperFunction,SMDPad,CuDef*%
%TO.P,J\u002A\u002A,16*%
G36*
X66025915Y-124145355D02*
G01*
X67157285Y-123013985D01*
X67581549Y-123438249D01*
X66450179Y-124569619D01*
X66025915Y-124145355D01*
G37*
%TD.AperFunction*%
%TA.AperFunction,SMDPad,CuDef*%
%TO.P,J\u002A\u002A,15*%
G36*
X62066117Y-128105153D02*
G01*
X63197487Y-126973783D01*
X63621751Y-127398047D01*
X62490381Y-128529417D01*
X62066117Y-128105153D01*
G37*
%TD.AperFunction*%
%TA.AperFunction,SMDPad,CuDef*%
%TO.P,J\u002A\u002A,14*%
G36*
X65318808Y-123438248D02*
G01*
X66450178Y-122306878D01*
X66874442Y-122731142D01*
X65743072Y-123862512D01*
X65318808Y-123438248D01*
G37*
%TD.AperFunction*%
%TA.AperFunction,SMDPad,CuDef*%
%TO.P,J\u002A\u002A,13*%
G36*
X61359010Y-127398046D02*
G01*
X62490380Y-126266676D01*
X62914644Y-126690940D01*
X61783274Y-127822310D01*
X61359010Y-127398046D01*
G37*
%TD.AperFunction*%
%TA.AperFunction,SMDPad,CuDef*%
%TO.P,J\u002A\u002A,12*%
G36*
X64611701Y-122731141D02*
G01*
X65743071Y-121599771D01*
X66167335Y-122024035D01*
X65035965Y-123155405D01*
X64611701Y-122731141D01*
G37*
%TD.AperFunction*%
%TA.AperFunction,SMDPad,CuDef*%
%TO.P,J\u002A\u002A,11*%
G36*
X60651903Y-126690939D02*
G01*
X61783273Y-125559569D01*
X62207537Y-125983833D01*
X61076167Y-127115203D01*
X60651903Y-126690939D01*
G37*
%TD.AperFunction*%
%TA.AperFunction,SMDPad,CuDef*%
%TO.P,J\u002A\u002A,10*%
G36*
X63904595Y-122024035D02*
G01*
X65035965Y-120892665D01*
X65460229Y-121316929D01*
X64328859Y-122448299D01*
X63904595Y-122024035D01*
G37*
%TD.AperFunction*%
%TA.AperFunction,SMDPad,CuDef*%
%TO.P,J\u002A\u002A,9*%
G36*
X59944797Y-125983833D02*
G01*
X61076167Y-124852463D01*
X61500431Y-125276727D01*
X60369061Y-126408097D01*
X59944797Y-125983833D01*
G37*
%TD.AperFunction*%
%TA.AperFunction,SMDPad,CuDef*%
%TO.P,J\u002A\u002A,8*%
G36*
X63197488Y-121316928D02*
G01*
X64328858Y-120185558D01*
X64753122Y-120609822D01*
X63621752Y-121741192D01*
X63197488Y-121316928D01*
G37*
%TD.AperFunction*%
%TA.AperFunction,SMDPad,CuDef*%
%TO.P,J\u002A\u002A,7*%
G36*
X59237690Y-125276726D02*
G01*
X60369060Y-124145356D01*
X60793324Y-124569620D01*
X59661954Y-125700990D01*
X59237690Y-125276726D01*
G37*
%TD.AperFunction*%
%TA.AperFunction,SMDPad,CuDef*%
%TO.P,J\u002A\u002A,6*%
G36*
X62490381Y-120609821D02*
G01*
X63621751Y-119478451D01*
X64046015Y-119902715D01*
X62914645Y-121034085D01*
X62490381Y-120609821D01*
G37*
%TD.AperFunction*%
%TA.AperFunction,SMDPad,CuDef*%
%TO.P,J\u002A\u002A,5*%
G36*
X58530583Y-124569619D02*
G01*
X59661953Y-123438249D01*
X60086217Y-123862513D01*
X58954847Y-124993883D01*
X58530583Y-124569619D01*
G37*
%TD.AperFunction*%
%TA.AperFunction,SMDPad,CuDef*%
%TO.P,J\u002A\u002A,4*%
G36*
X61783274Y-119902714D02*
G01*
X62914644Y-118771344D01*
X63338908Y-119195608D01*
X62207538Y-120326978D01*
X61783274Y-119902714D01*
G37*
%TD.AperFunction*%
%TA.AperFunction,SMDPad,CuDef*%
%TO.P,J\u002A\u002A,3*%
G36*
X57823476Y-123862512D02*
G01*
X58954846Y-122731142D01*
X59379110Y-123155406D01*
X58247740Y-124286776D01*
X57823476Y-123862512D01*
G37*
%TD.AperFunction*%
%TA.AperFunction,SMDPad,CuDef*%
%TO.P,J\u002A\u002A,2*%
G36*
X61076167Y-119195607D02*
G01*
X62207537Y-118064237D01*
X62631801Y-118488501D01*
X61500431Y-119619871D01*
X61076167Y-119195607D01*
G37*
%TD.AperFunction*%
%TA.AperFunction,SMDPad,CuDef*%
%TO.P,J\u002A\u002A,1*%
G36*
X57116370Y-123155405D02*
G01*
X58247740Y-122024035D01*
X58672004Y-122448299D01*
X57540634Y-123579669D01*
X57116370Y-123155405D01*
G37*
%TD.AperFunction*%
%TD*%
D10*
%TO.P,REF\u002A\u002A,1*%
%TO.N,N/C*%
X42795199Y-108711801D03*
%TD*%
%TO.P,,1*%
%TO.N,N/C*%
X42061300Y-159911383D03*
%TD*%
%TO.P,,1*%
%TO.N,N/C*%
X98995128Y-102977555D03*
%TD*%
%TO.P,,1*%
%TO.N,N/C*%
X83331276Y-153393530D03*
%TD*%
%TO.P,,1*%
%TO.N,N/C*%
X56235182Y-174085265D03*
%TD*%
%TO.P,,1*%
%TO.N,N/C*%
X109457136Y-155133705D03*
%TD*%
%TO.P,,1*%
%TO.N,N/C*%
X45773174Y-121929115D03*
%TD*%
%TO.P,,1*%
%TO.N,N/C*%
X113169010Y-117151437D03*
%TD*%
%TO.P,,1*%
%TO.N,N/C*%
X71899033Y-123669290D03*
%TD*%
%TO.P,REF\u002A\u002A,1*%
%TO.N,N/C*%
X62753035Y-132815289D03*
%TD*%
%TO.P,REF\u002A\u002A,1*%
%TO.N,N/C*%
X92477275Y-144247532D03*
%TD*%
%TO.P,ref1,1*%
%TO.N,N/C*%
X47439199Y-104088801D03*
%TD*%
%TO.P,REF\u002A\u002A,1*%
%TO.N,N/C*%
X112435199Y-168365903D03*
%TD*%
%TO.P,REF\u002A\u002A,1*%
%TO.N,N/C*%
X107791402Y-172988801D03*
%TD*%
%TO.P,,1*%
%TO.N,N/C*%
X61012860Y-106689429D03*
%TD*%
%TO.P,,1*%
%TO.N,N/C*%
X94217450Y-170373391D03*
%TD*%
D12*
%TO.N,*%
X62356800Y-124563000D03*
X62001200Y-123445400D03*
X60858200Y-123267600D03*
X60705800Y-122073800D03*
X59334200Y-121718200D03*
X63499800Y-124893200D03*
X63880800Y-125985400D03*
X64998400Y-126264800D03*
X64896800Y-127458600D03*
X65709600Y-127992000D03*
X66166800Y-126925200D03*
X65912800Y-125833000D03*
X65557200Y-125020200D03*
X64592000Y-124486800D03*
X64185600Y-123521600D03*
X63296600Y-122988200D03*
X62610800Y-122226200D03*
X61620200Y-121845200D03*
X61518600Y-120549800D03*
X59588200Y-120651400D03*
%TD*%
D13*
%TO.N,*%
X64682412Y-121670482D02*
X64682412Y-122237388D01*
X64682412Y-122237388D02*
X62356800Y-124563000D01*
X63975305Y-120963375D02*
X63975305Y-121471295D01*
X63975305Y-121471295D02*
X62001200Y-123445400D01*
X63268198Y-120256268D02*
X63268198Y-120857602D01*
X63268198Y-120857602D02*
X60858200Y-123267600D01*
X62561091Y-119549161D02*
X62561091Y-120218509D01*
X62561091Y-120218509D02*
X60705800Y-122073800D01*
X61853984Y-118842054D02*
X61853984Y-119198416D01*
X61853984Y-119198416D02*
X59334200Y-121718200D01*
X65389518Y-123003482D02*
X63499800Y-124893200D01*
X65389518Y-122377588D02*
X65389518Y-123003482D01*
X66096625Y-123769575D02*
X63880800Y-125985400D01*
X66096625Y-123084695D02*
X66096625Y-123769575D01*
X66803732Y-124459468D02*
X64998400Y-126264800D01*
X66803732Y-123791802D02*
X66803732Y-124459468D01*
X67510839Y-124844561D02*
X64896800Y-127458600D01*
X67510839Y-124498909D02*
X67510839Y-124844561D01*
X68217946Y-125483654D02*
X65709600Y-127992000D01*
X68217946Y-125206016D02*
X68217946Y-125483654D01*
X64258148Y-128833852D02*
X64258148Y-129165813D01*
X66166800Y-126925200D02*
X64258148Y-128833852D01*
X63551041Y-128194759D02*
X63551041Y-128458707D01*
X65912800Y-125833000D02*
X63551041Y-128194759D01*
X62843934Y-127733466D02*
X62843934Y-127751600D01*
X65557200Y-125020200D02*
X62843934Y-127733466D01*
X62136827Y-126941973D02*
X62136827Y-127044493D01*
X64592000Y-124486800D02*
X62136827Y-126941973D01*
X61429720Y-126277480D02*
X61429720Y-126337386D01*
X64185600Y-123521600D02*
X61429720Y-126277480D01*
X60722614Y-125562186D02*
X60722614Y-125630280D01*
X63296600Y-122988200D02*
X60722614Y-125562186D01*
X60015507Y-124821493D02*
X60015507Y-124923173D01*
X62610800Y-122226200D02*
X60015507Y-124821493D01*
X59308400Y-124157000D02*
X59308400Y-124216066D01*
X61620200Y-121845200D02*
X59308400Y-124157000D01*
X58601293Y-123467107D02*
X58601293Y-123508959D01*
X61518600Y-120549800D02*
X58601293Y-123467107D01*
X57894187Y-122345413D02*
X57894187Y-122801852D01*
X59588200Y-120651400D02*
X57894187Y-122345413D01*
%TD*%
D14*
G36*
X90046803Y-93532305D02*
G01*
X90095656Y-93547055D01*
X90140715Y-93571013D01*
X90207309Y-93625326D01*
X96623142Y-100041161D01*
X96645476Y-100059490D01*
X96647360Y-100061414D01*
X96655267Y-100067956D01*
X96806509Y-100191306D01*
X96862002Y-100228175D01*
X96894118Y-100250166D01*
X96805443Y-100309417D01*
X96326990Y-100787870D01*
X95951071Y-101350473D01*
X95692134Y-101975603D01*
X95560128Y-102639237D01*
X95560128Y-103315873D01*
X95692134Y-103979507D01*
X95951071Y-104604637D01*
X96326990Y-105167240D01*
X96805443Y-105645693D01*
X97368046Y-106021612D01*
X97993176Y-106280549D01*
X98656810Y-106412555D01*
X99333446Y-106412555D01*
X99997080Y-106280549D01*
X100622210Y-106021612D01*
X101184813Y-105645693D01*
X101663266Y-105167240D01*
X102039185Y-104604637D01*
X102298122Y-103979507D01*
X102430128Y-103315873D01*
X102430128Y-102639237D01*
X102298122Y-101975603D01*
X102039185Y-101350473D01*
X101663266Y-100787870D01*
X101399197Y-100523801D01*
X114831052Y-100523801D01*
X115618530Y-100594082D01*
X116349426Y-100794032D01*
X117033358Y-101120251D01*
X117648711Y-101562427D01*
X118176042Y-102106590D01*
X118598669Y-102735527D01*
X118903246Y-103429371D01*
X119081498Y-104171840D01*
X119128783Y-104815750D01*
X119128784Y-109352844D01*
X119101234Y-109633822D01*
X119030074Y-109869513D01*
X118914494Y-110086889D01*
X118758887Y-110277680D01*
X118569191Y-110434612D01*
X118352626Y-110551707D01*
X118117439Y-110624510D01*
X117838755Y-110653801D01*
X117399888Y-110653801D01*
X117363783Y-110650245D01*
X117327678Y-110653801D01*
X117219698Y-110664436D01*
X117081150Y-110706464D01*
X116953463Y-110774714D01*
X116841545Y-110866563D01*
X116749696Y-110978481D01*
X116681446Y-111106168D01*
X116639418Y-111244716D01*
X116625227Y-111388801D01*
X116628783Y-111424906D01*
X116628784Y-116934094D01*
X116631634Y-116963027D01*
X116631589Y-116967284D01*
X116632555Y-116977501D01*
X116662139Y-117268751D01*
X116675313Y-117334085D01*
X116687561Y-117399535D01*
X116690492Y-117409369D01*
X116776084Y-117689327D01*
X116801702Y-117750869D01*
X116826424Y-117812678D01*
X116831210Y-117821756D01*
X116969548Y-118079756D01*
X117006607Y-118135114D01*
X117042889Y-118190984D01*
X117049347Y-118198959D01*
X117235164Y-118425176D01*
X117257869Y-118452842D01*
X122525745Y-123720718D01*
X122581065Y-123788065D01*
X122605179Y-123833039D01*
X122620100Y-123881842D01*
X122628783Y-123967323D01*
X122628783Y-137583312D01*
X122565708Y-137431035D01*
X122309223Y-137047178D01*
X121982779Y-136720734D01*
X121598922Y-136464249D01*
X121172403Y-136287580D01*
X120719613Y-136197514D01*
X120257953Y-136197514D01*
X119805163Y-136287580D01*
X119378644Y-136464249D01*
X118994787Y-136720734D01*
X118668343Y-137047178D01*
X118411858Y-137431035D01*
X118235189Y-137857554D01*
X118145123Y-138310344D01*
X118145123Y-138772004D01*
X118235189Y-139224794D01*
X118411858Y-139651313D01*
X118668343Y-140035170D01*
X118994787Y-140361614D01*
X119378644Y-140618099D01*
X119805163Y-140794768D01*
X120257953Y-140884834D01*
X120719613Y-140884834D01*
X121172403Y-140794768D01*
X121598922Y-140618099D01*
X121982779Y-140361614D01*
X122309223Y-140035170D01*
X122565708Y-139651313D01*
X122628783Y-139499036D01*
X122628784Y-157790077D01*
X122620279Y-157876820D01*
X122605529Y-157925674D01*
X122581571Y-157970733D01*
X122527262Y-158037322D01*
X119611423Y-160953161D01*
X119593098Y-160975490D01*
X119591170Y-160977378D01*
X119584628Y-160985285D01*
X119461278Y-161136527D01*
X119424391Y-161192046D01*
X119386777Y-161246981D01*
X119381895Y-161256008D01*
X119290270Y-161428330D01*
X119264869Y-161489957D01*
X119238642Y-161551150D01*
X119235607Y-161560953D01*
X119179198Y-161747789D01*
X119166250Y-161813181D01*
X119152409Y-161878297D01*
X119151336Y-161888503D01*
X119132463Y-162080982D01*
X119128782Y-162118357D01*
X119128784Y-172256059D01*
X119058502Y-173043549D01*
X118858552Y-173774444D01*
X118532333Y-174458376D01*
X118090157Y-175073729D01*
X117545994Y-175601060D01*
X116917057Y-176023687D01*
X116223212Y-176328265D01*
X115480744Y-176506515D01*
X114836834Y-176553801D01*
X97788338Y-176553801D01*
X97759591Y-176556632D01*
X97756891Y-176556604D01*
X97746674Y-176557570D01*
X97552508Y-176577293D01*
X97487196Y-176590462D01*
X97421731Y-176602713D01*
X97411897Y-176605645D01*
X97411892Y-176605646D01*
X97411887Y-176605648D01*
X97225258Y-176662705D01*
X97163719Y-176688321D01*
X97101902Y-176713046D01*
X97092835Y-176717826D01*
X97092826Y-176717830D01*
X97092819Y-176717835D01*
X96920823Y-176810058D01*
X96865430Y-176847140D01*
X96809595Y-176883400D01*
X96801619Y-176889858D01*
X96650845Y-177013705D01*
X96623142Y-177036441D01*
X90208810Y-183450773D01*
X90141473Y-183506084D01*
X90096502Y-183530197D01*
X90047699Y-183545118D01*
X89962215Y-183553801D01*
X79841115Y-183553801D01*
X80281685Y-183113231D01*
X80657604Y-182550628D01*
X80916541Y-181925498D01*
X81048547Y-181261864D01*
X81048547Y-180585228D01*
X80916541Y-179921594D01*
X80657604Y-179296464D01*
X80281685Y-178733861D01*
X79803232Y-178255408D01*
X79240629Y-177879489D01*
X78615499Y-177620552D01*
X77951865Y-177488546D01*
X77275229Y-177488546D01*
X76611595Y-177620552D01*
X75986465Y-177879489D01*
X75423862Y-178255408D01*
X74945409Y-178733861D01*
X74569490Y-179296464D01*
X74310553Y-179921594D01*
X74178547Y-180585228D01*
X74178547Y-181261864D01*
X74310553Y-181925498D01*
X74569490Y-182550628D01*
X74945409Y-183113231D01*
X75385979Y-183553801D01*
X65267497Y-183553801D01*
X65180764Y-183545297D01*
X65131910Y-183530547D01*
X65086851Y-183506589D01*
X65020262Y-183452280D01*
X58604423Y-177036441D01*
X58582095Y-177018117D01*
X58580206Y-177016188D01*
X58572299Y-177009646D01*
X58421057Y-176886296D01*
X58365538Y-176849409D01*
X58323876Y-176820883D01*
X58424867Y-176753403D01*
X58903320Y-176274950D01*
X59279239Y-175712347D01*
X59538176Y-175087217D01*
X59670182Y-174423583D01*
X59670182Y-173746947D01*
X59538176Y-173083313D01*
X59279239Y-172458183D01*
X58903320Y-171895580D01*
X58424867Y-171417127D01*
X57862264Y-171041208D01*
X57237134Y-170782271D01*
X56573500Y-170650265D01*
X55896864Y-170650265D01*
X55233230Y-170782271D01*
X54608100Y-171041208D01*
X54045497Y-171417127D01*
X53567044Y-171895580D01*
X53191125Y-172458183D01*
X52932188Y-173083313D01*
X52800182Y-173746947D01*
X52800182Y-174423583D01*
X52932188Y-175087217D01*
X53191125Y-175712347D01*
X53567044Y-176274950D01*
X53845894Y-176553800D01*
X40396821Y-176553802D01*
X39609331Y-176483520D01*
X38878436Y-176283570D01*
X38194504Y-175957351D01*
X37579151Y-175515175D01*
X37051820Y-174971012D01*
X36629193Y-174342075D01*
X36324615Y-173648230D01*
X36146365Y-172905762D01*
X36099079Y-172261852D01*
X36099079Y-170035073D01*
X90782450Y-170035073D01*
X90782450Y-170711709D01*
X90914456Y-171375343D01*
X91173393Y-172000473D01*
X91549312Y-172563076D01*
X92027765Y-173041529D01*
X92590368Y-173417448D01*
X93215498Y-173676385D01*
X93879132Y-173808391D01*
X94555768Y-173808391D01*
X95219402Y-173676385D01*
X95844532Y-173417448D01*
X96407135Y-173041529D01*
X96798181Y-172650483D01*
X104356402Y-172650483D01*
X104356402Y-173327119D01*
X104488408Y-173990753D01*
X104747345Y-174615883D01*
X105123264Y-175178486D01*
X105601717Y-175656939D01*
X106164320Y-176032858D01*
X106789450Y-176291795D01*
X107453084Y-176423801D01*
X108129720Y-176423801D01*
X108793354Y-176291795D01*
X109418484Y-176032858D01*
X109981087Y-175656939D01*
X110459540Y-175178486D01*
X110835459Y-174615883D01*
X111094396Y-173990753D01*
X111226402Y-173327119D01*
X111226402Y-172650483D01*
X111094396Y-171986849D01*
X110865242Y-171433622D01*
X111433247Y-171668897D01*
X112096881Y-171800903D01*
X112773517Y-171800903D01*
X113437151Y-171668897D01*
X114062281Y-171409960D01*
X114624884Y-171034041D01*
X115103337Y-170555588D01*
X115479256Y-169992985D01*
X115738193Y-169367855D01*
X115870199Y-168704221D01*
X115870199Y-168027585D01*
X115738193Y-167363951D01*
X115479256Y-166738821D01*
X115103337Y-166176218D01*
X114624884Y-165697765D01*
X114062281Y-165321846D01*
X113437151Y-165062909D01*
X112773517Y-164930903D01*
X112096881Y-164930903D01*
X111433247Y-165062909D01*
X110808117Y-165321846D01*
X110245514Y-165697765D01*
X109767061Y-166176218D01*
X109391142Y-166738821D01*
X109132205Y-167363951D01*
X109000199Y-168027585D01*
X109000199Y-168704221D01*
X109132205Y-169367855D01*
X109361359Y-169921082D01*
X108793354Y-169685807D01*
X108129720Y-169553801D01*
X107453084Y-169553801D01*
X106789450Y-169685807D01*
X106164320Y-169944744D01*
X105601717Y-170320663D01*
X105123264Y-170799116D01*
X104747345Y-171361719D01*
X104488408Y-171986849D01*
X104356402Y-172650483D01*
X96798181Y-172650483D01*
X96885588Y-172563076D01*
X97261507Y-172000473D01*
X97520444Y-171375343D01*
X97652450Y-170711709D01*
X97652450Y-170035073D01*
X97520444Y-169371439D01*
X97261507Y-168746309D01*
X96885588Y-168183706D01*
X96407135Y-167705253D01*
X95844532Y-167329334D01*
X95219402Y-167070397D01*
X94555768Y-166938391D01*
X93879132Y-166938391D01*
X93215498Y-167070397D01*
X92590368Y-167329334D01*
X92027765Y-167705253D01*
X91549312Y-168183706D01*
X91173393Y-168746309D01*
X90914456Y-169371439D01*
X90782450Y-170035073D01*
X36099079Y-170035073D01*
X36099079Y-167724748D01*
X36126628Y-167443780D01*
X36197787Y-167208089D01*
X36313370Y-166990712D01*
X36468974Y-166799922D01*
X36658672Y-166642990D01*
X36875236Y-166525895D01*
X37110423Y-166453092D01*
X37389107Y-166423801D01*
X37827678Y-166423801D01*
X37863783Y-166427357D01*
X37899888Y-166423801D01*
X38007868Y-166413166D01*
X38146416Y-166371138D01*
X38274103Y-166302888D01*
X38386021Y-166211039D01*
X38477870Y-166099121D01*
X38546120Y-165971434D01*
X38588148Y-165832886D01*
X38602339Y-165688801D01*
X38598783Y-165652696D01*
X38598783Y-160143508D01*
X38595932Y-160114566D01*
X38595977Y-160110318D01*
X38595011Y-160100101D01*
X38565427Y-159808851D01*
X38552260Y-159743549D01*
X38540005Y-159678067D01*
X38537074Y-159668233D01*
X38507979Y-159573065D01*
X38626300Y-159573065D01*
X38626300Y-160249701D01*
X38758306Y-160913335D01*
X39017243Y-161538465D01*
X39393162Y-162101068D01*
X39871615Y-162579521D01*
X40434218Y-162955440D01*
X41059348Y-163214377D01*
X41722982Y-163346383D01*
X42399618Y-163346383D01*
X43063252Y-163214377D01*
X43688382Y-162955440D01*
X44250985Y-162579521D01*
X44729438Y-162101068D01*
X45105357Y-161538465D01*
X45364294Y-160913335D01*
X45496300Y-160249701D01*
X45496300Y-159573065D01*
X45364294Y-158909431D01*
X45105357Y-158284301D01*
X44729438Y-157721698D01*
X44250985Y-157243245D01*
X43688382Y-156867326D01*
X43063252Y-156608389D01*
X42399618Y-156476383D01*
X41722982Y-156476383D01*
X41059348Y-156608389D01*
X40434218Y-156867326D01*
X39871615Y-157243245D01*
X39393162Y-157721698D01*
X39017243Y-158284301D01*
X38758306Y-158909431D01*
X38626300Y-159573065D01*
X38507979Y-159573065D01*
X38451482Y-159388276D01*
X38425874Y-159326758D01*
X38401142Y-159264924D01*
X38396356Y-159255846D01*
X38258018Y-158997846D01*
X38220959Y-158942488D01*
X38184677Y-158886618D01*
X38178219Y-158878643D01*
X37993157Y-158653345D01*
X37969696Y-158624758D01*
X32701816Y-153356879D01*
X32646500Y-153289536D01*
X32622387Y-153244565D01*
X32607466Y-153195762D01*
X32598783Y-153110278D01*
X32598783Y-153055212D01*
X79896276Y-153055212D01*
X79896276Y-153731848D01*
X80028282Y-154395482D01*
X80287219Y-155020612D01*
X80663138Y-155583215D01*
X81141591Y-156061668D01*
X81704194Y-156437587D01*
X82329324Y-156696524D01*
X82992958Y-156828530D01*
X83669594Y-156828530D01*
X84333228Y-156696524D01*
X84958358Y-156437587D01*
X85520961Y-156061668D01*
X85999414Y-155583215D01*
X86375333Y-155020612D01*
X86468624Y-154795387D01*
X106022136Y-154795387D01*
X106022136Y-155472023D01*
X106154142Y-156135657D01*
X106413079Y-156760787D01*
X106788998Y-157323390D01*
X107267451Y-157801843D01*
X107830054Y-158177762D01*
X108455184Y-158436699D01*
X109118818Y-158568705D01*
X109795454Y-158568705D01*
X110459088Y-158436699D01*
X111084218Y-158177762D01*
X111646821Y-157801843D01*
X112125274Y-157323390D01*
X112501193Y-156760787D01*
X112760130Y-156135657D01*
X112892136Y-155472023D01*
X112892136Y-154795387D01*
X112760130Y-154131753D01*
X112501193Y-153506623D01*
X112125274Y-152944020D01*
X111646821Y-152465567D01*
X111084218Y-152089648D01*
X110459088Y-151830711D01*
X109795454Y-151698705D01*
X109118818Y-151698705D01*
X108455184Y-151830711D01*
X107830054Y-152089648D01*
X107267451Y-152465567D01*
X106788998Y-152944020D01*
X106413079Y-153506623D01*
X106154142Y-154131753D01*
X106022136Y-154795387D01*
X86468624Y-154795387D01*
X86634270Y-154395482D01*
X86766276Y-153731848D01*
X86766276Y-153055212D01*
X86634270Y-152391578D01*
X86375333Y-151766448D01*
X85999414Y-151203845D01*
X85520961Y-150725392D01*
X84958358Y-150349473D01*
X84333228Y-150090536D01*
X83669594Y-149958530D01*
X82992958Y-149958530D01*
X82329324Y-150090536D01*
X81704194Y-150349473D01*
X81141591Y-150725392D01*
X80663138Y-151203845D01*
X80287219Y-151766448D01*
X80028282Y-152391578D01*
X79896276Y-153055212D01*
X32598783Y-153055212D01*
X32598783Y-143909214D01*
X89042275Y-143909214D01*
X89042275Y-144585850D01*
X89174281Y-145249484D01*
X89433218Y-145874614D01*
X89809137Y-146437217D01*
X90287590Y-146915670D01*
X90850193Y-147291589D01*
X91475323Y-147550526D01*
X92138957Y-147682532D01*
X92815593Y-147682532D01*
X93479227Y-147550526D01*
X94104357Y-147291589D01*
X94666960Y-146915670D01*
X95145413Y-146437217D01*
X95521332Y-145874614D01*
X95780269Y-145249484D01*
X95912275Y-144585850D01*
X95912275Y-143909214D01*
X95780269Y-143245580D01*
X95521332Y-142620450D01*
X95145413Y-142057847D01*
X94666960Y-141579394D01*
X94104357Y-141203475D01*
X93479227Y-140944538D01*
X92815593Y-140812532D01*
X92138957Y-140812532D01*
X91475323Y-140944538D01*
X90850193Y-141203475D01*
X90287590Y-141579394D01*
X89809137Y-142057847D01*
X89433218Y-142620450D01*
X89174281Y-143245580D01*
X89042275Y-143909214D01*
X32598783Y-143909214D01*
X32598783Y-139499036D01*
X32661858Y-139651313D01*
X32918343Y-140035170D01*
X33244787Y-140361614D01*
X33628644Y-140618099D01*
X34055163Y-140794768D01*
X34507953Y-140884834D01*
X34969613Y-140884834D01*
X35422403Y-140794768D01*
X35848922Y-140618099D01*
X36232779Y-140361614D01*
X36559223Y-140035170D01*
X36815708Y-139651313D01*
X36992377Y-139224794D01*
X37082443Y-138772004D01*
X37082443Y-138310344D01*
X36992377Y-137857554D01*
X36815708Y-137431035D01*
X36559223Y-137047178D01*
X36232779Y-136720734D01*
X35848922Y-136464249D01*
X35422403Y-136287580D01*
X34969613Y-136197514D01*
X34507953Y-136197514D01*
X34055163Y-136287580D01*
X33628644Y-136464249D01*
X33244787Y-136720734D01*
X32918343Y-137047178D01*
X32661858Y-137431035D01*
X32598783Y-137583312D01*
X32598783Y-121590797D01*
X42338174Y-121590797D01*
X42338174Y-122267433D01*
X42470180Y-122931067D01*
X42729117Y-123556197D01*
X43105036Y-124118800D01*
X43583489Y-124597253D01*
X44146092Y-124973172D01*
X44771222Y-125232109D01*
X45434856Y-125364115D01*
X46111492Y-125364115D01*
X46775126Y-125232109D01*
X47400256Y-124973172D01*
X47962859Y-124597253D01*
X48441312Y-124118800D01*
X48817231Y-123556197D01*
X48983244Y-123155405D01*
X56478298Y-123155405D01*
X56490558Y-123279887D01*
X56526868Y-123399585D01*
X56585833Y-123509899D01*
X56665185Y-123606590D01*
X57089449Y-124030854D01*
X57186140Y-124110206D01*
X57255737Y-124147407D01*
X57292939Y-124217006D01*
X57372291Y-124313697D01*
X57796555Y-124737961D01*
X57893246Y-124817313D01*
X57962844Y-124854515D01*
X58000046Y-124924113D01*
X58079398Y-125020804D01*
X58503662Y-125445068D01*
X58600353Y-125524420D01*
X58669951Y-125561622D01*
X58707153Y-125631220D01*
X58786505Y-125727911D01*
X59210769Y-126152175D01*
X59307460Y-126231527D01*
X59377058Y-126268729D01*
X59414260Y-126338327D01*
X59493612Y-126435018D01*
X59917876Y-126859282D01*
X60014567Y-126938634D01*
X60084165Y-126975835D01*
X60121366Y-127045433D01*
X60200718Y-127142124D01*
X60624982Y-127566388D01*
X60721673Y-127645740D01*
X60791271Y-127682942D01*
X60828473Y-127752540D01*
X60907825Y-127849231D01*
X61332089Y-128273495D01*
X61428780Y-128352847D01*
X61498378Y-128390049D01*
X61535580Y-128459647D01*
X61614932Y-128556338D01*
X62039196Y-128980602D01*
X62135887Y-129059954D01*
X62205485Y-129097156D01*
X62242687Y-129166754D01*
X62322039Y-129263445D01*
X62438883Y-129380289D01*
X62414717Y-129380289D01*
X61751083Y-129512295D01*
X61125953Y-129771232D01*
X60563350Y-130147151D01*
X60084897Y-130625604D01*
X59708978Y-131188207D01*
X59450041Y-131813337D01*
X59318035Y-132476971D01*
X59318035Y-133153607D01*
X59450041Y-133817241D01*
X59708978Y-134442371D01*
X60084897Y-135004974D01*
X60563350Y-135483427D01*
X61125953Y-135859346D01*
X61751083Y-136118283D01*
X62414717Y-136250289D01*
X63091353Y-136250289D01*
X63754987Y-136118283D01*
X64380117Y-135859346D01*
X64942720Y-135483427D01*
X65421173Y-135004974D01*
X65797092Y-134442371D01*
X66056029Y-133817241D01*
X66188035Y-133153607D01*
X66188035Y-132476971D01*
X66056029Y-131813337D01*
X65877975Y-131383475D01*
X68676778Y-131383475D01*
X68676778Y-132193325D01*
X68834772Y-132987614D01*
X69144688Y-133735818D01*
X69594616Y-134409184D01*
X70167267Y-134981835D01*
X70840633Y-135431763D01*
X71588837Y-135741679D01*
X72383126Y-135899673D01*
X73192976Y-135899673D01*
X73987265Y-135741679D01*
X74735469Y-135431763D01*
X75408835Y-134981835D01*
X75981486Y-134409184D01*
X76431414Y-133735818D01*
X76741330Y-132987614D01*
X76899324Y-132193325D01*
X76899324Y-131383475D01*
X76741330Y-130589186D01*
X76431414Y-129840982D01*
X75981486Y-129167616D01*
X75408835Y-128594965D01*
X74735469Y-128145037D01*
X73987265Y-127835121D01*
X73192976Y-127677127D01*
X72383126Y-127677127D01*
X71588837Y-127835121D01*
X70840633Y-128145037D01*
X70167267Y-128594965D01*
X69594616Y-129167616D01*
X69144688Y-129840982D01*
X68834772Y-130589186D01*
X68676778Y-131383475D01*
X65877975Y-131383475D01*
X65797092Y-131188207D01*
X65421173Y-130625604D01*
X64942720Y-130147151D01*
X64739339Y-130011256D01*
X65487150Y-129263445D01*
X65566502Y-129166754D01*
X65625467Y-129056440D01*
X65634398Y-129027000D01*
X65811539Y-129027000D01*
X66011498Y-128987226D01*
X66199856Y-128909205D01*
X66290976Y-128848321D01*
X66794488Y-129351833D01*
X66891179Y-129431185D01*
X67001493Y-129490150D01*
X67121191Y-129526460D01*
X67245673Y-129538720D01*
X67370155Y-129526460D01*
X67489853Y-129490150D01*
X67600167Y-129431185D01*
X67696858Y-129351833D01*
X68969650Y-128079041D01*
X69049002Y-127982350D01*
X69107967Y-127872036D01*
X69144277Y-127752338D01*
X69156537Y-127627856D01*
X69144277Y-127503374D01*
X69107967Y-127383676D01*
X69049002Y-127273362D01*
X68969650Y-127176671D01*
X68368610Y-126575631D01*
X68276425Y-126499977D01*
X68728949Y-126047453D01*
X68757947Y-126023655D01*
X68784278Y-125991571D01*
X68852920Y-125907931D01*
X68864696Y-125885900D01*
X69095001Y-125655595D01*
X69230895Y-125858975D01*
X69709348Y-126337428D01*
X70271951Y-126713347D01*
X70897081Y-126972284D01*
X71560715Y-127104290D01*
X72237351Y-127104290D01*
X72900985Y-126972284D01*
X73526115Y-126713347D01*
X74088718Y-126337428D01*
X74567171Y-125858975D01*
X74943090Y-125296372D01*
X75202027Y-124671242D01*
X75334033Y-124007608D01*
X75334033Y-123330972D01*
X75202027Y-122667338D01*
X74943090Y-122042208D01*
X74567171Y-121479605D01*
X74088718Y-121001152D01*
X73526115Y-120625233D01*
X72900985Y-120366296D01*
X72237351Y-120234290D01*
X71560715Y-120234290D01*
X70897081Y-120366296D01*
X70271951Y-120625233D01*
X69709348Y-121001152D01*
X69230895Y-121479605D01*
X68854976Y-122042208D01*
X68596039Y-122667338D01*
X68464033Y-123330972D01*
X68464033Y-123418363D01*
X68315577Y-123269907D01*
X68218886Y-123190555D01*
X68149288Y-123153353D01*
X68112086Y-123083755D01*
X68032734Y-122987064D01*
X67608470Y-122562800D01*
X67511779Y-122483448D01*
X67442181Y-122446246D01*
X67404979Y-122376648D01*
X67325627Y-122279957D01*
X66901363Y-121855693D01*
X66804672Y-121776341D01*
X66735074Y-121739139D01*
X66697872Y-121669541D01*
X66618520Y-121572850D01*
X66194256Y-121148586D01*
X66097565Y-121069234D01*
X66027967Y-121032033D01*
X65990766Y-120962435D01*
X65911414Y-120865744D01*
X65487150Y-120441480D01*
X65390459Y-120362128D01*
X65320861Y-120324926D01*
X65283659Y-120255328D01*
X65204307Y-120158637D01*
X65096003Y-120050333D01*
X98878445Y-120050333D01*
X98882000Y-120086262D01*
X98882001Y-139191058D01*
X98878445Y-139227333D01*
X98885574Y-139299379D01*
X98892636Y-139371085D01*
X98892684Y-139371245D01*
X98892701Y-139371412D01*
X98913940Y-139441315D01*
X98934664Y-139509633D01*
X98934741Y-139509778D01*
X98934791Y-139509941D01*
X98969260Y-139574358D01*
X99002914Y-139637320D01*
X99003020Y-139637449D01*
X99003099Y-139637597D01*
X99048613Y-139693004D01*
X99094763Y-139749238D01*
X99094895Y-139749346D01*
X99094999Y-139749473D01*
X99150303Y-139794819D01*
X99206681Y-139841087D01*
X99206829Y-139841166D01*
X99206958Y-139841272D01*
X99270227Y-139875053D01*
X99334368Y-139909337D01*
X99334530Y-139909386D01*
X99334676Y-139909464D01*
X99403321Y-139930254D01*
X99472916Y-139951365D01*
X99473083Y-139951381D01*
X99473243Y-139951430D01*
X99544685Y-139958434D01*
X99617000Y-139965556D01*
X99653273Y-139961983D01*
X102678655Y-139960616D01*
X102714600Y-139964156D01*
X102750877Y-139960583D01*
X102751036Y-139960583D01*
X102785242Y-139957198D01*
X102858684Y-139949965D01*
X102858848Y-139949915D01*
X102859012Y-139949899D01*
X102927491Y-139929093D01*
X102997232Y-139907937D01*
X102997380Y-139907858D01*
X102997541Y-139907809D01*
X103061161Y-139873766D01*
X103124919Y-139839687D01*
X103125049Y-139839580D01*
X103125197Y-139839501D01*
X103180369Y-139794180D01*
X103236837Y-139747838D01*
X103236946Y-139747706D01*
X103237073Y-139747601D01*
X103282075Y-139692716D01*
X103328687Y-139635920D01*
X103328767Y-139635770D01*
X103328872Y-139635642D01*
X103362164Y-139573288D01*
X103396937Y-139508233D01*
X103396987Y-139508068D01*
X103397064Y-139507924D01*
X103417366Y-139440889D01*
X103438965Y-139369685D01*
X103438982Y-139369512D01*
X103439029Y-139369357D01*
X103445865Y-139299622D01*
X103449600Y-139261705D01*
X103449600Y-139261529D01*
X103453155Y-139225267D01*
X103449600Y-139189338D01*
X103449600Y-120084529D01*
X103453155Y-120048267D01*
X103446244Y-119978418D01*
X103438965Y-119904515D01*
X103438915Y-119904350D01*
X103438899Y-119904188D01*
X103418580Y-119837316D01*
X103396937Y-119765967D01*
X103396855Y-119765813D01*
X103396808Y-119765659D01*
X103363728Y-119703836D01*
X103328687Y-119638280D01*
X103328578Y-119638148D01*
X103328501Y-119638003D01*
X103283759Y-119583535D01*
X103236838Y-119526362D01*
X103236703Y-119526251D01*
X103236601Y-119526127D01*
X103182396Y-119481682D01*
X103124920Y-119434513D01*
X103124770Y-119434433D01*
X103124642Y-119434328D01*
X103062288Y-119401036D01*
X102997233Y-119366263D01*
X102997068Y-119366213D01*
X102996924Y-119366136D01*
X102928900Y-119345534D01*
X102858685Y-119324235D01*
X102858517Y-119324218D01*
X102858357Y-119324170D01*
X102787023Y-119317177D01*
X102714600Y-119310044D01*
X102678327Y-119313617D01*
X99652945Y-119314984D01*
X99617000Y-119311444D01*
X99580723Y-119315017D01*
X99580563Y-119315017D01*
X99546316Y-119318406D01*
X99472915Y-119325635D01*
X99472750Y-119325685D01*
X99472588Y-119325701D01*
X99404729Y-119346319D01*
X99334367Y-119367663D01*
X99334218Y-119367743D01*
X99334059Y-119367791D01*
X99271354Y-119401344D01*
X99206680Y-119435913D01*
X99206548Y-119436022D01*
X99206403Y-119436099D01*
X99151661Y-119481066D01*
X99094762Y-119527763D01*
X99094654Y-119527895D01*
X99094527Y-119527999D01*
X99049181Y-119583303D01*
X99002913Y-119639681D01*
X99002834Y-119639829D01*
X99002728Y-119639958D01*
X98968947Y-119703227D01*
X98934663Y-119767368D01*
X98934614Y-119767530D01*
X98934536Y-119767676D01*
X98913746Y-119836321D01*
X98892635Y-119905916D01*
X98892619Y-119906083D01*
X98892570Y-119906243D01*
X98885603Y-119977309D01*
X98882000Y-120013896D01*
X98882000Y-120014068D01*
X98878445Y-120050333D01*
X65096003Y-120050333D01*
X64780043Y-119734373D01*
X64683352Y-119655021D01*
X64613754Y-119617819D01*
X64576552Y-119548221D01*
X64497200Y-119451530D01*
X64072936Y-119027266D01*
X63976245Y-118947914D01*
X63906647Y-118910712D01*
X63869445Y-118841114D01*
X63790093Y-118744423D01*
X63365829Y-118320159D01*
X63269138Y-118240807D01*
X63199540Y-118203605D01*
X63162338Y-118134007D01*
X63082986Y-118037316D01*
X62658722Y-117613052D01*
X62562031Y-117533700D01*
X62451717Y-117474735D01*
X62332019Y-117438425D01*
X62207537Y-117426165D01*
X62083055Y-117438425D01*
X61963357Y-117474735D01*
X61853043Y-117533700D01*
X61756352Y-117613052D01*
X60624982Y-118744422D01*
X60573752Y-118806847D01*
X60563721Y-118788081D01*
X60484369Y-118691390D01*
X59883329Y-118090350D01*
X59786638Y-118010998D01*
X59676324Y-117952033D01*
X59556626Y-117915723D01*
X59432144Y-117903463D01*
X59307662Y-117915723D01*
X59187964Y-117952033D01*
X59077650Y-118010998D01*
X58980959Y-118090350D01*
X57708167Y-119363142D01*
X57628815Y-119459833D01*
X57569850Y-119570147D01*
X57533540Y-119689845D01*
X57521280Y-119814327D01*
X57533540Y-119938809D01*
X57569850Y-120058507D01*
X57628815Y-120168821D01*
X57708167Y-120265512D01*
X58303727Y-120861072D01*
X57383190Y-121781609D01*
X57354186Y-121805412D01*
X57312922Y-121855693D01*
X57259213Y-121921137D01*
X57194499Y-122042208D01*
X57188641Y-122053167D01*
X57145184Y-122196428D01*
X57142148Y-122227257D01*
X56665185Y-122704220D01*
X56585833Y-122800911D01*
X56526868Y-122911225D01*
X56490558Y-123030923D01*
X56478298Y-123155405D01*
X48983244Y-123155405D01*
X49076168Y-122931067D01*
X49208174Y-122267433D01*
X49208174Y-121590797D01*
X49076168Y-120927163D01*
X48817231Y-120302033D01*
X48441312Y-119739430D01*
X47962859Y-119260977D01*
X47400256Y-118885058D01*
X46775126Y-118626121D01*
X46111492Y-118494115D01*
X45434856Y-118494115D01*
X44771222Y-118626121D01*
X44146092Y-118885058D01*
X43583489Y-119260977D01*
X43105036Y-119739430D01*
X42729117Y-120302033D01*
X42470180Y-120927163D01*
X42338174Y-121590797D01*
X32598783Y-121590797D01*
X32598783Y-119297301D01*
X32607287Y-119210567D01*
X32622037Y-119161714D01*
X32645995Y-119116655D01*
X32700286Y-119050088D01*
X34937619Y-116813119D01*
X109734010Y-116813119D01*
X109734010Y-117489755D01*
X109866016Y-118153389D01*
X110124953Y-118778519D01*
X110500872Y-119341122D01*
X110979325Y-119819575D01*
X111541928Y-120195494D01*
X112167058Y-120454431D01*
X112830692Y-120586437D01*
X113507328Y-120586437D01*
X114170962Y-120454431D01*
X114796092Y-120195494D01*
X115358695Y-119819575D01*
X115837148Y-119341122D01*
X116213067Y-118778519D01*
X116472004Y-118153389D01*
X116604010Y-117489755D01*
X116604010Y-116813119D01*
X116472004Y-116149485D01*
X116213067Y-115524355D01*
X115837148Y-114961752D01*
X115358695Y-114483299D01*
X114796092Y-114107380D01*
X114170962Y-113848443D01*
X113507328Y-113716437D01*
X112830692Y-113716437D01*
X112167058Y-113848443D01*
X111541928Y-114107380D01*
X110979325Y-114483299D01*
X110500872Y-114961752D01*
X110124953Y-115524355D01*
X109866016Y-116149485D01*
X109734010Y-116813119D01*
X34937619Y-116813119D01*
X35616342Y-116134507D01*
X35634711Y-116112128D01*
X35636692Y-116110188D01*
X35643234Y-116102281D01*
X35766585Y-115951038D01*
X35803484Y-115895501D01*
X35841088Y-115840581D01*
X35845963Y-115831565D01*
X35845967Y-115831559D01*
X35845969Y-115831553D01*
X35937593Y-115659232D01*
X35962991Y-115597611D01*
X35989220Y-115536415D01*
X35992255Y-115526612D01*
X36048664Y-115339776D01*
X36061612Y-115274384D01*
X36075453Y-115209268D01*
X36076526Y-115199062D01*
X36095571Y-115004829D01*
X36095571Y-115004827D01*
X36099079Y-114969209D01*
X36099079Y-108373483D01*
X39360199Y-108373483D01*
X39360199Y-109050119D01*
X39492205Y-109713753D01*
X39751142Y-110338883D01*
X40127061Y-110901486D01*
X40605514Y-111379939D01*
X41168117Y-111755858D01*
X41793247Y-112014795D01*
X42456881Y-112146801D01*
X43133517Y-112146801D01*
X43797151Y-112014795D01*
X44422281Y-111755858D01*
X44984884Y-111379939D01*
X45463337Y-110901486D01*
X45839256Y-110338883D01*
X46098193Y-109713753D01*
X46230199Y-109050119D01*
X46230199Y-108373483D01*
X46098193Y-107709849D01*
X45868946Y-107156397D01*
X46437247Y-107391795D01*
X47100881Y-107523801D01*
X47777517Y-107523801D01*
X48441151Y-107391795D01*
X49066281Y-107132858D01*
X49628884Y-106756939D01*
X50034712Y-106351111D01*
X57577860Y-106351111D01*
X57577860Y-107027747D01*
X57709866Y-107691381D01*
X57968803Y-108316511D01*
X58344722Y-108879114D01*
X58823175Y-109357567D01*
X59385778Y-109733486D01*
X60010908Y-109992423D01*
X60674542Y-110124429D01*
X61351178Y-110124429D01*
X62014812Y-109992423D01*
X62639942Y-109733486D01*
X63202545Y-109357567D01*
X63680998Y-108879114D01*
X64056917Y-108316511D01*
X64315854Y-107691381D01*
X64447860Y-107027747D01*
X64447860Y-106351111D01*
X64315854Y-105687477D01*
X64056917Y-105062347D01*
X63680998Y-104499744D01*
X63202545Y-104021291D01*
X62639942Y-103645372D01*
X62014812Y-103386435D01*
X61351178Y-103254429D01*
X60674542Y-103254429D01*
X60010908Y-103386435D01*
X59385778Y-103645372D01*
X58823175Y-104021291D01*
X58344722Y-104499744D01*
X57968803Y-105062347D01*
X57709866Y-105687477D01*
X57577860Y-106351111D01*
X50034712Y-106351111D01*
X50107337Y-106278486D01*
X50483256Y-105715883D01*
X50742193Y-105090753D01*
X50874199Y-104427119D01*
X50874199Y-103750483D01*
X50742193Y-103086849D01*
X50483256Y-102461719D01*
X50107337Y-101899116D01*
X49628884Y-101420663D01*
X49066281Y-101044744D01*
X48441151Y-100785807D01*
X47777517Y-100653801D01*
X47100881Y-100653801D01*
X46437247Y-100785807D01*
X45812117Y-101044744D01*
X45249514Y-101420663D01*
X44771061Y-101899116D01*
X44395142Y-102461719D01*
X44136205Y-103086849D01*
X44004199Y-103750483D01*
X44004199Y-104427119D01*
X44136205Y-105090753D01*
X44365452Y-105644205D01*
X43797151Y-105408807D01*
X43133517Y-105276801D01*
X42456881Y-105276801D01*
X41793247Y-105408807D01*
X41168117Y-105667744D01*
X40605514Y-106043663D01*
X40127061Y-106522116D01*
X39751142Y-107084719D01*
X39492205Y-107709849D01*
X39360199Y-108373483D01*
X36099079Y-108373483D01*
X36099079Y-104821532D01*
X36169360Y-104034054D01*
X36369310Y-103303158D01*
X36695529Y-102619226D01*
X37137705Y-102003873D01*
X37681868Y-101476542D01*
X38310805Y-101053915D01*
X39004649Y-100749338D01*
X39747118Y-100571086D01*
X40391028Y-100523801D01*
X57439228Y-100523801D01*
X57467975Y-100520970D01*
X57470675Y-100520998D01*
X57480892Y-100520032D01*
X57675057Y-100500309D01*
X57740400Y-100487134D01*
X57805835Y-100474888D01*
X57815670Y-100471957D01*
X57815672Y-100471956D01*
X57815674Y-100471956D01*
X57815676Y-100471955D01*
X58002308Y-100414897D01*
X58063847Y-100389281D01*
X58125664Y-100364556D01*
X58134731Y-100359776D01*
X58134740Y-100359772D01*
X58134747Y-100359767D01*
X58306744Y-100267544D01*
X58362146Y-100230455D01*
X58417971Y-100194202D01*
X58425947Y-100187744D01*
X58576758Y-100063866D01*
X58576774Y-100063850D01*
X58604422Y-100041160D01*
X65018750Y-93626834D01*
X65086092Y-93571518D01*
X65131064Y-93547405D01*
X65179868Y-93532484D01*
X65265350Y-93523801D01*
X75395961Y-93523800D01*
X74945645Y-93974116D01*
X74569726Y-94536719D01*
X74310789Y-95161849D01*
X74178783Y-95825483D01*
X74178783Y-96502119D01*
X74310789Y-97165753D01*
X74569726Y-97790883D01*
X74945645Y-98353486D01*
X75424098Y-98831939D01*
X75986701Y-99207858D01*
X76611831Y-99466795D01*
X77275465Y-99598801D01*
X77952101Y-99598801D01*
X78615735Y-99466795D01*
X79240865Y-99207858D01*
X79803468Y-98831939D01*
X80281921Y-98353486D01*
X80657840Y-97790883D01*
X80916777Y-97165753D01*
X81048783Y-96502119D01*
X81048783Y-95825483D01*
X80916777Y-95161849D01*
X80657840Y-94536719D01*
X80281921Y-93974116D01*
X79831605Y-93523800D01*
X89960048Y-93523799D01*
X90046803Y-93532305D01*
G37*
X90046803Y-93532305D02*
X90095656Y-93547055D01*
X90140715Y-93571013D01*
X90207309Y-93625326D01*
X96623142Y-100041161D01*
X96645476Y-100059490D01*
X96647360Y-100061414D01*
X96655267Y-100067956D01*
X96806509Y-100191306D01*
X96862002Y-100228175D01*
X96894118Y-100250166D01*
X96805443Y-100309417D01*
X96326990Y-100787870D01*
X95951071Y-101350473D01*
X95692134Y-101975603D01*
X95560128Y-102639237D01*
X95560128Y-103315873D01*
X95692134Y-103979507D01*
X95951071Y-104604637D01*
X96326990Y-105167240D01*
X96805443Y-105645693D01*
X97368046Y-106021612D01*
X97993176Y-106280549D01*
X98656810Y-106412555D01*
X99333446Y-106412555D01*
X99997080Y-106280549D01*
X100622210Y-106021612D01*
X101184813Y-105645693D01*
X101663266Y-105167240D01*
X102039185Y-104604637D01*
X102298122Y-103979507D01*
X102430128Y-103315873D01*
X102430128Y-102639237D01*
X102298122Y-101975603D01*
X102039185Y-101350473D01*
X101663266Y-100787870D01*
X101399197Y-100523801D01*
X114831052Y-100523801D01*
X115618530Y-100594082D01*
X116349426Y-100794032D01*
X117033358Y-101120251D01*
X117648711Y-101562427D01*
X118176042Y-102106590D01*
X118598669Y-102735527D01*
X118903246Y-103429371D01*
X119081498Y-104171840D01*
X119128783Y-104815750D01*
X119128784Y-109352844D01*
X119101234Y-109633822D01*
X119030074Y-109869513D01*
X118914494Y-110086889D01*
X118758887Y-110277680D01*
X118569191Y-110434612D01*
X118352626Y-110551707D01*
X118117439Y-110624510D01*
X117838755Y-110653801D01*
X117399888Y-110653801D01*
X117363783Y-110650245D01*
X117327678Y-110653801D01*
X117219698Y-110664436D01*
X117081150Y-110706464D01*
X116953463Y-110774714D01*
X116841545Y-110866563D01*
X116749696Y-110978481D01*
X116681446Y-111106168D01*
X116639418Y-111244716D01*
X116625227Y-111388801D01*
X116628783Y-111424906D01*
X116628784Y-116934094D01*
X116631634Y-116963027D01*
X116631589Y-116967284D01*
X116632555Y-116977501D01*
X116662139Y-117268751D01*
X116675313Y-117334085D01*
X116687561Y-117399535D01*
X116690492Y-117409369D01*
X116776084Y-117689327D01*
X116801702Y-117750869D01*
X116826424Y-117812678D01*
X116831210Y-117821756D01*
X116969548Y-118079756D01*
X117006607Y-118135114D01*
X117042889Y-118190984D01*
X117049347Y-118198959D01*
X117235164Y-118425176D01*
X117257869Y-118452842D01*
X122525745Y-123720718D01*
X122581065Y-123788065D01*
X122605179Y-123833039D01*
X122620100Y-123881842D01*
X122628783Y-123967323D01*
X122628783Y-137583312D01*
X122565708Y-137431035D01*
X122309223Y-137047178D01*
X121982779Y-136720734D01*
X121598922Y-136464249D01*
X121172403Y-136287580D01*
X120719613Y-136197514D01*
X120257953Y-136197514D01*
X119805163Y-136287580D01*
X119378644Y-136464249D01*
X118994787Y-136720734D01*
X118668343Y-137047178D01*
X118411858Y-137431035D01*
X118235189Y-137857554D01*
X118145123Y-138310344D01*
X118145123Y-138772004D01*
X118235189Y-139224794D01*
X118411858Y-139651313D01*
X118668343Y-140035170D01*
X118994787Y-140361614D01*
X119378644Y-140618099D01*
X119805163Y-140794768D01*
X120257953Y-140884834D01*
X120719613Y-140884834D01*
X121172403Y-140794768D01*
X121598922Y-140618099D01*
X121982779Y-140361614D01*
X122309223Y-140035170D01*
X122565708Y-139651313D01*
X122628783Y-139499036D01*
X122628784Y-157790077D01*
X122620279Y-157876820D01*
X122605529Y-157925674D01*
X122581571Y-157970733D01*
X122527262Y-158037322D01*
X119611423Y-160953161D01*
X119593098Y-160975490D01*
X119591170Y-160977378D01*
X119584628Y-160985285D01*
X119461278Y-161136527D01*
X119424391Y-161192046D01*
X119386777Y-161246981D01*
X119381895Y-161256008D01*
X119290270Y-161428330D01*
X119264869Y-161489957D01*
X119238642Y-161551150D01*
X119235607Y-161560953D01*
X119179198Y-161747789D01*
X119166250Y-161813181D01*
X119152409Y-161878297D01*
X119151336Y-161888503D01*
X119132463Y-162080982D01*
X119128782Y-162118357D01*
X119128784Y-172256059D01*
X119058502Y-173043549D01*
X118858552Y-173774444D01*
X118532333Y-174458376D01*
X118090157Y-175073729D01*
X117545994Y-175601060D01*
X116917057Y-176023687D01*
X116223212Y-176328265D01*
X115480744Y-176506515D01*
X114836834Y-176553801D01*
X97788338Y-176553801D01*
X97759591Y-176556632D01*
X97756891Y-176556604D01*
X97746674Y-176557570D01*
X97552508Y-176577293D01*
X97487196Y-176590462D01*
X97421731Y-176602713D01*
X97411897Y-176605645D01*
X97411892Y-176605646D01*
X97411887Y-176605648D01*
X97225258Y-176662705D01*
X97163719Y-176688321D01*
X97101902Y-176713046D01*
X97092835Y-176717826D01*
X97092826Y-176717830D01*
X97092819Y-176717835D01*
X96920823Y-176810058D01*
X96865430Y-176847140D01*
X96809595Y-176883400D01*
X96801619Y-176889858D01*
X96650845Y-177013705D01*
X96623142Y-177036441D01*
X90208810Y-183450773D01*
X90141473Y-183506084D01*
X90096502Y-183530197D01*
X90047699Y-183545118D01*
X89962215Y-183553801D01*
X79841115Y-183553801D01*
X80281685Y-183113231D01*
X80657604Y-182550628D01*
X80916541Y-181925498D01*
X81048547Y-181261864D01*
X81048547Y-180585228D01*
X80916541Y-179921594D01*
X80657604Y-179296464D01*
X80281685Y-178733861D01*
X79803232Y-178255408D01*
X79240629Y-177879489D01*
X78615499Y-177620552D01*
X77951865Y-177488546D01*
X77275229Y-177488546D01*
X76611595Y-177620552D01*
X75986465Y-177879489D01*
X75423862Y-178255408D01*
X74945409Y-178733861D01*
X74569490Y-179296464D01*
X74310553Y-179921594D01*
X74178547Y-180585228D01*
X74178547Y-181261864D01*
X74310553Y-181925498D01*
X74569490Y-182550628D01*
X74945409Y-183113231D01*
X75385979Y-183553801D01*
X65267497Y-183553801D01*
X65180764Y-183545297D01*
X65131910Y-183530547D01*
X65086851Y-183506589D01*
X65020262Y-183452280D01*
X58604423Y-177036441D01*
X58582095Y-177018117D01*
X58580206Y-177016188D01*
X58572299Y-177009646D01*
X58421057Y-176886296D01*
X58365538Y-176849409D01*
X58323876Y-176820883D01*
X58424867Y-176753403D01*
X58903320Y-176274950D01*
X59279239Y-175712347D01*
X59538176Y-175087217D01*
X59670182Y-174423583D01*
X59670182Y-173746947D01*
X59538176Y-173083313D01*
X59279239Y-172458183D01*
X58903320Y-171895580D01*
X58424867Y-171417127D01*
X57862264Y-171041208D01*
X57237134Y-170782271D01*
X56573500Y-170650265D01*
X55896864Y-170650265D01*
X55233230Y-170782271D01*
X54608100Y-171041208D01*
X54045497Y-171417127D01*
X53567044Y-171895580D01*
X53191125Y-172458183D01*
X52932188Y-173083313D01*
X52800182Y-173746947D01*
X52800182Y-174423583D01*
X52932188Y-175087217D01*
X53191125Y-175712347D01*
X53567044Y-176274950D01*
X53845894Y-176553800D01*
X40396821Y-176553802D01*
X39609331Y-176483520D01*
X38878436Y-176283570D01*
X38194504Y-175957351D01*
X37579151Y-175515175D01*
X37051820Y-174971012D01*
X36629193Y-174342075D01*
X36324615Y-173648230D01*
X36146365Y-172905762D01*
X36099079Y-172261852D01*
X36099079Y-170035073D01*
X90782450Y-170035073D01*
X90782450Y-170711709D01*
X90914456Y-171375343D01*
X91173393Y-172000473D01*
X91549312Y-172563076D01*
X92027765Y-173041529D01*
X92590368Y-173417448D01*
X93215498Y-173676385D01*
X93879132Y-173808391D01*
X94555768Y-173808391D01*
X95219402Y-173676385D01*
X95844532Y-173417448D01*
X96407135Y-173041529D01*
X96798181Y-172650483D01*
X104356402Y-172650483D01*
X104356402Y-173327119D01*
X104488408Y-173990753D01*
X104747345Y-174615883D01*
X105123264Y-175178486D01*
X105601717Y-175656939D01*
X106164320Y-176032858D01*
X106789450Y-176291795D01*
X107453084Y-176423801D01*
X108129720Y-176423801D01*
X108793354Y-176291795D01*
X109418484Y-176032858D01*
X109981087Y-175656939D01*
X110459540Y-175178486D01*
X110835459Y-174615883D01*
X111094396Y-173990753D01*
X111226402Y-173327119D01*
X111226402Y-172650483D01*
X111094396Y-171986849D01*
X110865242Y-171433622D01*
X111433247Y-171668897D01*
X112096881Y-171800903D01*
X112773517Y-171800903D01*
X113437151Y-171668897D01*
X114062281Y-171409960D01*
X114624884Y-171034041D01*
X115103337Y-170555588D01*
X115479256Y-169992985D01*
X115738193Y-169367855D01*
X115870199Y-168704221D01*
X115870199Y-168027585D01*
X115738193Y-167363951D01*
X115479256Y-166738821D01*
X115103337Y-166176218D01*
X114624884Y-165697765D01*
X114062281Y-165321846D01*
X113437151Y-165062909D01*
X112773517Y-164930903D01*
X112096881Y-164930903D01*
X111433247Y-165062909D01*
X110808117Y-165321846D01*
X110245514Y-165697765D01*
X109767061Y-166176218D01*
X109391142Y-166738821D01*
X109132205Y-167363951D01*
X109000199Y-168027585D01*
X109000199Y-168704221D01*
X109132205Y-169367855D01*
X109361359Y-169921082D01*
X108793354Y-169685807D01*
X108129720Y-169553801D01*
X107453084Y-169553801D01*
X106789450Y-169685807D01*
X106164320Y-169944744D01*
X105601717Y-170320663D01*
X105123264Y-170799116D01*
X104747345Y-171361719D01*
X104488408Y-171986849D01*
X104356402Y-172650483D01*
X96798181Y-172650483D01*
X96885588Y-172563076D01*
X97261507Y-172000473D01*
X97520444Y-171375343D01*
X97652450Y-170711709D01*
X97652450Y-170035073D01*
X97520444Y-169371439D01*
X97261507Y-168746309D01*
X96885588Y-168183706D01*
X96407135Y-167705253D01*
X95844532Y-167329334D01*
X95219402Y-167070397D01*
X94555768Y-166938391D01*
X93879132Y-166938391D01*
X93215498Y-167070397D01*
X92590368Y-167329334D01*
X92027765Y-167705253D01*
X91549312Y-168183706D01*
X91173393Y-168746309D01*
X90914456Y-169371439D01*
X90782450Y-170035073D01*
X36099079Y-170035073D01*
X36099079Y-167724748D01*
X36126628Y-167443780D01*
X36197787Y-167208089D01*
X36313370Y-166990712D01*
X36468974Y-166799922D01*
X36658672Y-166642990D01*
X36875236Y-166525895D01*
X37110423Y-166453092D01*
X37389107Y-166423801D01*
X37827678Y-166423801D01*
X37863783Y-166427357D01*
X37899888Y-166423801D01*
X38007868Y-166413166D01*
X38146416Y-166371138D01*
X38274103Y-166302888D01*
X38386021Y-166211039D01*
X38477870Y-166099121D01*
X38546120Y-165971434D01*
X38588148Y-165832886D01*
X38602339Y-165688801D01*
X38598783Y-165652696D01*
X38598783Y-160143508D01*
X38595932Y-160114566D01*
X38595977Y-160110318D01*
X38595011Y-160100101D01*
X38565427Y-159808851D01*
X38552260Y-159743549D01*
X38540005Y-159678067D01*
X38537074Y-159668233D01*
X38507979Y-159573065D01*
X38626300Y-159573065D01*
X38626300Y-160249701D01*
X38758306Y-160913335D01*
X39017243Y-161538465D01*
X39393162Y-162101068D01*
X39871615Y-162579521D01*
X40434218Y-162955440D01*
X41059348Y-163214377D01*
X41722982Y-163346383D01*
X42399618Y-163346383D01*
X43063252Y-163214377D01*
X43688382Y-162955440D01*
X44250985Y-162579521D01*
X44729438Y-162101068D01*
X45105357Y-161538465D01*
X45364294Y-160913335D01*
X45496300Y-160249701D01*
X45496300Y-159573065D01*
X45364294Y-158909431D01*
X45105357Y-158284301D01*
X44729438Y-157721698D01*
X44250985Y-157243245D01*
X43688382Y-156867326D01*
X43063252Y-156608389D01*
X42399618Y-156476383D01*
X41722982Y-156476383D01*
X41059348Y-156608389D01*
X40434218Y-156867326D01*
X39871615Y-157243245D01*
X39393162Y-157721698D01*
X39017243Y-158284301D01*
X38758306Y-158909431D01*
X38626300Y-159573065D01*
X38507979Y-159573065D01*
X38451482Y-159388276D01*
X38425874Y-159326758D01*
X38401142Y-159264924D01*
X38396356Y-159255846D01*
X38258018Y-158997846D01*
X38220959Y-158942488D01*
X38184677Y-158886618D01*
X38178219Y-158878643D01*
X37993157Y-158653345D01*
X37969696Y-158624758D01*
X32701816Y-153356879D01*
X32646500Y-153289536D01*
X32622387Y-153244565D01*
X32607466Y-153195762D01*
X32598783Y-153110278D01*
X32598783Y-153055212D01*
X79896276Y-153055212D01*
X79896276Y-153731848D01*
X80028282Y-154395482D01*
X80287219Y-155020612D01*
X80663138Y-155583215D01*
X81141591Y-156061668D01*
X81704194Y-156437587D01*
X82329324Y-156696524D01*
X82992958Y-156828530D01*
X83669594Y-156828530D01*
X84333228Y-156696524D01*
X84958358Y-156437587D01*
X85520961Y-156061668D01*
X85999414Y-155583215D01*
X86375333Y-155020612D01*
X86468624Y-154795387D01*
X106022136Y-154795387D01*
X106022136Y-155472023D01*
X106154142Y-156135657D01*
X106413079Y-156760787D01*
X106788998Y-157323390D01*
X107267451Y-157801843D01*
X107830054Y-158177762D01*
X108455184Y-158436699D01*
X109118818Y-158568705D01*
X109795454Y-158568705D01*
X110459088Y-158436699D01*
X111084218Y-158177762D01*
X111646821Y-157801843D01*
X112125274Y-157323390D01*
X112501193Y-156760787D01*
X112760130Y-156135657D01*
X112892136Y-155472023D01*
X112892136Y-154795387D01*
X112760130Y-154131753D01*
X112501193Y-153506623D01*
X112125274Y-152944020D01*
X111646821Y-152465567D01*
X111084218Y-152089648D01*
X110459088Y-151830711D01*
X109795454Y-151698705D01*
X109118818Y-151698705D01*
X108455184Y-151830711D01*
X107830054Y-152089648D01*
X107267451Y-152465567D01*
X106788998Y-152944020D01*
X106413079Y-153506623D01*
X106154142Y-154131753D01*
X106022136Y-154795387D01*
X86468624Y-154795387D01*
X86634270Y-154395482D01*
X86766276Y-153731848D01*
X86766276Y-153055212D01*
X86634270Y-152391578D01*
X86375333Y-151766448D01*
X85999414Y-151203845D01*
X85520961Y-150725392D01*
X84958358Y-150349473D01*
X84333228Y-150090536D01*
X83669594Y-149958530D01*
X82992958Y-149958530D01*
X82329324Y-150090536D01*
X81704194Y-150349473D01*
X81141591Y-150725392D01*
X80663138Y-151203845D01*
X80287219Y-151766448D01*
X80028282Y-152391578D01*
X79896276Y-153055212D01*
X32598783Y-153055212D01*
X32598783Y-143909214D01*
X89042275Y-143909214D01*
X89042275Y-144585850D01*
X89174281Y-145249484D01*
X89433218Y-145874614D01*
X89809137Y-146437217D01*
X90287590Y-146915670D01*
X90850193Y-147291589D01*
X91475323Y-147550526D01*
X92138957Y-147682532D01*
X92815593Y-147682532D01*
X93479227Y-147550526D01*
X94104357Y-147291589D01*
X94666960Y-146915670D01*
X95145413Y-146437217D01*
X95521332Y-145874614D01*
X95780269Y-145249484D01*
X95912275Y-144585850D01*
X95912275Y-143909214D01*
X95780269Y-143245580D01*
X95521332Y-142620450D01*
X95145413Y-142057847D01*
X94666960Y-141579394D01*
X94104357Y-141203475D01*
X93479227Y-140944538D01*
X92815593Y-140812532D01*
X92138957Y-140812532D01*
X91475323Y-140944538D01*
X90850193Y-141203475D01*
X90287590Y-141579394D01*
X89809137Y-142057847D01*
X89433218Y-142620450D01*
X89174281Y-143245580D01*
X89042275Y-143909214D01*
X32598783Y-143909214D01*
X32598783Y-139499036D01*
X32661858Y-139651313D01*
X32918343Y-140035170D01*
X33244787Y-140361614D01*
X33628644Y-140618099D01*
X34055163Y-140794768D01*
X34507953Y-140884834D01*
X34969613Y-140884834D01*
X35422403Y-140794768D01*
X35848922Y-140618099D01*
X36232779Y-140361614D01*
X36559223Y-140035170D01*
X36815708Y-139651313D01*
X36992377Y-139224794D01*
X37082443Y-138772004D01*
X37082443Y-138310344D01*
X36992377Y-137857554D01*
X36815708Y-137431035D01*
X36559223Y-137047178D01*
X36232779Y-136720734D01*
X35848922Y-136464249D01*
X35422403Y-136287580D01*
X34969613Y-136197514D01*
X34507953Y-136197514D01*
X34055163Y-136287580D01*
X33628644Y-136464249D01*
X33244787Y-136720734D01*
X32918343Y-137047178D01*
X32661858Y-137431035D01*
X32598783Y-137583312D01*
X32598783Y-121590797D01*
X42338174Y-121590797D01*
X42338174Y-122267433D01*
X42470180Y-122931067D01*
X42729117Y-123556197D01*
X43105036Y-124118800D01*
X43583489Y-124597253D01*
X44146092Y-124973172D01*
X44771222Y-125232109D01*
X45434856Y-125364115D01*
X46111492Y-125364115D01*
X46775126Y-125232109D01*
X47400256Y-124973172D01*
X47962859Y-124597253D01*
X48441312Y-124118800D01*
X48817231Y-123556197D01*
X48983244Y-123155405D01*
X56478298Y-123155405D01*
X56490558Y-123279887D01*
X56526868Y-123399585D01*
X56585833Y-123509899D01*
X56665185Y-123606590D01*
X57089449Y-124030854D01*
X57186140Y-124110206D01*
X57255737Y-124147407D01*
X57292939Y-124217006D01*
X57372291Y-124313697D01*
X57796555Y-124737961D01*
X57893246Y-124817313D01*
X57962844Y-124854515D01*
X58000046Y-124924113D01*
X58079398Y-125020804D01*
X58503662Y-125445068D01*
X58600353Y-125524420D01*
X58669951Y-125561622D01*
X58707153Y-125631220D01*
X58786505Y-125727911D01*
X59210769Y-126152175D01*
X59307460Y-126231527D01*
X59377058Y-126268729D01*
X59414260Y-126338327D01*
X59493612Y-126435018D01*
X59917876Y-126859282D01*
X60014567Y-126938634D01*
X60084165Y-126975835D01*
X60121366Y-127045433D01*
X60200718Y-127142124D01*
X60624982Y-127566388D01*
X60721673Y-127645740D01*
X60791271Y-127682942D01*
X60828473Y-127752540D01*
X60907825Y-127849231D01*
X61332089Y-128273495D01*
X61428780Y-128352847D01*
X61498378Y-128390049D01*
X61535580Y-128459647D01*
X61614932Y-128556338D01*
X62039196Y-128980602D01*
X62135887Y-129059954D01*
X62205485Y-129097156D01*
X62242687Y-129166754D01*
X62322039Y-129263445D01*
X62438883Y-129380289D01*
X62414717Y-129380289D01*
X61751083Y-129512295D01*
X61125953Y-129771232D01*
X60563350Y-130147151D01*
X60084897Y-130625604D01*
X59708978Y-131188207D01*
X59450041Y-131813337D01*
X59318035Y-132476971D01*
X59318035Y-133153607D01*
X59450041Y-133817241D01*
X59708978Y-134442371D01*
X60084897Y-135004974D01*
X60563350Y-135483427D01*
X61125953Y-135859346D01*
X61751083Y-136118283D01*
X62414717Y-136250289D01*
X63091353Y-136250289D01*
X63754987Y-136118283D01*
X64380117Y-135859346D01*
X64942720Y-135483427D01*
X65421173Y-135004974D01*
X65797092Y-134442371D01*
X66056029Y-133817241D01*
X66188035Y-133153607D01*
X66188035Y-132476971D01*
X66056029Y-131813337D01*
X65877975Y-131383475D01*
X68676778Y-131383475D01*
X68676778Y-132193325D01*
X68834772Y-132987614D01*
X69144688Y-133735818D01*
X69594616Y-134409184D01*
X70167267Y-134981835D01*
X70840633Y-135431763D01*
X71588837Y-135741679D01*
X72383126Y-135899673D01*
X73192976Y-135899673D01*
X73987265Y-135741679D01*
X74735469Y-135431763D01*
X75408835Y-134981835D01*
X75981486Y-134409184D01*
X76431414Y-133735818D01*
X76741330Y-132987614D01*
X76899324Y-132193325D01*
X76899324Y-131383475D01*
X76741330Y-130589186D01*
X76431414Y-129840982D01*
X75981486Y-129167616D01*
X75408835Y-128594965D01*
X74735469Y-128145037D01*
X73987265Y-127835121D01*
X73192976Y-127677127D01*
X72383126Y-127677127D01*
X71588837Y-127835121D01*
X70840633Y-128145037D01*
X70167267Y-128594965D01*
X69594616Y-129167616D01*
X69144688Y-129840982D01*
X68834772Y-130589186D01*
X68676778Y-131383475D01*
X65877975Y-131383475D01*
X65797092Y-131188207D01*
X65421173Y-130625604D01*
X64942720Y-130147151D01*
X64739339Y-130011256D01*
X65487150Y-129263445D01*
X65566502Y-129166754D01*
X65625467Y-129056440D01*
X65634398Y-129027000D01*
X65811539Y-129027000D01*
X66011498Y-128987226D01*
X66199856Y-128909205D01*
X66290976Y-128848321D01*
X66794488Y-129351833D01*
X66891179Y-129431185D01*
X67001493Y-129490150D01*
X67121191Y-129526460D01*
X67245673Y-129538720D01*
X67370155Y-129526460D01*
X67489853Y-129490150D01*
X67600167Y-129431185D01*
X67696858Y-129351833D01*
X68969650Y-128079041D01*
X69049002Y-127982350D01*
X69107967Y-127872036D01*
X69144277Y-127752338D01*
X69156537Y-127627856D01*
X69144277Y-127503374D01*
X69107967Y-127383676D01*
X69049002Y-127273362D01*
X68969650Y-127176671D01*
X68368610Y-126575631D01*
X68276425Y-126499977D01*
X68728949Y-126047453D01*
X68757947Y-126023655D01*
X68784278Y-125991571D01*
X68852920Y-125907931D01*
X68864696Y-125885900D01*
X69095001Y-125655595D01*
X69230895Y-125858975D01*
X69709348Y-126337428D01*
X70271951Y-126713347D01*
X70897081Y-126972284D01*
X71560715Y-127104290D01*
X72237351Y-127104290D01*
X72900985Y-126972284D01*
X73526115Y-126713347D01*
X74088718Y-126337428D01*
X74567171Y-125858975D01*
X74943090Y-125296372D01*
X75202027Y-124671242D01*
X75334033Y-124007608D01*
X75334033Y-123330972D01*
X75202027Y-122667338D01*
X74943090Y-122042208D01*
X74567171Y-121479605D01*
X74088718Y-121001152D01*
X73526115Y-120625233D01*
X72900985Y-120366296D01*
X72237351Y-120234290D01*
X71560715Y-120234290D01*
X70897081Y-120366296D01*
X70271951Y-120625233D01*
X69709348Y-121001152D01*
X69230895Y-121479605D01*
X68854976Y-122042208D01*
X68596039Y-122667338D01*
X68464033Y-123330972D01*
X68464033Y-123418363D01*
X68315577Y-123269907D01*
X68218886Y-123190555D01*
X68149288Y-123153353D01*
X68112086Y-123083755D01*
X68032734Y-122987064D01*
X67608470Y-122562800D01*
X67511779Y-122483448D01*
X67442181Y-122446246D01*
X67404979Y-122376648D01*
X67325627Y-122279957D01*
X66901363Y-121855693D01*
X66804672Y-121776341D01*
X66735074Y-121739139D01*
X66697872Y-121669541D01*
X66618520Y-121572850D01*
X66194256Y-121148586D01*
X66097565Y-121069234D01*
X66027967Y-121032033D01*
X65990766Y-120962435D01*
X65911414Y-120865744D01*
X65487150Y-120441480D01*
X65390459Y-120362128D01*
X65320861Y-120324926D01*
X65283659Y-120255328D01*
X65204307Y-120158637D01*
X65096003Y-120050333D01*
X98878445Y-120050333D01*
X98882000Y-120086262D01*
X98882001Y-139191058D01*
X98878445Y-139227333D01*
X98885574Y-139299379D01*
X98892636Y-139371085D01*
X98892684Y-139371245D01*
X98892701Y-139371412D01*
X98913940Y-139441315D01*
X98934664Y-139509633D01*
X98934741Y-139509778D01*
X98934791Y-139509941D01*
X98969260Y-139574358D01*
X99002914Y-139637320D01*
X99003020Y-139637449D01*
X99003099Y-139637597D01*
X99048613Y-139693004D01*
X99094763Y-139749238D01*
X99094895Y-139749346D01*
X99094999Y-139749473D01*
X99150303Y-139794819D01*
X99206681Y-139841087D01*
X99206829Y-139841166D01*
X99206958Y-139841272D01*
X99270227Y-139875053D01*
X99334368Y-139909337D01*
X99334530Y-139909386D01*
X99334676Y-139909464D01*
X99403321Y-139930254D01*
X99472916Y-139951365D01*
X99473083Y-139951381D01*
X99473243Y-139951430D01*
X99544685Y-139958434D01*
X99617000Y-139965556D01*
X99653273Y-139961983D01*
X102678655Y-139960616D01*
X102714600Y-139964156D01*
X102750877Y-139960583D01*
X102751036Y-139960583D01*
X102785242Y-139957198D01*
X102858684Y-139949965D01*
X102858848Y-139949915D01*
X102859012Y-139949899D01*
X102927491Y-139929093D01*
X102997232Y-139907937D01*
X102997380Y-139907858D01*
X102997541Y-139907809D01*
X103061161Y-139873766D01*
X103124919Y-139839687D01*
X103125049Y-139839580D01*
X103125197Y-139839501D01*
X103180369Y-139794180D01*
X103236837Y-139747838D01*
X103236946Y-139747706D01*
X103237073Y-139747601D01*
X103282075Y-139692716D01*
X103328687Y-139635920D01*
X103328767Y-139635770D01*
X103328872Y-139635642D01*
X103362164Y-139573288D01*
X103396937Y-139508233D01*
X103396987Y-139508068D01*
X103397064Y-139507924D01*
X103417366Y-139440889D01*
X103438965Y-139369685D01*
X103438982Y-139369512D01*
X103439029Y-139369357D01*
X103445865Y-139299622D01*
X103449600Y-139261705D01*
X103449600Y-139261529D01*
X103453155Y-139225267D01*
X103449600Y-139189338D01*
X103449600Y-120084529D01*
X103453155Y-120048267D01*
X103446244Y-119978418D01*
X103438965Y-119904515D01*
X103438915Y-119904350D01*
X103438899Y-119904188D01*
X103418580Y-119837316D01*
X103396937Y-119765967D01*
X103396855Y-119765813D01*
X103396808Y-119765659D01*
X103363728Y-119703836D01*
X103328687Y-119638280D01*
X103328578Y-119638148D01*
X103328501Y-119638003D01*
X103283759Y-119583535D01*
X103236838Y-119526362D01*
X103236703Y-119526251D01*
X103236601Y-119526127D01*
X103182396Y-119481682D01*
X103124920Y-119434513D01*
X103124770Y-119434433D01*
X103124642Y-119434328D01*
X103062288Y-119401036D01*
X102997233Y-119366263D01*
X102997068Y-119366213D01*
X102996924Y-119366136D01*
X102928900Y-119345534D01*
X102858685Y-119324235D01*
X102858517Y-119324218D01*
X102858357Y-119324170D01*
X102787023Y-119317177D01*
X102714600Y-119310044D01*
X102678327Y-119313617D01*
X99652945Y-119314984D01*
X99617000Y-119311444D01*
X99580723Y-119315017D01*
X99580563Y-119315017D01*
X99546316Y-119318406D01*
X99472915Y-119325635D01*
X99472750Y-119325685D01*
X99472588Y-119325701D01*
X99404729Y-119346319D01*
X99334367Y-119367663D01*
X99334218Y-119367743D01*
X99334059Y-119367791D01*
X99271354Y-119401344D01*
X99206680Y-119435913D01*
X99206548Y-119436022D01*
X99206403Y-119436099D01*
X99151661Y-119481066D01*
X99094762Y-119527763D01*
X99094654Y-119527895D01*
X99094527Y-119527999D01*
X99049181Y-119583303D01*
X99002913Y-119639681D01*
X99002834Y-119639829D01*
X99002728Y-119639958D01*
X98968947Y-119703227D01*
X98934663Y-119767368D01*
X98934614Y-119767530D01*
X98934536Y-119767676D01*
X98913746Y-119836321D01*
X98892635Y-119905916D01*
X98892619Y-119906083D01*
X98892570Y-119906243D01*
X98885603Y-119977309D01*
X98882000Y-120013896D01*
X98882000Y-120014068D01*
X98878445Y-120050333D01*
X65096003Y-120050333D01*
X64780043Y-119734373D01*
X64683352Y-119655021D01*
X64613754Y-119617819D01*
X64576552Y-119548221D01*
X64497200Y-119451530D01*
X64072936Y-119027266D01*
X63976245Y-118947914D01*
X63906647Y-118910712D01*
X63869445Y-118841114D01*
X63790093Y-118744423D01*
X63365829Y-118320159D01*
X63269138Y-118240807D01*
X63199540Y-118203605D01*
X63162338Y-118134007D01*
X63082986Y-118037316D01*
X62658722Y-117613052D01*
X62562031Y-117533700D01*
X62451717Y-117474735D01*
X62332019Y-117438425D01*
X62207537Y-117426165D01*
X62083055Y-117438425D01*
X61963357Y-117474735D01*
X61853043Y-117533700D01*
X61756352Y-117613052D01*
X60624982Y-118744422D01*
X60573752Y-118806847D01*
X60563721Y-118788081D01*
X60484369Y-118691390D01*
X59883329Y-118090350D01*
X59786638Y-118010998D01*
X59676324Y-117952033D01*
X59556626Y-117915723D01*
X59432144Y-117903463D01*
X59307662Y-117915723D01*
X59187964Y-117952033D01*
X59077650Y-118010998D01*
X58980959Y-118090350D01*
X57708167Y-119363142D01*
X57628815Y-119459833D01*
X57569850Y-119570147D01*
X57533540Y-119689845D01*
X57521280Y-119814327D01*
X57533540Y-119938809D01*
X57569850Y-120058507D01*
X57628815Y-120168821D01*
X57708167Y-120265512D01*
X58303727Y-120861072D01*
X57383190Y-121781609D01*
X57354186Y-121805412D01*
X57312922Y-121855693D01*
X57259213Y-121921137D01*
X57194499Y-122042208D01*
X57188641Y-122053167D01*
X57145184Y-122196428D01*
X57142148Y-122227257D01*
X56665185Y-122704220D01*
X56585833Y-122800911D01*
X56526868Y-122911225D01*
X56490558Y-123030923D01*
X56478298Y-123155405D01*
X48983244Y-123155405D01*
X49076168Y-122931067D01*
X49208174Y-122267433D01*
X49208174Y-121590797D01*
X49076168Y-120927163D01*
X48817231Y-120302033D01*
X48441312Y-119739430D01*
X47962859Y-119260977D01*
X47400256Y-118885058D01*
X46775126Y-118626121D01*
X46111492Y-118494115D01*
X45434856Y-118494115D01*
X44771222Y-118626121D01*
X44146092Y-118885058D01*
X43583489Y-119260977D01*
X43105036Y-119739430D01*
X42729117Y-120302033D01*
X42470180Y-120927163D01*
X42338174Y-121590797D01*
X32598783Y-121590797D01*
X32598783Y-119297301D01*
X32607287Y-119210567D01*
X32622037Y-119161714D01*
X32645995Y-119116655D01*
X32700286Y-119050088D01*
X34937619Y-116813119D01*
X109734010Y-116813119D01*
X109734010Y-117489755D01*
X109866016Y-118153389D01*
X110124953Y-118778519D01*
X110500872Y-119341122D01*
X110979325Y-119819575D01*
X111541928Y-120195494D01*
X112167058Y-120454431D01*
X112830692Y-120586437D01*
X113507328Y-120586437D01*
X114170962Y-120454431D01*
X114796092Y-120195494D01*
X115358695Y-119819575D01*
X115837148Y-119341122D01*
X116213067Y-118778519D01*
X116472004Y-118153389D01*
X116604010Y-117489755D01*
X116604010Y-116813119D01*
X116472004Y-116149485D01*
X116213067Y-115524355D01*
X115837148Y-114961752D01*
X115358695Y-114483299D01*
X114796092Y-114107380D01*
X114170962Y-113848443D01*
X113507328Y-113716437D01*
X112830692Y-113716437D01*
X112167058Y-113848443D01*
X111541928Y-114107380D01*
X110979325Y-114483299D01*
X110500872Y-114961752D01*
X110124953Y-115524355D01*
X109866016Y-116149485D01*
X109734010Y-116813119D01*
X34937619Y-116813119D01*
X35616342Y-116134507D01*
X35634711Y-116112128D01*
X35636692Y-116110188D01*
X35643234Y-116102281D01*
X35766585Y-115951038D01*
X35803484Y-115895501D01*
X35841088Y-115840581D01*
X35845963Y-115831565D01*
X35845967Y-115831559D01*
X35845969Y-115831553D01*
X35937593Y-115659232D01*
X35962991Y-115597611D01*
X35989220Y-115536415D01*
X35992255Y-115526612D01*
X36048664Y-115339776D01*
X36061612Y-115274384D01*
X36075453Y-115209268D01*
X36076526Y-115199062D01*
X36095571Y-115004829D01*
X36095571Y-115004827D01*
X36099079Y-114969209D01*
X36099079Y-108373483D01*
X39360199Y-108373483D01*
X39360199Y-109050119D01*
X39492205Y-109713753D01*
X39751142Y-110338883D01*
X40127061Y-110901486D01*
X40605514Y-111379939D01*
X41168117Y-111755858D01*
X41793247Y-112014795D01*
X42456881Y-112146801D01*
X43133517Y-112146801D01*
X43797151Y-112014795D01*
X44422281Y-111755858D01*
X44984884Y-111379939D01*
X45463337Y-110901486D01*
X45839256Y-110338883D01*
X46098193Y-109713753D01*
X46230199Y-109050119D01*
X46230199Y-108373483D01*
X46098193Y-107709849D01*
X45868946Y-107156397D01*
X46437247Y-107391795D01*
X47100881Y-107523801D01*
X47777517Y-107523801D01*
X48441151Y-107391795D01*
X49066281Y-107132858D01*
X49628884Y-106756939D01*
X50034712Y-106351111D01*
X57577860Y-106351111D01*
X57577860Y-107027747D01*
X57709866Y-107691381D01*
X57968803Y-108316511D01*
X58344722Y-108879114D01*
X58823175Y-109357567D01*
X59385778Y-109733486D01*
X60010908Y-109992423D01*
X60674542Y-110124429D01*
X61351178Y-110124429D01*
X62014812Y-109992423D01*
X62639942Y-109733486D01*
X63202545Y-109357567D01*
X63680998Y-108879114D01*
X64056917Y-108316511D01*
X64315854Y-107691381D01*
X64447860Y-107027747D01*
X64447860Y-106351111D01*
X64315854Y-105687477D01*
X64056917Y-105062347D01*
X63680998Y-104499744D01*
X63202545Y-104021291D01*
X62639942Y-103645372D01*
X62014812Y-103386435D01*
X61351178Y-103254429D01*
X60674542Y-103254429D01*
X60010908Y-103386435D01*
X59385778Y-103645372D01*
X58823175Y-104021291D01*
X58344722Y-104499744D01*
X57968803Y-105062347D01*
X57709866Y-105687477D01*
X57577860Y-106351111D01*
X50034712Y-106351111D01*
X50107337Y-106278486D01*
X50483256Y-105715883D01*
X50742193Y-105090753D01*
X50874199Y-104427119D01*
X50874199Y-103750483D01*
X50742193Y-103086849D01*
X50483256Y-102461719D01*
X50107337Y-101899116D01*
X49628884Y-101420663D01*
X49066281Y-101044744D01*
X48441151Y-100785807D01*
X47777517Y-100653801D01*
X47100881Y-100653801D01*
X46437247Y-100785807D01*
X45812117Y-101044744D01*
X45249514Y-101420663D01*
X44771061Y-101899116D01*
X44395142Y-102461719D01*
X44136205Y-103086849D01*
X44004199Y-103750483D01*
X44004199Y-104427119D01*
X44136205Y-105090753D01*
X44365452Y-105644205D01*
X43797151Y-105408807D01*
X43133517Y-105276801D01*
X42456881Y-105276801D01*
X41793247Y-105408807D01*
X41168117Y-105667744D01*
X40605514Y-106043663D01*
X40127061Y-106522116D01*
X39751142Y-107084719D01*
X39492205Y-107709849D01*
X39360199Y-108373483D01*
X36099079Y-108373483D01*
X36099079Y-104821532D01*
X36169360Y-104034054D01*
X36369310Y-103303158D01*
X36695529Y-102619226D01*
X37137705Y-102003873D01*
X37681868Y-101476542D01*
X38310805Y-101053915D01*
X39004649Y-100749338D01*
X39747118Y-100571086D01*
X40391028Y-100523801D01*
X57439228Y-100523801D01*
X57467975Y-100520970D01*
X57470675Y-100520998D01*
X57480892Y-100520032D01*
X57675057Y-100500309D01*
X57740400Y-100487134D01*
X57805835Y-100474888D01*
X57815670Y-100471957D01*
X57815672Y-100471956D01*
X57815674Y-100471956D01*
X57815676Y-100471955D01*
X58002308Y-100414897D01*
X58063847Y-100389281D01*
X58125664Y-100364556D01*
X58134731Y-100359776D01*
X58134740Y-100359772D01*
X58134747Y-100359767D01*
X58306744Y-100267544D01*
X58362146Y-100230455D01*
X58417971Y-100194202D01*
X58425947Y-100187744D01*
X58576758Y-100063866D01*
X58576774Y-100063850D01*
X58604422Y-100041160D01*
X65018750Y-93626834D01*
X65086092Y-93571518D01*
X65131064Y-93547405D01*
X65179868Y-93532484D01*
X65265350Y-93523801D01*
X75395961Y-93523800D01*
X74945645Y-93974116D01*
X74569726Y-94536719D01*
X74310789Y-95161849D01*
X74178783Y-95825483D01*
X74178783Y-96502119D01*
X74310789Y-97165753D01*
X74569726Y-97790883D01*
X74945645Y-98353486D01*
X75424098Y-98831939D01*
X75986701Y-99207858D01*
X76611831Y-99466795D01*
X77275465Y-99598801D01*
X77952101Y-99598801D01*
X78615735Y-99466795D01*
X79240865Y-99207858D01*
X79803468Y-98831939D01*
X80281921Y-98353486D01*
X80657840Y-97790883D01*
X80916777Y-97165753D01*
X81048783Y-96502119D01*
X81048783Y-95825483D01*
X80916777Y-95161849D01*
X80657840Y-94536719D01*
X80281921Y-93974116D01*
X79831605Y-93523800D01*
X89960048Y-93523799D01*
X90046803Y-93532305D01*
M02*
