(module "DIP794W56P254L1905H533Q14N" (layer F.Cu)
  (descr "LM324N/NOPB")
  (tags "Integrated Circuit")
  (fp_text reference IC** (at 0 0) (layer F.SilkS)
    (effects (font (size 1.27 1.27) (thickness 0.254)))
  )
  (fp_text user %R (at 0 0) (layer F.Fab)
    (effects (font (size 1.27 1.27) (thickness 0.254)))
  )
  (fp_text value "DIP794W56P254L1905H533Q14N" (at 0 0) (layer F.SilkS) hide
    (effects (font (size 1.27 1.27) (thickness 0.254)))
  )
  (fp_line (start -4.957 -9.838) (end 4.957 -9.838) (layer F.CrtYd) (width 0.05))
  (fp_line (start 4.957 -9.838) (end 4.957 9.838) (layer F.CrtYd) (width 0.05))
  (fp_line (start 4.957 9.838) (end -4.957 9.838) (layer F.CrtYd) (width 0.05))
  (fp_line (start -4.957 9.838) (end -4.957 -9.838) (layer F.CrtYd) (width 0.05))
  (fp_line (start -3.302 -9.588) (end 3.302 -9.588) (layer F.Fab) (width 0.1))
  (fp_line (start 3.302 -9.588) (end 3.302 9.588) (layer F.Fab) (width 0.1))
  (fp_line (start 3.302 9.588) (end -3.302 9.588) (layer F.Fab) (width 0.1))
  (fp_line (start -3.302 9.588) (end -3.302 -9.588) (layer F.Fab) (width 0.1))
  (fp_line (start -3.302 -8.318) (end -2.032 -9.588) (layer F.Fab) (width 0.1))
  (fp_line (start -4.548 -9.588) (end 3.302 -9.588) (layer F.SilkS) (width 0.2))
  (fp_line (start -3.302 9.588) (end 3.302 9.588) (layer F.SilkS) (width 0.2))
  (pad 1 thru_hole rect (at -3.969 -7.62) (size 1.159 1.159) (drill 0.759) (layers *.Cu *.Mask))
  (pad 2 thru_hole circle (at -3.969 -5.08) (size 1.159 1.159) (drill 0.759) (layers *.Cu *.Mask))
  (pad 3 thru_hole circle (at -3.969 -2.54) (size 1.159 1.159) (drill 0.759) (layers *.Cu *.Mask))
  (pad 4 thru_hole circle (at -3.969 0) (size 1.159 1.159) (drill 0.759) (layers *.Cu *.Mask))
  (pad 5 thru_hole circle (at -3.969 2.54) (size 1.159 1.159) (drill 0.759) (layers *.Cu *.Mask))
  (pad 6 thru_hole circle (at -3.969 5.08) (size 1.159 1.159) (drill 0.759) (layers *.Cu *.Mask))
  (pad 7 thru_hole circle (at -3.969 7.62) (size 1.159 1.159) (drill 0.759) (layers *.Cu *.Mask))
  (pad 8 thru_hole circle (at 3.969 7.62) (size 1.159 1.159) (drill 0.759) (layers *.Cu *.Mask))
  (pad 9 thru_hole circle (at 3.969 5.08) (size 1.159 1.159) (drill 0.759) (layers *.Cu *.Mask))
  (pad 10 thru_hole circle (at 3.969 2.54) (size 1.159 1.159) (drill 0.759) (layers *.Cu *.Mask))
  (pad 11 thru_hole circle (at 3.969 0) (size 1.159 1.159) (drill 0.759) (layers *.Cu *.Mask))
  (pad 12 thru_hole circle (at 3.969 -2.54) (size 1.159 1.159) (drill 0.759) (layers *.Cu *.Mask))
  (pad 13 thru_hole circle (at 3.969 -5.08) (size 1.159 1.159) (drill 0.759) (layers *.Cu *.Mask))
  (pad 14 thru_hole circle (at 3.969 -7.62) (size 1.159 1.159) (drill 0.759) (layers *.Cu *.Mask))
  (model "C:\\Users\\boupa\\Desktop\\AcubeSAT\\Libraries\\SamacSys_Parts.3dshapes\\LM324N_NOPB.stp"
    (at (xyz 0 0 0.10236220096979))
    (scale (xyz 1 1 1))
    (rotate (xyz -90 0 0))
  )
)
