%TF.GenerationSoftware,KiCad,Pcbnew,(5.1.10)-1*%
%TF.CreationDate,2021-12-21T14:35:48+02:00*%
%TF.ProjectId,TVACboard,54564143-626f-4617-9264-2e6b69636164,1*%
%TF.SameCoordinates,Original*%
%TF.FileFunction,Profile,NP*%
%FSLAX46Y46*%
G04 Gerber Fmt 4.6, Leading zero omitted, Abs format (unit mm)*
G04 Created by KiCad (PCBNEW (5.1.10)-1) date 2021-12-21 14:35:48*
%MOMM*%
%LPD*%
G01*
G04 APERTURE LIST*
%TA.AperFunction,Profile*%
%ADD10C,0.150000*%
%TD*%
%TA.AperFunction,Profile*%
%ADD11C,0.200000*%
%TD*%
G04 APERTURE END LIST*
D10*
X265659701Y-198246995D02*
G75*
G02*
X263120000Y-200748000I-2539701J38995D01*
G01*
X145899000Y-200748000D02*
G75*
G02*
X143359000Y-198208000I0J2540000D01*
G01*
X143359000Y-91020000D02*
G75*
G02*
X145899000Y-88480000I2540000J0D01*
G01*
X263120000Y-88480000D02*
G75*
G02*
X265660000Y-91020000I0J-2540000D01*
G01*
X143359000Y-198208000D02*
X143359000Y-91020000D01*
X263120000Y-200748000D02*
X145899000Y-200748000D01*
X265660000Y-91020000D02*
X265660000Y-198247000D01*
X145899000Y-88480000D02*
X263120000Y-88480000D01*
D11*
X251397247Y-144609764D02*
G75*
G03*
X251397247Y-144609764I-1264500J0D01*
G01*
X209014875Y-101735000D02*
G75*
G03*
X209014875Y-101735000I-1264500J0D01*
G01*
X209014875Y-187485000D02*
G75*
G03*
X209014875Y-187485000I-1264500J0D01*
G01*
X209929000Y-144690000D02*
G75*
G03*
X209929000Y-144690000I-2117000J0D01*
G01*
M02*
