%TF.GenerationSoftware,KiCad,Pcbnew,(5.1.10)-1*%
%TF.CreationDate,2021-12-24T05:48:50+02:00*%
%TF.ProjectId,bottom_pcbv3,626f7474-6f6d-45f7-9063-6276332e6b69,2*%
%TF.SameCoordinates,Original*%
%TF.FileFunction,Profile,NP*%
%FSLAX46Y46*%
G04 Gerber Fmt 4.6, Leading zero omitted, Abs format (unit mm)*
G04 Created by KiCad (PCBNEW (5.1.10)-1) date 2021-12-24 05:48:50*
%MOMM*%
%LPD*%
G01*
G04 APERTURE LIST*
%TA.AperFunction,Profile*%
%ADD10C,0.150000*%
%TD*%
%TA.AperFunction,Profile*%
%ADD11C,0.050000*%
%TD*%
%TA.AperFunction,Profile*%
%ADD12C,0.200000*%
%TD*%
G04 APERTURE END LIST*
D10*
X139680111Y-100345826D02*
G75*
G03*
X139680111Y-100345826I-1253994J0D01*
G01*
X225430111Y-100345826D02*
G75*
G03*
X225430111Y-100345826I-1253994J0D01*
G01*
D11*
X179469693Y-83393872D02*
X183959821Y-87884000D01*
X185755872Y-77107693D02*
X179469693Y-83393872D01*
X201022307Y-92374128D02*
X185755872Y-77107693D01*
X194736128Y-98660307D02*
X201022307Y-92374128D01*
X183959821Y-87884000D02*
X194736128Y-98660307D01*
D12*
X168035836Y-94639089D02*
G75*
G03*
X168035836Y-94639089I-1600001J0D01*
G01*
X189503015Y-107098600D02*
G75*
G03*
X189503015Y-107098600I-3376166J0D01*
G01*
X218550821Y-139098199D02*
X216301121Y-139098199D01*
X223550821Y-134098199D02*
G75*
G02*
X218550821Y-139098199I-5000000J0D01*
G01*
X223550821Y-123953896D02*
X223550821Y-134098199D01*
X223550821Y-123953896D02*
G75*
G02*
X223843771Y-123246731I1000000J1D01*
G01*
X226758166Y-120332810D02*
X223843771Y-123246731D01*
X227051117Y-119625646D02*
G75*
G02*
X226758166Y-120332810I-1000000J0D01*
G01*
X227051117Y-85742921D02*
X227051117Y-119625646D01*
X226758224Y-85035814D02*
G75*
G02*
X227051117Y-85742921I-707107J-707107D01*
G01*
X221490457Y-79768048D02*
X226758224Y-85035815D01*
X221490457Y-79768047D02*
G75*
G02*
X221051117Y-78707387I1060660J1060660D01*
G01*
X221051117Y-73198199D02*
X221051117Y-78707387D01*
X221550821Y-73198199D02*
X221051117Y-73198199D01*
X223550821Y-71198199D02*
G75*
G02*
X221550821Y-73198199I-2000000J0D01*
G01*
X223550821Y-66598199D02*
X223550821Y-71198199D01*
X218550821Y-61598199D02*
G75*
G02*
X223550821Y-66598199I0J-5000000D01*
G01*
X201511777Y-61598200D02*
X218550821Y-61598199D01*
X201511777Y-61598199D02*
G75*
G02*
X200804670Y-61305306I0J1000000D01*
G01*
X194390457Y-54891092D02*
X200804670Y-61305306D01*
X193683350Y-54598199D02*
G75*
G02*
X194390457Y-54891092I0J-1000000D01*
G01*
X168918884Y-54598199D02*
X193683350Y-54598199D01*
X168211777Y-54891092D02*
G75*
G02*
X168918884Y-54598199I707107J-707107D01*
G01*
X161797564Y-61305306D02*
X168211778Y-54891093D01*
X161797564Y-61305306D02*
G75*
G02*
X161090457Y-61598199I-707107J707107D01*
G01*
X145970819Y-61598199D02*
X161090457Y-61598199D01*
X144051117Y-61598199D02*
X145970819Y-61598199D01*
X139051117Y-66598199D02*
G75*
G02*
X144051117Y-61598199I5000000J0D01*
G01*
X139051118Y-76732539D02*
X139051117Y-66598199D01*
X139051117Y-76732539D02*
G75*
G02*
X138758224Y-77439646I-1000000J0D01*
G01*
X135844010Y-80353859D02*
X138758224Y-77439646D01*
X135551117Y-81060966D02*
G75*
G02*
X135844010Y-80353859I1000000J0D01*
G01*
X135551117Y-114953477D02*
X135551117Y-81060966D01*
X135844010Y-115660583D02*
G75*
G02*
X135551117Y-114953477I707107J707106D01*
G01*
X141111778Y-120928351D02*
X135844010Y-115660584D01*
X141111777Y-120928351D02*
G75*
G02*
X141551117Y-121989011I-1060660J-1060660D01*
G01*
X141551117Y-127498199D02*
X141551117Y-121989011D01*
X141051117Y-127498199D02*
X141551117Y-127498199D01*
X139051117Y-129498199D02*
G75*
G02*
X141051117Y-127498199I2000000J0D01*
G01*
X139051117Y-134098199D02*
X139051117Y-129498199D01*
X144051117Y-139098199D02*
G75*
G02*
X139051117Y-134098199I0J5000000D01*
G01*
X161090457Y-139098199D02*
X144051117Y-139098199D01*
X161090457Y-139098199D02*
G75*
G02*
X161797564Y-139391092I0J-1000000D01*
G01*
X168211777Y-145805306D02*
X161797564Y-139391092D01*
X168918884Y-146098199D02*
G75*
G02*
X168211777Y-145805306I0J1000000D01*
G01*
X193683350Y-146098199D02*
X168918884Y-146098200D01*
X194390457Y-145805306D02*
G75*
G02*
X193683350Y-146098199I-707107J707107D01*
G01*
X200804671Y-139391093D02*
X194390457Y-145805306D01*
X200804670Y-139391092D02*
G75*
G02*
X201511777Y-139098199I707107J-707107D01*
G01*
X216301121Y-139098199D02*
X201511777Y-139098199D01*
M02*
