%TF.GenerationSoftware,KiCad,Pcbnew,(5.1.10)-1*%
%TF.CreationDate,2021-12-07T15:18:02+02:00*%
%TF.ProjectId,filler_pcbv4,66696c6c-6572-45f7-9063-6276342e6b69,2*%
%TF.SameCoordinates,Original*%
%TF.FileFunction,Soldermask,Top*%
%TF.FilePolarity,Negative*%
%FSLAX46Y46*%
G04 Gerber Fmt 4.6, Leading zero omitted, Abs format (unit mm)*
G04 Created by KiCad (PCBNEW (5.1.10)-1) date 2021-12-07 15:18:02*
%MOMM*%
%LPD*%
G01*
G04 APERTURE LIST*
%ADD10C,0.722000*%
%ADD11C,0.721881*%
%ADD12C,1.500000*%
%ADD13C,0.100000*%
%ADD14R,1.050000X1.000000*%
%ADD15R,2.200000X1.050000*%
%ADD16C,1.600000*%
%ADD17C,5.000000*%
%ADD18C,2.020000*%
G04 APERTURE END LIST*
D10*
X190274361Y-89318742D02*
X190259856Y-89436346D01*
X190182031Y-89782916D02*
X190144861Y-89895431D01*
X190285987Y-89082108D02*
X190246000Y-88392000D01*
X190283078Y-89200567D02*
X190274361Y-89318742D01*
X190000919Y-90220159D02*
X189942512Y-90323261D01*
X189810887Y-90520252D02*
X189737985Y-90613667D01*
X189737985Y-90613667D02*
X189660587Y-90703393D01*
X189578880Y-90789214D02*
X186944000Y-93472000D01*
X189660587Y-90703393D02*
X189578880Y-90789214D01*
X189942512Y-90323261D02*
X189879118Y-90423372D01*
X190213635Y-89668713D02*
X190182031Y-89782916D01*
X190259856Y-89436346D02*
X190239598Y-89553097D01*
X190054196Y-90114316D02*
X190000919Y-90220159D01*
X190144861Y-89895431D02*
X190102215Y-90005987D01*
X190285987Y-89082108D02*
X190283078Y-89200567D01*
X190239598Y-89553097D02*
X190213635Y-89668713D01*
X190102215Y-90005987D02*
X190054196Y-90114316D01*
X189879118Y-90423372D02*
X189810887Y-90520252D01*
X191084207Y-92152413D02*
X190998386Y-92234120D01*
X191673284Y-91758804D02*
X191567441Y-91812081D01*
X191267348Y-92002113D02*
X191173933Y-92075015D01*
X191464339Y-91870488D02*
X191364228Y-91933882D01*
X191173933Y-92075015D02*
X191084207Y-92152413D01*
X190998386Y-92234120D02*
X188341000Y-94869000D01*
X191567441Y-91812081D02*
X191464339Y-91870488D01*
X191364228Y-91933882D02*
X191267348Y-92002113D01*
X192468858Y-91538639D02*
X192351254Y-91553144D01*
X191781613Y-91710785D02*
X191673284Y-91758804D01*
X191892169Y-91668139D02*
X191781613Y-91710785D01*
X192118887Y-91599365D02*
X192004684Y-91630969D01*
X192351254Y-91553144D02*
X192234503Y-91573402D01*
X193294000Y-91527013D02*
X192587033Y-91529922D01*
X192587033Y-91529922D02*
X192468858Y-91538639D01*
X192705492Y-91527013D02*
X193303468Y-91527013D01*
X192234503Y-91573402D02*
X192118887Y-91599365D01*
X192004684Y-91630969D02*
X191892169Y-91668139D01*
X172504093Y-110666587D02*
X172589914Y-110584880D01*
X171915016Y-111060196D02*
X172020859Y-111006919D01*
X172123961Y-110948512D02*
X172224072Y-110885118D01*
X172414367Y-110743985D02*
X172504093Y-110666587D01*
X172589914Y-110584880D02*
X175260000Y-107950000D01*
X172224072Y-110885118D02*
X172320952Y-110816887D01*
X172320952Y-110816887D02*
X172414367Y-110743985D01*
X172020859Y-111006919D02*
X172123961Y-110948512D01*
X170307000Y-111289078D02*
X171119442Y-111280361D01*
X170882808Y-111291987D02*
X170284832Y-111291987D01*
X171806687Y-111108215D02*
X171915016Y-111060196D01*
X171696131Y-111150861D02*
X171806687Y-111108215D01*
X171583616Y-111188031D02*
X171696131Y-111150861D01*
X171469413Y-111219635D02*
X171583616Y-111188031D01*
X171353797Y-111245598D02*
X171469413Y-111219635D01*
X171237046Y-111265856D02*
X171353797Y-111245598D01*
X170882808Y-111291987D02*
X171001267Y-111289078D01*
X171119442Y-111280361D02*
X171237046Y-111265856D01*
X173355000Y-114300000D02*
X173305222Y-113618433D01*
X173328444Y-113382654D02*
X173348702Y-113265903D01*
X173348702Y-113265903D02*
X173374665Y-113150287D01*
X173374665Y-113150287D02*
X173406269Y-113036084D01*
X173406269Y-113036084D02*
X173443439Y-112923569D01*
X173443439Y-112923569D02*
X173486085Y-112813013D01*
X173486085Y-112813013D02*
X173534104Y-112704684D01*
X173302313Y-113736892D02*
X173302313Y-114334868D01*
X173305222Y-113618433D02*
X173313939Y-113500258D01*
X173587381Y-112598841D02*
X173645788Y-112495739D01*
X173777413Y-112298748D02*
X173850315Y-112205333D01*
X173709182Y-112395628D02*
X173777413Y-112298748D01*
X174009420Y-112029786D02*
X176657000Y-109347000D01*
X173850315Y-112205333D02*
X173927713Y-112115607D01*
X173645788Y-112495739D02*
X173709182Y-112395628D01*
X173534104Y-112704684D02*
X173587381Y-112598841D01*
X173927713Y-112115607D02*
X174009420Y-112029786D01*
X173313939Y-113500258D02*
X173328444Y-113382654D01*
D11*
X182989602Y-104140654D02*
X186326449Y-107483200D01*
X176657000Y-106553000D02*
X181016774Y-102167826D01*
X187198000Y-96012000D02*
X182812826Y-100371774D01*
D12*
%TO.C,TP3*%
X205913200Y-73816800D03*
%TD*%
%TO.C,TP3*%
X207323200Y-75296800D03*
%TD*%
%TO.C,TP3*%
X157306800Y-125573200D03*
%TD*%
%TO.C,TP3*%
X155896800Y-124093200D03*
%TD*%
D13*
%TO.C,J\u002A\u002A*%
G36*
X191055081Y-87837123D02*
G01*
X190673055Y-85670546D01*
X191707103Y-85488215D01*
X192089129Y-87654792D01*
X191055081Y-87837123D01*
G37*
G36*
X188149897Y-88349385D02*
G01*
X187767871Y-86182808D01*
X188801919Y-86000477D01*
X189183945Y-88167054D01*
X188149897Y-88349385D01*
G37*
G36*
X189792074Y-89024480D02*
G01*
X189609744Y-87990432D01*
X190594552Y-87816784D01*
X190776882Y-88850832D01*
X189792074Y-89024480D01*
G37*
%TD*%
D14*
%TO.C,J\u002A\u002A*%
X193281300Y-91567000D03*
D15*
X194806300Y-90091999D03*
X194806300Y-93042001D03*
%TD*%
D13*
%TO.C,J\u002A\u002A*%
G36*
X173796226Y-113794520D02*
G01*
X173978556Y-114828568D01*
X172993748Y-115002216D01*
X172811418Y-113968168D01*
X173796226Y-113794520D01*
G37*
G36*
X175438403Y-114469615D02*
G01*
X175820429Y-116636192D01*
X174786381Y-116818523D01*
X174404355Y-114651946D01*
X175438403Y-114469615D01*
G37*
G36*
X172533219Y-114981877D02*
G01*
X172915245Y-117148454D01*
X171881197Y-117330785D01*
X171499171Y-115164208D01*
X172533219Y-114981877D01*
G37*
%TD*%
D15*
%TO.C,J\u002A\u002A*%
X168782000Y-109776999D03*
X168782000Y-112727001D03*
D14*
X170307000Y-111252000D03*
%TD*%
D13*
%TO.C,IC3*%
G36*
X178548790Y-107889616D02*
G01*
X177792185Y-108646221D01*
X177360850Y-108214886D01*
X178117455Y-107458281D01*
X178548790Y-107889616D01*
G37*
G36*
X177848754Y-107189581D02*
G01*
X177092149Y-107946186D01*
X176660814Y-107514851D01*
X177417419Y-106758246D01*
X177848754Y-107189581D01*
G37*
G36*
X177148719Y-106489545D02*
G01*
X176392114Y-107246150D01*
X175960779Y-106814815D01*
X176717384Y-106058210D01*
X177148719Y-106489545D01*
G37*
G36*
X175699150Y-107939114D02*
G01*
X174942545Y-108695719D01*
X174511210Y-108264384D01*
X175267815Y-107507779D01*
X175699150Y-107939114D01*
G37*
G36*
X176399186Y-108639149D02*
G01*
X175642581Y-109395754D01*
X175211246Y-108964419D01*
X175967851Y-108207814D01*
X176399186Y-108639149D01*
G37*
G36*
X177099221Y-109339185D02*
G01*
X176342616Y-110095790D01*
X175911281Y-109664455D01*
X176667886Y-108907850D01*
X177099221Y-109339185D01*
G37*
%TD*%
%TO.C,R9*%
G36*
G01*
X179275433Y-107099519D02*
X179031481Y-106855567D01*
G75*
G02*
X179031481Y-106646971I104298J104298D01*
G01*
X179240077Y-106438375D01*
G75*
G02*
X179448673Y-106438375I104298J-104298D01*
G01*
X179692625Y-106682327D01*
G75*
G02*
X179692625Y-106890923I-104298J-104298D01*
G01*
X179484029Y-107099519D01*
G75*
G02*
X179275433Y-107099519I-104298J104298D01*
G01*
G37*
G36*
G01*
X179961327Y-106413625D02*
X179717375Y-106169673D01*
G75*
G02*
X179717375Y-105961077I104298J104298D01*
G01*
X179925971Y-105752481D01*
G75*
G02*
X180134567Y-105752481I104298J-104298D01*
G01*
X180378519Y-105996433D01*
G75*
G02*
X180378519Y-106205029I-104298J-104298D01*
G01*
X180169923Y-106413625D01*
G75*
G02*
X179961327Y-106413625I-104298J104298D01*
G01*
G37*
%TD*%
%TO.C,R10*%
G36*
G01*
X157001320Y-70555280D02*
X157001320Y-70555280D01*
G75*
G02*
X157001320Y-69423910I565685J565685D01*
G01*
X157001320Y-69423910D01*
G75*
G02*
X158132690Y-69423910I565685J-565685D01*
G01*
X158132690Y-69423910D01*
G75*
G02*
X158132690Y-70555280I-565685J-565685D01*
G01*
X158132690Y-70555280D01*
G75*
G02*
X157001320Y-70555280I-565685J565685D01*
G01*
G37*
D16*
X150382800Y-77173800D03*
%TD*%
D17*
%TO.C,*%
X145744100Y-121735183D03*
%TD*%
%TO.C,*%
X202677928Y-64801355D03*
%TD*%
%TO.C,*%
X187014076Y-115217330D03*
%TD*%
%TO.C,*%
X159917982Y-135909065D03*
%TD*%
%TO.C,*%
X213139936Y-116957505D03*
%TD*%
%TO.C,*%
X149455974Y-83752915D03*
%TD*%
%TO.C,*%
X216851810Y-78975237D03*
%TD*%
%TO.C,*%
X175581833Y-85493090D03*
%TD*%
%TO.C,REF\u002A\u002A*%
X166435835Y-94639089D03*
%TD*%
%TO.C,REF\u002A\u002A*%
X196160075Y-106071332D03*
%TD*%
%TO.C,*%
X164695660Y-68513229D03*
%TD*%
%TO.C,*%
X197900250Y-132197191D03*
%TD*%
D12*
%TO.C,TP3*%
X159222800Y-80153800D03*
%TD*%
%TO.C,TP3*%
X160702800Y-78743800D03*
%TD*%
%TO.C,R4*%
G36*
G01*
X183639673Y-96405375D02*
X183883625Y-96649327D01*
G75*
G02*
X183883625Y-96857923I-104298J-104298D01*
G01*
X183675029Y-97066519D01*
G75*
G02*
X183466433Y-97066519I-104298J104298D01*
G01*
X183222481Y-96822567D01*
G75*
G02*
X183222481Y-96613971I104298J104298D01*
G01*
X183431077Y-96405375D01*
G75*
G02*
X183639673Y-96405375I104298J-104298D01*
G01*
G37*
G36*
G01*
X184325567Y-95719481D02*
X184569519Y-95963433D01*
G75*
G02*
X184569519Y-96172029I-104298J-104298D01*
G01*
X184360923Y-96380625D01*
G75*
G02*
X184152327Y-96380625I-104298J104298D01*
G01*
X183908375Y-96136673D01*
G75*
G02*
X183908375Y-95928077I104298J104298D01*
G01*
X184116971Y-95719481D01*
G75*
G02*
X184325567Y-95719481I104298J-104298D01*
G01*
G37*
%TD*%
D18*
%TO.C,PHv1*%
X170510200Y-95885000D03*
%TD*%
%TO.C,PHp1*%
X174955200Y-102920800D03*
%TD*%
D12*
%TO.C,TP3*%
X203312800Y-120463800D03*
%TD*%
%TO.C,TP3*%
X201832800Y-121873800D03*
%TD*%
%TO.C,R13*%
G36*
G01*
X209323720Y-121706680D02*
X209323720Y-121706680D01*
G75*
G02*
X209323720Y-120575310I565685J565685D01*
G01*
X209323720Y-120575310D01*
G75*
G02*
X210455090Y-120575310I565685J-565685D01*
G01*
X210455090Y-120575310D01*
G75*
G02*
X210455090Y-121706680I-565685J-565685D01*
G01*
X210455090Y-121706680D01*
G75*
G02*
X209323720Y-121706680I-565685J565685D01*
G01*
G37*
D16*
X202705200Y-128325200D03*
%TD*%
%TO.C,R12*%
G36*
G01*
X211584320Y-124018080D02*
X211584320Y-124018080D01*
G75*
G02*
X211584320Y-122886710I565685J565685D01*
G01*
X211584320Y-122886710D01*
G75*
G02*
X212715690Y-122886710I565685J-565685D01*
G01*
X212715690Y-122886710D01*
G75*
G02*
X212715690Y-124018080I-565685J-565685D01*
G01*
X212715690Y-124018080D01*
G75*
G02*
X211584320Y-124018080I-565685J565685D01*
G01*
G37*
X204965800Y-130636600D03*
%TD*%
%TO.C,R11*%
G36*
G01*
X159251320Y-72865280D02*
X159251320Y-72865280D01*
G75*
G02*
X159251320Y-71733910I565685J565685D01*
G01*
X159251320Y-71733910D01*
G75*
G02*
X160382690Y-71733910I565685J-565685D01*
G01*
X160382690Y-71733910D01*
G75*
G02*
X160382690Y-72865280I-565685J-565685D01*
G01*
X160382690Y-72865280D01*
G75*
G02*
X159251320Y-72865280I-565685J565685D01*
G01*
G37*
X152632800Y-79483800D03*
%TD*%
D13*
%TO.C,S4*%
G36*
X156175157Y-89311767D02*
G01*
X155875157Y-89831383D01*
X155398843Y-89556383D01*
X155698843Y-89036767D01*
X156175157Y-89311767D01*
G37*
G36*
X159595957Y-91286767D02*
G01*
X159295957Y-91806383D01*
X158819643Y-91531383D01*
X159119643Y-91011767D01*
X159595957Y-91286767D01*
G37*
G36*
X157454965Y-87695075D02*
G01*
X156904965Y-88647703D01*
X156168843Y-88222703D01*
X156718843Y-87270075D01*
X157454965Y-87695075D01*
G37*
G36*
X160615957Y-89520075D02*
G01*
X160065957Y-90472703D01*
X159329835Y-90047703D01*
X159879835Y-89095075D01*
X160615957Y-89520075D01*
G37*
%TD*%
%TO.C,S3*%
G36*
X190623433Y-122515557D02*
G01*
X190103817Y-122815557D01*
X189828817Y-122339243D01*
X190348433Y-122039243D01*
X190623433Y-122515557D01*
G37*
G36*
X192598433Y-125936357D02*
G01*
X192078817Y-126236357D01*
X191803817Y-125760043D01*
X192323433Y-125460043D01*
X192598433Y-125936357D01*
G37*
G36*
X192540125Y-121755365D02*
G01*
X191587497Y-122305365D01*
X191162497Y-121569243D01*
X192115125Y-121019243D01*
X192540125Y-121755365D01*
G37*
G36*
X194365125Y-124916357D02*
G01*
X193412497Y-125466357D01*
X192987497Y-124730235D01*
X193940125Y-124180235D01*
X194365125Y-124916357D01*
G37*
%TD*%
%TO.C,S2*%
G36*
X205978043Y-111145033D02*
G01*
X206278043Y-110625417D01*
X206754357Y-110900417D01*
X206454357Y-111420033D01*
X205978043Y-111145033D01*
G37*
G36*
X202557243Y-109170033D02*
G01*
X202857243Y-108650417D01*
X203333557Y-108925417D01*
X203033557Y-109445033D01*
X202557243Y-109170033D01*
G37*
G36*
X204698235Y-112761725D02*
G01*
X205248235Y-111809097D01*
X205984357Y-112234097D01*
X205434357Y-113186725D01*
X204698235Y-112761725D01*
G37*
G36*
X201537243Y-110936725D02*
G01*
X202087243Y-109984097D01*
X202823365Y-110409097D01*
X202273365Y-111361725D01*
X201537243Y-110936725D01*
G37*
%TD*%
%TO.C,S1*%
G36*
X171662292Y-77635843D02*
G01*
X172181908Y-77335843D01*
X172456908Y-77812157D01*
X171937292Y-78112157D01*
X171662292Y-77635843D01*
G37*
G36*
X169687292Y-74215043D02*
G01*
X170206908Y-73915043D01*
X170481908Y-74391357D01*
X169962292Y-74691357D01*
X169687292Y-74215043D01*
G37*
G36*
X169745600Y-78396035D02*
G01*
X170698228Y-77846035D01*
X171123228Y-78582157D01*
X170170600Y-79132157D01*
X169745600Y-78396035D01*
G37*
G36*
X167920600Y-75235043D02*
G01*
X168873228Y-74685043D01*
X169298228Y-75421165D01*
X168345600Y-75971165D01*
X167920600Y-75235043D01*
G37*
%TD*%
D12*
%TO.C,J1*%
X188117751Y-107480100D03*
X186321700Y-105684049D03*
X184525649Y-107480100D03*
X186321700Y-109276151D03*
X186321700Y-107480100D03*
%TD*%
D13*
%TO.C,IC3*%
G36*
X186501779Y-93479815D02*
G01*
X187258384Y-92723210D01*
X187689719Y-93154545D01*
X186933114Y-93911150D01*
X186501779Y-93479815D01*
G37*
G36*
X187201814Y-94179851D02*
G01*
X187958419Y-93423246D01*
X188389754Y-93854581D01*
X187633149Y-94611186D01*
X187201814Y-94179851D01*
G37*
G36*
X187901850Y-94879886D02*
G01*
X188658455Y-94123281D01*
X189089790Y-94554616D01*
X188333185Y-95311221D01*
X187901850Y-94879886D01*
G37*
G36*
X186452281Y-96329455D02*
G01*
X187208886Y-95572850D01*
X187640221Y-96004185D01*
X186883616Y-96760790D01*
X186452281Y-96329455D01*
G37*
G36*
X185752246Y-95629419D02*
G01*
X186508851Y-94872814D01*
X186940186Y-95304149D01*
X186183581Y-96060754D01*
X185752246Y-95629419D01*
G37*
G36*
X185052210Y-94929384D02*
G01*
X185808815Y-94172779D01*
X186240150Y-94604114D01*
X185483545Y-95360719D01*
X185052210Y-94929384D01*
G37*
%TD*%
%TO.C,FL1*%
G36*
X183169914Y-104858367D02*
G01*
X182271889Y-103960342D01*
X182809290Y-103422941D01*
X183707315Y-104320966D01*
X183169914Y-104858367D01*
G37*
G36*
X184965966Y-103062315D02*
G01*
X184067941Y-102164290D01*
X184605342Y-101626889D01*
X185503367Y-102524914D01*
X184965966Y-103062315D01*
G37*
G36*
X182993138Y-101089487D02*
G01*
X182095113Y-100191462D01*
X182632514Y-99654061D01*
X183530539Y-100552086D01*
X182993138Y-101089487D01*
G37*
G36*
X182095112Y-101987513D02*
G01*
X181197087Y-101089488D01*
X181734488Y-100552087D01*
X182632513Y-101450112D01*
X182095112Y-101987513D01*
G37*
G36*
X181197086Y-102885539D02*
G01*
X180299061Y-101987514D01*
X180836462Y-101450113D01*
X181734487Y-102348138D01*
X181197086Y-102885539D01*
G37*
%TD*%
M02*
