(module "SON50P100X145X60-6N-D" (layer F.Cu)
  (descr "UQFN 1.45x1 6L-1")
  (tags "TVS Diode (Uni-directional)")
  (attr smd)
  (fp_text reference D** (at 0 0) (layer F.SilkS)
    (effects (font (size 1.27 1.27) (thickness 0.254)))
  )
  (fp_text user %R (at 0 0) (layer F.Fab)
    (effects (font (size 1.27 1.27) (thickness 0.254)))
  )
  (fp_text value "SON50P100X145X60-6N-D" (at 0 0) (layer F.SilkS) hide
    (effects (font (size 1.27 1.27) (thickness 0.254)))
  )
  (fp_line (start -1.15 -0.975) (end 1.15 -0.975) (layer F.CrtYd) (width 0.05))
  (fp_line (start 1.15 -0.975) (end 1.15 0.975) (layer F.CrtYd) (width 0.05))
  (fp_line (start 1.15 0.975) (end -1.15 0.975) (layer F.CrtYd) (width 0.05))
  (fp_line (start -1.15 0.975) (end -1.15 -0.975) (layer F.CrtYd) (width 0.05))
  (fp_line (start -0.5 -0.725) (end 0.5 -0.725) (layer F.Fab) (width 0.1))
  (fp_line (start 0.5 -0.725) (end 0.5 0.725) (layer F.Fab) (width 0.1))
  (fp_line (start 0.5 0.725) (end -0.5 0.725) (layer F.Fab) (width 0.1))
  (fp_line (start -0.5 0.725) (end -0.5 -0.725) (layer F.Fab) (width 0.1))
  (fp_line (start -0.5 -0.475) (end -0.25 -0.725) (layer F.Fab) (width 0.1))
  (fp_circle (center -0.9 -1.15) (end -0.9 -1.025) (layer F.SilkS) (width 0.25))
  (pad 1 smd rect (at -0.5 -0.5 90) (size 0.3 0.8) (layers F.Cu F.Paste F.Mask))
  (pad 2 smd rect (at -0.5 0 90) (size 0.3 0.8) (layers F.Cu F.Paste F.Mask))
  (pad 3 smd rect (at -0.5 0.5 90) (size 0.3 0.8) (layers F.Cu F.Paste F.Mask))
  (pad 4 smd rect (at 0.5 0.5 90) (size 0.3 0.8) (layers F.Cu F.Paste F.Mask))
  (pad 5 smd rect (at 0.5 0 90) (size 0.3 0.8) (layers F.Cu F.Paste F.Mask))
  (pad 6 smd rect (at 0.5 -0.5 90) (size 0.3 0.8) (layers F.Cu F.Paste F.Mask))
  (model "C:\\Users\\boupa\\Desktop\\AcubeSAT\\Libraries\\SamacSys_Parts.3dshapes\\USBULC6-2M6.stp"
    (at (xyz 0 0 0))
    (scale (xyz 1 1 1))
    (rotate (xyz 0 0 0))
  )
)
