(module "374317" (layer F.Cu)
  (descr "374317-1")
  (tags "Connector")
  (fp_text reference J** (at 0.000 -0.35) (layer F.SilkS)
    (effects (font (size 1.27 1.27) (thickness 0.254)))
  )
  (fp_text user %R (at 0.000 -0.35) (layer F.Fab)
    (effects (font (size 1.27 1.27) (thickness 0.254)))
  )
  (fp_text value "374317" (at 0.000 -0.35) (layer F.SilkS) hide
    (effects (font (size 1.27 1.27) (thickness 0.254)))
  )
  (fp_line (start -15.08 -4.9) (end 15.08 -4.9) (layer F.Fab) (width 0.2))
  (fp_line (start 15.08 -4.9) (end 15.08 6.5) (layer F.Fab) (width 0.2))
  (fp_line (start 15.08 6.5) (end -15.08 6.5) (layer F.Fab) (width 0.2))
  (fp_line (start -15.08 6.5) (end -15.08 -4.9) (layer F.Fab) (width 0.2))
  (fp_line (start -17.13 -8.2) (end 17.13 -8.2) (layer F.CrtYd) (width 0.1))
  (fp_line (start 17.13 -8.2) (end 17.13 7.5) (layer F.CrtYd) (width 0.1))
  (fp_line (start 17.13 7.5) (end -17.13 7.5) (layer F.CrtYd) (width 0.1))
  (fp_line (start -17.13 7.5) (end -17.13 -8.2) (layer F.CrtYd) (width 0.1))
  (fp_line (start -15.08 -3.2) (end -15.08 -4.9) (layer F.SilkS) (width 0.1))
  (fp_line (start -15.08 -4.9) (end 15.08 -4.9) (layer F.SilkS) (width 0.1))
  (fp_line (start 15.08 -4.9) (end 15.08 -3.2) (layer F.SilkS) (width 0.1))
  (fp_line (start -15.08 6.5) (end 15.08 6.5) (layer F.SilkS) (width 0.1))
  (fp_line (start 15.6 -3.3) (end 15.6 -3.3) (layer F.SilkS) (width 0.2))
  (fp_line (start 15.6 -3.1) (end 15.6 -3.1) (layer F.SilkS) (width 0.2))
  (fp_arc (start 15.6 -3.2) (end 15.600 -3.3) (angle 180) (layer F.SilkS) (width 0.2))
  (fp_arc (start 15.6 -3.2) (end 15.600 -3.1) (angle 180) (layer F.SilkS) (width 0.2))
  (pad A1 smd rect (at 11.430 -3.2 0) (size 1.020 1.400) (layers F.Cu F.Paste F.Mask))
  (pad A2 smd rect (at 8.890 -3.2 0) (size 1.020 1.400) (layers F.Cu F.Paste F.Mask))
  (pad A3 smd rect (at 6.350 -3.2 0) (size 1.020 1.400) (layers F.Cu F.Paste F.Mask))
  (pad A4 smd rect (at 3.810 -3.2 0) (size 1.020 1.400) (layers F.Cu F.Paste F.Mask))
  (pad A5 smd rect (at 1.270 -3.2 0) (size 1.020 1.400) (layers F.Cu F.Paste F.Mask))
  (pad A6 smd rect (at -1.270 -3.2 0) (size 1.020 1.400) (layers F.Cu F.Paste F.Mask))
  (pad A7 smd rect (at -3.810 -3.2 0) (size 1.020 1.400) (layers F.Cu F.Paste F.Mask))
  (pad A8 smd rect (at -6.350 -3.2 0) (size 1.020 1.400) (layers F.Cu F.Paste F.Mask))
  (pad A9 smd rect (at -8.890 -3.2 0) (size 1.020 1.400) (layers F.Cu F.Paste F.Mask))
  (pad A10 smd rect (at -11.430 -3.2 0) (size 1.020 1.400) (layers F.Cu F.Paste F.Mask))
  (pad B1 smd rect (at 11.430 -6.5 0) (size 1.020 1.400) (layers F.Cu F.Paste F.Mask))
  (pad B2 smd rect (at 8.890 -6.5 0) (size 1.020 1.400) (layers F.Cu F.Paste F.Mask))
  (pad B3 smd rect (at 6.350 -6.5 0) (size 1.020 1.400) (layers F.Cu F.Paste F.Mask))
  (pad B4 smd rect (at 3.810 -6.5 0) (size 1.020 1.400) (layers F.Cu F.Paste F.Mask))
  (pad B5 smd rect (at 1.270 -6.5 0) (size 1.020 1.400) (layers F.Cu F.Paste F.Mask))
  (pad B6 smd rect (at -1.270 -6.5 0) (size 1.020 1.400) (layers F.Cu F.Paste F.Mask))
  (pad B7 smd rect (at -3.810 -6.5 0) (size 1.020 1.400) (layers F.Cu F.Paste F.Mask))
  (pad B8 smd rect (at -6.350 -6.5 0) (size 1.020 1.400) (layers F.Cu F.Paste F.Mask))
  (pad B9 smd rect (at -8.890 -6.5 0) (size 1.020 1.400) (layers F.Cu F.Paste F.Mask))
  (pad B10 smd rect (at -11.430 -6.5 0) (size 1.020 1.400) (layers F.Cu F.Paste F.Mask))
  (pad MH1 np_thru_hole circle (at -14.580 1.8) (size 1.6 0) (drill 1.6) (layers *.Cu *.Mask))
  (pad MH2 np_thru_hole circle (at 14.580 1.8) (size 1.6 0) (drill 1.6) (layers *.Cu *.Mask))
  (pad MP1 smd rect (at -15.155 -0.65 0) (size 1.950 2.700) (layers F.Cu F.Paste F.Mask))
  (pad MP2 smd rect (at -15.155 4.25 0) (size 1.950 2.700) (layers F.Cu F.Paste F.Mask))
  (pad MP3 smd rect (at 15.155 4.25 0) (size 1.950 2.700) (layers F.Cu F.Paste F.Mask))
  (pad MP4 smd rect (at 15.155 -0.65 0) (size 1.950 2.700) (layers F.Cu F.Paste F.Mask))
  (model 374317.stp
    (at (xyz 0 0.094488192731001 0.15826771578451))
    (scale (xyz 1 1 1))
    (rotate (xyz -90 0 0))
  )
)
