<?xml version="1.0" standalone="no"?>
 <!DOCTYPE svg PUBLIC "-//W3C//DTD SVG 1.1//EN" 
 "http://www.w3.org/Graphics/SVG/1.1/DTD/svg11.dtd"> 
<svg
  xmlns:svg="http://www.w3.org/2000/svg"
  xmlns="http://www.w3.org/2000/svg"
  xmlns:xlink="http://www.w3.org/1999/xlink"
  version="1.1"
  width="29.700220cm" height="21.000720cm" viewBox="0 0 116930 82680">
<title>SVG Picture created as Burner circuit-NPTH-drl_map.svg date 2021/04/25 12:01:12 </title>
  <desc>Picture generated by PCBNEW </desc>
<g style="fill:#000000; fill-opacity:1;stroke:#000000; stroke-opacity:1;
stroke-linecap:round; stroke-linejoin:round;"
 transform="translate(0 0) scale(1 1)">
</g>
<g style="fill:#000000; fill-opacity:0.0; 
stroke:#000000; stroke-width:-0.000393701; stroke-opacity:1; 
stroke-linecap:round; stroke-linejoin:round;">
</g>
<g style="fill:#000000; fill-opacity:0.0; 
stroke:#000000; stroke-width:78.7402; stroke-opacity:1; 
stroke-linecap:round; stroke-linejoin:round;">
<path d="M46108 35877
L46108 38200
" />
<path d="M46108.7 35877.2 A393.701 393.701 0.0 0 0 45715 35483.5" />
<path d="M49612.6 43593.7 A196.85 196.85 0.0 0 0 49809.4 43790.6" />
<path d="M49612 39381
L49612 43593
" />
<path d="M49612.6 39381.1 A393.701 393.701 0.0 0 0 49218.9 38987.4" />
<path d="M46108.7 38200 A787.402 787.402 0.0 0 0 46896.1 38987.4" />
<path d="M46896 38987
L49218 38987
" />
<path d="M45714 73593
L41502 73593
" />
<path d="M19612 73593
L15400 73593
" />
<path d="M49218.9 70089.8 A393.701 393.701 0.0 0 0 49612.6 69696.1" />
<path d="M15400 35483
L19612 35483
" />
<path d="M45715 73593.7 A393.701 393.701 0.0 0 0 46108.7 73200" />
<path d="M41502 35483
L45714 35483
" />
<path d="M41305.5 35286.6 A196.85 196.85 0.0 0 0 41502.4 35483.5" />
<path d="M15400 35483.5 A393.701 393.701 0.0 0 0 15006.3 35877.2" />
<path d="M11896 38987
L14218 38987
" />
<path d="M46896.1 70089.8 A787.402 787.402 0.0 0 0 46108.7 70877.2" />
<path d="M41502.4 73593.7 A196.85 196.85 0.0 0 0 41305.5 73790.6" />
<path d="M49218 70089
L46896 70089
" />
<path d="M49809.4 65286.6 A196.85 196.85 0.0 0 0 49612.6 65483.5" />
<path d="M19809 35286
L41305 35286
" />
<path d="M19612.6 35483.5 A196.85 196.85 0.0 0 0 19809.4 35286.6" />
<path d="M11502 69696
L11502 65483
" />
<path d="M11896.1 38987.4 A393.701 393.701 0.0 0 0 11502.4 39381.1" />
<path d="M41305 73790
L19809 73790
" />
<path d="M14218 70089
L11896 70089
" />
<path d="M49612 65483
L49612 69696
" />
<path d="M15006 38200
L15006 35877
" />
<path d="M14218.9 38987.4 A787.402 787.402 0.0 0 0 15006.3 38200" />
<path d="M11305.5 43790.6 A196.85 196.85 0.0 0 0 11502.4 43593.7" />
<path d="M11305 65286
L11305 43790
" />
<path d="M11502 43593
L11502 39381
" />
<path d="M11502.4 65483.5 A196.85 196.85 0.0 0 0 11305.5 65286.6" />
<path d="M11502.4 69696.1 A393.701 393.701 0.0 0 0 11896.1 70089.8" />
<path d="M19809.4 73790.6 A196.85 196.85 0.0 0 0 19612.6 73593.7" />
<path d="M46108 70877
L46108 73200
" />
<path d="M49809 43790
L49809 65286
" />
<path d="M15006.3 70877.2 A787.402 787.402 0.0 0 0 14218.9 70089.8" />
<path d="M15006 73200
L15006 70877
" />
<path d="M15006.3 73200 A393.701 393.701 0.0 0 0 15400 73593.7" />
</g>
<g style="fill:#000000; fill-opacity:0.0; 
stroke:#000000; stroke-width:78.7402; stroke-opacity:1; 
stroke-linecap:round; stroke-linejoin:round;">
<path d="M22446 71941
L23706 73201
" />
<path d="M23706 71941
L22446 73201
" />
<path d="M27143 56693
L28403 57953
" />
<path d="M28403 56693
L27143 57953
" />
<path d="M39651 35877
L40911 37137
" />
<path d="M40911 35877
L39651 37137
" />
<path d="M38344 39912
L39604 41172
" />
<path d="M39604 39912
L38344 41172
" />
<path d="M32711 51126
L33970 52385
" />
<path d="M33970 51126
L32711 52385
" />
<path d="M21509 67907
L22769 69167
" />
<path d="M22769 67907
L21509 69167
" />
<path d="M15929 62327
L17189 63587
" />
<path d="M17189 62327
L15929 63587
" />
<path d="M11895 61390
L13155 62650
" />
<path d="M13155 61390
L11895 62650
" />
<path d="M47959 44184
L49218 45444
" />
<path d="M49218 44184
L47959 45444
" />
<path d="M47958 46429
L49218 47689
" />
<path d="M49218 46429
L47958 47689
" />
<path d="M43924 45492
L45184 46752
" />
<path d="M45184 45492
L43924 46752
" />
<path d="M37407 35878
L38667 37138
" />
<path d="M38667 35878
L37407 37138
" />
<path d="M20203 71940
L21462 73200
" />
<path d="M21462 71940
L20203 73200
" />
<path d="M24075 51659
L25335 52919
" />
<path d="M25335 51659
L24075 52919
" />
<path d="M11896 63633
L13155 64892
" />
<path d="M13155 63633
L11896 64892
" />
<path d="M17391 47373
L18650 48633
" />
<path d="M18650 47373
L17391 48633
" />
<path d="M27676 48058
L28936 49318
" />
<path d="M28936 48058
L27676 49318
" />
<path d="M42463 60446
L43723 61706
" />
<path d="M43723 60446
L42463 61706
" />
<path d="M35778 56160
L37038 57420
" />
<path d="M37038 56160
L35778 57420
" />
<path d="M32177 59761
L33437 61021
" />
<path d="M33437 59761
L32177 61021
" />
</g>
<g style="fill:#000000; fill-opacity:0.0; 
stroke:#000000; stroke-width:118.11; stroke-opacity:1; 
stroke-linecap:round; stroke-linejoin:round;">
<text x="12053.5" y="75719.7"
textLength="8779.53" font-size="1574.8" lengthAdjust="spacingAndGlyphs"
text-anchor="start" opacity="0">Drill Map:</text>
<path d="M12393 75663
L12393 74482
L12675 74482
L12843 74538
L12956 74651
L13012 74763
L13068 74988
L13068 75157
L13012 75382
L12956 75494
L12843 75607
L12675 75663
L12393 75663
" />
<path d="M13574 75663
L13574 74876
" />
<path d="M13574 75101
L13631 74988
L13687 74932
L13799 74876
L13912 74876
" />
<path d="M14306 75663
L14306 74876
" />
<path d="M14306 74482
L14249 74538
L14306 74594
L14362 74538
L14306 74482
L14306 74594
" />
<path d="M15037 75663
L14924 75607
L14868 75494
L14868 74482
" />
<path d="M15655 75663
L15543 75607
L15487 75494
L15487 74482
" />
<path d="M17005 75663
L17005 74482
L17399 75325
L17793 74482
L17793 75663
" />
<path d="M18861 75663
L18861 75044
L18805 74932
L18693 74876
L18468 74876
L18355 74932
" />
<path d="M18861 75607
L18749 75663
L18468 75663
L18355 75607
L18299 75494
L18299 75382
L18355 75269
L18468 75213
L18749 75213
L18861 75157
" />
<path d="M19424 74876
L19424 76057
" />
<path d="M19424 74932
L19536 74876
L19761 74876
L19874 74932
L19930 74988
L19986 75101
L19986 75438
L19930 75550
L19874 75607
L19761 75663
L19536 75663
L19424 75607
" />
<path d="M20492 75550
L20549 75607
L20492 75663
L20436 75607
L20492 75550
L20492 75663
" />
<path d="M20492 74932
L20549 74988
L20492 75044
L20436 74988
L20492 74932
L20492 75044
" />
<path d="M10006 76979
L11266 78239
" />
<path d="M11266 76979
L10006 78239
" />
<text x="12053.5" y="78200"
textLength="38250.8" font-size="1574.8" lengthAdjust="spacingAndGlyphs"
text-anchor="start" opacity="0">3.20mm / 0.126" (20 holes) (not plated)</text>
<path d="M12281 76962
L13012 76962
L12618 77412
L12787 77412
L12899 77468
L12956 77525
L13012 77637
L13012 77918
L12956 78031
L12899 78087
L12787 78143
L12450 78143
L12337 78087
L12281 78031
" />
<path d="M13518 78031
L13574 78087
L13518 78143
L13462 78087
L13518 78031
L13518 78143
" />
<path d="M14024 77075
L14081 77018
L14193 76962
L14474 76962
L14587 77018
L14643 77075
L14699 77187
L14699 77300
L14643 77468
L13968 78143
L14699 78143
" />
<path d="M15430 76962
L15543 76962
L15655 77018
L15712 77075
L15768 77187
L15824 77412
L15824 77693
L15768 77918
L15712 78031
L15655 78087
L15543 78143
L15430 78143
L15318 78087
L15262 78031
L15205 77918
L15149 77693
L15149 77412
L15205 77187
L15262 77075
L15318 77018
L15430 76962
" />
<path d="M16330 78143
L16330 77356
" />
<path d="M16330 77468
L16387 77412
L16499 77356
L16668 77356
L16780 77412
L16837 77525
L16837 78143
" />
<path d="M16837 77525
L16893 77412
L17005 77356
L17174 77356
L17286 77412
L17343 77525
L17343 78143
" />
<path d="M17905 78143
L17905 77356
" />
<path d="M17905 77468
L17961 77412
L18074 77356
L18243 77356
L18355 77412
L18411 77525
L18411 78143
" />
<path d="M18411 77525
L18468 77412
L18580 77356
L18749 77356
L18861 77412
L18917 77525
L18917 78143
" />
<path d="M21223 76906
L20211 78424
" />
<path d="M22742 76962
L22855 76962
L22967 77018
L23023 77075
L23079 77187
L23136 77412
L23136 77693
L23079 77918
L23023 78031
L22967 78087
L22855 78143
L22742 78143
L22630 78087
L22573 78031
L22517 77918
L22461 77693
L22461 77412
L22517 77187
L22573 77075
L22630 77018
L22742 76962
" />
<path d="M23642 78031
L23698 78087
L23642 78143
L23586 78087
L23642 78031
L23642 78143
" />
<path d="M24823 78143
L24148 78143
" />
<path d="M24486 78143
L24486 76962
L24373 77131
L24261 77243
L24148 77300
" />
<path d="M25273 77075
L25329 77018
L25442 76962
L25723 76962
L25835 77018
L25892 77075
L25948 77187
L25948 77300
L25892 77468
L25217 78143
L25948 78143
" />
<path d="M26960 76962
L26735 76962
L26623 77018
L26567 77075
L26454 77243
L26398 77468
L26398 77918
L26454 78031
L26510 78087
L26623 78143
L26848 78143
L26960 78087
L27016 78031
L27073 77918
L27073 77637
L27016 77525
L26960 77468
L26848 77412
L26623 77412
L26510 77468
L26454 77525
L26398 77637
" />
<path d="M27523 76962
L27523 77187
" />
<path d="M27973 76962
L27973 77187
" />
<path d="M29716 78593
L29660 78537
L29547 78368
L29491 78256
L29435 78087
L29379 77806
L29379 77581
L29435 77300
L29491 77131
L29547 77018
L29660 76850
L29716 76793
" />
<path d="M30110 77075
L30166 77018
L30279 76962
L30560 76962
L30672 77018
L30729 77075
L30785 77187
L30785 77300
L30729 77468
L30054 78143
L30785 78143
" />
<path d="M31516 76962
L31628 76962
L31741 77018
L31797 77075
L31853 77187
L31910 77412
L31910 77693
L31853 77918
L31797 78031
L31741 78087
L31628 78143
L31516 78143
L31403 78087
L31347 78031
L31291 77918
L31235 77693
L31235 77412
L31291 77187
L31347 77075
L31403 77018
L31516 76962
" />
<path d="M33316 78143
L33316 76962
" />
<path d="M33822 78143
L33822 77525
L33766 77412
L33653 77356
L33484 77356
L33372 77412
L33316 77468
" />
<path d="M34553 78143
L34441 78087
L34384 78031
L34328 77918
L34328 77581
L34384 77468
L34441 77412
L34553 77356
L34722 77356
L34834 77412
L34891 77468
L34947 77581
L34947 77918
L34891 78031
L34834 78087
L34722 78143
L34553 78143
" />
<path d="M35622 78143
L35509 78087
L35453 77975
L35453 76962
" />
<path d="M36522 78087
L36409 78143
L36184 78143
L36072 78087
L36015 77975
L36015 77525
L36072 77412
L36184 77356
L36409 77356
L36522 77412
L36578 77525
L36578 77637
L36015 77750
" />
<path d="M37028 78087
L37140 78143
L37365 78143
L37478 78087
L37534 77975
L37534 77918
L37478 77806
L37365 77750
L37196 77750
L37084 77693
L37028 77581
L37028 77525
L37084 77412
L37196 77356
L37365 77356
L37478 77412
" />
<path d="M37928 78593
L37984 78537
L38096 78368
L38153 78256
L38209 78087
L38265 77806
L38265 77581
L38209 77300
L38153 77131
L38096 77018
L37984 76850
L37928 76793
" />
<path d="M40065 78593
L40009 78537
L39896 78368
L39840 78256
L39784 78087
L39727 77806
L39727 77581
L39784 77300
L39840 77131
L39896 77018
L40009 76850
L40065 76793
" />
<path d="M40515 77356
L40515 78143
" />
<path d="M40515 77468
L40571 77412
L40684 77356
L40852 77356
L40965 77412
L41021 77525
L41021 78143
" />
<path d="M41752 78143
L41640 78087
L41583 78031
L41527 77918
L41527 77581
L41583 77468
L41640 77412
L41752 77356
L41921 77356
L42033 77412
L42090 77468
L42146 77581
L42146 77918
L42090 78031
L42033 78087
L41921 78143
L41752 78143
" />
<path d="M42483 77356
L42933 77356
" />
<path d="M42652 76962
L42652 77975
L42708 78087
L42821 78143
L42933 78143
" />
<path d="M44227 77356
L44227 78537
" />
<path d="M44227 77412
L44339 77356
L44564 77356
L44677 77412
L44733 77468
L44789 77581
L44789 77918
L44733 78031
L44677 78087
L44564 78143
L44339 78143
L44227 78087
" />
<path d="M45464 78143
L45352 78087
L45295 77975
L45295 76962
" />
<path d="M46420 78143
L46420 77525
L46364 77412
L46252 77356
L46027 77356
L45914 77412
" />
<path d="M46420 78087
L46308 78143
L46027 78143
L45914 78087
L45858 77975
L45858 77862
L45914 77750
L46027 77693
L46308 77693
L46420 77637
" />
<path d="M46814 77356
L47264 77356
" />
<path d="M46983 76962
L46983 77975
L47039 78087
L47151 78143
L47264 78143
" />
<path d="M48108 78087
L47995 78143
L47770 78143
L47658 78087
L47601 77975
L47601 77525
L47658 77412
L47770 77356
L47995 77356
L48108 77412
L48164 77525
L48164 77637
L47601 77750
" />
<path d="M49176 78143
L49176 76962
" />
<path d="M49176 78087
L49064 78143
L48839 78143
L48726 78087
L48670 78031
L48614 77918
L48614 77581
L48670 77468
L48726 77412
L48839 77356
L49064 77356
L49176 77412
" />
<path d="M49626 78593
L49682 78537
L49795 78368
L49851 78256
L49907 78087
L49964 77806
L49964 77581
L49907 77300
L49851 77131
L49795 77018
L49682 76850
L49626 76793
" />
</g> 
</svg>
