(export (version D)
  (design
    (source "C:\\Users\\wmaker\\Documents\\GitHub\\antenna-deployment-mch\\Burner circuit\\Burner circuit.sch")
    (date "25/04/2021 10:32:33")
    (tool "Eeschema (5.1.6)-1")
    (sheet (number 1) (name /) (tstamps /)
      (title_block
        (title "Burner Circuit")
        (company "SpaceDot - Bountzioukas Panagiotis")
        (rev v.0)
        (date 2021-04-18)
        (source "Burner circuit.sch")
        (comment (number 1) (value ""))
        (comment (number 2) (value ""))
        (comment (number 3) (value ""))
        (comment (number 4) (value "")))))
  (components
    (comp (ref D1)
      (value LG_R971-KN-1)
      (footprint digikey-footprints:0805)
      (datasheet https://dammedia.osram.info/media/resource/hires/osram-dam-2493936/LG%20R971.pdf)
      (fields
        (field (name Category) Optoelectronics)
        (field (name DK_Datasheet_Link) https://dammedia.osram.info/media/resource/hires/osram-dam-2493936/LG%20R971.pdf)
        (field (name DK_Detail_Page) /product-detail/en/osram-opto-semiconductors-inc/LG-R971-KN-1/475-1410-1-ND/1802598)
        (field (name Description) "LED GREEN DIFFUSED 0805 SMD")
        (field (name Digi-Key_PN) 475-1410-1-ND)
        (field (name Family) "LED Indication - Discrete")
        (field (name MPN) "LG R971-KN-1")
        (field (name Manufacturer) "OSRAM Opto Semiconductors Inc.")
        (field (name Status) Active))
      (libsource (lib dk_LED-Indication-Discrete) (part LG_R971-KN-1) (description "LED GREEN DIFFUSED 0805 SMD"))
      (sheetpath (names /) (tstamps /))
      (tstamp 60A2E8B1))
    (comp (ref R1)
      (value 330)
      (footprint Resistor_SMD:R_0805_2012Metric_Pad1.15x1.40mm_HandSolder)
      (datasheet ~)
      (libsource (lib Device) (part R_Small) (description "Resistor, small symbol"))
      (sheetpath (names /) (tstamps /))
      (tstamp 60A2F477))
    (comp (ref R3)
      (value R_Small)
      (footprint SamacSys_Parts:RESAD1526W69L610D229)
      (datasheet ~)
      (libsource (lib Device) (part R_Small) (description "Resistor, small symbol"))
      (sheetpath (names /) (tstamps /))
      (tstamp 60A37217))
    (comp (ref R2)
      (value R_Small)
      (footprint SamacSys_Parts:RESAD1526W69L610D229)
      (datasheet ~)
      (libsource (lib Device) (part R_Small) (description "Resistor, small symbol"))
      (sheetpath (names /) (tstamps /))
      (tstamp 60A3AACD))
    (comp (ref J3)
      (value 22-23-2021)
      (footprint digikey-footprints:PinHeader_1x2_P2.54mm_Drill1.02mm)
      (datasheet https://media.digikey.com/pdf/Data%20Sheets/Molex%20PDFs/A-6373-N_Series_Dwg_2010-12-03.pdf)
      (fields
        (field (name Category) "Connectors, Interconnects")
        (field (name DK_Datasheet_Link) https://media.digikey.com/pdf/Data%20Sheets/Molex%20PDFs/A-6373-N_Series_Dwg_2010-12-03.pdf)
        (field (name DK_Detail_Page) /product-detail/en/molex/22-23-2021/WM4200-ND/26667)
        (field (name Description) "CONN HEADER VERT 2POS 2.54MM")
        (field (name Digi-Key_PN) WM4200-ND)
        (field (name Family) "Rectangular Connectors - Headers, Male Pins")
        (field (name MPN) 22-23-2021)
        (field (name Manufacturer) Molex)
        (field (name Status) Active))
      (libsource (lib dk_Rectangular-Connectors-Headers-Male-Pins) (part 22-23-2021) (description "CONN HEADER VERT 2POS 2.54MM"))
      (sheetpath (names /) (tstamps /))
      (tstamp 60A3BC59))
    (comp (ref J4)
      (value 22-23-2021)
      (footprint digikey-footprints:PinHeader_1x2_P2.54mm_Drill1.02mm)
      (datasheet https://media.digikey.com/pdf/Data%20Sheets/Molex%20PDFs/A-6373-N_Series_Dwg_2010-12-03.pdf)
      (fields
        (field (name Category) "Connectors, Interconnects")
        (field (name DK_Datasheet_Link) https://media.digikey.com/pdf/Data%20Sheets/Molex%20PDFs/A-6373-N_Series_Dwg_2010-12-03.pdf)
        (field (name DK_Detail_Page) /product-detail/en/molex/22-23-2021/WM4200-ND/26667)
        (field (name Description) "CONN HEADER VERT 2POS 2.54MM")
        (field (name Digi-Key_PN) WM4200-ND)
        (field (name Family) "Rectangular Connectors - Headers, Male Pins")
        (field (name MPN) 22-23-2021)
        (field (name Manufacturer) Molex)
        (field (name Status) Active))
      (libsource (lib dk_Rectangular-Connectors-Headers-Male-Pins) (part 22-23-2021) (description "CONN HEADER VERT 2POS 2.54MM"))
      (sheetpath (names /) (tstamps /))
      (tstamp 60A404C7))
    (comp (ref J1)
      (value 22-23-2021)
      (footprint digikey-footprints:PinHeader_1x2_P2.54mm_Drill1.02mm)
      (datasheet https://media.digikey.com/pdf/Data%20Sheets/Molex%20PDFs/A-6373-N_Series_Dwg_2010-12-03.pdf)
      (fields
        (field (name Category) "Connectors, Interconnects")
        (field (name DK_Datasheet_Link) https://media.digikey.com/pdf/Data%20Sheets/Molex%20PDFs/A-6373-N_Series_Dwg_2010-12-03.pdf)
        (field (name DK_Detail_Page) /product-detail/en/molex/22-23-2021/WM4200-ND/26667)
        (field (name Description) "CONN HEADER VERT 2POS 2.54MM")
        (field (name Digi-Key_PN) WM4200-ND)
        (field (name Family) "Rectangular Connectors - Headers, Male Pins")
        (field (name MPN) 22-23-2021)
        (field (name Manufacturer) Molex)
        (field (name Status) Active))
      (libsource (lib dk_Rectangular-Connectors-Headers-Male-Pins) (part 22-23-2021) (description "CONN HEADER VERT 2POS 2.54MM"))
      (sheetpath (names /) (tstamps /))
      (tstamp 60A413F3))
    (comp (ref J2)
      (value 22-23-2021)
      (footprint digikey-footprints:PinHeader_1x2_P2.54mm_Drill1.02mm)
      (datasheet https://media.digikey.com/pdf/Data%20Sheets/Molex%20PDFs/A-6373-N_Series_Dwg_2010-12-03.pdf)
      (fields
        (field (name Category) "Connectors, Interconnects")
        (field (name DK_Datasheet_Link) https://media.digikey.com/pdf/Data%20Sheets/Molex%20PDFs/A-6373-N_Series_Dwg_2010-12-03.pdf)
        (field (name DK_Detail_Page) /product-detail/en/molex/22-23-2021/WM4200-ND/26667)
        (field (name Description) "CONN HEADER VERT 2POS 2.54MM")
        (field (name Digi-Key_PN) WM4200-ND)
        (field (name Family) "Rectangular Connectors - Headers, Male Pins")
        (field (name MPN) 22-23-2021)
        (field (name Manufacturer) Molex)
        (field (name Status) Active))
      (libsource (lib dk_Rectangular-Connectors-Headers-Male-Pins) (part 22-23-2021) (description "CONN HEADER VERT 2POS 2.54MM"))
      (sheetpath (names /) (tstamps /))
      (tstamp 60A41F98))
    (comp (ref IC2)
      (value MP5095GJ-Z)
      (footprint SamacSys_Parts:SOT65P280X100-8N)
      (datasheet https://componentsearchengine.com/Datasheets/1/MP5095GJ-Z.pdf)
      (fields
        (field (name Description) "Power Switch ICs - Power Distribution Low IQ, Dual-Channel, 2.3A Load Switch")
        (field (name Height) 1)
        (field (name Manufacturer_Name) "Monolithic Power Systems (MPS)")
        (field (name Manufacturer_Part_Number) MP5095GJ-Z)
        (field (name "Mouser Part Number") 946-MP5095GJ-Z)
        (field (name "Mouser Price/Stock") https://www.mouser.com/Search/Refine.aspx?Keyword=946-MP5095GJ-Z))
      (libsource (lib SamacSys_Parts) (part MP5095GJ-Z) (description "Power Switch ICs - Power Distribution Low IQ, Dual-Channel, 2.3A Load Switch"))
      (sheetpath (names /) (tstamps /))
      (tstamp 60A2BE3E))
    (comp (ref C4)
      (value 220uF)
      (footprint Capacitor_SMD:C_1206_3216Metric)
      (datasheet ~)
      (libsource (lib Device) (part C_Small) (description "Unpolarized capacitor, small symbol"))
      (sheetpath (names /) (tstamps /))
      (tstamp 60A575A6))
    (comp (ref J6)
      (value 640456-3)
      (footprint digikey-footprints:PinHeader_1x3_P2.54_Drill1.1mm)
      (datasheet https://www.te.com/commerce/DocumentDelivery/DDEController?Action=srchrtrv&DocNm=640456&DocType=Customer+Drawing&DocLang=English)
      (fields
        (field (name Category) "Connectors, Interconnects")
        (field (name DK_Datasheet_Link) https://www.te.com/commerce/DocumentDelivery/DDEController?Action=srchrtrv&DocNm=640456&DocType=Customer+Drawing&DocLang=English)
        (field (name DK_Detail_Page) /product-detail/en/te-connectivity-amp-connectors/640456-3/A19470-ND/259010)
        (field (name Description) "CONN HEADER VERT 3POS 2.54MM")
        (field (name Digi-Key_PN) A19470-ND)
        (field (name Family) "Rectangular Connectors - Headers, Male Pins")
        (field (name MPN) 640456-3)
        (field (name Manufacturer) "TE Connectivity AMP Connectors")
        (field (name Status) Active))
      (libsource (lib dk_Rectangular-Connectors-Headers-Male-Pins) (part 640456-3) (description "CONN HEADER VERT 3POS 2.54MM"))
      (sheetpath (names /) (tstamps /))
      (tstamp 60A5E457))
    (comp (ref J5)
      (value 640456-3)
      (footprint digikey-footprints:PinHeader_1x3_P2.54_Drill1.1mm)
      (datasheet https://www.te.com/commerce/DocumentDelivery/DDEController?Action=srchrtrv&DocNm=640456&DocType=Customer+Drawing&DocLang=English)
      (fields
        (field (name Category) "Connectors, Interconnects")
        (field (name DK_Datasheet_Link) https://www.te.com/commerce/DocumentDelivery/DDEController?Action=srchrtrv&DocNm=640456&DocType=Customer+Drawing&DocLang=English)
        (field (name DK_Detail_Page) /product-detail/en/te-connectivity-amp-connectors/640456-3/A19470-ND/259010)
        (field (name Description) "CONN HEADER VERT 3POS 2.54MM")
        (field (name Digi-Key_PN) A19470-ND)
        (field (name Family) "Rectangular Connectors - Headers, Male Pins")
        (field (name MPN) 640456-3)
        (field (name Manufacturer) "TE Connectivity AMP Connectors")
        (field (name Status) Active))
      (libsource (lib dk_Rectangular-Connectors-Headers-Male-Pins) (part 640456-3) (description "CONN HEADER VERT 3POS 2.54MM"))
      (sheetpath (names /) (tstamps /))
      (tstamp 60A5FA61))
    (comp (ref R4)
      (value 10K-100K)
      (footprint Resistor_SMD:R_0805_2012Metric_Pad1.15x1.40mm_HandSolder)
      (datasheet ~)
      (libsource (lib Device) (part R_Small) (description "Resistor, small symbol"))
      (sheetpath (names /) (tstamps /))
      (tstamp 60A699D3))
    (comp (ref C6)
      (value 220uF)
      (footprint Capacitor_SMD:C_1206_3216Metric)
      (datasheet ~)
      (libsource (lib Device) (part C_Small) (description "Unpolarized capacitor, small symbol"))
      (sheetpath (names /) (tstamps /))
      (tstamp 60A76311))
    (comp (ref R5)
      (value 10K-100K)
      (footprint Resistor_SMD:R_0805_2012Metric_Pad1.15x1.40mm_HandSolder)
      (datasheet ~)
      (libsource (lib Device) (part R_Small) (description "Resistor, small symbol"))
      (sheetpath (names /) (tstamps /))
      (tstamp 60AB3F94))
    (comp (ref C3)
      (value 10uF)
      (footprint Capacitor_SMD:C_0805_2012Metric_Pad1.15x1.40mm_HandSolder)
      (datasheet ~)
      (libsource (lib Device) (part C_Small) (description "Unpolarized capacitor, small symbol"))
      (sheetpath (names /) (tstamps /))
      (tstamp 60AB530D))
    (comp (ref C8)
      (value 10uF)
      (footprint Capacitor_SMD:C_0805_2012Metric_Pad1.15x1.40mm_HandSolder)
      (datasheet ~)
      (libsource (lib Device) (part C_Small) (description "Unpolarized capacitor, small symbol"))
      (sheetpath (names /) (tstamps /))
      (tstamp 60AB704D))
    (comp (ref C7)
      (value 1uF)
      (footprint Capacitor_SMD:C_0603_1608Metric)
      (datasheet ~)
      (libsource (lib Device) (part C_Small) (description "Unpolarized capacitor, small symbol"))
      (sheetpath (names /) (tstamps /))
      (tstamp 60AB7490))
    (comp (ref C2)
      (value 1uF)
      (footprint Capacitor_SMD:C_0603_1608Metric)
      (datasheet ~)
      (libsource (lib Device) (part C_Small) (description "Unpolarized capacitor, small symbol"))
      (sheetpath (names /) (tstamps /))
      (tstamp 60AB771B))
    (comp (ref IC3)
      (value TPS2561DRCR)
      (footprint SamacSys_Parts:TPS74901DRCR)
      (datasheet https://www.ti.com/lit/gpn/TPS2561)
      (fields
        (field (name Description) "Power Switch ICs - Power Distribution Dual Ch Prec Adj Current-Ltd Pwr Sw")
        (field (name Manufacturer_Name) "Texas Instruments")
        (field (name Manufacturer_Part_Number) TPS2561DRCR)
        (field (name "Mouser Part Number") 595-TPS2561DRCR)
        (field (name "Mouser Price/Stock") https://www.mouser.co.uk/ProductDetail/Texas-Instruments/TPS2561DRCR/?qs=%2Fqzd9s%252BcLd7rIDSRKlRjAw%3D%3D))
      (libsource (lib SamacSys_Parts) (part TPS2561DRCR) (description "Power Switch ICs - Power Distribution Dual Ch Prec Adj Current-Ltd Pwr Sw"))
      (sheetpath (names /) (tstamps /))
      (tstamp 60B0CB07))
    (comp (ref R15)
      (value 24.9K)
      (footprint Resistor_SMD:R_0805_2012Metric_Pad1.15x1.40mm_HandSolder)
      (datasheet ~)
      (libsource (lib Device) (part R_Small) (description "Resistor, small symbol"))
      (sheetpath (names /) (tstamps /))
      (tstamp 60B11C03))
    (comp (ref R13)
      (value 100K)
      (footprint Resistor_SMD:R_0805_2012Metric_Pad1.15x1.40mm_HandSolder)
      (datasheet ~)
      (libsource (lib Device) (part R_Small) (description "Resistor, small symbol"))
      (sheetpath (names /) (tstamps /))
      (tstamp 60B14E0C))
    (comp (ref R12)
      (value 100K)
      (footprint Resistor_SMD:R_0805_2012Metric_Pad1.15x1.40mm_HandSolder)
      (datasheet ~)
      (libsource (lib Device) (part R_Small) (description "Resistor, small symbol"))
      (sheetpath (names /) (tstamps /))
      (tstamp 60B152CA))
    (comp (ref C5)
      (value 1uF)
      (footprint Capacitor_SMD:C_0603_1608Metric)
      (datasheet ~)
      (libsource (lib Device) (part C_Small) (description "Unpolarized capacitor, small symbol"))
      (sheetpath (names /) (tstamps /))
      (tstamp 60AB588B))
    (comp (ref C1)
      (value 1uF)
      (footprint Capacitor_SMD:C_0603_1608Metric)
      (datasheet ~)
      (libsource (lib Device) (part C_Small) (description "Unpolarized capacitor, small symbol"))
      (sheetpath (names /) (tstamps /))
      (tstamp 60AB8379))
    (comp (ref C10)
      (value 0.1uF)
      (footprint Capacitor_SMD:C_0603_1608Metric)
      (datasheet ~)
      (libsource (lib Device) (part C_Small) (description "Unpolarized capacitor, small symbol"))
      (sheetpath (names /) (tstamps /))
      (tstamp 60B2698F))
    (comp (ref C13)
      (value 150uF)
      (footprint Capacitor_Tantalum_SMD:CP_EIA-3528-15_AVX-H)
      (datasheet ~)
      (libsource (lib Device) (part CP1_Small) (description "Polarized capacitor, small US symbol"))
      (sheetpath (names /) (tstamps /))
      (tstamp 60B312A5))
    (comp (ref C11)
      (value 150uF)
      (footprint Capacitor_Tantalum_SMD:CP_EIA-3528-15_AVX-H)
      (datasheet ~)
      (libsource (lib Device) (part CP1_Small) (description "Polarized capacitor, small US symbol"))
      (sheetpath (names /) (tstamps /))
      (tstamp 60B31CD8))
    (comp (ref IC4)
      (value TPS25221DBVT)
      (footprint SamacSys_Parts:SOT95P280X145-6N)
      (datasheet http://www.ti.com/lit/gpn/TPS25221)
      (fields
        (field (name Description) "Precision Adjustable Current-Limited Power-Distribution Switches")
        (field (name Height) 1.45)
        (field (name Manufacturer_Name) "Texas Instruments")
        (field (name Manufacturer_Part_Number) TPS25221DBVT)
        (field (name "Mouser Part Number") 595-TPS25221DBVT)
        (field (name "Mouser Price/Stock") https://www.mouser.co.uk/ProductDetail/Texas-Instruments/TPS25221DBVT?qs=F5EMLAvA7IDMBmkvyaVcBw%3D%3D))
      (libsource (lib SamacSys_Parts) (part TPS25221DBVT) (description "Precision Adjustable Current-Limited Power-Distribution Switches"))
      (sheetpath (names /) (tstamps /))
      (tstamp 60B5E53B))
    (comp (ref R14)
      (value 20K)
      (footprint Resistor_SMD:R_0805_2012Metric_Pad1.15x1.40mm_HandSolder)
      (datasheet ~)
      (libsource (lib Device) (part R_Small) (description "Resistor, small symbol"))
      (sheetpath (names /) (tstamps /))
      (tstamp 60B69486))
    (comp (ref R16)
      (value 20K)
      (footprint Resistor_SMD:R_0805_2012Metric_Pad1.15x1.40mm_HandSolder)
      (datasheet ~)
      (libsource (lib Device) (part R_Small) (description "Resistor, small symbol"))
      (sheetpath (names /) (tstamps /))
      (tstamp 60B69704))
    (comp (ref C9)
      (value 0.1uF)
      (footprint Capacitor_SMD:C_0603_1608Metric)
      (datasheet ~)
      (libsource (lib Device) (part C_Small) (description "Unpolarized capacitor, small symbol"))
      (sheetpath (names /) (tstamps /))
      (tstamp 60B7517D))
    (comp (ref R11)
      (value R_Small)
      (footprint SamacSys_Parts:RESAD1526W69L610D229)
      (datasheet ~)
      (libsource (lib Device) (part R_Small) (description "Resistor, small symbol"))
      (sheetpath (names /) (tstamps /))
      (tstamp 60B86BB1))
    (comp (ref R8)
      (value R_Small)
      (footprint SamacSys_Parts:RESAD1526W69L610D229)
      (datasheet ~)
      (libsource (lib Device) (part R_Small) (description "Resistor, small symbol"))
      (sheetpath (names /) (tstamps /))
      (tstamp 60B86BB7))
    (comp (ref J10)
      (value 640456-3)
      (footprint digikey-footprints:PinHeader_1x3_P2.54_Drill1.1mm)
      (datasheet https://www.te.com/commerce/DocumentDelivery/DDEController?Action=srchrtrv&DocNm=640456&DocType=Customer+Drawing&DocLang=English)
      (fields
        (field (name Category) "Connectors, Interconnects")
        (field (name DK_Datasheet_Link) https://www.te.com/commerce/DocumentDelivery/DDEController?Action=srchrtrv&DocNm=640456&DocType=Customer+Drawing&DocLang=English)
        (field (name DK_Detail_Page) /product-detail/en/te-connectivity-amp-connectors/640456-3/A19470-ND/259010)
        (field (name Description) "CONN HEADER VERT 3POS 2.54MM")
        (field (name Digi-Key_PN) A19470-ND)
        (field (name Family) "Rectangular Connectors - Headers, Male Pins")
        (field (name MPN) 640456-3)
        (field (name Manufacturer) "TE Connectivity AMP Connectors")
        (field (name Status) Active))
      (libsource (lib dk_Rectangular-Connectors-Headers-Male-Pins) (part 640456-3) (description "CONN HEADER VERT 3POS 2.54MM"))
      (sheetpath (names /) (tstamps /))
      (tstamp 60B86BD0))
    (comp (ref J9)
      (value 640456-3)
      (footprint digikey-footprints:PinHeader_1x3_P2.54_Drill1.1mm)
      (datasheet https://www.te.com/commerce/DocumentDelivery/DDEController?Action=srchrtrv&DocNm=640456&DocType=Customer+Drawing&DocLang=English)
      (fields
        (field (name Category) "Connectors, Interconnects")
        (field (name DK_Datasheet_Link) https://www.te.com/commerce/DocumentDelivery/DDEController?Action=srchrtrv&DocNm=640456&DocType=Customer+Drawing&DocLang=English)
        (field (name DK_Detail_Page) /product-detail/en/te-connectivity-amp-connectors/640456-3/A19470-ND/259010)
        (field (name Description) "CONN HEADER VERT 3POS 2.54MM")
        (field (name Digi-Key_PN) A19470-ND)
        (field (name Family) "Rectangular Connectors - Headers, Male Pins")
        (field (name MPN) 640456-3)
        (field (name Manufacturer) "TE Connectivity AMP Connectors")
        (field (name Status) Active))
      (libsource (lib dk_Rectangular-Connectors-Headers-Male-Pins) (part 640456-3) (description "CONN HEADER VERT 3POS 2.54MM"))
      (sheetpath (names /) (tstamps /))
      (tstamp 60B86BDF))
    (comp (ref C12)
      (value 0.1uF)
      (footprint Capacitor_SMD:C_0603_1608Metric)
      (datasheet ~)
      (libsource (lib Device) (part C_Small) (description "Unpolarized capacitor, small symbol"))
      (sheetpath (names /) (tstamps /))
      (tstamp 60B9206C))
    (comp (ref J7)
      (value 22-23-2021)
      (footprint digikey-footprints:PinHeader_1x2_P2.54mm_Drill1.02mm)
      (datasheet https://media.digikey.com/pdf/Data%20Sheets/Molex%20PDFs/A-6373-N_Series_Dwg_2010-12-03.pdf)
      (fields
        (field (name Category) "Connectors, Interconnects")
        (field (name DK_Datasheet_Link) https://media.digikey.com/pdf/Data%20Sheets/Molex%20PDFs/A-6373-N_Series_Dwg_2010-12-03.pdf)
        (field (name DK_Detail_Page) /product-detail/en/molex/22-23-2021/WM4200-ND/26667)
        (field (name Description) "CONN HEADER VERT 2POS 2.54MM")
        (field (name Digi-Key_PN) WM4200-ND)
        (field (name Family) "Rectangular Connectors - Headers, Male Pins")
        (field (name MPN) 22-23-2021)
        (field (name Manufacturer) Molex)
        (field (name Status) Active))
      (libsource (lib dk_Rectangular-Connectors-Headers-Male-Pins) (part 22-23-2021) (description "CONN HEADER VERT 2POS 2.54MM"))
      (sheetpath (names /) (tstamps /))
      (tstamp 60BCC4F0))
    (comp (ref J8)
      (value 22-23-2021)
      (footprint digikey-footprints:PinHeader_1x2_P2.54mm_Drill1.02mm)
      (datasheet https://media.digikey.com/pdf/Data%20Sheets/Molex%20PDFs/A-6373-N_Series_Dwg_2010-12-03.pdf)
      (fields
        (field (name Category) "Connectors, Interconnects")
        (field (name DK_Datasheet_Link) https://media.digikey.com/pdf/Data%20Sheets/Molex%20PDFs/A-6373-N_Series_Dwg_2010-12-03.pdf)
        (field (name DK_Detail_Page) /product-detail/en/molex/22-23-2021/WM4200-ND/26667)
        (field (name Description) "CONN HEADER VERT 2POS 2.54MM")
        (field (name Digi-Key_PN) WM4200-ND)
        (field (name Family) "Rectangular Connectors - Headers, Male Pins")
        (field (name MPN) 22-23-2021)
        (field (name Manufacturer) Molex)
        (field (name Status) Active))
      (libsource (lib dk_Rectangular-Connectors-Headers-Male-Pins) (part 22-23-2021) (description "CONN HEADER VERT 2POS 2.54MM"))
      (sheetpath (names /) (tstamps /))
      (tstamp 60BCC867))
    (comp (ref R6)
      (value 100K)
      (footprint Resistor_SMD:R_0805_2012Metric_Pad1.15x1.40mm_HandSolder)
      (datasheet ~)
      (libsource (lib Device) (part R_Small) (description "Resistor, small symbol"))
      (sheetpath (names /) (tstamps /))
      (tstamp 60BF1F3F))
    (comp (ref IC1)
      (value BD2069FJ-MGE2)
      (footprint SamacSys_Parts:SOIC127P600X165-8N)
      (datasheet https://componentsearchengine.com/Datasheets/2/BD2069FJ-MGE2.pdf)
      (fields
        (field (name Description) "Power Switch ICs - Power Distribution 2.4A 2.7-5.5V 2ch Crnt Limit H. Side")
        (field (name Height) 1.65)
        (field (name Manufacturer_Name) "ROHM Semiconductor")
        (field (name Manufacturer_Part_Number) BD2069FJ-MGE2)
        (field (name "Mouser Part Number") 755-BD2069FJ-MGE2)
        (field (name "Mouser Price/Stock") https://www.mouser.co.uk/ProductDetail/ROHM-Semiconductor/BD2069FJ-MGE2?qs=WHeKGGBt0W8aeBPIwgyoAQ%3D%3D))
      (libsource (lib SamacSys_Parts) (part BD2069FJ-MGE2) (description "Power Switch ICs - Power Distribution 2.4A 2.7-5.5V 2ch Crnt Limit H. Side"))
      (sheetpath (names /) (tstamps /))
      (tstamp 60C16B64))
    (comp (ref J11)
      (value 22-23-2021)
      (footprint digikey-footprints:PinHeader_1x2_P2.54mm_Drill1.02mm)
      (datasheet https://media.digikey.com/pdf/Data%20Sheets/Molex%20PDFs/A-6373-N_Series_Dwg_2010-12-03.pdf)
      (fields
        (field (name Category) "Connectors, Interconnects")
        (field (name DK_Datasheet_Link) https://media.digikey.com/pdf/Data%20Sheets/Molex%20PDFs/A-6373-N_Series_Dwg_2010-12-03.pdf)
        (field (name DK_Detail_Page) /product-detail/en/molex/22-23-2021/WM4200-ND/26667)
        (field (name Description) "CONN HEADER VERT 2POS 2.54MM")
        (field (name Digi-Key_PN) WM4200-ND)
        (field (name Family) "Rectangular Connectors - Headers, Male Pins")
        (field (name MPN) 22-23-2021)
        (field (name Manufacturer) Molex)
        (field (name Status) Active))
      (libsource (lib dk_Rectangular-Connectors-Headers-Male-Pins) (part 22-23-2021) (description "CONN HEADER VERT 2POS 2.54MM"))
      (sheetpath (names /) (tstamps /))
      (tstamp 608097BB))
    (comp (ref S1)
      (value JJCHLUJ100NCNMRTR)
      (footprint SamacSys_Parts:JJCHLUJ100NCNMRTR)
      (datasheet https://componentsearchengine.com/Datasheets/2/JJCHLUJ100NCNMRTR.pdf)
      (fields
        (field (name Description) "Detector Switches JJC Detector Switch 3.5x3.3x1 JB HORZ(L)")
        (field (name Height) 1)
        (field (name Manufacturer_Name) "TE Connectivity")
        (field (name Manufacturer_Part_Number) JJCHLUJ100NCNMRTR)
        (field (name "Mouser Part Number") 506-JJCHLUJ100NCNMR)
        (field (name "Mouser Price/Stock") https://www.mouser.co.uk/ProductDetail/TE-Connectivity-Alcoswitch/JJCHLUJ100NCNMRTR?qs=%252BEew9%252B0nqrCPMEy1F0yZQw%3D%3D))
      (libsource (lib SamacSys_Parts) (part JJCHLUJ100NCNMRTR) (description "Detector Switches JJC Detector Switch 3.5x3.3x1 JB HORZ(L)"))
      (sheetpath (names /) (tstamps /))
      (tstamp 607DBF7D))
    (comp (ref R10)
      (value 100K)
      (footprint Resistor_SMD:R_0805_2012Metric_Pad1.15x1.40mm_HandSolder)
      (datasheet ~)
      (libsource (lib Device) (part R_Small) (description "Resistor, small symbol"))
      (sheetpath (names /) (tstamps /))
      (tstamp 6082C63C))
    (comp (ref S4)
      (value JJCHLUJ100NCNMRTR)
      (footprint SamacSys_Parts:JJCHLUJ100NCNMRTR)
      (datasheet https://componentsearchengine.com/Datasheets/2/JJCHLUJ100NCNMRTR.pdf)
      (fields
        (field (name Description) "Detector Switches JJC Detector Switch 3.5x3.3x1 JB HORZ(L)")
        (field (name Height) 1)
        (field (name Manufacturer_Name) "TE Connectivity")
        (field (name Manufacturer_Part_Number) JJCHLUJ100NCNMRTR)
        (field (name "Mouser Part Number") 506-JJCHLUJ100NCNMR)
        (field (name "Mouser Price/Stock") https://www.mouser.co.uk/ProductDetail/TE-Connectivity-Alcoswitch/JJCHLUJ100NCNMRTR?qs=%252BEew9%252B0nqrCPMEy1F0yZQw%3D%3D))
      (libsource (lib SamacSys_Parts) (part JJCHLUJ100NCNMRTR) (description "Detector Switches JJC Detector Switch 3.5x3.3x1 JB HORZ(L)"))
      (sheetpath (names /) (tstamps /))
      (tstamp 6082C648))
    (comp (ref R7)
      (value 100K)
      (footprint Resistor_SMD:R_0805_2012Metric_Pad1.15x1.40mm_HandSolder)
      (datasheet ~)
      (libsource (lib Device) (part R_Small) (description "Resistor, small symbol"))
      (sheetpath (names /) (tstamps /))
      (tstamp 6083186E))
    (comp (ref S2)
      (value JJCHLUJ100NCNMRTR)
      (footprint SamacSys_Parts:JJCHLUJ100NCNMRTR)
      (datasheet https://componentsearchengine.com/Datasheets/2/JJCHLUJ100NCNMRTR.pdf)
      (fields
        (field (name Description) "Detector Switches JJC Detector Switch 3.5x3.3x1 JB HORZ(L)")
        (field (name Height) 1)
        (field (name Manufacturer_Name) "TE Connectivity")
        (field (name Manufacturer_Part_Number) JJCHLUJ100NCNMRTR)
        (field (name "Mouser Part Number") 506-JJCHLUJ100NCNMR)
        (field (name "Mouser Price/Stock") https://www.mouser.co.uk/ProductDetail/TE-Connectivity-Alcoswitch/JJCHLUJ100NCNMRTR?qs=%252BEew9%252B0nqrCPMEy1F0yZQw%3D%3D))
      (libsource (lib SamacSys_Parts) (part JJCHLUJ100NCNMRTR) (description "Detector Switches JJC Detector Switch 3.5x3.3x1 JB HORZ(L)"))
      (sheetpath (names /) (tstamps /))
      (tstamp 6083187A))
    (comp (ref R9)
      (value 100K)
      (footprint Resistor_SMD:R_0805_2012Metric_Pad1.15x1.40mm_HandSolder)
      (datasheet ~)
      (libsource (lib Device) (part R_Small) (description "Resistor, small symbol"))
      (sheetpath (names /) (tstamps /))
      (tstamp 60837008))
    (comp (ref S3)
      (value JJCHLUJ100NCNMRTR)
      (footprint SamacSys_Parts:JJCHLUJ100NCNMRTR)
      (datasheet https://componentsearchengine.com/Datasheets/2/JJCHLUJ100NCNMRTR.pdf)
      (fields
        (field (name Description) "Detector Switches JJC Detector Switch 3.5x3.3x1 JB HORZ(L)")
        (field (name Height) 1)
        (field (name Manufacturer_Name) "TE Connectivity")
        (field (name Manufacturer_Part_Number) JJCHLUJ100NCNMRTR)
        (field (name "Mouser Part Number") 506-JJCHLUJ100NCNMR)
        (field (name "Mouser Price/Stock") https://www.mouser.co.uk/ProductDetail/TE-Connectivity-Alcoswitch/JJCHLUJ100NCNMRTR?qs=%252BEew9%252B0nqrCPMEy1F0yZQw%3D%3D))
      (libsource (lib SamacSys_Parts) (part JJCHLUJ100NCNMRTR) (description "Detector Switches JJC Detector Switch 3.5x3.3x1 JB HORZ(L)"))
      (sheetpath (names /) (tstamps /))
      (tstamp 60837014))
    (comp (ref J12)
      (value 22-23-2021)
      (footprint digikey-footprints:PinHeader_1x2_P2.54mm_Drill1.02mm)
      (datasheet https://media.digikey.com/pdf/Data%20Sheets/Molex%20PDFs/A-6373-N_Series_Dwg_2010-12-03.pdf)
      (fields
        (field (name Category) "Connectors, Interconnects")
        (field (name DK_Datasheet_Link) https://media.digikey.com/pdf/Data%20Sheets/Molex%20PDFs/A-6373-N_Series_Dwg_2010-12-03.pdf)
        (field (name DK_Detail_Page) /product-detail/en/molex/22-23-2021/WM4200-ND/26667)
        (field (name Description) "CONN HEADER VERT 2POS 2.54MM")
        (field (name Digi-Key_PN) WM4200-ND)
        (field (name Family) "Rectangular Connectors - Headers, Male Pins")
        (field (name MPN) 22-23-2021)
        (field (name Manufacturer) Molex)
        (field (name Status) Active))
      (libsource (lib dk_Rectangular-Connectors-Headers-Male-Pins) (part 22-23-2021) (description "CONN HEADER VERT 2POS 2.54MM"))
      (sheetpath (names /) (tstamps /))
      (tstamp 6080EA5B))
    (comp (ref J15)
      (value 22-23-2021)
      (footprint digikey-footprints:PinHeader_1x2_P2.54mm_Drill1.02mm)
      (datasheet https://media.digikey.com/pdf/Data%20Sheets/Molex%20PDFs/A-6373-N_Series_Dwg_2010-12-03.pdf)
      (fields
        (field (name Category) "Connectors, Interconnects")
        (field (name DK_Datasheet_Link) https://media.digikey.com/pdf/Data%20Sheets/Molex%20PDFs/A-6373-N_Series_Dwg_2010-12-03.pdf)
        (field (name DK_Detail_Page) /product-detail/en/molex/22-23-2021/WM4200-ND/26667)
        (field (name Description) "CONN HEADER VERT 2POS 2.54MM")
        (field (name Digi-Key_PN) WM4200-ND)
        (field (name Family) "Rectangular Connectors - Headers, Male Pins")
        (field (name MPN) 22-23-2021)
        (field (name Manufacturer) Molex)
        (field (name Status) Active))
      (libsource (lib dk_Rectangular-Connectors-Headers-Male-Pins) (part 22-23-2021) (description "CONN HEADER VERT 2POS 2.54MM"))
      (sheetpath (names /) (tstamps /))
      (tstamp 6081B69E))
    (comp (ref J13)
      (value 22-23-2021)
      (footprint digikey-footprints:PinHeader_1x2_P2.54mm_Drill1.02mm)
      (datasheet https://media.digikey.com/pdf/Data%20Sheets/Molex%20PDFs/A-6373-N_Series_Dwg_2010-12-03.pdf)
      (fields
        (field (name Category) "Connectors, Interconnects")
        (field (name DK_Datasheet_Link) https://media.digikey.com/pdf/Data%20Sheets/Molex%20PDFs/A-6373-N_Series_Dwg_2010-12-03.pdf)
        (field (name DK_Detail_Page) /product-detail/en/molex/22-23-2021/WM4200-ND/26667)
        (field (name Description) "CONN HEADER VERT 2POS 2.54MM")
        (field (name Digi-Key_PN) WM4200-ND)
        (field (name Family) "Rectangular Connectors - Headers, Male Pins")
        (field (name MPN) 22-23-2021)
        (field (name Manufacturer) Molex)
        (field (name Status) Active))
      (libsource (lib dk_Rectangular-Connectors-Headers-Male-Pins) (part 22-23-2021) (description "CONN HEADER VERT 2POS 2.54MM"))
      (sheetpath (names /) (tstamps /))
      (tstamp 608216D0))
    (comp (ref J14)
      (value 22-23-2021)
      (footprint digikey-footprints:PinHeader_1x2_P2.54mm_Drill1.02mm)
      (datasheet https://media.digikey.com/pdf/Data%20Sheets/Molex%20PDFs/A-6373-N_Series_Dwg_2010-12-03.pdf)
      (fields
        (field (name Category) "Connectors, Interconnects")
        (field (name DK_Datasheet_Link) https://media.digikey.com/pdf/Data%20Sheets/Molex%20PDFs/A-6373-N_Series_Dwg_2010-12-03.pdf)
        (field (name DK_Detail_Page) /product-detail/en/molex/22-23-2021/WM4200-ND/26667)
        (field (name Description) "CONN HEADER VERT 2POS 2.54MM")
        (field (name Digi-Key_PN) WM4200-ND)
        (field (name Family) "Rectangular Connectors - Headers, Male Pins")
        (field (name MPN) 22-23-2021)
        (field (name Manufacturer) Molex)
        (field (name Status) Active))
      (libsource (lib dk_Rectangular-Connectors-Headers-Male-Pins) (part 22-23-2021) (description "CONN HEADER VERT 2POS 2.54MM"))
      (sheetpath (names /) (tstamps /))
      (tstamp 608224E3))
    (comp (ref J16)
      (value 22-23-2021)
      (footprint digikey-footprints:PinHeader_1x2_P2.54mm_Drill1.02mm)
      (datasheet https://media.digikey.com/pdf/Data%20Sheets/Molex%20PDFs/A-6373-N_Series_Dwg_2010-12-03.pdf)
      (fields
        (field (name Category) "Connectors, Interconnects")
        (field (name DK_Datasheet_Link) https://media.digikey.com/pdf/Data%20Sheets/Molex%20PDFs/A-6373-N_Series_Dwg_2010-12-03.pdf)
        (field (name DK_Detail_Page) /product-detail/en/molex/22-23-2021/WM4200-ND/26667)
        (field (name Description) "CONN HEADER VERT 2POS 2.54MM")
        (field (name Digi-Key_PN) WM4200-ND)
        (field (name Family) "Rectangular Connectors - Headers, Male Pins")
        (field (name MPN) 22-23-2021)
        (field (name Manufacturer) Molex)
        (field (name Status) Active))
      (libsource (lib dk_Rectangular-Connectors-Headers-Male-Pins) (part 22-23-2021) (description "CONN HEADER VERT 2POS 2.54MM"))
      (sheetpath (names /) (tstamps /))
      (tstamp 60842696))
    (comp (ref J19)
      (value 22-23-2021)
      (footprint digikey-footprints:PinHeader_1x2_P2.54mm_Drill1.02mm)
      (datasheet https://media.digikey.com/pdf/Data%20Sheets/Molex%20PDFs/A-6373-N_Series_Dwg_2010-12-03.pdf)
      (fields
        (field (name Category) "Connectors, Interconnects")
        (field (name DK_Datasheet_Link) https://media.digikey.com/pdf/Data%20Sheets/Molex%20PDFs/A-6373-N_Series_Dwg_2010-12-03.pdf)
        (field (name DK_Detail_Page) /product-detail/en/molex/22-23-2021/WM4200-ND/26667)
        (field (name Description) "CONN HEADER VERT 2POS 2.54MM")
        (field (name Digi-Key_PN) WM4200-ND)
        (field (name Family) "Rectangular Connectors - Headers, Male Pins")
        (field (name MPN) 22-23-2021)
        (field (name Manufacturer) Molex)
        (field (name Status) Active))
      (libsource (lib dk_Rectangular-Connectors-Headers-Male-Pins) (part 22-23-2021) (description "CONN HEADER VERT 2POS 2.54MM"))
      (sheetpath (names /) (tstamps /))
      (tstamp 608426AA))
    (comp (ref J17)
      (value 22-23-2021)
      (footprint digikey-footprints:PinHeader_1x2_P2.54mm_Drill1.02mm)
      (datasheet https://media.digikey.com/pdf/Data%20Sheets/Molex%20PDFs/A-6373-N_Series_Dwg_2010-12-03.pdf)
      (fields
        (field (name Category) "Connectors, Interconnects")
        (field (name DK_Datasheet_Link) https://media.digikey.com/pdf/Data%20Sheets/Molex%20PDFs/A-6373-N_Series_Dwg_2010-12-03.pdf)
        (field (name DK_Detail_Page) /product-detail/en/molex/22-23-2021/WM4200-ND/26667)
        (field (name Description) "CONN HEADER VERT 2POS 2.54MM")
        (field (name Digi-Key_PN) WM4200-ND)
        (field (name Family) "Rectangular Connectors - Headers, Male Pins")
        (field (name MPN) 22-23-2021)
        (field (name Manufacturer) Molex)
        (field (name Status) Active))
      (libsource (lib dk_Rectangular-Connectors-Headers-Male-Pins) (part 22-23-2021) (description "CONN HEADER VERT 2POS 2.54MM"))
      (sheetpath (names /) (tstamps /))
      (tstamp 608426BC))
    (comp (ref J18)
      (value 22-23-2021)
      (footprint digikey-footprints:PinHeader_1x2_P2.54mm_Drill1.02mm)
      (datasheet https://media.digikey.com/pdf/Data%20Sheets/Molex%20PDFs/A-6373-N_Series_Dwg_2010-12-03.pdf)
      (fields
        (field (name Category) "Connectors, Interconnects")
        (field (name DK_Datasheet_Link) https://media.digikey.com/pdf/Data%20Sheets/Molex%20PDFs/A-6373-N_Series_Dwg_2010-12-03.pdf)
        (field (name DK_Detail_Page) /product-detail/en/molex/22-23-2021/WM4200-ND/26667)
        (field (name Description) "CONN HEADER VERT 2POS 2.54MM")
        (field (name Digi-Key_PN) WM4200-ND)
        (field (name Family) "Rectangular Connectors - Headers, Male Pins")
        (field (name MPN) 22-23-2021)
        (field (name Manufacturer) Molex)
        (field (name Status) Active))
      (libsource (lib dk_Rectangular-Connectors-Headers-Male-Pins) (part 22-23-2021) (description "CONN HEADER VERT 2POS 2.54MM"))
      (sheetpath (names /) (tstamps /))
      (tstamp 608426CB))
    (comp (ref R18)
      (value R_Small)
      (footprint Resistor_SMD:R_2512_6332Metric)
      (datasheet ~)
      (libsource (lib Device) (part R_Small) (description "Resistor, small symbol"))
      (sheetpath (names /) (tstamps /))
      (tstamp 608522DE))
    (comp (ref R20)
      (value R_Small)
      (footprint Resistor_SMD:R_2512_6332Metric)
      (datasheet ~)
      (libsource (lib Device) (part R_Small) (description "Resistor, small symbol"))
      (sheetpath (names /) (tstamps /))
      (tstamp 6085B63F))
    (comp (ref R17)
      (value R_Small)
      (footprint Resistor_SMD:R_2512_6332Metric)
      (datasheet ~)
      (libsource (lib Device) (part R_Small) (description "Resistor, small symbol"))
      (sheetpath (names /) (tstamps /))
      (tstamp 6087479D))
    (comp (ref R19)
      (value R_Small)
      (footprint Resistor_SMD:R_2512_6332Metric)
      (datasheet ~)
      (libsource (lib Device) (part R_Small) (description "Resistor, small symbol"))
      (sheetpath (names /) (tstamps /))
      (tstamp 6087D0C2)))
  (libparts
    (libpart (lib Device) (part CP1_Small)
      (description "Polarized capacitor, small US symbol")
      (docs ~)
      (footprints
        (fp CP_*))
      (fields
        (field (name Reference) C)
        (field (name Value) CP1_Small))
      (pins
        (pin (num 1) (name ~) (type passive))
        (pin (num 2) (name ~) (type passive))))
    (libpart (lib Device) (part C_Small)
      (description "Unpolarized capacitor, small symbol")
      (docs ~)
      (footprints
        (fp C_*))
      (fields
        (field (name Reference) C)
        (field (name Value) C_Small))
      (pins
        (pin (num 1) (name ~) (type passive))
        (pin (num 2) (name ~) (type passive))))
    (libpart (lib Device) (part R_Small)
      (description "Resistor, small symbol")
      (docs ~)
      (footprints
        (fp R_*))
      (fields
        (field (name Reference) R)
        (field (name Value) R_Small))
      (pins
        (pin (num 1) (name ~) (type passive))
        (pin (num 2) (name ~) (type passive))))
    (libpart (lib SamacSys_Parts) (part BD2069FJ-MGE2)
      (description "Power Switch ICs - Power Distribution 2.4A 2.7-5.5V 2ch Crnt Limit H. Side")
      (docs https://componentsearchengine.com/Datasheets/2/BD2069FJ-MGE2.pdf)
      (fields
        (field (name Reference) IC)
        (field (name Value) BD2069FJ-MGE2)
        (field (name Footprint) SOIC127P600X165-8N)
        (field (name Datasheet) https://componentsearchengine.com/Datasheets/2/BD2069FJ-MGE2.pdf)
        (field (name Description) "Power Switch ICs - Power Distribution 2.4A 2.7-5.5V 2ch Crnt Limit H. Side")
        (field (name Height) 1.65)
        (field (name "Mouser Part Number") 755-BD2069FJ-MGE2)
        (field (name "Mouser Price/Stock") https://www.mouser.co.uk/ProductDetail/ROHM-Semiconductor/BD2069FJ-MGE2?qs=WHeKGGBt0W8aeBPIwgyoAQ%3D%3D)
        (field (name Manufacturer_Name) "ROHM Semiconductor")
        (field (name Manufacturer_Part_Number) BD2069FJ-MGE2))
      (pins
        (pin (num 1) (name GND) (type passive))
        (pin (num 2) (name IN) (type passive))
        (pin (num 3) (name ~EN1) (type passive))
        (pin (num 4) (name ~EN2) (type passive))
        (pin (num 5) (name ~OC2) (type passive))
        (pin (num 6) (name OUT2) (type passive))
        (pin (num 7) (name OUT1) (type passive))
        (pin (num 8) (name ~OC1) (type passive))))
    (libpart (lib SamacSys_Parts) (part JJCHLUJ100NCNMRTR)
      (description "Detector Switches JJC Detector Switch 3.5x3.3x1 JB HORZ(L)")
      (docs https://componentsearchengine.com/Datasheets/2/JJCHLUJ100NCNMRTR.pdf)
      (fields
        (field (name Reference) S)
        (field (name Value) JJCHLUJ100NCNMRTR)
        (field (name Footprint) JJCHLUJ100NCNMRTR)
        (field (name Datasheet) https://componentsearchengine.com/Datasheets/2/JJCHLUJ100NCNMRTR.pdf)
        (field (name Description) "Detector Switches JJC Detector Switch 3.5x3.3x1 JB HORZ(L)")
        (field (name Height) 1)
        (field (name "Mouser Part Number") 506-JJCHLUJ100NCNMR)
        (field (name "Mouser Price/Stock") https://www.mouser.co.uk/ProductDetail/TE-Connectivity-Alcoswitch/JJCHLUJ100NCNMRTR?qs=%252BEew9%252B0nqrCPMEy1F0yZQw%3D%3D)
        (field (name Manufacturer_Name) "TE Connectivity")
        (field (name Manufacturer_Part_Number) JJCHLUJ100NCNMRTR))
      (pins
        (pin (num 1) (name 1) (type passive))
        (pin (num 2) (name 2) (type passive))
        (pin (num A1) (name A1) (type passive))
        (pin (num B1) (name B1) (type passive))))
    (libpart (lib SamacSys_Parts) (part MP5095GJ-Z)
      (description "Power Switch ICs - Power Distribution Low IQ, Dual-Channel, 2.3A Load Switch")
      (docs https://componentsearchengine.com/Datasheets/1/MP5095GJ-Z.pdf)
      (fields
        (field (name Reference) IC)
        (field (name Value) MP5095GJ-Z)
        (field (name Footprint) SOT65P280X100-8N)
        (field (name Datasheet) https://componentsearchengine.com/Datasheets/1/MP5095GJ-Z.pdf)
        (field (name Description) "Power Switch ICs - Power Distribution Low IQ, Dual-Channel, 2.3A Load Switch")
        (field (name Height) 1)
        (field (name "Mouser Part Number") 946-MP5095GJ-Z)
        (field (name "Mouser Price/Stock") https://www.mouser.com/Search/Refine.aspx?Keyword=946-MP5095GJ-Z)
        (field (name Manufacturer_Name) "Monolithic Power Systems (MPS)")
        (field (name Manufacturer_Part_Number) MP5095GJ-Z))
      (pins
        (pin (num 1) (name VCC) (type passive))
        (pin (num 2) (name GND) (type passive))
        (pin (num 3) (name EN1) (type passive))
        (pin (num 4) (name EN2) (type passive))
        (pin (num 5) (name IN2) (type passive))
        (pin (num 6) (name OUT2) (type passive))
        (pin (num 7) (name OUT1) (type passive))
        (pin (num 8) (name IN1) (type passive))))
    (libpart (lib SamacSys_Parts) (part TPS25221DBVT)
      (description "Precision Adjustable Current-Limited Power-Distribution Switches")
      (docs http://www.ti.com/lit/gpn/TPS25221)
      (fields
        (field (name Reference) IC)
        (field (name Value) TPS25221DBVT)
        (field (name Footprint) SOT95P280X145-6N)
        (field (name Datasheet) http://www.ti.com/lit/gpn/TPS25221)
        (field (name Description) "Precision Adjustable Current-Limited Power-Distribution Switches")
        (field (name Height) 1.45)
        (field (name "Mouser Part Number") 595-TPS25221DBVT)
        (field (name "Mouser Price/Stock") https://www.mouser.co.uk/ProductDetail/Texas-Instruments/TPS25221DBVT?qs=F5EMLAvA7IDMBmkvyaVcBw%3D%3D)
        (field (name Manufacturer_Name) "Texas Instruments")
        (field (name Manufacturer_Part_Number) TPS25221DBVT))
      (pins
        (pin (num 1) (name IN) (type passive))
        (pin (num 2) (name GND) (type passive))
        (pin (num 3) (name EN) (type passive))
        (pin (num 4) (name ~FAULT) (type passive))
        (pin (num 5) (name ILIM) (type passive))
        (pin (num 6) (name OUT) (type passive))))
    (libpart (lib SamacSys_Parts) (part TPS2561DRCR)
      (description "Power Switch ICs - Power Distribution Dual Ch Prec Adj Current-Ltd Pwr Sw")
      (docs https://www.ti.com/lit/gpn/TPS2561)
      (fields
        (field (name Reference) IC)
        (field (name Value) TPS2561DRCR)
        (field (name Footprint) TPS74901DRCR)
        (field (name Datasheet) https://www.ti.com/lit/gpn/TPS2561)
        (field (name Description) "Power Switch ICs - Power Distribution Dual Ch Prec Adj Current-Ltd Pwr Sw")
        (field (name "Mouser Part Number") 595-TPS2561DRCR)
        (field (name "Mouser Price/Stock") https://www.mouser.co.uk/ProductDetail/Texas-Instruments/TPS2561DRCR/?qs=%2Fqzd9s%252BcLd7rIDSRKlRjAw%3D%3D)
        (field (name Manufacturer_Name) "Texas Instruments")
        (field (name Manufacturer_Part_Number) TPS2561DRCR))
      (pins
        (pin (num 1) (name GND) (type passive))
        (pin (num 2) (name IN_1) (type passive))
        (pin (num 3) (name IN_2) (type passive))
        (pin (num 4) (name EN1) (type passive))
        (pin (num 5) (name EN2) (type passive))
        (pin (num 6) (name ~FAULT2) (type passive))
        (pin (num 7) (name ILIM) (type passive))
        (pin (num 8) (name OUT2) (type passive))
        (pin (num 9) (name OUT1) (type passive))
        (pin (num 10) (name ~FAULT1) (type passive))
        (pin (num EP1) (name EP1) (type passive))))
    (libpart (lib dk_LED-Indication-Discrete) (part LG_R971-KN-1)
      (description "LED GREEN DIFFUSED 0805 SMD")
      (docs https://dammedia.osram.info/media/resource/hires/osram-dam-2493936/LG%20R971.pdf)
      (fields
        (field (name Reference) D)
        (field (name Value) LG_R971-KN-1)
        (field (name Footprint) digikey-footprints:0805)
        (field (name Datasheet) https://dammedia.osram.info/media/resource/hires/osram-dam-2493936/LG%20R971.pdf)
        (field (name Digi-Key_PN) 475-1410-1-ND)
        (field (name MPN) "LG R971-KN-1")
        (field (name Category) Optoelectronics)
        (field (name Family) "LED Indication - Discrete")
        (field (name DK_Datasheet_Link) https://dammedia.osram.info/media/resource/hires/osram-dam-2493936/LG%20R971.pdf)
        (field (name DK_Detail_Page) /product-detail/en/osram-opto-semiconductors-inc/LG-R971-KN-1/475-1410-1-ND/1802598)
        (field (name Description) "LED GREEN DIFFUSED 0805 SMD")
        (field (name Manufacturer) "OSRAM Opto Semiconductors Inc.")
        (field (name Status) Active))
      (pins
        (pin (num 1) (name ~) (type passive))
        (pin (num 2) (name ~) (type passive))))
    (libpart (lib dk_Rectangular-Connectors-Headers-Male-Pins) (part 22-23-2021)
      (description "CONN HEADER VERT 2POS 2.54MM")
      (docs https://media.digikey.com/pdf/Data%20Sheets/Molex%20PDFs/A-6373-N_Series_Dwg_2010-12-03.pdf)
      (fields
        (field (name Reference) J)
        (field (name Value) 22-23-2021)
        (field (name Footprint) digikey-footprints:PinHeader_1x2_P2.54mm_Drill1.02mm)
        (field (name Datasheet) https://media.digikey.com/pdf/Data%20Sheets/Molex%20PDFs/A-6373-N_Series_Dwg_2010-12-03.pdf)
        (field (name Digi-Key_PN) WM4200-ND)
        (field (name MPN) 22-23-2021)
        (field (name Category) "Connectors, Interconnects")
        (field (name Family) "Rectangular Connectors - Headers, Male Pins")
        (field (name DK_Datasheet_Link) https://media.digikey.com/pdf/Data%20Sheets/Molex%20PDFs/A-6373-N_Series_Dwg_2010-12-03.pdf)
        (field (name DK_Detail_Page) /product-detail/en/molex/22-23-2021/WM4200-ND/26667)
        (field (name Description) "CONN HEADER VERT 2POS 2.54MM")
        (field (name Manufacturer) Molex)
        (field (name Status) Active))
      (pins
        (pin (num 1) (name ~) (type passive))
        (pin (num 2) (name ~) (type passive))))
    (libpart (lib dk_Rectangular-Connectors-Headers-Male-Pins) (part 640456-3)
      (description "CONN HEADER VERT 3POS 2.54MM")
      (docs https://www.te.com/commerce/DocumentDelivery/DDEController?Action=srchrtrv&DocNm=640456&DocType=Customer+Drawing&DocLang=English)
      (fields
        (field (name Reference) J)
        (field (name Value) 640456-3)
        (field (name Footprint) digikey-footprints:PinHeader_1x3_P2.54_Drill1.1mm)
        (field (name Datasheet) https://www.te.com/commerce/DocumentDelivery/DDEController?Action=srchrtrv&DocNm=640456&DocType=Customer+Drawing&DocLang=English)
        (field (name Digi-Key_PN) A19470-ND)
        (field (name MPN) 640456-3)
        (field (name Category) "Connectors, Interconnects")
        (field (name Family) "Rectangular Connectors - Headers, Male Pins")
        (field (name DK_Datasheet_Link) https://www.te.com/commerce/DocumentDelivery/DDEController?Action=srchrtrv&DocNm=640456&DocType=Customer+Drawing&DocLang=English)
        (field (name DK_Detail_Page) /product-detail/en/te-connectivity-amp-connectors/640456-3/A19470-ND/259010)
        (field (name Description) "CONN HEADER VERT 3POS 2.54MM")
        (field (name Manufacturer) "TE Connectivity AMP Connectors")
        (field (name Status) Active))
      (pins
        (pin (num 1) (name ~) (type passive))
        (pin (num 2) (name ~) (type passive))
        (pin (num 3) (name ~) (type passive)))))
  (libraries
    (library (logical Device)
      (uri "C:\\Program Files\\KiCad\\share\\kicad\\library/Device.lib"))
    (library (logical SamacSys_Parts)
      (uri C:/Users/wmaker/Desktop/kicadlib/SamacSys_Parts.lib))
    (library (logical dk_LED-Indication-Discrete)
      (uri C:/Users/wmaker/Desktop/AcubeSAT/digikey-kicad-library-master/digikey-symbols/dk_LED-Indication-Discrete.lib))
    (library (logical dk_Rectangular-Connectors-Headers-Male-Pins)
      (uri C:/Users/wmaker/Desktop/AcubeSAT/digikey-kicad-library-master/digikey-symbols/dk_Rectangular-Connectors-Headers-Male-Pins.lib)))
  (nets
    (net (code 1) (name GND)
      (node (ref R19) (pin 2))
      (node (ref D1) (pin 2))
      (node (ref R17) (pin 2))
      (node (ref J4) (pin 1))
      (node (ref S3) (pin B1))
      (node (ref S3) (pin A1))
      (node (ref J18) (pin 2))
      (node (ref C9) (pin 2))
      (node (ref R20) (pin 2))
      (node (ref R18) (pin 2))
      (node (ref J18) (pin 1))
      (node (ref J17) (pin 2))
      (node (ref J17) (pin 1))
      (node (ref C13) (pin 2))
      (node (ref C11) (pin 2))
      (node (ref R2) (pin 1))
      (node (ref J13) (pin 2))
      (node (ref J13) (pin 1))
      (node (ref IC2) (pin 2))
      (node (ref J14) (pin 1))
      (node (ref C6) (pin 1))
      (node (ref C4) (pin 1))
      (node (ref C3) (pin 2))
      (node (ref R9) (pin 1))
      (node (ref R3) (pin 1))
      (node (ref S2) (pin B1))
      (node (ref S2) (pin A1))
      (node (ref J14) (pin 2))
      (node (ref IC1) (pin 1))
      (node (ref R10) (pin 1))
      (node (ref C12) (pin 2))
      (node (ref S1) (pin A1))
      (node (ref S1) (pin B1))
      (node (ref C5) (pin 2))
      (node (ref R15) (pin 1))
      (node (ref S4) (pin B1))
      (node (ref C8) (pin 2))
      (node (ref C7) (pin 2))
      (node (ref C2) (pin 2))
      (node (ref IC3) (pin 1))
      (node (ref C10) (pin 2))
      (node (ref C1) (pin 1))
      (node (ref IC3) (pin EP1))
      (node (ref S4) (pin A1))
      (node (ref R7) (pin 1))
      (node (ref R16) (pin 1))
      (node (ref J11) (pin 1))
      (node (ref R8) (pin 1))
      (node (ref R11) (pin 1))
      (node (ref IC4) (pin 2))
      (node (ref R6) (pin 1)))
    (net (code 2) (name EN3.1)
      (node (ref J11) (pin 2))
      (node (ref IC3) (pin 4)))
    (net (code 3) (name "Net-(IC1-Pad5)")
      (node (ref IC1) (pin 5))
      (node (ref R4) (pin 1)))
    (net (code 4) (name out1.2)
      (node (ref C4) (pin 2))
      (node (ref J5) (pin 1))
      (node (ref IC1) (pin 7)))
    (net (code 5) (name "Net-(IC1-Pad8)")
      (node (ref R5) (pin 1))
      (node (ref IC1) (pin 8)))
    (net (code 6) (name EN2.2)
      (node (ref J1) (pin 1))
      (node (ref IC1) (pin 4)))
    (net (code 7) (name EN2.1)
      (node (ref J1) (pin 2))
      (node (ref IC1) (pin 3)))
    (net (code 8) (name Sw3)
      (node (ref S2) (pin 2))
      (node (ref R7) (pin 2))
      (node (ref J8) (pin 1)))
    (net (code 9) (name Vcc)
      (node (ref IC2) (pin 5))
      (node (ref C3) (pin 1))
      (node (ref R5) (pin 2))
      (node (ref IC4) (pin 1))
      (node (ref C8) (pin 1))
      (node (ref J2) (pin 1))
      (node (ref R13) (pin 1))
      (node (ref IC2) (pin 1))
      (node (ref R14) (pin 1))
      (node (ref C9) (pin 1))
      (node (ref R4) (pin 2))
      (node (ref R1) (pin 2))
      (node (ref R12) (pin 1))
      (node (ref IC3) (pin 3))
      (node (ref IC3) (pin 2))
      (node (ref C2) (pin 1))
      (node (ref C10) (pin 1))
      (node (ref C1) (pin 2))
      (node (ref S2) (pin 1))
      (node (ref S3) (pin 1))
      (node (ref S4) (pin 1))
      (node (ref IC1) (pin 2))
      (node (ref S1) (pin 1))
      (node (ref IC2) (pin 8)))
    (net (code 10) (name Sw2)
      (node (ref S4) (pin 2))
      (node (ref R10) (pin 2))
      (node (ref J7) (pin 1)))
    (net (code 11) (name "Net-(J10-Pad2)")
      (node (ref J10) (pin 2))
      (node (ref R20) (pin 1))
      (node (ref R11) (pin 2))
      (node (ref J15) (pin 2))
      (node (ref J15) (pin 1)))
    (net (code 12) (name out3.1)
      (node (ref J9) (pin 3))
      (node (ref C13) (pin 1))
      (node (ref IC3) (pin 9)))
    (net (code 13) (name out4.1)
      (node (ref IC4) (pin 6))
      (node (ref C12) (pin 1))
      (node (ref J9) (pin 1))
      (node (ref J10) (pin 3)))
    (net (code 14) (name out3.2)
      (node (ref IC3) (pin 8))
      (node (ref J10) (pin 1))
      (node (ref C11) (pin 1)))
    (net (code 15) (name Sw1)
      (node (ref S1) (pin 2))
      (node (ref J7) (pin 2))
      (node (ref R6) (pin 2)))
    (net (code 16) (name "Net-(J19-Pad1)")
      (node (ref J19) (pin 1))
      (node (ref J6) (pin 2))
      (node (ref R19) (pin 1))
      (node (ref J19) (pin 2))
      (node (ref R3) (pin 2)))
    (net (code 17) (name "Net-(J16-Pad1)")
      (node (ref J5) (pin 2))
      (node (ref R2) (pin 2))
      (node (ref J16) (pin 2))
      (node (ref R17) (pin 1))
      (node (ref J16) (pin 1)))
    (net (code 18) (name Sw4)
      (node (ref R9) (pin 2))
      (node (ref S3) (pin 2))
      (node (ref J8) (pin 2)))
    (net (code 19) (name "Net-(J12-Pad1)")
      (node (ref J12) (pin 1))
      (node (ref R8) (pin 2))
      (node (ref R18) (pin 1))
      (node (ref J9) (pin 2))
      (node (ref J12) (pin 2)))
    (net (code 20) (name out2.2)
      (node (ref J6) (pin 3))
      (node (ref C6) (pin 2))
      (node (ref IC1) (pin 6)))
    (net (code 21) (name EN1.2)
      (node (ref IC2) (pin 4))
      (node (ref J3) (pin 2)))
    (net (code 22) (name EN1.1)
      (node (ref IC2) (pin 3))
      (node (ref J3) (pin 1)))
    (net (code 23) (name out1)
      (node (ref C5) (pin 1))
      (node (ref J5) (pin 3))
      (node (ref IC2) (pin 7)))
    (net (code 24) (name out2)
      (node (ref J6) (pin 1))
      (node (ref C7) (pin 1))
      (node (ref IC2) (pin 6)))
    (net (code 25) (name "Net-(D1-Pad1)")
      (node (ref R1) (pin 1))
      (node (ref D1) (pin 1)))
    (net (code 26) (name EN4.1)
      (node (ref IC4) (pin 3))
      (node (ref J2) (pin 2)))
    (net (code 27) (name EN3.2)
      (node (ref J4) (pin 2))
      (node (ref IC3) (pin 5)))
    (net (code 28) (name "Net-(IC4-Pad5)")
      (node (ref IC4) (pin 5))
      (node (ref R16) (pin 2)))
    (net (code 29) (name "Net-(IC4-Pad4)")
      (node (ref R14) (pin 2))
      (node (ref IC4) (pin 4)))
    (net (code 30) (name "Net-(IC3-Pad7)")
      (node (ref IC3) (pin 7))
      (node (ref R15) (pin 2)))
    (net (code 31) (name "Net-(IC3-Pad6)")
      (node (ref IC3) (pin 6))
      (node (ref R13) (pin 2)))
    (net (code 32) (name "Net-(IC3-Pad10)")
      (node (ref IC3) (pin 10))
      (node (ref R12) (pin 2)))))