(module LOGO (layer F.Cu)
  (at 0 0)
 (fp_text reference "G***" (at 0 0) (layer F.SilkS) hide
  (effects (font (thickness 0.3)))
  )
  (fp_text value "LOGO" (at 0.75 0) (layer F.SilkS) hide
  (effects (font (thickness 0.3)))
  )
  (fp_poly (pts (xy 0.403177 -6.489927) (xy 0.804292 -6.452799) (xy 1.200016 -6.391417) (xy 1.589405 -6.306234) (xy 1.971512 -6.197703) (xy 2.345390 -6.066274) (xy 2.710094 -5.912401) (xy 3.064676 -5.736536)
     (xy 3.408190 -5.539131) (xy 3.739691 -5.320639) (xy 4.058231 -5.081511) (xy 4.362864 -4.822200) (xy 4.652645 -4.543159) (xy 4.926626 -4.244839) (xy 5.063287 -4.081318) (xy 5.306352 -3.760774)
     (xy 5.528133 -3.426890) (xy 5.728243 -3.080768) (xy 5.906293 -2.723511) (xy 6.061894 -2.356222) (xy 6.194657 -1.980003) (xy 6.304193 -1.595957) (xy 6.390114 -1.205187) (xy 6.452030 -0.808796)
     (xy 6.489554 -0.407886) (xy 6.502295 -0.003561) (xy 6.502296 0.000000) (xy 6.489747 0.407785) (xy 6.452249 0.811413) (xy 6.390024 1.210118) (xy 6.303297 1.603131) (xy 6.192292 1.989687)
     (xy 6.057231 2.369018) (xy 5.898338 2.740357) (xy 5.715836 3.102937) (xy 5.509950 3.455991) (xy 5.482940 3.498850) (xy 5.264305 3.819760) (xy 5.023971 4.129258) (xy 4.763734 4.425577)
     (xy 4.485393 4.706953) (xy 4.190743 4.971620) (xy 3.881583 5.217813) (xy 3.559710 5.443765) (xy 3.399364 5.545656) (xy 3.293410 5.608308) (xy 3.170285 5.677082) (xy 3.036405 5.748672)
     (xy 2.898183 5.819771) (xy 2.762036 5.887072) (xy 2.634376 5.947270) (xy 2.532713 5.992357) (xy 2.189174 6.126046) (xy 1.830971 6.240927) (xy 1.461317 6.336238) (xy 1.083422 6.411217)
     (xy 0.700499 6.465102) (xy 0.438150 6.489359) (xy 0.350680 6.494169) (xy 0.244003 6.497572) (xy 0.124271 6.499578) (xy -0.002365 6.500197) (xy -0.129750 6.499437) (xy -0.251734 6.497310)
     (xy -0.362162 6.493825) (xy -0.454884 6.488991) (xy -0.469900 6.487928) (xy -0.873022 6.445382) (xy -1.269398 6.378745) (xy -1.658161 6.288636) (xy -2.038448 6.175673) (xy -2.409394 6.040477)
     (xy -2.770132 5.883664) (xy -3.119798 5.705855) (xy -3.457528 5.507668) (xy -3.782455 5.289722) (xy -4.093716 5.052635) (xy -4.390444 4.797026) (xy -4.671775 4.523515) (xy -4.936843 4.232720)
     (xy -5.184785 3.925259) (xy -5.414733 3.601753) (xy -5.625825 3.262818) (xy -5.817193 2.909075) (xy -5.987974 2.541142) (xy -5.988247 2.540503) (xy -6.132070 2.171772) (xy -6.252560 1.794165)
     (xy -6.349563 1.409186) (xy -6.422928 1.018343) (xy -6.472501 0.623141) (xy -6.498131 0.225086) (xy -6.499002 -0.001880) (xy -6.234184 -0.001880) (xy -6.222261 0.387207) (xy -6.186328 0.772516)
     (xy -6.126845 1.153053) (xy -6.044271 1.527820) (xy -5.939065 1.895820) (xy -5.811687 2.256059) (xy -5.662596 2.607538) (xy -5.492251 2.949263) (xy -5.301111 3.280237) (xy -5.089637 3.599463)
     (xy -4.858287 3.905945) (xy -4.607520 4.198687) (xy -4.337796 4.476693) (xy -4.049575 4.738966) (xy -3.743315 4.984510) (xy -3.419477 5.212329) (xy -3.417397 5.213696) (xy -3.081944 5.419027)
     (xy -2.734926 5.602176) (xy -2.377657 5.762795) (xy -2.011451 5.900533) (xy -1.637622 6.015043) (xy -1.257483 6.105974) (xy -0.872348 6.172979) (xy -0.483532 6.215709) (xy -0.092348 6.233814)
     (xy 0.299890 6.226946) (xy 0.381000 6.222378) (xy 0.777387 6.184906) (xy 1.167572 6.123150) (xy 1.550630 6.037649) (xy 1.925633 5.928940) (xy 2.291653 5.797562) (xy 2.647766 5.644051)
     (xy 2.993044 5.468947) (xy 3.326559 5.272786) (xy 3.647386 5.056107) (xy 3.954598 4.819448) (xy 4.247268 4.563346) (xy 4.524470 4.288340) (xy 4.785276 3.994967) (xy 5.028760 3.683765)
     (xy 5.213696 3.417396) (xy 5.419837 3.080713) (xy 5.603390 2.733065) (xy 5.764088 2.375610) (xy 5.901664 2.009504) (xy 6.015850 1.635905) (xy 6.106380 1.255970) (xy 6.172987 0.870856)
     (xy 6.215404 0.481720) (xy 6.233362 0.089718) (xy 6.226597 -0.303991) (xy 6.194840 -0.698251) (xy 6.184162 -0.787400) (xy 6.121886 -1.178070) (xy 6.035562 -1.561639) (xy 5.925787 -1.937152)
     (xy 5.793157 -2.303654) (xy 5.638269 -2.660190) (xy 5.461721 -3.005806) (xy 5.264109 -3.339545) (xy 5.046030 -3.660454) (xy 4.808082 -3.967578) (xy 4.550860 -4.259961) (xy 4.274961 -4.536649)
     (xy 3.980984 -4.796686) (xy 3.669524 -5.039119) (xy 3.417396 -5.213697) (xy 3.079938 -5.420286) (xy 2.730798 -5.604523) (xy 2.371088 -5.765997) (xy 2.001921 -5.904297) (xy 1.624407 -6.019013)
     (xy 1.239659 -6.109735) (xy 0.848789 -6.176053) (xy 0.787400 -6.184163) (xy 0.393747 -6.221637) (xy 0.001879 -6.234184) (xy -0.387208 -6.222261) (xy -0.772517 -6.186328) (xy -1.153054 -6.126845)
     (xy -1.527821 -6.044271) (xy -1.895821 -5.939065) (xy -2.256060 -5.811687) (xy -2.607539 -5.662596) (xy -2.949264 -5.492251) (xy -3.280238 -5.301111) (xy -3.599464 -5.089637) (xy -3.905946 -4.858287)
     (xy -4.198688 -4.607520) (xy -4.476694 -4.337796) (xy -4.738967 -4.049575) (xy -4.984511 -3.743315) (xy -5.212330 -3.419477) (xy -5.213697 -3.417397) (xy -5.420286 -3.079939) (xy -5.604523 -2.730799)
     (xy -5.765997 -2.371089) (xy -5.904297 -2.001922) (xy -6.019013 -1.624408) (xy -6.109735 -1.239660) (xy -6.176053 -0.848790) (xy -6.184163 -0.787400) (xy -6.221637 -0.393748) (xy -6.234184 -0.001880)
     (xy -6.499002 -0.001880) (xy -6.499665 -0.174317) (xy -6.476951 -0.573562) (xy -6.429836 -0.971143) (xy -6.375335 -1.282700) (xy -6.283848 -1.675239) (xy -6.168523 -2.059911) (xy -6.029984 -2.435688)
     (xy -5.868855 -2.801540) (xy -5.685761 -3.156437) (xy -5.481325 -3.499350) (xy -5.256173 -3.829250) (xy -5.010928 -4.145106) (xy -4.746215 -4.445889) (xy -4.462658 -4.730569) (xy -4.160882 -4.998117)
     (xy -4.084366 -5.060833) (xy -3.760507 -5.306039) (xy -3.424034 -5.529439) (xy -3.075917 -5.730692) (xy -2.717124 -5.909455) (xy -2.348624 -6.065386) (xy -1.971386 -6.198143) (xy -1.586380 -6.307383)
     (xy -1.194575 -6.392765) (xy -0.796939 -6.453946) (xy -0.394442 -6.490584) (xy -0.002380 -6.502349) (xy 0.403177 -6.489927) )(layer F.SilkS) (width  0.010000)
  )
  (fp_poly (pts (xy 0.443161 5.466995) (xy 0.483015 5.469570) (xy 0.498975 5.472683) (xy 0.529009 5.496808) (xy 0.543751 5.526887) (xy 0.550764 5.562190) (xy 0.556545 5.614247) (xy 0.560869 5.676504)
     (xy 0.563509 5.742412) (xy 0.564241 5.805419) (xy 0.562839 5.858973) (xy 0.559078 5.896522) (xy 0.556787 5.905814) (xy 0.547197 5.925343) (xy 0.531580 5.940436) (xy 0.506659 5.951864)
     (xy 0.469155 5.960394) (xy 0.415789 5.966797) (xy 0.343282 5.971840) (xy 0.258006 5.975893) (xy 0.052463 5.984517) (xy 0.021301 5.953356) (xy 0.009000 5.939548) (xy 0.000099 5.923665)
     (xy -0.006254 5.901162) (xy -0.010911 5.867492) (xy -0.014723 5.818111) (xy -0.018542 5.748473) (xy -0.019073 5.737907) (xy -0.022521 5.655995) (xy -0.022869 5.595619) (xy -0.021823 5.583449)
     (xy 0.076718 5.583449) (xy 0.077122 5.617436) (xy 0.078893 5.666898) (xy 0.081895 5.726901) (xy 0.082353 5.734960) (xy 0.091626 5.895734) (xy 0.277588 5.886578) (xy 0.343311 5.883175)
     (xy 0.399257 5.879960) (xy 0.440893 5.877218) (xy 0.463684 5.875236) (xy 0.466575 5.874677) (xy 0.467106 5.861713) (xy 0.466395 5.828241) (xy 0.464593 5.779117) (xy 0.461855 5.719193)
     (xy 0.461379 5.709696) (xy 0.453156 5.547461) (xy 0.267853 5.556512) (xy 0.202075 5.559989) (xy 0.145913 5.563460) (xy 0.103966 5.566601) (xy 0.080831 5.569089) (xy 0.077815 5.569874)
     (xy 0.076718 5.583449) (xy -0.021823 5.583449) (xy -0.019204 5.553013) (xy -0.010617 5.524408) (xy 0.003803 5.506035) (xy 0.024966 5.494126) (xy 0.041177 5.488548) (xy 0.072492 5.482590)
     (xy 0.121866 5.477267) (xy 0.183686 5.472775) (xy 0.252337 5.469307) (xy 0.322209 5.467058) (xy 0.387688 5.466223) (xy 0.443161 5.466995) )(layer F.SilkS) (width  0.010000)
  )
  (fp_poly (pts (xy -0.911712 5.402884) (xy -0.860162 5.408311) (xy -0.800971 5.415708) (xy -0.739939 5.424310) (xy -0.682866 5.433355) (xy -0.635551 5.442077) (xy -0.607895 5.448512) (xy -0.542700 5.478642)
     (xy -0.493058 5.525994) (xy -0.460461 5.586638) (xy -0.446402 5.656643) (xy -0.452373 5.732078) (xy -0.474905 5.798813) (xy -0.507159 5.855143) (xy -0.545427 5.892929) (xy -0.595076 5.915333)
     (xy -0.661475 5.925521) (xy -0.692150 5.926846) (xy -0.753790 5.925681) (xy -0.826860 5.920542) (xy -0.897885 5.912452) (xy -0.914316 5.909997) (xy -0.966664 5.901229) (xy -1.008776 5.893317)
     (xy -1.034886 5.887390) (xy -1.040431 5.885303) (xy -1.041995 5.869982) (xy -1.039776 5.834598) (xy -1.037540 5.813191) (xy -0.934097 5.813191) (xy -0.921404 5.816703) (xy -0.891101 5.822659)
     (xy -0.862776 5.827581) (xy -0.789140 5.836855) (xy -0.720648 5.840105) (xy -0.664106 5.837264) (xy -0.630141 5.829866) (xy -0.590156 5.801627) (xy -0.563365 5.752144) (xy -0.550141 5.686982)
     (xy -0.547462 5.644486) (xy -0.552158 5.616137) (xy -0.566870 5.591127) (xy -0.576436 5.579296) (xy -0.600980 5.556212) (xy -0.633694 5.538148) (xy -0.679075 5.523594) (xy -0.741621 5.511041)
     (xy -0.809625 5.501085) (xy -0.850743 5.495825) (xy -0.879701 5.492444) (xy -0.889761 5.491676) (xy -0.892201 5.504540) (xy -0.897116 5.536623) (xy -0.903708 5.582121) (xy -0.911175 5.635231)
     (xy -0.918717 5.690149) (xy -0.925534 5.741072) (xy -0.930825 5.782197) (xy -0.933791 5.807721) (xy -0.934097 5.813191) (xy -1.037540 5.813191) (xy -1.034484 5.783944) (xy -1.026829 5.722810)
     (xy -1.017520 5.655989) (xy -1.007267 5.588273) (xy -0.996780 5.524452) (xy -0.986769 5.469319) (xy -0.977943 5.427666) (xy -0.971013 5.404283) (xy -0.968691 5.400995) (xy -0.949822 5.400191)
     (xy -0.911712 5.402884) )(layer F.SilkS) (width  0.010000)
  )
  (fp_poly (pts (xy 1.403017 5.310809) (xy 1.407983 5.324824) (xy 1.414876 5.353014) (xy 1.415158 5.354327) (xy 1.423584 5.393704) (xy 1.329149 5.409857) (xy 1.281686 5.418747) (xy 1.243591 5.427298)
     (xy 1.222228 5.433833) (xy 1.221022 5.434473) (xy 1.217191 5.449045) (xy 1.219832 5.484802) (xy 1.229082 5.542826) (xy 1.245080 5.624197) (xy 1.245452 5.625983) (xy 1.258730 5.692147)
     (xy 1.269476 5.750373) (xy 1.276849 5.795711) (xy 1.280006 5.823213) (xy 1.279885 5.828186) (xy 1.266945 5.843120) (xy 1.241254 5.854079) (xy 1.213209 5.858563) (xy 1.193205 5.854078)
     (xy 1.189971 5.849780) (xy 1.185713 5.832776) (xy 1.177583 5.795748) (xy 1.166622 5.743592) (xy 1.153869 5.681205) (xy 1.149174 5.657850) (xy 1.135782 5.593362) (xy 1.123327 5.537754)
     (xy 1.112947 5.495812) (xy 1.105786 5.472324) (xy 1.104226 5.469319) (xy 1.088214 5.466684) (xy 1.054106 5.469289) (xy 1.008526 5.476542) (xy 0.996298 5.478974) (xy 0.949681 5.488018)
     (xy 0.913792 5.493854) (xy 0.894866 5.495504) (xy 0.893495 5.495128) (xy 0.888273 5.480983) (xy 0.881691 5.453033) (xy 0.874118 5.415169) (xy 1.136711 5.360919) (xy 1.214752 5.345018)
     (xy 1.283918 5.331348) (xy 1.340521 5.320604) (xy 1.380871 5.313480) (xy 1.401283 5.310669) (xy 1.403017 5.310809) )(layer F.SilkS) (width  0.010000)
  )
  (fp_poly (pts (xy -1.791558 5.175145) (xy -1.768587 5.181355) (xy -1.726371 5.193792) (xy -1.669860 5.210956) (xy -1.604008 5.231353) (xy -1.562100 5.244510) (xy -1.488795 5.267882) (xy -1.436412 5.285487)
     (xy -1.401566 5.298925) (xy -1.380872 5.309797) (xy -1.370943 5.319704) (xy -1.368396 5.330246) (xy -1.368790 5.335919) (xy -1.375893 5.363574) (xy -1.383044 5.375923) (xy -1.398375 5.376164)
     (xy -1.433209 5.369528) (xy -1.482926 5.357104) (xy -1.542910 5.339979) (xy -1.567039 5.332588) (xy -1.642205 5.310252) (xy -1.699560 5.295574) (xy -1.737075 5.289012) (xy -1.752357 5.290576)
     (xy -1.761613 5.310680) (xy -1.767785 5.343201) (xy -1.768021 5.345777) (xy -1.771650 5.388944) (xy -1.667095 5.420461) (xy -1.616742 5.436064) (xy -1.586370 5.447577) (xy -1.571557 5.457954)
     (xy -1.567881 5.470150) (xy -1.570426 5.485063) (xy -1.577887 5.512691) (xy -1.582836 5.526348) (xy -1.596136 5.526629) (xy -1.627416 5.520074) (xy -1.670609 5.508027) (xy -1.683164 5.504123)
     (xy -1.730820 5.489678) (xy -1.770356 5.478947) (xy -1.794525 5.473867) (xy -1.796937 5.473700) (xy -1.810136 5.484725) (xy -1.824334 5.511942) (xy -1.835940 5.546556) (xy -1.841365 5.579778)
     (xy -1.841430 5.582676) (xy -1.829968 5.591109) (xy -1.798490 5.604692) (xy -1.751442 5.621730) (xy -1.693270 5.640527) (xy -1.675749 5.645829) (xy -1.613908 5.664571) (xy -1.560492 5.681326)
     (xy -1.520417 5.694509) (xy -1.498596 5.702538) (xy -1.496591 5.703541) (xy -1.490655 5.718692) (xy -1.491120 5.745056) (xy -1.496427 5.771905) (xy -1.505018 5.788512) (xy -1.509135 5.789868)
     (xy -1.523417 5.785804) (xy -1.557939 5.775320) (xy -1.608721 5.759643) (xy -1.671782 5.740002) (xy -1.739900 5.718645) (xy -1.810668 5.696249) (xy -1.872616 5.676377) (xy -1.921849 5.660298)
     (xy -1.954477 5.649283) (xy -1.966570 5.644649) (xy -1.964346 5.631843) (xy -1.955546 5.598573) (xy -1.941248 5.548595) (xy -1.922528 5.485664) (xy -1.900466 5.413535) (xy -1.897577 5.404222)
     (xy -1.872280 5.323103) (xy -1.853058 5.263177) (xy -1.838487 5.221369) (xy -1.827144 5.194602) (xy -1.817607 5.179803) (xy -1.808451 5.173894) (xy -1.798254 5.173802) (xy -1.791558 5.175145) )(layer F.SilkS) (width  0.010000)
  )
  (fp_poly (pts (xy 2.673987 5.057155) (xy 2.754100 5.113726) (xy 2.815509 5.157386) (xy 2.860117 5.190073) (xy 2.889828 5.213727) (xy 2.906544 5.230285) (xy 2.912170 5.241688) (xy 2.908609 5.249873)
     (xy 2.897762 5.256779) (xy 2.881535 5.264344) (xy 2.878698 5.265683) (xy 2.832433 5.287745) (xy 2.775676 5.246985) (xy 2.718920 5.206226) (xy 2.438400 5.346912) (xy 2.438400 5.409979)
     (xy 2.436795 5.448955) (xy 2.429291 5.471480) (xy 2.411851 5.486437) (xy 2.400930 5.492423) (xy 2.362845 5.508793) (xy 2.343107 5.508651) (xy 2.340722 5.491951) (xy 2.341341 5.489575)
     (xy 2.343857 5.469922) (xy 2.346864 5.429588) (xy 2.350085 5.373276) (xy 2.353243 5.305693) (xy 2.355367 5.251450) (xy 2.356257 5.227688) (xy 2.444772 5.227688) (xy 2.445112 5.244356)
     (xy 2.445441 5.245100) (xy 2.457289 5.240217) (xy 2.486706 5.227204) (xy 2.528171 5.208515) (xy 2.544764 5.200970) (xy 2.588898 5.180292) (xy 2.622493 5.163476) (xy 2.640169 5.153257)
     (xy 2.641600 5.151731) (xy 2.632220 5.142252) (xy 2.607844 5.122813) (xy 2.574115 5.097489) (xy 2.536678 5.070357) (xy 2.501177 5.045490) (xy 2.473255 5.026964) (xy 2.458556 5.018856)
     (xy 2.457637 5.018895) (xy 2.455585 5.032033) (xy 2.452998 5.063065) (xy 2.450250 5.105069) (xy 2.447714 5.151122) (xy 2.445764 5.194303) (xy 2.444772 5.227688) (xy 2.356257 5.227688)
     (xy 2.358937 5.156153) (xy 2.362325 5.082991) (xy 2.366151 5.028708) (xy 2.371033 4.990051) (xy 2.377592 4.963766) (xy 2.386446 4.946601) (xy 2.398217 4.935299) (xy 2.413522 4.926609)
     (xy 2.417594 4.924644) (xy 2.458725 4.905030) (xy 2.673987 5.057155) )(layer F.SilkS) (width  0.010000)
  )
  (fp_poly (pts (xy 1.917995 5.371127) (xy 1.928956 5.387139) (xy 1.933210 5.408954) (xy 1.932452 5.425406) (xy 1.922368 5.438250) (xy 1.898118 5.450919) (xy 1.854864 5.466847) (xy 1.848551 5.469009)
     (xy 1.795051 5.486722) (xy 1.760369 5.495590) (xy 1.739410 5.495333) (xy 1.727078 5.485670) (xy 1.718278 5.466319) (xy 1.716660 5.461737) (xy 1.703635 5.424374) (xy 1.805440 5.390470)
     (xy 1.860596 5.373423) (xy 1.896661 5.366765) (xy 1.917995 5.371127) )(layer F.SilkS) (width  0.010000)
  )
  (fp_poly (pts (xy -2.608862 4.822476) (xy -2.575713 4.832404) (xy -2.529851 4.851795) (xy -2.467314 4.881630) (xy -2.432050 4.899035) (xy -2.355222 4.938269) (xy -2.299464 4.970456) (xy -2.262484 4.998512)
     (xy -2.241986 5.025353) (xy -2.235679 5.053896) (xy -2.241267 5.087056) (xy -2.254956 5.124180) (xy -2.269230 5.154160) (xy -2.284212 5.165877) (xy -2.309485 5.164865) (xy -2.321631 5.162698)
     (xy -2.352931 5.156144) (xy -2.370996 5.151018) (xy -2.372270 5.150289) (xy -2.369718 5.137745) (xy -2.358807 5.110890) (xy -2.354119 5.100781) (xy -2.341585 5.070806) (xy -2.337038 5.052060)
     (xy -2.337699 5.049868) (xy -2.351148 5.042014) (xy -2.381555 5.026070) (xy -2.423365 5.004794) (xy -2.471022 4.980945) (xy -2.518971 4.957281) (xy -2.561655 4.936561) (xy -2.593520 4.921543)
     (xy -2.609010 4.914987) (xy -2.609514 4.914900) (xy -2.616912 4.925430) (xy -2.632778 4.953512) (xy -2.654411 4.993883) (xy -2.679114 5.041282) (xy -2.704187 5.090446) (xy -2.726932 5.136112)
     (xy -2.744650 5.173019) (xy -2.754641 5.195905) (xy -2.755900 5.200332) (xy -2.745228 5.208152) (xy -2.716116 5.224784) (xy -2.672921 5.247842) (xy -2.620003 5.274940) (xy -2.616109 5.276895)
     (xy -2.476318 5.347003) (xy -2.449011 5.290798) (xy -2.421705 5.234593) (xy -2.385603 5.261285) (xy -2.359456 5.286033) (xy -2.351732 5.311783) (xy -2.362527 5.344141) (xy -2.387680 5.382894)
     (xy -2.421116 5.420587) (xy -2.450784 5.435270) (xy -2.455795 5.435600) (xy -2.477881 5.430160) (xy -2.517419 5.415256) (xy -2.569259 5.393013) (xy -2.628250 5.365556) (xy -2.643040 5.358358)
     (xy -2.721388 5.318828) (xy -2.779000 5.286896) (xy -2.818637 5.260517) (xy -2.843060 5.237642) (xy -2.855031 5.216226) (xy -2.857500 5.199378) (xy -2.851366 5.173576) (xy -2.834834 5.131515)
     (xy -2.810716 5.078636) (xy -2.781820 5.020375) (xy -2.750957 4.962173) (xy -2.720935 4.909468) (xy -2.694566 4.867699) (xy -2.674658 4.842305) (xy -2.671659 4.839638) (xy -2.652872 4.827075)
     (xy -2.633260 4.821027) (xy -2.608862 4.822476) )(layer F.SilkS) (width  0.010000)
  )
  (fp_poly (pts (xy 0.476410 -5.063224) (xy 0.828430 -5.018468) (xy 1.180413 -4.948820) (xy 1.197349 -4.944847) (xy 1.257070 -4.929560) (xy 1.307019 -4.913040) (xy 1.351670 -4.892447) (xy 1.395501 -4.864945)
     (xy 1.442986 -4.827695) (xy 1.498602 -4.777861) (xy 1.566825 -4.712604) (xy 1.572724 -4.706863) (xy 1.738661 -4.528351) (xy 1.882155 -4.338108) (xy 2.002942 -4.136726) (xy 2.100757 -3.924794)
     (xy 2.175334 -3.702906) (xy 2.226409 -3.471652) (xy 2.253717 -3.231624) (xy 2.256357 -3.181350) (xy 2.253977 -2.943707) (xy 2.227098 -2.709834) (xy 2.176428 -2.481487) (xy 2.102676 -2.260420)
     (xy 2.006551 -2.048388) (xy 1.888762 -1.847145) (xy 1.750017 -1.658446) (xy 1.591027 -1.484045) (xy 1.557458 -1.451599) (xy 1.510720 -1.408991) (xy 1.457023 -1.362636) (xy 1.400578 -1.315877)
     (xy 1.345595 -1.272060) (xy 1.296284 -1.234529) (xy 1.256857 -1.206626) (xy 1.231522 -1.191698) (xy 1.229006 -1.190719) (xy 1.231047 -1.178692) (xy 1.243550 -1.146795) (xy 1.265279 -1.097708)
     (xy 1.295000 -1.034107) (xy 1.331477 -0.958670) (xy 1.373477 -0.874076) (xy 1.391246 -0.838865) (xy 1.567283 -0.491611) (xy 1.526510 -0.418007) (xy 1.477881 -0.329989) (xy 1.424361 -0.232702)
     (xy 1.367168 -0.128398) (xy 1.307522 -0.019325) (xy 1.246643 0.092267) (xy 1.185748 0.204129) (xy 1.126058 0.314011) (xy 1.068792 0.419665) (xy 1.015169 0.518840) (xy 0.966407 0.609287)
     (xy 0.923727 0.688757) (xy 0.888347 0.755000) (xy 0.861487 0.805768) (xy 0.844366 0.838810) (xy 0.838203 0.851877) (xy 0.838200 0.851924) (xy 0.848685 0.861750) (xy 0.860425 0.863439)
     (xy 0.887427 0.867126) (xy 0.927491 0.877042) (xy 0.974364 0.891073) (xy 1.021793 0.907103) (xy 1.063527 0.923017) (xy 1.093312 0.936700) (xy 1.104896 0.946037) (xy 1.104900 0.946141)
     (xy 1.093900 0.958798) (xy 1.066378 0.972303) (xy 1.054633 0.976239) (xy 1.020991 0.988829) (xy 0.998847 1.001719) (xy 0.995941 1.004931) (xy 0.996943 1.024143) (xy 1.016066 1.045645)
     (xy 1.047122 1.064375) (xy 1.081515 1.074906) (xy 1.103210 1.077294) (xy 1.120835 1.073954) (xy 1.139205 1.061463) (xy 1.163133 1.036400) (xy 1.197433 0.995340) (xy 1.202993 0.988541)
     (xy 1.250017 0.933895) (xy 1.302302 0.877874) (xy 1.355597 0.824569) (xy 1.405654 0.778072) (xy 1.416328 0.769145) (xy 2.208415 0.769145) (xy 2.229116 0.780619) (xy 2.266950 0.799527)
     (xy 2.309684 0.820504) (xy 2.334420 0.832146) (xy 2.346044 0.836139) (xy 2.349441 0.834169) (xy 2.349500 0.828008) (xy 2.338614 0.818372) (xy 2.310530 0.804196) (xy 2.283180 0.793083)
     (xy 2.235113 0.775510) (xy 2.210303 0.767486) (xy 2.208415 0.769145) (xy 1.416328 0.769145) (xy 1.448222 0.742472) (xy 1.460021 0.734583) (xy 2.235200 0.734583) (xy 2.245787 0.743376)
     (xy 2.272192 0.757147) (xy 2.306380 0.772143) (xy 2.340315 0.784615) (xy 2.346325 0.786464) (xy 2.349493 0.778078) (xy 2.349500 0.777439) (xy 2.338681 0.767615) (xy 2.311167 0.753829)
     (xy 2.292350 0.746297) (xy 2.259336 0.735813) (xy 2.238694 0.732626) (xy 2.235200 0.734583) (xy 1.460021 0.734583) (xy 1.479050 0.721861) (xy 1.481023 0.720917) (xy 1.504165 0.706356)
     (xy 1.507571 0.690770) (xy 1.489965 0.671764) (xy 1.450070 0.646945) (xy 1.438078 0.640415) (xy 1.397364 0.616914) (xy 1.374503 0.597807) (xy 1.364020 0.577437) (xy 1.361270 0.561040)
     (xy 1.360530 0.534202) (xy 1.370270 0.523041) (xy 1.397494 0.520711) (xy 1.402545 0.520700) (xy 1.436138 0.516792) (xy 1.445611 0.505374) (xy 1.430961 0.486900) (xy 1.402807 0.467897)
     (xy 1.376024 0.450502) (xy 1.362716 0.438659) (xy 1.362474 0.436692) (xy 1.377335 0.437626) (xy 1.412173 0.446983) (xy 1.463499 0.463462) (xy 1.527825 0.485766) (xy 1.601661 0.512595)
     (xy 1.681519 0.542651) (xy 1.763908 0.574636) (xy 1.845341 0.607251) (xy 1.922328 0.639197) (xy 1.991379 0.669176) (xy 2.011393 0.678216) (xy 2.111437 0.723930) (xy 2.133883 0.703678)
     (xy 2.280141 0.703678) (xy 2.296684 0.716383) (xy 2.298700 0.717550) (xy 2.327319 0.731473) (xy 2.343702 0.735101) (xy 2.343808 0.728484) (xy 2.331197 0.717146) (xy 2.303955 0.702564)
     (xy 2.286747 0.698950) (xy 2.280141 0.703678) (xy 2.133883 0.703678) (xy 2.157443 0.682421) (xy 2.196953 0.649768) (xy 2.239081 0.619224) (xy 2.250069 0.612141) (xy 2.278908 0.592501)
     (xy 2.290009 0.575945) (xy 2.287933 0.553390) (xy 2.284994 0.542594) (xy 2.276711 0.497283) (xy 2.276152 0.484848) (xy 2.362258 0.484848) (xy 2.371683 0.493201) (xy 2.374900 0.495300)
     (xy 2.403734 0.505539) (xy 2.419350 0.506912) (xy 2.444750 0.506214) (xy 2.419350 0.495300) (xy 2.389679 0.485901) (xy 2.374900 0.483687) (xy 2.362258 0.484848) (xy 2.276152 0.484848)
     (xy 2.274384 0.445535) (xy 2.275042 0.433706) (xy 2.364451 0.433706) (xy 2.366286 0.439301) (xy 2.384205 0.450733) (xy 2.416411 0.465519) (xy 2.453015 0.479221) (xy 2.460625 0.481633)
     (xy 2.463759 0.473057) (xy 2.463800 0.471276) (xy 2.453065 0.459983) (xy 2.433229 0.452280) (xy 2.398901 0.442613) (xy 2.379254 0.436180) (xy 2.364451 0.433706) (xy 2.275042 0.433706)
     (xy 2.277289 0.393325) (xy 2.277598 0.391374) (xy 2.362200 0.391374) (xy 2.373118 0.399081) (xy 2.400220 0.410148) (xy 2.435029 0.421860) (xy 2.469065 0.431501) (xy 2.493851 0.436355)
     (xy 2.500841 0.435780) (xy 2.500841 0.426752) (xy 2.484883 0.419021) (xy 2.455234 0.409386) (xy 2.420114 0.399942) (xy 2.387746 0.392788) (xy 2.366350 0.390022) (xy 2.362200 0.391374)
     (xy 2.277598 0.391374) (xy 2.284707 0.346631) (xy 2.295915 0.311427) (xy 2.310191 0.293690) (xy 2.315171 0.292673) (xy 2.334449 0.298786) (xy 2.366725 0.313748) (xy 2.387600 0.324766)
     (xy 2.444750 0.356285) (xy 2.400300 0.348109) (xy 2.370760 0.344159) (xy 2.363028 0.346545) (xy 2.374722 0.353862) (xy 2.403457 0.364705) (xy 2.446851 0.377670) (xy 2.453464 0.379443)
     (xy 2.512172 0.395947) (xy 2.549493 0.409927) (xy 2.568886 0.424126) (xy 2.573811 0.441290) (xy 2.567728 0.464162) (xy 2.565918 0.468647) (xy 2.548149 0.497391) (xy 2.517506 0.534287)
     (xy 2.481189 0.570807) (xy 2.446130 0.603774) (xy 2.427023 0.625918) (xy 2.420635 0.643062) (xy 2.423730 0.661026) (xy 2.426620 0.669017) (xy 2.433349 0.699282) (xy 2.438249 0.745405)
     (xy 2.440337 0.797854) (xy 2.440354 0.802334) (xy 2.440405 0.899818) (xy 2.639427 1.033001) (xy 2.926565 1.240012) (xy 3.195642 1.464521) (xy 3.446148 1.705980) (xy 3.677574 1.963839)
     (xy 3.889410 2.237548) (xy 4.081145 2.526558) (xy 4.177101 2.690500) (xy 4.243486 2.809251) (xy 4.208864 2.861950) (xy 4.133700 2.970194) (xy 4.043714 3.089543) (xy 3.943351 3.214549)
     (xy 3.837052 3.339763) (xy 3.729262 3.459737) (xy 3.671068 3.521394) (xy 3.618009 3.576222) (xy 3.578453 3.614684) (xy 3.548152 3.638580) (xy 3.522860 3.649713) (xy 3.498329 3.649884)
     (xy 3.470312 3.640897) (xy 3.434563 3.624552) (xy 3.431433 3.623071) (xy 3.398807 3.611182) (xy 3.379083 3.614261) (xy 3.374918 3.617701) (xy 3.347946 3.629282) (xy 3.304755 3.631084)
     (xy 3.252601 3.623021) (xy 3.238500 3.619307) (xy 3.209551 3.606316) (xy 3.167300 3.581571) (xy 3.118337 3.549111) (xy 3.086100 3.525840) (xy 3.026706 3.482365) (xy 2.983646 3.453802)
     (xy 2.953635 3.438938) (xy 2.933382 3.436556) (xy 2.919602 3.445440) (xy 2.910527 3.460931) (xy 2.903354 3.485195) (xy 2.906801 3.511505) (xy 2.922213 3.549385) (xy 2.923374 3.551863)
     (xy 2.950486 3.598426) (xy 2.984993 3.644024) (xy 2.996292 3.656274) (xy 3.029167 3.686448) (xy 3.072094 3.721654) (xy 3.120653 3.758769) (xy 3.170422 3.794672) (xy 3.216983 3.826243)
     (xy 3.255913 3.850359) (xy 3.282794 3.863900) (xy 3.292312 3.865288) (xy 3.299825 3.864794) (xy 3.296425 3.872245) (xy 3.277503 3.893254) (xy 3.240953 3.925466) (xy 3.189904 3.966670)
     (xy 3.127485 4.014653) (xy 3.056824 4.067202) (xy 2.981048 4.122104) (xy 2.903286 4.177148) (xy 2.826666 4.230120) (xy 2.754317 4.278808) (xy 2.689366 4.320999) (xy 2.634943 4.354481)
     (xy 2.594174 4.377041) (xy 2.570189 4.386466) (xy 2.569245 4.386575) (xy 2.554907 4.377448) (xy 2.531434 4.352168) (xy 2.503522 4.315885) (xy 2.499157 4.309689) (xy 2.385487 4.152554)
     (xy 2.275196 4.012319) (xy 2.170043 3.891093) (xy 2.071783 3.790981) (xy 2.049529 3.770427) (xy 2.029161 3.754314) (xy 2.013776 3.754879) (xy 1.993292 3.769838) (xy 1.963974 3.793578)
     (xy 2.003490 3.863595) (xy 2.044022 3.930853) (xy 2.092948 4.005032) (xy 2.145584 4.079595) (xy 2.197247 4.148000) (xy 2.243253 4.203711) (xy 2.260721 4.222750) (xy 2.291436 4.260175)
     (xy 2.323964 4.308648) (xy 2.354687 4.361587) (xy 2.379982 4.412412) (xy 2.396229 4.454541) (xy 2.400300 4.476468) (xy 2.389144 4.487690) (xy 2.357924 4.507094) (xy 2.310007 4.533066)
     (xy 2.248764 4.563991) (xy 2.177563 4.598252) (xy 2.099774 4.634235) (xy 2.018765 4.670324) (xy 1.937906 4.704905) (xy 1.860565 4.736361) (xy 1.847850 4.741344) (xy 1.508942 4.859754)
     (xy 1.163326 4.953695) (xy 0.811612 5.023018) (xy 0.529713 5.060293) (xy 0.449011 5.067314) (xy 0.351776 5.073585) (xy 0.244060 5.078912) (xy 0.131915 5.083101) (xy 0.021391 5.085957)
     (xy -0.081459 5.087285) (xy -0.170584 5.086892) (xy -0.234950 5.084858) (xy -0.444666 5.069005) (xy -0.664767 5.043697) (xy -0.884492 5.010424) (xy -1.093079 4.970674) (xy -1.149350 4.958284)
     (xy -1.245465 4.935950) (xy -1.330657 4.914915) (xy -1.409644 4.893704) (xy -1.487142 4.870840) (xy -1.567868 4.844849) (xy -1.656540 4.814253) (xy -1.757874 4.777576) (xy -1.876588 4.733343)
     (xy -1.917700 4.717849) (xy -1.946214 4.706231) (xy -1.991753 4.686715) (xy -2.048234 4.661943) (xy -2.109573 4.634559) (xy -2.114550 4.632315) (xy -2.180633 4.602204) (xy -2.225896 4.578653)
     (xy -2.252478 4.557355) (xy -2.262518 4.534002) (xy -2.258153 4.504286) (xy -2.241522 4.463899) (xy -2.220136 4.419600) (xy -2.172468 4.342271) (xy -2.107312 4.265452) (xy -2.031678 4.196368)
     (xy -1.952574 4.142243) (xy -1.949274 4.140402) (xy -1.893514 4.104132) (xy -1.852794 4.062844) (xy -1.832425 4.033472) (xy -1.793833 3.975649) (xy -1.751291 3.918212) (xy -1.709154 3.866513)
     (xy -1.671777 3.825907) (xy -1.644252 3.802221) (xy -1.613329 3.787257) (xy -1.569554 3.772131) (xy -1.541816 3.764741) (xy -1.496500 3.751873) (xy -1.456966 3.736708) (xy -1.440681 3.728113)
     (xy -1.397512 3.687209) (xy -1.361588 3.629307) (xy -1.337532 3.562672) (xy -1.332050 3.533851) (xy -1.327376 3.512061) (xy 0.510833 3.512061) (xy 0.524114 3.517107) (xy 0.555873 3.527215)
     (xy 0.600121 3.540623) (xy 0.650872 3.555565) (xy 0.702137 3.570278) (xy 0.747928 3.582998) (xy 0.781050 3.591665) (xy 0.828830 3.602105) (xy 0.859241 3.604751) (xy 0.878972 3.599957)
     (xy 0.883869 3.597080) (xy 0.896579 3.578914) (xy 0.906954 3.549650) (xy 0.920405 3.510874) (xy 0.935300 3.481910) (xy 0.964884 3.453297) (xy 1.010083 3.427747) (xy 1.061154 3.409793)
     (xy 1.103026 3.403878) (xy 1.135168 3.408141) (xy 1.183538 3.419676) (xy 1.240841 3.436180) (xy 1.299781 3.455347) (xy 1.353061 3.474874) (xy 1.393384 3.492456) (xy 1.406078 3.499583)
     (xy 1.431261 3.512655) (xy 1.457340 3.516368) (xy 1.491041 3.510174) (xy 1.539089 3.493520) (xy 1.554753 3.487412) (xy 1.610330 3.467657) (xy 1.670345 3.449589) (xy 1.704487 3.441050)
     (xy 1.750455 3.432702) (xy 1.784224 3.432518) (xy 1.817804 3.440978) (xy 1.831911 3.446138) (xy 1.866097 3.458637) (xy 1.889416 3.466137) (xy 1.894129 3.467100) (xy 1.896723 3.455355)
     (xy 1.897621 3.423835) (xy 1.896756 3.378114) (xy 1.895539 3.349625) (xy 1.893453 3.289481) (xy 1.895223 3.244985) (xy 1.902131 3.206516) (xy 1.915460 3.164454) (xy 1.922874 3.144473)
     (xy 1.938159 3.101321) (xy 1.947888 3.068128) (xy 1.950239 3.051244) (xy 1.949863 3.050530) (xy 1.935587 3.051056) (xy 1.904083 3.058413) (xy 1.862091 3.071020) (xy 1.860893 3.071412)
     (xy 1.778190 3.098562) (xy 1.722806 3.071654) (xy 1.667423 3.044747) (xy 1.608091 3.079518) (xy 1.555775 3.103896) (xy 1.515589 3.108151) (xy 1.514154 3.107905) (xy 1.475283 3.097058)
     (xy 1.426429 3.078527) (xy 1.376338 3.056188) (xy 1.333757 3.033919) (xy 1.308805 3.016888) (xy 1.289650 2.990370) (xy 1.269851 2.949310) (xy 1.253588 2.904106) (xy 1.245042 2.865154)
     (xy 1.244600 2.857205) (xy 1.235758 2.832605) (xy 1.221405 2.815045) (xy 1.207367 2.804722) (xy 1.192094 2.802857) (xy 1.169013 2.810727) (xy 1.131555 2.829607) (xy 1.122980 2.834166)
     (xy 1.084102 2.855125) (xy 1.054989 2.871249) (xy 1.042098 2.878949) (xy 1.047959 2.889306) (xy 1.068332 2.913331) (xy 1.099598 2.946904) (xy 1.121473 2.969303) (xy 1.158332 3.007950)
     (xy 1.187135 3.041010) (xy 1.203879 3.063739) (xy 1.206500 3.070096) (xy 1.195312 3.090193) (xy 1.167008 3.104195) (xy 1.129475 3.110472) (xy 1.090601 3.107397) (xy 1.066997 3.098905)
     (xy 1.046959 3.077737) (xy 1.035594 3.050478) (xy 1.020159 3.024102) (xy 0.988098 2.992509) (xy 0.946151 2.960429) (xy 0.901061 2.932595) (xy 0.859571 2.913741) (xy 0.833036 2.908300)
     (xy 0.811325 2.911161) (xy 0.801980 2.924652) (xy 0.799879 2.955925) (xy 0.794203 3.020217) (xy 0.779440 3.096215) (xy 0.758223 3.173094) (xy 0.733186 3.240027) (xy 0.728093 3.250978)
     (xy 0.698955 3.298892) (xy 0.655379 3.355176) (xy 0.602977 3.412610) (xy 0.600706 3.414900) (xy 0.562560 3.453845) (xy 0.532641 3.485563) (xy 0.514524 3.506190) (xy 0.510833 3.512061)
     (xy -1.327376 3.512061) (xy -1.319458 3.475160) (xy -1.296941 3.431069) (xy -1.274851 3.409950) (xy 0.215900 3.409950) (xy 0.222250 3.416300) (xy 0.228600 3.409950) (xy 0.222250 3.403600)
     (xy 0.215900 3.409950) (xy -1.274851 3.409950) (xy -1.259692 3.395458) (xy -1.202901 3.362202) (xy -1.193680 3.357659) (xy -1.153158 3.333791) (xy 0.242603 3.333791) (xy 0.248186 3.349611)
     (xy 0.267564 3.379414) (xy 0.290361 3.405695) (xy 0.308437 3.416520) (xy 0.317248 3.409474) (xy 0.317500 3.405976) (xy 0.309100 3.391480) (xy 0.288101 3.367759) (xy 0.279400 3.359150)
     (xy 0.253165 3.336700) (xy 0.242603 3.333791) (xy -1.153158 3.333791) (xy -1.131404 3.320978) (xy -1.079790 3.278107) (xy -1.043315 3.233528) (xy -1.030972 3.202918) (xy 0.218085 3.202918)
     (xy 0.223784 3.216738) (xy 0.242957 3.242826) (xy 0.271012 3.276190) (xy 0.303356 3.311840) (xy 0.335398 3.344784) (xy 0.362547 3.370032) (xy 0.380210 3.382592) (xy 0.383665 3.382902)
     (xy 0.380304 3.371457) (xy 0.362301 3.346135) (xy 0.332861 3.311133) (xy 0.308542 3.284574) (xy 0.271887 3.247060) (xy 0.242086 3.219049) (xy 0.222984 3.204010) (xy 0.218085 3.202918)
     (xy -1.030972 3.202918) (xy -1.026457 3.191723) (xy -1.026245 3.190093) (xy -1.013607 3.160772) (xy -0.991286 3.149691) (xy -0.985600 3.147471) (xy -0.946150 3.147471) (xy -0.869950 3.152484)
     (xy -0.824292 3.155580) (xy -0.785948 3.158340) (xy -0.768350 3.159734) (xy -0.743411 3.157208) (xy -0.703563 3.148404) (xy -0.662444 3.136736) (xy -0.629874 3.127602) (xy -0.595934 3.120922)
     (xy -0.555968 3.116334) (xy -0.505319 3.113477) (xy -0.439330 3.111988) (xy -0.353345 3.111507) (xy -0.337530 3.111500) (xy -0.093122 3.111500) (xy -0.087291 3.103033) (xy 0.118533 3.103033)
     (xy 0.120276 3.110583) (xy 0.127000 3.111500) (xy 0.137453 3.106853) (xy 0.135466 3.103033) (xy 0.120394 3.101513) (xy 0.118533 3.103033) (xy -0.087291 3.103033) (xy -0.051899 3.051643)
     (xy 0.170431 3.051643) (xy 0.175935 3.063884) (xy 0.193284 3.086688) (xy 0.224081 3.122021) (xy 0.269932 3.171849) (xy 0.317500 3.222381) (xy 0.361861 3.268127) (xy 0.400332 3.305742)
     (xy 0.429496 3.332037) (xy 0.445938 3.343828) (xy 0.447925 3.344035) (xy 0.443102 3.333342) (xy 0.423428 3.307552) (xy 0.391614 3.269919) (xy 0.350373 3.223695) (xy 0.322187 3.193145)
     (xy 0.275043 3.143401) (xy 0.233526 3.101003) (xy 0.200862 3.069137) (xy 0.180276 3.050987) (xy 0.175166 3.048000) (xy 0.170431 3.051643) (xy -0.051899 3.051643) (xy -0.046055 3.043159)
     (xy -0.018435 3.005009) (xy 0.215900 3.005009) (xy 0.224243 3.017757) (xy 0.246820 3.044019) (xy 0.279950 3.080043) (xy 0.319954 3.122080) (xy 0.363151 3.166379) (xy 0.405861 3.209190)
     (xy 0.444404 3.246764) (xy 0.475099 3.275349) (xy 0.494267 3.291196) (xy 0.498611 3.293100) (xy 0.493706 3.282540) (xy 0.473890 3.256924) (xy 0.441885 3.219481) (xy 0.400413 3.173437)
     (xy 0.371611 3.142488) (xy 0.341587 3.110897) (xy 0.421533 3.110897) (xy 0.433217 3.127396) (xy 0.458046 3.155257) (xy 0.469155 3.166852) (xy 0.502345 3.199462) (xy 0.528579 3.222447)
     (xy 0.543231 3.231834) (xy 0.544530 3.231602) (xy 0.539915 3.219944) (xy 0.521482 3.196296) (xy 0.500824 3.173761) (xy 0.468316 3.142482) (xy 0.438845 3.117889) (xy 0.438551 3.117694)
     (xy 0.535672 3.117694) (xy 0.538409 3.130483) (xy 0.552450 3.149600) (xy 0.571324 3.166215) (xy 0.581927 3.168805) (xy 0.579190 3.156016) (xy 0.565150 3.136900) (xy 0.546275 3.120284)
     (xy 0.535672 3.117694) (xy 0.438551 3.117694) (xy 0.425450 3.109011) (xy 0.421533 3.110897) (xy 0.341587 3.110897) (xy 0.314856 3.082772) (xy 0.273046 3.040283) (xy 0.262578 3.030481)
     (xy 0.541238 3.030481) (xy 0.555687 3.050323) (xy 0.565023 3.060567) (xy 0.588826 3.082661) (xy 0.604991 3.092636) (xy 0.607665 3.092267) (xy 0.604198 3.079941) (xy 0.587489 3.057934)
     (xy 0.584152 3.054299) (xy 0.560481 3.032768) (xy 0.542630 3.022700) (xy 0.541510 3.022600) (xy 0.541238 3.030481) (xy 0.262578 3.030481) (xy 0.244220 3.013291) (xy 0.226419 3.000066)
     (xy 0.217682 2.998878) (xy 0.215900 3.005009) (xy -0.018435 3.005009) (xy -0.017491 3.003706) (xy 0.009163 2.970254) (xy 0.015887 2.962998) (xy 0.283968 2.962998) (xy 0.285070 2.977005)
     (xy 0.299652 2.997594) (xy 0.320209 3.017035) (xy 0.339240 3.027594) (xy 0.346066 3.026992) (xy 0.346138 3.014329) (xy 0.330957 2.992474) (xy 0.325555 2.986782) (xy 0.302131 2.967670)
     (xy 0.285804 2.961997) (xy 0.283968 2.962998) (xy 0.015887 2.962998) (xy 0.025304 2.952836) (xy 0.032031 2.941587) (xy 0.350689 2.941587) (xy 0.365214 2.961451) (xy 0.374650 2.971800)
     (xy 0.400330 2.995663) (xy 0.420081 3.008931) (xy 0.423852 3.009900) (xy 0.424010 3.002012) (xy 0.420492 2.997200) (xy 0.609600 2.997200) (xy 0.614246 3.007653) (xy 0.618066 3.005666)
     (xy 0.619586 2.990594) (xy 0.618066 2.988733) (xy 0.610516 2.990476) (xy 0.609600 2.997200) (xy 0.420492 2.997200) (xy 0.409485 2.982148) (xy 0.400050 2.971800) (xy 0.374369 2.947936)
     (xy 0.354618 2.934668) (xy 0.350847 2.933700) (xy 0.350689 2.941587) (xy 0.032031 2.941587) (xy 0.039673 2.928810) (xy 0.439090 2.928810) (xy 0.452941 2.948069) (xy 0.457200 2.952750)
     (xy 0.480835 2.974296) (xy 0.498594 2.984394) (xy 0.499727 2.984500) (xy 0.500709 2.976689) (xy 0.486858 2.957430) (xy 0.482600 2.952750) (xy 0.458964 2.931203) (xy 0.441205 2.921105)
     (xy 0.440072 2.921000) (xy 0.439090 2.928810) (xy 0.039673 2.928810) (xy 0.043561 2.922310) (xy 0.042923 2.897351) (xy 0.042514 2.859783) (xy 0.049561 2.828925) (xy 0.070441 2.801125)
     (xy 0.098992 2.792815) (xy 0.126853 2.804397) (xy 0.141436 2.824490) (xy 0.155329 2.854980) (xy 0.216033 2.824490) (xy 0.251164 2.807438) (xy 0.276226 2.796372) (xy 0.283592 2.794000)
     (xy 0.299257 2.789934) (xy 0.324557 2.781031) (xy 0.358668 2.768062) (xy 0.309015 2.732093) (xy 0.273922 2.703002) (xy 0.244923 2.672780) (xy 0.237825 2.663256) (xy 0.211244 2.633044)
     (xy 0.173207 2.601628) (xy 0.131580 2.574364) (xy 0.094231 2.556609) (xy 0.075451 2.552700) (xy 0.050477 2.560903) (xy 0.017137 2.581887) (xy -0.003194 2.598524) (xy -0.035921 2.625605)
     (xy -0.061128 2.637697) (xy -0.088381 2.638601) (xy -0.099983 2.637008) (xy -0.130217 2.634342) (xy -0.149368 2.642310) (xy -0.167194 2.666204) (xy -0.173532 2.676909) (xy -0.187462 2.697864)
     (xy -0.204680 2.714900) (xy -0.229960 2.730840) (xy -0.268074 2.748505) (xy -0.323796 2.770718) (xy -0.347483 2.779763) (xy -0.424723 2.810722) (xy -0.480157 2.837460) (xy -0.516542 2.862219)
     (xy -0.536635 2.887241) (xy -0.543195 2.914769) (xy -0.541121 2.937211) (xy -0.539287 2.973221) (xy -0.552319 2.997055) (xy -0.555449 2.999974) (xy -0.590692 3.024308) (xy -0.640266 3.050639)
     (xy -0.694022 3.074206) (xy -0.741808 3.090245) (xy -0.753497 3.092884) (xy -0.792773 3.101861) (xy -0.842454 3.115310) (xy -0.873446 3.124609) (xy -0.946150 3.147471) (xy -0.985600 3.147471)
     (xy -0.978460 3.144684) (xy -0.983056 3.138171) (xy -1.007725 3.128431) (xy -1.039380 3.118461) (xy -1.109217 3.090961) (xy -1.155984 3.058023) (xy -1.178837 3.020336) (xy -1.181100 3.003025)
     (xy -1.186691 2.984015) (xy -1.200518 2.950308) (xy -1.026962 2.950308) (xy -1.023927 2.957590) (xy -1.016988 2.959100) (xy -1.002535 2.954594) (xy -0.967648 2.941881) (xy -0.915483 2.922166)
     (xy -0.849196 2.896656) (xy -0.771946 2.866556) (xy -0.686888 2.833073) (xy -0.680638 2.830600) (xy -0.583920 2.792193) (xy -0.507551 2.761360) (xy -0.448215 2.736441) (xy -0.402601 2.715774)
     (xy -0.367393 2.697699) (xy -0.339278 2.680556) (xy -0.314942 2.662682) (xy -0.291072 2.642418) (xy -0.273612 2.626606) (xy -0.209356 2.559383) (xy -0.152955 2.480845) (xy -0.129364 2.441121)
     (xy 0.319928 2.441121) (xy 0.323997 2.472271) (xy 0.328520 2.488602) (xy 0.339331 2.514737) (xy 0.357935 2.541696) (xy 0.387909 2.573488) (xy 0.432829 2.614121) (xy 0.464869 2.641410)
     (xy 0.512623 2.680389) (xy 0.554580 2.712471) (xy 0.586374 2.734462) (xy 0.603635 2.743169) (xy 0.604116 2.743200) (xy 0.615854 2.735259) (xy 0.621426 2.708770) (xy 0.622300 2.681147)
     (xy 0.621214 2.652655) (xy 1.337500 2.652655) (xy 1.364075 2.679977) (xy 1.399477 2.699092) (xy 1.450643 2.703118) (xy 1.513243 2.692496) (xy 1.582944 2.667671) (xy 1.609978 2.654816)
     (xy 1.702824 2.618320) (xy 1.793211 2.605735) (xy 1.885669 2.616553) (xy 1.905434 2.621655) (xy 1.960740 2.633526) (xy 2.007476 2.636815) (xy 2.023178 2.635156) (xy 2.074999 2.622777)
     (xy 2.102506 2.609349) (xy 2.106692 2.591669) (xy 2.088554 2.566531) (xy 2.054225 2.535108) (xy 1.997497 2.495688) (xy 1.941550 2.473284) (xy 1.892134 2.470060) (xy 1.885112 2.471495)
     (xy 1.859891 2.469810) (xy 1.831318 2.449880) (xy 1.817722 2.436209) (xy 1.793766 2.407409) (xy 1.779651 2.384182) (xy 1.778058 2.378075) (xy 1.772213 2.363129) (xy 1.760018 2.366794)
     (xy 1.749205 2.386544) (xy 1.748920 2.387600) (xy 1.731871 2.409087) (xy 1.715082 2.413000) (xy 1.687943 2.421931) (xy 1.659598 2.443544) (xy 1.658462 2.444750) (xy 1.625688 2.470653)
     (xy 1.598190 2.473588) (xy 1.578344 2.453465) (xy 1.575970 2.447925) (xy 1.559292 2.422593) (xy 1.529217 2.391058) (xy 1.492350 2.358835) (xy 1.455294 2.331438) (xy 1.424651 2.314382)
     (xy 1.412485 2.311400) (xy 1.401028 2.313434) (xy 1.393938 2.322705) (xy 1.390278 2.343967) (xy 1.389114 2.381972) (xy 1.389364 2.428875) (xy 1.388837 2.491247) (xy 1.384884 2.535993)
     (xy 1.376368 2.570785) (xy 1.364075 2.599502) (xy 1.337500 2.652655) (xy 0.621214 2.652655) (xy 0.620846 2.643015) (xy 0.613324 2.621181) (xy 0.594988 2.606579) (xy 0.579105 2.598597)
     (xy 0.547177 2.585105) (xy 0.524220 2.578298) (xy 0.521849 2.578100) (xy 0.507316 2.569543) (xy 0.480037 2.546600) (xy 0.444699 2.513355) (xy 0.424845 2.493508) (xy 0.382424 2.452011)
     (xy 0.353436 2.428277) (xy 0.335245 2.420399) (xy 0.327569 2.423250) (xy 0.319928 2.441121) (xy -0.129364 2.441121) (xy -0.126519 2.436331) (xy -0.100193 2.388469) (xy -0.079963 2.349445)
     (xy -0.068244 2.324065) (xy -0.066467 2.316899) (xy -0.078917 2.320342) (xy -0.112277 2.332199) (xy -0.163871 2.351450) (xy -0.231028 2.377075) (xy -0.311072 2.408055) (xy -0.401330 2.443369)
     (xy -0.494339 2.480098) (xy -0.917559 2.647950) (xy -0.973130 2.792115) (xy -0.998355 2.858149) (xy -1.015112 2.904150) (xy -1.024336 2.933682) (xy -1.026962 2.950308) (xy -1.200518 2.950308)
     (xy -1.202568 2.945311) (xy -1.227388 2.889800) (xy -1.259811 2.820369) (xy -1.298493 2.739905) (xy -1.342093 2.651296) (xy -1.376667 2.582311) (xy -1.572233 2.195086) (xy -1.554208 2.114242)
     (xy -1.459154 2.114242) (xy -1.457721 2.164198) (xy -1.455844 2.194112) (xy -1.453052 2.220298) (xy -1.448088 2.245923) (xy -1.439698 2.274152) (xy -1.426624 2.308150) (xy -1.407611 2.351085)
     (xy -1.381403 2.406120) (xy -1.346743 2.476422) (xy -1.302375 2.565158) (xy -1.284462 2.600875) (xy -1.241783 2.685085) (xy -1.202428 2.761078) (xy -1.167887 2.826106) (xy -1.139651 2.877424)
     (xy -1.119208 2.912285) (xy -1.108050 2.927942) (xy -1.106726 2.928477) (xy -1.098648 2.914771) (xy -1.084006 2.881937) (xy -1.064814 2.834758) (xy -1.043086 2.778014) (xy -1.041030 2.772482)
     (xy -0.985564 2.622808) (xy -1.023646 2.548158) (xy -0.876300 2.548158) (xy -0.867104 2.551023) (xy -0.860425 2.549003) (xy -0.845151 2.542923) (xy -0.809171 2.528647) (xy -0.755396 2.507328)
     (xy -0.686739 2.480119) (xy -0.606109 2.448175) (xy -0.516417 2.412649) (xy -0.456710 2.389004) (xy -0.343857 2.344221) (xy -0.251847 2.307026) (xy -0.214827 2.291292) (xy 2.316314 2.291292)
     (xy 2.317892 2.299148) (xy 2.334509 2.330639) (xy 2.365078 2.371923) (xy 2.403969 2.416613) (xy 2.445552 2.458324) (xy 2.484198 2.490670) (xy 2.490746 2.495231) (xy 2.542957 2.531722)
     (xy 2.576581 2.560149) (xy 2.595302 2.584662) (xy 2.602802 2.609410) (xy 2.603500 2.622223) (xy 2.607947 2.655016) (xy 2.618245 2.676665) (xy 2.630834 2.696789) (xy 2.646262 2.731379)
     (xy 2.653984 2.752169) (xy 2.669959 2.790795) (xy 2.689476 2.813830) (xy 2.721247 2.830552) (xy 2.731313 2.834523) (xy 2.787901 2.852166) (xy 2.831865 2.854903) (xy 2.871096 2.842807)
     (xy 2.883786 2.835906) (xy 2.920341 2.814312) (xy 2.875027 2.731131) (xy 2.847151 2.684747) (xy 2.817665 2.643165) (xy 2.792999 2.615436) (xy 2.769681 2.592300) (xy 2.763097 2.573253)
     (xy 2.769967 2.546744) (xy 2.771964 2.541385) (xy 2.780888 2.511810) (xy 2.777001 2.494455) (xy 2.762994 2.481823) (xy 2.730767 2.467614) (xy 2.705250 2.463800) (xy 2.669451 2.451826)
     (xy 2.625752 2.416055) (xy 2.621952 2.412200) (xy 2.585272 2.377611) (xy 2.547640 2.346864) (xy 2.530475 2.334964) (xy 2.502111 2.312813) (xy 2.490750 2.286757) (xy 2.489200 2.261119)
     (xy 2.494137 2.224064) (xy 2.506546 2.198689) (xy 2.508250 2.197100) (xy 2.525750 2.172313) (xy 2.518047 2.147484) (xy 2.495996 2.128710) (xy 2.462893 2.111827) (xy 2.435807 2.112809)
     (xy 2.407396 2.133314) (xy 2.389153 2.152821) (xy 2.347841 2.206598) (xy 2.322951 2.254007) (xy 2.316314 2.291292) (xy -0.214827 2.291292) (xy -0.177928 2.275610) (xy -0.119345 2.248164)
     (xy -0.073347 2.222879) (xy -0.037178 2.197946) (xy -0.008086 2.171554) (xy 0.016684 2.141896) (xy 0.039884 2.107161) (xy 0.044943 2.098525) (xy 2.791419 2.098525) (xy 2.796392 2.118028)
     (xy 2.814862 2.146786) (xy 2.829587 2.166203) (xy 2.876550 2.226674) (xy 2.880743 2.183619) (xy 2.877747 2.144369) (xy 2.860838 2.121049) (xy 2.836333 2.096295) (xy 2.824571 2.079792)
     (xy 2.813917 2.065281) (xy 2.803923 2.072088) (xy 2.797514 2.081891) (xy 2.791419 2.098525) (xy 0.044943 2.098525) (xy 0.064268 2.065541) (xy 0.081115 2.035615) (xy 0.113208 1.976583)
     (xy 0.132100 1.936756) (xy 0.138483 1.914075) (xy 0.133050 1.906479) (xy 0.123825 1.908532) (xy 0.108703 1.914502) (xy 0.072725 1.928713) (xy 0.018660 1.950072) (xy -0.050725 1.977485)
     (xy -0.132663 2.009860) (xy -0.224387 2.046102) (xy -0.317500 2.082894) (xy -0.415862 2.121758) (xy -0.506999 2.157762) (xy -0.588153 2.189817) (xy -0.656567 2.216834) (xy -0.709484 2.237724)
     (xy -0.744146 2.251398) (xy -0.757643 2.256708) (xy -0.766115 2.269415) (xy -0.781038 2.300267) (xy -0.800095 2.343573) (xy -0.820970 2.393641) (xy -0.841344 2.444779) (xy -0.858900 2.491295)
     (xy -0.871321 2.527496) (xy -0.876289 2.547691) (xy -0.876300 2.548158) (xy -1.023646 2.548158) (xy -1.188096 2.225804) (xy -1.235442 2.133483) (xy -1.279368 2.048764) (xy -1.318506 1.974213)
     (xy -1.351491 1.912394) (xy -1.376955 1.865872) (xy -1.393532 1.837210) (xy -1.399674 1.828800) (xy -1.408372 1.839779) (xy -1.418779 1.867078) (xy -1.421454 1.876425) (xy -1.443077 1.966430)
     (xy -1.455255 2.042617) (xy -1.459154 2.114242) (xy -1.554208 2.114242) (xy -1.549096 2.091318) (xy -1.537576 2.039383) (xy -1.522464 1.970871) (xy -1.505574 1.894024) (xy -1.488720 1.817082)
     (xy -1.485730 1.803400) (xy -1.471241 1.737726) (xy -1.458362 1.680018) (xy -1.358972 1.680018) (xy -1.356082 1.699560) (xy -1.346857 1.729054) (xy -1.330398 1.770510) (xy -1.305805 1.825939)
     (xy -1.272180 1.897353) (xy -1.228623 1.986763) (xy -1.174234 2.096179) (xy -1.161625 2.121343) (xy -1.115155 2.213380) (xy -1.071971 2.297768) (xy -1.033442 2.371916) (xy -1.000940 2.433231)
     (xy -0.975836 2.479123) (xy -0.959501 2.507000) (xy -0.953584 2.514600) (xy -0.945136 2.503433) (xy -0.930278 2.473090) (xy -0.911161 2.428309) (xy -0.891531 2.378075) (xy -0.840244 2.241550)
     (xy -0.888034 2.147385) (xy -0.723900 2.147385) (xy -0.714378 2.158813) (xy -0.712307 2.159000) (xy -0.698238 2.154479) (xy -0.663259 2.141609) (xy -0.610062 2.121427) (xy -0.541339 2.094968)
     (xy -0.459782 2.063270) (xy -0.368082 2.027368) (xy -0.268932 1.988301) (xy -0.264632 1.986602) (xy -0.144598 1.938878) (xy -0.046171 1.899083) (xy 0.032831 1.866239) (xy 0.094589 1.839372)
     (xy 0.141286 1.817507) (xy 0.175102 1.799668) (xy 0.198220 1.784879) (xy 0.211188 1.773877) (xy 0.229231 1.751506) (xy 0.253222 1.716331) (xy 0.256638 1.710900) (xy 0.357853 1.710900)
     (xy 0.361911 1.720711) (xy 0.379251 1.718637) (xy 0.400825 1.721915) (xy 0.410011 1.739639) (xy 0.417121 1.766825) (xy 0.468404 1.740662) (xy 0.504566 1.724588) (xy 0.534337 1.715362)
     (xy 0.541600 1.714500) (xy 0.566118 1.722754) (xy 0.592260 1.741506) (xy 0.621596 1.762247) (xy 0.642304 1.760468) (xy 0.654973 1.735561) (xy 0.660190 1.686918) (xy 0.660400 1.671068)
     (xy 0.663417 1.613856) (xy 0.671177 1.554555) (xy 0.678155 1.521444) (xy 0.688929 1.480519) (xy 0.697370 1.448290) (xy 0.700380 1.436687) (xy 0.692794 1.420458) (xy 0.666750 1.406528)
     (xy 0.629718 1.388322) (xy 0.596052 1.363519) (xy 0.563454 1.333207) (xy 0.502660 1.448510) (xy 0.471107 1.512042) (xy 0.453089 1.557898) (xy 0.447485 1.589145) (xy 0.448225 1.597076)
     (xy 0.449995 1.637782) (xy 0.435675 1.659409) (xy 0.415966 1.663700) (xy 0.387551 1.673243) (xy 0.373278 1.685925) (xy 0.357853 1.710900) (xy 0.256638 1.710900) (xy 0.280317 1.673261)
     (xy 0.307674 1.627206) (xy 0.332452 1.583075) (xy 0.351808 1.545778) (xy 0.362900 1.520225) (xy 0.363192 1.511300) (xy 0.348330 1.515899) (xy 0.313022 1.528886) (xy 0.260303 1.549044)
     (xy 0.193208 1.575155) (xy 0.114771 1.606002) (xy 0.028028 1.640369) (xy -0.063988 1.677037) (xy -0.158240 1.714789) (xy -0.251694 1.752409) (xy -0.341316 1.788680) (xy -0.424071 1.822383)
     (xy -0.496923 1.852302) (xy -0.556838 1.877220) (xy -0.600782 1.895920) (xy -0.625719 1.907184) (xy -0.630183 1.909714) (xy -0.640166 1.926865) (xy -0.655795 1.961128) (xy -0.674359 2.005633)
     (xy -0.693149 2.053506) (xy -0.709454 2.097875) (xy -0.720565 2.131866) (xy -0.723900 2.147385) (xy -0.888034 2.147385) (xy -1.057780 1.812925) (xy -1.106944 1.716773) (xy -1.152964 1.628146)
     (xy -1.194501 1.549518) (xy -1.230218 1.483366) (xy -1.258773 1.432163) (xy -1.278830 1.398387) (xy -1.289048 1.384513) (xy -1.289609 1.384300) (xy -1.298205 1.395878) (xy -1.309477 1.426773)
     (xy -1.322073 1.471220) (xy -1.334640 1.523456) (xy -1.345828 1.577719) (xy -1.354284 1.628245) (xy -1.358656 1.669271) (xy -1.358972 1.680018) (xy -1.458362 1.680018) (xy -1.452430 1.653444)
     (xy -1.430680 1.556696) (xy -1.407376 1.453624) (xy -1.383899 1.350372) (xy -1.370451 1.291519) (xy -1.352810 1.213903) (xy -1.257300 1.213903) (xy -1.251915 1.236634) (xy -1.236719 1.277240)
     (xy -1.213152 1.332850) (xy -1.182655 1.400592) (xy -1.146667 1.477596) (xy -1.106629 1.560992) (xy -1.063980 1.647908) (xy -1.020160 1.735474) (xy -0.976610 1.820819) (xy -0.934769 1.901073)
     (xy -0.896078 1.973364) (xy -0.861976 2.034822) (xy -0.833904 2.082577) (xy -0.813301 2.113757) (xy -0.801608 2.125491) (xy -0.800248 2.125053) (xy -0.791784 2.109072) (xy -0.777207 2.075322)
     (xy -0.759094 2.029899) (xy -0.751009 2.008689) (xy -0.733184 1.959799) (xy -0.719484 1.919386) (xy -0.711993 1.893726) (xy -0.711200 1.888842) (xy -0.716823 1.875099) (xy -0.732693 1.841751)
     (xy -0.757316 1.791716) (xy -0.784790 1.736725) (xy -0.571458 1.736725) (xy -0.568777 1.738794) (xy -0.559333 1.737639) (xy -0.541162 1.732531) (xy -0.512299 1.722741) (xy -0.470781 1.707542)
     (xy -0.414642 1.686204) (xy -0.341919 1.657998) (xy -0.250647 1.622198) (xy -0.138862 1.578073) (xy -0.066850 1.549566) (xy 0.054628 1.501304) (xy 0.154735 1.461140) (xy 0.235796 1.428023)
     (xy 0.300135 1.400901) (xy 0.350075 1.378722) (xy 0.387941 1.360434) (xy 0.416057 1.344987) (xy 0.436747 1.331328) (xy 0.452335 1.318405) (xy 0.459375 1.311441) (xy 0.487399 1.277883)
     (xy 0.517852 1.234504) (xy 0.548350 1.185734) (xy 0.576511 1.136001) (xy 0.599950 1.089733) (xy 0.616283 1.051359) (xy 0.623127 1.025308) (xy 0.618400 1.016000) (xy 0.606174 1.020542)
     (xy 0.572711 1.033547) (xy 0.520373 1.054082) (xy 0.451524 1.081217) (xy 0.368524 1.114018) (xy 0.273736 1.151553) (xy 0.169521 1.192891) (xy 0.076492 1.229844) (xy -0.461516 1.443689)
     (xy -0.516465 1.588619) (xy -0.537559 1.644490) (xy -0.554912 1.690903) (xy -0.566787 1.723176) (xy -0.571445 1.736629) (xy -0.571458 1.736725) (xy -0.784790 1.736725) (xy -0.789195 1.727910)
     (xy -0.826836 1.653252) (xy -0.868742 1.570658) (xy -0.913418 1.483046) (xy -0.959368 1.393333) (xy -1.005097 1.304436) (xy -1.049109 1.219274) (xy -1.089909 1.140762) (xy -1.126001 1.071819)
     (xy -1.155889 1.015362) (xy -1.178078 0.974308) (xy -1.191072 0.951574) (xy -1.193434 0.948185) (xy -1.200306 0.954641) (xy -1.210171 0.980475) (xy -1.221671 1.020040) (xy -1.233450 1.067688)
     (xy -1.244148 1.117773) (xy -1.252411 1.164648) (xy -1.256879 1.202665) (xy -1.257300 1.213903) (xy -1.352810 1.213903) (xy -1.350378 1.203207) (xy -1.332331 1.122541) (xy -1.317059 1.052981)
     (xy -1.305315 0.997985) (xy -1.297848 0.961011) (xy -1.295400 0.945762) (xy -1.299268 0.936681) (xy -1.313017 0.933385) (xy -1.339872 0.936341) (xy -1.383053 0.946016) (xy -1.445782 0.962876)
     (xy -1.479550 0.972446) (xy -1.580126 1.004602) (xy -1.674485 1.041167) (xy -1.757570 1.079848) (xy -1.824323 1.118348) (xy -1.859672 1.144880) (xy -1.892087 1.170466) (xy -1.918071 1.185681)
     (xy -1.930180 1.187586) (xy -1.942873 1.165886) (xy -1.940999 1.129109) (xy -1.926426 1.081542) (xy -1.901021 1.027475) (xy -1.866651 0.971196) (xy -1.825183 0.916996) (xy -1.800815 0.890425)
     (xy -1.726956 0.824699) (xy -1.635667 0.758383) (xy -1.534301 0.696446) (xy -1.528560 0.693490) (xy -1.130300 0.693490) (xy -1.130300 0.778716) (xy -0.892276 1.246608) (xy -0.840964 1.347119)
     (xy -0.793083 1.440230) (xy -0.749874 1.523578) (xy -0.712577 1.594800) (xy -0.682432 1.651535) (xy -0.660681 1.691420) (xy -0.648564 1.712092) (xy -0.646559 1.714500) (xy -0.639461 1.703311)
     (xy -0.625728 1.672806) (xy -0.607306 1.627576) (xy -0.586140 1.572212) (xy -0.585043 1.569255) (xy -0.531219 1.424011) (xy -0.573688 1.341418) (xy -0.417748 1.341418) (xy -0.415857 1.345894)
     (xy -0.414202 1.346200) (xy -0.401754 1.341651) (xy -0.368145 1.328643) (xy -0.315803 1.308135) (xy -0.247157 1.281085) (xy -0.164634 1.248451) (xy -0.070664 1.211190) (xy 0.032324 1.170262)
     (xy 0.102270 1.142418) (xy 0.227144 1.092571) (xy 0.330746 1.050898) (xy 0.415453 1.016315) (xy 0.483647 0.987738) (xy 0.537705 0.964080) (xy 0.580008 0.944260) (xy 0.612935 0.927190)
     (xy 0.638865 0.911788) (xy 0.660178 0.896968) (xy 0.679252 0.881646) (xy 0.684746 0.876918) (xy 0.730423 0.829880) (xy 0.775271 0.771036) (xy 0.815781 0.706485) (xy 0.848441 0.642326)
     (xy 0.869741 0.584660) (xy 0.876300 0.544119) (xy 0.875568 0.513072) (xy 0.873749 0.496380) (xy 0.873125 0.495454) (xy 0.861056 0.500027) (xy 0.827670 0.513077) (xy 0.775257 0.533703)
     (xy 0.706101 0.560999) (xy 0.622492 0.594062) (xy 0.526716 0.631988) (xy 0.421061 0.673874) (xy 0.307814 0.718814) (xy 0.298450 0.722533) (xy -0.273050 0.949456) (xy -0.345593 1.138303)
     (xy -0.374384 1.213569) (xy -0.394952 1.268351) (xy -0.408339 1.305810) (xy -0.415589 1.329112) (xy -0.417748 1.341418) (xy -0.573688 1.341418) (xy -0.795835 0.909401) (xy -0.861566 0.782021)
     (xy -0.916820 0.675997) (xy -0.962385 0.589921) (xy -0.999049 0.522384) (xy -1.027600 0.471976) (xy -1.048826 0.437289) (xy -1.063514 0.416913) (xy -1.072452 0.409441) (xy -1.075029 0.410120)
     (xy -1.087563 0.434219) (xy -1.100478 0.477054) (xy -1.112485 0.532017) (xy -1.122294 0.592498) (xy -1.128618 0.651889) (xy -1.130300 0.693490) (xy -1.528560 0.693490) (xy -1.448254 0.652146)
     (xy -1.389596 0.623447) (xy -1.327223 0.591118) (xy -1.274485 0.562081) (xy -1.273776 0.561672) (xy -1.195002 0.516125) (xy -1.156672 0.356487) (xy -1.143957 0.302721) (xy -1.126790 0.228935)
     (xy -1.125760 0.224464) (xy -1.017095 0.224464) (xy -1.016008 0.241784) (xy -1.013734 0.265468) (xy -1.010491 0.287687) (xy -1.005227 0.310818) (xy -0.996893 0.337241) (xy -0.984440 0.369336)
     (xy -0.966817 0.409481) (xy -0.942975 0.460054) (xy -0.911863 0.523435) (xy -0.872432 0.602003) (xy -0.823631 0.698136) (xy -0.764412 0.814214) (xy -0.756778 0.829159) (xy -0.703948 0.932228)
     (xy -0.654518 1.027955) (xy -0.609703 1.114039) (xy -0.570719 1.188179) (xy -0.538780 1.248073) (xy -0.515101 1.291422) (xy -0.500896 1.315923) (xy -0.497311 1.320652) (xy -0.490242 1.309338)
     (xy -0.476209 1.278218) (xy -0.456915 1.231362) (xy -0.434058 1.172840) (xy -0.420159 1.136012) (xy -0.396390 1.071241) (xy -0.376178 1.014203) (xy -0.361071 0.969427) (xy -0.352619 0.941442)
     (xy -0.351367 0.934937) (xy -0.356990 0.920931) (xy -0.372929 0.887110) (xy -0.394900 0.842124) (xy -0.225544 0.842124) (xy -0.223581 0.848492) (xy -0.218240 0.849293) (xy -0.210228 0.846798)
     (xy -0.208276 0.846070) (xy -0.191752 0.839624) (xy -0.154129 0.824786) (xy -0.097910 0.802549) (xy -0.025599 0.773904) (xy 0.060300 0.739843) (xy 0.157284 0.701358) (xy 0.262848 0.659443)
     (xy 0.345558 0.626586) (xy 0.875266 0.416108) (xy 1.010625 0.271128) (xy 1.054015 0.224161) (xy 1.089652 0.183766) (xy 1.120377 0.145772) (xy 1.149033 0.106009) (xy 1.178464 0.060308)
     (xy 1.211512 0.004499) (xy 1.251020 -0.065589) (xy 1.296892 -0.148769) (xy 1.338530 -0.225082) (xy 1.375768 -0.294208) (xy 1.406940 -0.352986) (xy 1.430382 -0.398251) (xy 1.444430 -0.426843)
     (xy 1.447800 -0.435452) (xy 1.438820 -0.442400) (xy 1.431925 -0.440777) (xy 1.417345 -0.434985) (xy 1.381421 -0.420761) (xy 1.326429 -0.399006) (xy 1.254649 -0.370622) (xy 1.168359 -0.336509)
     (xy 1.069837 -0.297567) (xy 0.961361 -0.254698) (xy 0.845209 -0.208803) (xy 0.806450 -0.193489) (xy 0.685863 -0.145839) (xy 0.570235 -0.100137) (xy 0.462146 -0.057403) (xy 0.364178 -0.018658)
     (xy 0.278913 0.015077) (xy 0.208931 0.042780) (xy 0.156816 0.063430) (xy 0.125147 0.076007) (xy 0.121015 0.077655) (xy 0.045181 0.107950) (xy -0.085377 0.450850) (xy -0.126836 0.559795)
     (xy -0.159973 0.647271) (xy -0.185494 0.715550) (xy -0.204105 0.766903) (xy -0.216513 0.803602) (xy -0.223424 0.827918) (xy -0.225544 0.842124) (xy -0.394900 0.842124) (xy -0.397794 0.836200)
     (xy -0.430192 0.770926) (xy -0.468732 0.694014) (xy -0.512020 0.608188) (xy -0.558667 0.516175) (xy -0.607279 0.420699) (xy -0.656464 0.324487) (xy -0.704831 0.230263) (xy -0.750989 0.140753)
     (xy -0.793544 0.058682) (xy -0.831105 -0.013224) (xy -0.862280 -0.072240) (xy -0.885677 -0.115641) (xy -0.899904 -0.140700) (xy -0.903196 -0.145557) (xy -0.920077 -0.146893) (xy -0.941527 -0.130918)
     (xy -0.961591 -0.098938) (xy -0.980323 -0.047772) (xy -0.996482 0.016366) (xy -1.008824 0.087260) (xy -1.016109 0.158698) (xy -1.017095 0.224464) (xy -1.125760 0.224464) (xy -1.106264 0.139897)
     (xy -1.083475 0.040374) (xy -1.059517 -0.064868) (xy -1.035483 -0.171061) (xy -1.029669 -0.196850) (xy -1.005690 -0.303315) (xy -0.981502 -0.410709) (xy -0.958212 -0.514113) (xy -0.939453 -0.597401)
     (xy -0.866045 -0.597401) (xy -0.857176 -0.403476) (xy -0.848306 -0.209550) (xy -0.625625 0.228600) (xy -0.557724 0.362050) (xy -0.500310 0.474479) (xy -0.452470 0.567561) (xy -0.413289 0.642973)
     (xy -0.381854 0.702389) (xy -0.357251 0.747487) (xy -0.338566 0.779940) (xy -0.324885 0.801426) (xy -0.315295 0.813619) (xy -0.308882 0.818195) (xy -0.304797 0.816902) (xy -0.298082 0.802813)
     (xy -0.283619 0.767942) (xy -0.262589 0.715286) (xy -0.236171 0.647844) (xy -0.205546 0.568613) (xy -0.171894 0.480590) (xy -0.158230 0.444595) (xy -0.021142 0.082740) (xy -0.359029 -0.583841)
     (xy -0.420376 -0.704585) (xy -0.455191 -0.772784) (xy -0.419100 -0.772784) (xy -0.411697 -0.747011) (xy -0.391949 -0.707648) (xy -0.363549 -0.660801) (xy -0.330194 -0.612576) (xy -0.296527 -0.570175)
     (xy -0.262269 -0.524063) (xy -0.219192 -0.454858) (xy -0.167644 -0.363154) (xy -0.107972 -0.249547) (xy -0.101600 -0.237061) (xy -0.063179 -0.162613) (xy -0.027995 -0.096373) (xy 0.002183 -0.041515)
     (xy 0.025587 -0.001212) (xy 0.040450 0.021363) (xy 0.044450 0.025083) (xy 0.058304 0.020565) (xy 0.093591 0.007494) (xy 0.148145 -0.013289) (xy 0.219799 -0.040941) (xy 0.306388 -0.074621)
     (xy 0.405745 -0.113488) (xy 0.515706 -0.156700) (xy 0.634102 -0.203415) (xy 0.717550 -0.236445) (xy 0.841509 -0.285522) (xy 0.959354 -0.332076) (xy 1.068792 -0.375211) (xy 1.167530 -0.414027)
     (xy 1.253276 -0.447625) (xy 1.323740 -0.475107) (xy 1.376628 -0.495574) (xy 1.409648 -0.508127) (xy 1.419225 -0.511570) (xy 1.446932 -0.522795) (xy 1.460283 -0.532595) (xy 1.460500 -0.533543)
     (xy 1.454840 -0.548276) (xy 1.438689 -0.582887) (xy 1.413286 -0.634979) (xy 1.379869 -0.702152) (xy 1.339678 -0.782010) (xy 1.293953 -0.872152) (xy 1.243932 -0.970181) (xy 1.190855 -1.073698)
     (xy 1.135961 -1.180305) (xy 1.080490 -1.287603) (xy 1.025680 -1.393195) (xy 0.972772 -1.494680) (xy 0.923004 -1.589661) (xy 0.877616 -1.675740) (xy 0.837847 -1.750518) (xy 0.804936 -1.811596)
     (xy 0.780123 -1.856576) (xy 0.764647 -1.883060) (xy 0.759949 -1.889338) (xy 0.744563 -1.885585) (xy 0.708400 -1.873403) (xy 0.654253 -1.853831) (xy 0.584911 -1.827913) (xy 0.503167 -1.796690)
     (xy 0.411812 -1.761204) (xy 0.324104 -1.726650) (xy 0.205952 -1.680262) (xy 0.105444 -1.641759) (xy 0.023667 -1.611530) (xy -0.038291 -1.589964) (xy -0.079340 -1.577451) (xy -0.098392 -1.574379)
     (xy -0.099620 -1.575209) (xy -0.113813 -1.597941) (xy -0.141829 -1.630575) (xy -0.177626 -1.667184) (xy -0.215164 -1.701839) (xy -0.248402 -1.728612) (xy -0.267982 -1.740431) (xy -0.303232 -1.749735)
     (xy -0.335317 -1.742703) (xy -0.339736 -1.740760) (xy -0.373527 -1.725364) (xy -0.332185 -1.705341) (xy -0.279298 -1.667518) (xy -0.227678 -1.607598) (xy -0.178843 -1.528887) (xy -0.134315 -1.434687)
     (xy -0.095612 -1.328301) (xy -0.064254 -1.213032) (xy -0.041762 -1.092185) (xy -0.038346 -1.066715) (xy -0.032057 -1.007420) (xy -0.028077 -0.951582) (xy -0.026971 -0.908132) (xy -0.027514 -0.895553)
     (xy -0.031750 -0.844956) (xy -0.225425 -0.814684) (xy -0.291991 -0.803567) (xy -0.348681 -0.792742) (xy -0.391206 -0.783137) (xy -0.415279 -0.775678) (xy -0.419100 -0.772784) (xy -0.455191 -0.772784)
     (xy -0.478480 -0.818403) (xy -0.532305 -0.923303) (xy -0.580815 -1.017289) (xy -0.622973 -1.098369) (xy -0.657744 -1.164549) (xy -0.684090 -1.213835) (xy -0.700976 -1.244233) (xy -0.707234 -1.253795)
     (xy -0.712636 -1.242843) (xy -0.722615 -1.210251) (xy -0.736350 -1.159196) (xy -0.753016 -1.092859) (xy -0.771791 -1.014416) (xy -0.791798 -0.927284) (xy -0.866045 -0.597401) (xy -0.939453 -0.597401)
     (xy -0.936929 -0.608605) (xy -0.918762 -0.689265) (xy -0.904819 -0.751172) (xy -0.902380 -0.762000) (xy -0.887728 -0.826985) (xy -0.874629 -0.884955) (xy -0.864323 -0.930431) (xy -0.858050 -0.957937)
     (xy -0.857274 -0.961293) (xy -0.856837 -0.974586) (xy -0.864688 -0.987321) (xy -0.884461 -1.002160) (xy -0.919788 -1.021771) (xy -0.974303 -1.048816) (xy -0.981017 -1.052065) (xy -1.189201 -1.166369)
     (xy -1.381757 -1.299803) (xy -1.557755 -1.450817) (xy -1.716268 -1.617861) (xy -1.856367 -1.799386) (xy -1.977125 -1.993842) (xy -2.077613 -2.199678) (xy -2.156903 -2.415346) (xy -2.214066 -2.639295)
     (xy -2.248175 -2.869976) (xy -2.255872 -3.049281) (xy -0.736600 -3.049281) (xy -0.735233 -3.030498) (xy -0.731295 -2.988829) (xy -0.725037 -2.926628) (xy -0.716705 -2.846253) (xy -0.706549 -2.750060)
     (xy -0.694817 -2.640405) (xy -0.681757 -2.519644) (xy -0.667618 -2.390133) (xy -0.655347 -2.278643) (xy -0.640288 -2.141802) (xy -0.625920 -2.010272) (xy -0.612519 -1.886624) (xy -0.600357 -1.773428)
     (xy -0.589708 -1.673256) (xy -0.580845 -1.588676) (xy -0.574043 -1.522260) (xy -0.569575 -1.476577) (xy -0.567915 -1.457395) (xy -0.561737 -1.371740) (xy -0.611069 -1.356960) (xy -0.641895 -1.346427)
     (xy -0.659104 -1.338028) (xy -0.660400 -1.336301) (xy -0.654923 -1.322270) (xy -0.640321 -1.292094) (xy -0.619336 -1.250925) (xy -0.594710 -1.203914) (xy -0.569187 -1.156213) (xy -0.545510 -1.112973)
     (xy -0.526420 -1.079345) (xy -0.514662 -1.060480) (xy -0.512342 -1.058226) (xy -0.511937 -1.071915) (xy -0.514628 -1.104651) (xy -0.519866 -1.150343) (xy -0.522354 -1.169414) (xy -0.529111 -1.244412)
     (xy -0.531115 -1.327306) (xy -0.528695 -1.411040) (xy -0.522184 -1.488554) (xy -0.511912 -1.552792) (xy -0.502819 -1.585647) (xy -0.498620 -1.598400) (xy -0.495439 -1.612375) (xy -0.493447 -1.629678)
     (xy -0.492815 -1.652415) (xy -0.493715 -1.682691) (xy -0.496318 -1.722612) (xy -0.500795 -1.774285) (xy -0.507316 -1.839814) (xy -0.516054 -1.921306) (xy -0.527180 -2.020867) (xy -0.540864 -2.140601)
     (xy -0.557278 -2.282615) (xy -0.564627 -2.345968) (xy -0.579908 -2.476922) (xy -0.594444 -2.600165) (xy -0.607958 -2.713415) (xy -0.620168 -2.814388) (xy -0.630795 -2.900804) (xy -0.639559 -2.970379)
     (xy -0.646180 -3.020832) (xy -0.650379 -3.049879) (xy -0.651705 -3.056239) (xy -0.666379 -3.063027) (xy -0.694807 -3.072337) (xy -0.696776 -3.072906) (xy -0.723982 -3.078985) (xy -0.734723 -3.072434)
     (xy -0.736600 -3.049281) (xy -2.255872 -3.049281) (xy -2.258300 -3.105840) (xy -2.256358 -3.181350) (xy -2.233959 -3.423106) (xy -2.187738 -3.656208) (xy -2.117961 -3.880066) (xy -2.024892 -4.094088)
     (xy -1.908796 -4.297683) (xy -1.769939 -4.490259) (xy -1.608585 -4.671226) (xy -1.572725 -4.706863) (xy -1.503347 -4.773424) (xy -1.446920 -4.824344) (xy -1.398968 -4.862461) (xy -1.355016 -4.890612)
     (xy -1.310586 -4.911636) (xy -1.261204 -4.928369) (xy -1.202394 -4.943650) (xy -1.197350 -4.944847) (xy -0.947819 -4.998213) (xy -0.707451 -5.037545) (xy -0.465333 -5.064369) (xy -0.238126 -5.079025)
     (xy 0.121756 -5.083328) (xy 0.476410 -5.063224) )(layer F.SilkS) (width  0.010000)
  )
  (fp_poly (pts (xy -3.224617 4.420442) (xy -3.210736 4.430579) (xy -3.200468 4.440832) (xy -3.193700 4.454559) (xy -3.190319 4.475115) (xy -3.190212 4.505857) (xy -3.193266 4.550140) (xy -3.199369 4.611322)
     (xy -3.208407 4.692757) (xy -3.213852 4.740879) (xy -3.224246 4.832208) (xy -3.232628 4.901027) (xy -3.239925 4.950056) (xy -3.247061 4.982013) (xy -3.254962 4.999618) (xy -3.264554 5.005590)
     (xy -3.276762 5.002650) (xy -3.292511 4.993516) (xy -3.298521 4.989684) (xy -3.321591 4.973551) (xy -3.333024 4.957576) (xy -3.335748 4.933334) (xy -3.332694 4.892399) (xy -3.332620 4.891620)
     (xy -3.325749 4.819650) (xy -3.448251 4.732234) (xy -3.570753 4.644819) (xy -3.632121 4.673562) (xy -3.693488 4.702305) (xy -3.777056 4.642799) (xy -3.693319 4.602411) (xy -3.491191 4.602411)
     (xy -3.406470 4.663405) (xy -3.366412 4.691570) (xy -3.334362 4.712850) (xy -3.315716 4.723705) (xy -3.313511 4.724400) (xy -3.307446 4.712992) (xy -3.300677 4.683677) (xy -3.296678 4.657725)
     (xy -3.290010 4.607952) (xy -3.283131 4.559526) (xy -3.280595 4.542651) (xy -3.273107 4.494252) (xy -3.382149 4.548331) (xy -3.491191 4.602411) (xy -3.693319 4.602411) (xy -3.519295 4.518477)
     (xy -3.261533 4.394156) (xy -3.224617 4.420442) )(layer F.SilkS) (width  0.010000)
  )
  (fp_poly (pts (xy 3.413704 4.341010) (xy 3.437886 4.368571) (xy 3.469457 4.409446) (xy 3.505557 4.459413) (xy 3.543325 4.514251) (xy 3.579901 4.569741) (xy 3.612422 4.621660) (xy 3.638029 4.665790)
     (xy 3.653860 4.697908) (xy 3.657600 4.711347) (xy 3.654765 4.730852) (xy 3.644491 4.750975) (xy 3.624117 4.774236) (xy 3.590985 4.803157) (xy 3.542437 4.840259) (xy 3.475814 4.888063)
     (xy 3.458076 4.900541) (xy 3.388553 4.947410) (xy 3.335006 4.978610) (xy 3.294407 4.995326) (xy 3.263726 4.998742) (xy 3.239936 4.990042) (xy 3.236193 4.987314) (xy 3.221822 4.971623)
     (xy 3.195827 4.939047) (xy 3.161192 4.893485) (xy 3.120896 4.838833) (xy 3.092763 4.799835) (xy 2.970689 4.629150) (xy 3.006169 4.600638) (xy 3.031486 4.581732) (xy 3.047620 4.572301)
     (xy 3.048816 4.572063) (xy 3.058206 4.581887) (xy 3.079364 4.609014) (xy 3.109612 4.649859) (xy 3.146270 4.700834) (xy 3.167308 4.730628) (xy 3.206724 4.786209) (xy 3.241567 4.834247)
     (xy 3.269015 4.870939) (xy 3.286250 4.892479) (xy 3.290183 4.896395) (xy 3.305452 4.892866) (xy 3.335238 4.876690) (xy 3.374744 4.851373) (xy 3.419174 4.820422) (xy 3.463732 4.787341)
     (xy 3.503619 4.755638) (xy 3.534041 4.728817) (xy 3.550199 4.710385) (xy 3.551444 4.705445) (xy 3.542141 4.689694) (xy 3.520777 4.657398) (xy 3.490125 4.612635) (xy 3.452953 4.559479)
     (xy 3.434485 4.533412) (xy 3.323874 4.377918) (xy 3.354212 4.354591) (xy 3.380802 4.337678) (xy 3.399773 4.330982) (xy 3.413704 4.341010) )(layer F.SilkS) (width  0.010000)
  )
  (fp_poly (pts (xy 4.115435 3.789624) (xy 4.036030 3.869742) (xy 3.956624 3.949860) (xy 4.101791 4.095440) (xy 4.246959 4.241021) (xy 4.216765 4.273160) (xy 4.192758 4.294730) (xy 4.174268 4.304683)
     (xy 4.172911 4.304766) (xy 4.159930 4.295785) (xy 4.132964 4.271332) (xy 4.095289 4.234570) (xy 4.050181 4.188661) (xy 4.020747 4.157868) (xy 3.882245 4.011503) (xy 3.801102 4.091726)
     (xy 3.719959 4.171950) (xy 3.695430 4.140200) (xy 3.679250 4.116392) (xy 3.673766 4.102363) (xy 3.673861 4.102100) (xy 3.683420 4.091692) (xy 3.708415 4.066275) (xy 3.746106 4.028582)
     (xy 3.793757 3.981350) (xy 3.848627 3.927311) (xy 3.863856 3.912369) (xy 4.050891 3.728988) (xy 4.115435 3.789624) )(layer F.SilkS) (width  0.010000)
  )
  (fp_poly (pts (xy -3.844925 3.896419) (xy -3.780894 3.961438) (xy -3.733876 4.011960) (xy -3.702898 4.051420) (xy -3.686985 4.083255) (xy -3.685161 4.110900) (xy -3.696453 4.137789) (xy -3.719885 4.167360)
     (xy -3.754484 4.203046) (xy -3.757168 4.205732) (xy -3.797332 4.244297) (xy -3.829997 4.268873) (xy -3.859373 4.278730) (xy -3.889670 4.273137) (xy -3.925100 4.251365) (xy -3.969872 4.212684)
     (xy -4.025260 4.159250) (xy -4.071130 4.115006) (xy -4.111036 4.078052) (xy -4.141304 4.051680) (xy -4.158258 4.039178) (xy -4.160006 4.038606) (xy -4.173776 4.047575) (xy -4.198296 4.071061)
     (xy -4.227660 4.103302) (xy -4.283370 4.167991) (xy -4.362036 4.089325) (xy -4.242041 3.969038) (xy -4.089400 3.969038) (xy -4.080878 3.982344) (xy -4.058324 4.008426) (xy -4.026256 4.042730)
     (xy -3.989193 4.080704) (xy -3.951651 4.117793) (xy -3.918151 4.149446) (xy -3.893209 4.171108) (xy -3.881751 4.178300) (xy -3.868669 4.170635) (xy -3.843886 4.151197) (xy -3.829492 4.138884)
     (xy -3.802813 4.112645) (xy -3.786732 4.091400) (xy -3.784600 4.085190) (xy -3.793164 4.070659) (xy -3.815831 4.043525) (xy -3.848067 4.008388) (xy -3.885337 3.969851) (xy -3.923105 3.932514)
     (xy -3.956836 3.900979) (xy -3.981995 3.879846) (xy -3.993248 3.873500) (xy -4.010643 3.882262) (xy -4.036303 3.903666) (xy -4.062857 3.930389) (xy -4.082934 3.955106) (xy -4.089400 3.969038)
     (xy -4.242041 3.969038) (xy -4.184443 3.911300) (xy -4.006850 3.733274) (xy -3.844925 3.896419) )(layer F.SilkS) (width  0.010000)
  )
  (fp_poly (pts (xy 3.474995 3.687010) (xy 3.477203 3.701895) (xy 3.457922 3.729811) (xy 3.417226 3.770618) (xy 3.394075 3.791300) (xy 3.359886 3.820404) (xy 3.337617 3.837952) (xy 3.329981 3.841901)
     (xy 3.333600 3.836837) (xy 3.354649 3.808205) (xy 3.379373 3.768697) (xy 3.390750 3.748506) (xy 3.420335 3.704787) (xy 3.448451 3.685816) (xy 3.451225 3.685291) (xy 3.474995 3.687010) )(layer F.SilkS) (width  0.010000)
  )
  (fp_poly (pts (xy 4.620631 3.042398) (xy 4.648328 3.061809) (xy 4.688683 3.090704) (xy 4.737827 3.126255) (xy 4.791891 3.165635) (xy 4.847008 3.206015) (xy 4.899309 3.244569) (xy 4.944924 3.278468)
     (xy 4.979987 3.304885) (xy 5.000627 3.320991) (xy 5.002760 3.322792) (xy 5.001849 3.336443) (xy 4.990397 3.360089) (xy 4.974083 3.384179) (xy 4.958581 3.399158) (xy 4.956915 3.399941)
     (xy 4.940058 3.395538) (xy 4.909623 3.378458) (xy 4.871638 3.352172) (xy 4.864347 3.346640) (xy 4.826189 3.318875) (xy 4.795220 3.299269) (xy 4.777175 3.291389) (xy 4.775682 3.291512)
     (xy 4.763772 3.302997) (xy 4.740988 3.330491) (xy 4.710865 3.369194) (xy 4.676939 3.414308) (xy 4.642745 3.461033) (xy 4.611818 3.504570) (xy 4.587695 3.540120) (xy 4.573910 3.562885)
     (xy 4.572000 3.567993) (xy 4.581562 3.580332) (xy 4.606949 3.602963) (xy 4.643210 3.631562) (xy 4.653972 3.639562) (xy 4.735945 3.699750) (xy 4.710257 3.735825) (xy 4.689044 3.759876)
     (xy 4.671155 3.770965) (xy 4.669560 3.771056) (xy 4.655059 3.763429) (xy 4.623941 3.742758) (xy 4.579705 3.711509) (xy 4.525848 3.672150) (xy 4.470400 3.630587) (xy 4.411426 3.585469)
     (xy 4.359858 3.545248) (xy 4.318981 3.512552) (xy 4.292081 3.490003) (xy 4.282482 3.480428) (xy 4.287452 3.464708) (xy 4.304571 3.439954) (xy 4.307882 3.436010) (xy 4.337050 3.402126)
     (xy 4.413250 3.459248) (xy 4.450644 3.485503) (xy 4.480076 3.502865) (xy 4.496065 3.508174) (xy 4.497089 3.507610) (xy 4.515733 3.484588) (xy 4.542982 3.448936) (xy 4.575467 3.405298)
     (xy 4.609821 3.358321) (xy 4.642677 3.312650) (xy 4.670667 3.272930) (xy 4.690424 3.243807) (xy 4.698579 3.229926) (xy 4.698629 3.229587) (xy 4.688883 3.217721) (xy 4.663512 3.195796)
     (xy 4.627730 3.168274) (xy 4.622697 3.164598) (xy 4.547134 3.109747) (xy 4.574655 3.072523) (xy 4.594514 3.048097) (xy 4.608120 3.035689) (xy 4.609460 3.035300) (xy 4.620631 3.042398) )(layer F.SilkS) (width  0.010000)
  )
  (fp_poly (pts (xy -4.574939 3.047505) (xy -4.542944 3.074299) (xy -4.504851 3.117879) (xy -4.457585 3.179915) (xy -4.423504 3.226742) (xy -4.380750 3.287621) (xy -4.352869 3.333012) (xy -4.338748 3.367168)
     (xy -4.337275 3.394337) (xy -4.347334 3.418772) (xy -4.366732 3.443515) (xy -4.404834 3.486150) (xy -4.437931 3.455066) (xy -4.459135 3.433603) (xy -4.463122 3.419859) (xy -4.451397 3.404386)
     (xy -4.446752 3.399707) (xy -4.437020 3.388702) (xy -4.433418 3.377323) (xy -4.437755 3.361442) (xy -4.451843 3.336930) (xy -4.477492 3.299658) (xy -4.511089 3.252990) (xy -4.545892 3.205018)
     (xy -4.574992 3.165128) (xy -4.595324 3.137505) (xy -4.603813 3.126346) (xy -4.617271 3.128810) (xy -4.643545 3.143227) (xy -4.675608 3.165694) (xy -4.678001 3.167556) (xy -4.686492 3.176051)
     (xy -4.688879 3.186760) (xy -4.683385 3.203274) (xy -4.668233 3.229187) (xy -4.641648 3.268090) (xy -4.601852 3.323574) (xy -4.598626 3.328033) (xy -4.551375 3.395240) (xy -4.519440 3.446573)
     (xy -4.501815 3.485624) (xy -4.497498 3.515980) (xy -4.505481 3.541234) (xy -4.524762 3.564973) (xy -4.530725 3.570630) (xy -4.591266 3.621299) (xy -4.640898 3.651195) (xy -4.681984 3.661202)
     (xy -4.716889 3.652204) (xy -4.728415 3.644468) (xy -4.749463 3.623264) (xy -4.780781 3.586118) (xy -4.818521 3.538206) (xy -4.858838 3.484700) (xy -4.897884 3.430775) (xy -4.931813 3.381607)
     (xy -4.956777 3.342368) (xy -4.966657 3.324021) (xy -4.973338 3.281580) (xy -4.956612 3.240699) (xy -4.921923 3.208358) (xy -4.901659 3.198605) (xy -4.882872 3.202631) (xy -4.857401 3.220766)
     (xy -4.819755 3.250784) (xy -4.848278 3.270762) (xy -4.869315 3.288865) (xy -4.876800 3.301058) (xy -4.869931 3.313442) (xy -4.851584 3.341556) (xy -4.825150 3.380536) (xy -4.794021 3.425519)
     (xy -4.761588 3.471641) (xy -4.731242 3.514040) (xy -4.706374 3.547852) (xy -4.691067 3.567411) (xy -4.679177 3.563821) (xy -4.653657 3.549041) (xy -4.635975 3.537278) (xy -4.585189 3.502084)
     (xy -4.613139 3.462367) (xy -4.633054 3.434443) (xy -4.662907 3.393027) (xy -4.697640 3.345124) (xy -4.714494 3.321975) (xy -4.757079 3.259076) (xy -4.781155 3.209673) (xy -4.786540 3.169678)
     (xy -4.773052 3.134999) (xy -4.740509 3.101548) (xy -4.703473 3.074795) (xy -4.665104 3.051142) (xy -4.632942 3.037596) (xy -4.603913 3.035827) (xy -4.574939 3.047505) )(layer F.SilkS) (width  0.010000)
  )
  (fp_poly (pts (xy -2.212427 0.790627) (xy -2.209800 0.799061) (xy -2.216602 0.827152) (xy -2.239294 0.856652) (xy -2.281306 0.891863) (xy -2.287314 0.896314) (xy -2.327146 0.928435) (xy -2.345486 0.952240)
     (xy -2.343412 0.971068) (xy -2.322002 0.988256) (xy -2.317750 0.990600) (xy -2.294488 1.009396) (xy -2.286000 1.027351) (xy -2.294750 1.042686) (xy -2.318852 1.071785) (xy -2.355088 1.111085)
     (xy -2.400241 1.157021) (xy -2.424550 1.180780) (xy -2.477932 1.232642) (xy -2.515927 1.271168) (xy -2.541591 1.300489) (xy -2.557979 1.324733) (xy -2.568145 1.348032) (xy -2.575145 1.374516)
     (xy -2.578009 1.388239) (xy -2.605647 1.466225) (xy -2.653315 1.529373) (xy -2.716598 1.574196) (xy -2.765738 1.605301) (xy -2.797063 1.642845) (xy -2.817496 1.695590) (xy -2.819957 1.704985)
     (xy -2.846455 1.766959) (xy -2.878503 1.803410) (xy -2.913960 1.828671) (xy -2.944690 1.840327) (xy -2.965586 1.837315) (xy -2.971800 1.822776) (xy -2.982102 1.804677) (xy -3.007176 1.785806)
     (xy -3.009900 1.784350) (xy -3.035825 1.766707) (xy -3.047890 1.750149) (xy -3.048000 1.748890) (xy -3.037856 1.734665) (xy -3.011394 1.713144) (xy -2.978247 1.691413) (xy -2.924549 1.654235)
     (xy -2.894107 1.621687) (xy -2.886899 1.595015) (xy -2.902905 1.575467) (xy -2.942103 1.564288) (xy -2.980421 1.562100) (xy -3.023157 1.563903) (xy -3.051123 1.572004) (xy -3.074852 1.590438)
     (xy -3.086600 1.602793) (xy -3.131317 1.661554) (xy -3.153657 1.714805) (xy -3.152952 1.760891) (xy -3.151866 1.764259) (xy -3.145212 1.788355) (xy -3.147579 1.806632) (xy -3.162583 1.823775)
     (xy -3.193844 1.844467) (xy -3.229518 1.864788) (xy -3.276150 1.888566) (xy -3.305750 1.897009) (xy -3.321662 1.889949) (xy -3.327231 1.867214) (xy -3.327400 1.859800) (xy -3.332531 1.835184)
     (xy -3.348677 1.828212) (xy -3.376968 1.839400) (xy -3.418536 1.869265) (xy -3.474510 1.918323) (xy -3.492500 1.935173) (xy -3.545778 1.983037) (xy -3.586842 2.013469) (xy -3.619350 2.028870)
     (xy -3.640031 2.032000) (xy -3.661413 2.041899) (xy -3.695685 2.070185) (xy -3.740748 2.114735) (xy -3.794505 2.173430) (xy -3.854857 2.244147) (xy -3.878735 2.273300) (xy -3.907606 2.305733)
     (xy -3.931673 2.327089) (xy -3.946732 2.334035) (xy -3.949700 2.329518) (xy -3.941739 2.311045) (xy -3.919359 2.276258) (xy -3.884811 2.228005) (xy -3.840350 2.169134) (xy -3.788229 2.102494)
     (xy -3.730700 2.030931) (xy -3.670018 1.957294) (xy -3.608435 1.884430) (xy -3.548205 1.815189) (xy -3.502629 1.764448) (xy -3.334746 1.592410) (xy -3.147354 1.421215) (xy -2.946086 1.255306)
     (xy -2.736575 1.099126) (xy -2.524456 0.957117) (xy -2.338606 0.846562) (xy -2.282902 0.816093) (xy -2.245571 0.797450) (xy -2.223213 0.789379) (xy -2.212427 0.790627) )(layer F.SilkS) (width  0.010000)
  )
  (fp_poly (pts (xy 4.601699 1.188334) (xy 4.604676 1.196719) (xy 4.619623 1.223459) (xy 4.645476 1.254412) (xy 4.652864 1.261657) (xy 4.692063 1.298275) (xy 4.659994 1.325412) (xy 4.631875 1.356256)
     (xy 4.612935 1.387475) (xy 4.596313 1.415399) (xy 4.579523 1.418865) (xy 4.560554 1.397690) (xy 4.551701 1.381885) (xy 4.529247 1.346883) (xy 4.504220 1.318789) (xy 4.503750 1.318385)
     (xy 4.476750 1.295400) (xy 4.503750 1.272414) (xy 4.528699 1.244642) (xy 4.551334 1.209619) (xy 4.551701 1.208914) (xy 4.572096 1.177416) (xy 4.588460 1.170626) (xy 4.601699 1.188334) )(layer F.SilkS) (width  0.010000)
  )
  (fp_poly (pts (xy -1.489744 0.482207) (xy -1.515754 0.501486) (xy -1.517650 0.502802) (xy -1.548163 0.525274) (xy -1.568419 0.542730) (xy -1.572514 0.547872) (xy -1.587695 0.564263) (xy -1.620858 0.589137)
     (xy -1.667229 0.619692) (xy -1.722035 0.653125) (xy -1.780504 0.686633) (xy -1.837862 0.717412) (xy -1.889336 0.742662) (xy -1.930153 0.759577) (xy -1.936750 0.761755) (xy -1.979947 0.780252)
     (xy -2.024330 0.806742) (xy -2.034504 0.814245) (xy -2.076720 0.843439) (xy -2.116323 0.864206) (xy -2.148386 0.874711) (xy -2.167978 0.873120) (xy -2.171700 0.865274) (xy -2.164417 0.850709)
     (xy -2.145067 0.821786) (xy -2.117402 0.784018) (xy -2.108682 0.772616) (xy -2.079331 0.735897) (xy -2.053844 0.709264) (xy -2.025889 0.688240) (xy -1.989135 0.668347) (xy -1.937252 0.645106)
     (xy -1.915007 0.635632) (xy -1.847965 0.607836) (xy -1.774045 0.578188) (xy -1.698658 0.548756) (xy -1.627215 0.521607) (xy -1.565127 0.498810) (xy -1.517806 0.482432) (xy -1.498600 0.476505)
     (xy -1.484389 0.474381) (xy -1.489744 0.482207) )(layer F.SilkS) (width  0.010000)
  )
  (fp_poly (pts (xy -1.384359 0.446748) (xy -1.393784 0.455101) (xy -1.397000 0.457200) (xy -1.425835 0.467439) (xy -1.441450 0.468812) (xy -1.466850 0.468114) (xy -1.441450 0.457200) (xy -1.411780 0.447801)
     (xy -1.397000 0.445587) (xy -1.384359 0.446748) )(layer F.SilkS) (width  0.010000)
  )
  (fp_poly (pts (xy -4.541976 0.247006) (xy -4.524152 0.262737) (xy -4.503381 0.285750) (xy -4.474854 0.319326) (xy -4.461676 0.340810) (xy -4.461986 0.356791) (xy -4.473926 0.373859) (xy -4.477405 0.377825)
     (xy -4.500369 0.405493) (xy -4.518977 0.429630) (xy -4.535526 0.449547) (xy -4.547538 0.450017) (xy -4.562772 0.434980) (xy -4.579467 0.412355) (xy -4.584700 0.398929) (xy -4.594302 0.383789)
     (xy -4.610781 0.370822) (xy -4.636862 0.354534) (xy -4.607606 0.318668) (xy -4.583245 0.287308) (xy -4.564027 0.260124) (xy -4.563229 0.258876) (xy -4.553171 0.246541) (xy -4.541976 0.247006) )(layer F.SilkS) (width  0.010000)
  )
  (fp_poly (pts (xy -2.851282 -0.723190) (xy -2.826703 -0.688010) (xy -2.795573 -0.663217) (xy -2.792893 -0.661946) (xy -2.763621 -0.644600) (xy -2.759106 -0.627600) (xy -2.779301 -0.608173) (xy -2.791836 -0.600495)
     (xy -2.824957 -0.573670) (xy -2.848395 -0.543936) (xy -2.869098 -0.515342) (xy -2.886068 -0.511330) (xy -2.901989 -0.531909) (xy -2.907466 -0.544085) (xy -2.930943 -0.575881) (xy -2.968111 -0.601955)
     (xy -2.969186 -0.602474) (xy -3.015961 -0.624779) (xy -2.986124 -0.648940) (xy -2.959082 -0.666400) (xy -2.938644 -0.673100) (xy -2.922715 -0.683179) (xy -2.921000 -0.690744) (xy -2.913497 -0.712760)
     (xy -2.896840 -0.738224) (xy -2.872679 -0.768061) (xy -2.851282 -0.723190) )(layer F.SilkS) (width  0.010000)
  )
  (fp_poly (pts (xy 2.216519 -1.201540) (xy 2.225675 -1.187942) (xy 2.245084 -1.162161) (xy 2.272071 -1.131292) (xy 2.276475 -1.126640) (xy 2.302096 -1.097353) (xy 2.309117 -1.078056) (xy 2.297992 -1.061947)
     (xy 2.281598 -1.050195) (xy 2.255250 -1.024225) (xy 2.235607 -0.991584) (xy 2.220216 -0.961690) (xy 2.206407 -0.955629) (xy 2.190861 -0.973627) (xy 2.179638 -0.995397) (xy 2.156791 -1.030672)
     (xy 2.128928 -1.058134) (xy 2.127040 -1.059420) (xy 2.094799 -1.080545) (xy 2.136424 -1.121400) (xy 2.165735 -1.152284) (xy 2.188969 -1.180384) (xy 2.193925 -1.187553) (xy 2.206838 -1.205291)
     (xy 2.216519 -1.201540) )(layer F.SilkS) (width  0.010000)
  )
  (fp_poly (pts (xy -3.194700 -2.346276) (xy -3.181854 -2.320885) (xy -3.168544 -2.272744) (xy -3.163285 -2.247756) (xy -3.148534 -2.193171) (xy -3.126395 -2.157791) (xy -3.090949 -2.135465) (xy -3.041445 -2.121154)
     (xy -2.988226 -2.108971) (xy -2.955513 -2.099893) (xy -2.938841 -2.092381) (xy -2.933746 -2.084893) (xy -2.933700 -2.083955) (xy -2.944751 -2.074498) (xy -2.972148 -2.063178) (xy -3.007258 -2.052737)
     (xy -3.041448 -2.045917) (xy -3.057286 -2.044700) (xy -3.093863 -2.033581) (xy -3.128002 -2.005267) (xy -3.151602 -1.967326) (xy -3.156019 -1.952471) (xy -3.171416 -1.883848) (xy -3.184852 -1.838623)
     (xy -3.196074 -1.817596) (xy -3.199382 -1.816100) (xy -3.208547 -1.827229) (xy -3.219476 -1.855406) (xy -3.224293 -1.872524) (xy -3.233038 -1.912353) (xy -3.238043 -1.945029) (xy -3.238500 -1.952861)
     (xy -3.250694 -1.985798) (xy -3.285280 -2.015735) (xy -3.339268 -2.040604) (xy -3.383205 -2.053037) (xy -3.425260 -2.063939) (xy -3.455364 -2.074241) (xy -3.467097 -2.081739) (xy -3.467100 -2.081827)
     (xy -3.456036 -2.091241) (xy -3.428575 -2.102481) (xy -3.393314 -2.112850) (xy -3.358851 -2.119652) (xy -3.342510 -2.120900) (xy -3.301844 -2.132981) (xy -3.267198 -2.167277) (xy -3.240918 -2.220872)
     (xy -3.230272 -2.260438) (xy -3.220757 -2.302822) (xy -3.212032 -2.334469) (xy -3.206520 -2.347615) (xy -3.194700 -2.346276) )(layer F.SilkS) (width  0.010000)
  )
  (fp_poly (pts (xy 2.878423 -2.966818) (xy 2.897706 -2.941483) (xy 2.902778 -2.932098) (xy 2.927449 -2.895051) (xy 2.955791 -2.864456) (xy 2.988272 -2.836517) (xy 2.948286 -2.808044) (xy 2.922361 -2.786078)
     (xy 2.908563 -2.767571) (xy 2.907896 -2.764561) (xy 2.900436 -2.743054) (xy 2.890082 -2.726589) (xy 2.876374 -2.711810) (xy 2.865098 -2.715841) (xy 2.852386 -2.732590) (xy 2.837348 -2.758214)
     (xy 2.832100 -2.774124) (xy 2.823034 -2.789811) (xy 2.800869 -2.811538) (xy 2.797468 -2.814311) (xy 2.762836 -2.841925) (xy 2.802035 -2.878543) (xy 2.829280 -2.908661) (xy 2.847890 -2.937625)
     (xy 2.850223 -2.943481) (xy 2.862872 -2.967424) (xy 2.878423 -2.966818) )(layer F.SilkS) (width  0.010000)
  )
  (fp_poly (pts (xy -3.554845 -4.475644) (xy -3.480089 -4.448696) (xy -3.411453 -4.423962) (xy -3.353322 -4.403021) (xy -3.310084 -4.387454) (xy -3.286124 -4.378841) (xy -3.285484 -4.378612) (xy -3.261536 -4.368459)
     (xy -3.258875 -4.357887) (xy -3.272642 -4.340758) (xy -3.307207 -4.309754) (xy -3.340004 -4.299829) (xy -3.379456 -4.308795) (xy -3.385811 -4.311359) (xy -3.420534 -4.323945) (xy -3.447477 -4.330454)
     (xy -3.451094 -4.330700) (xy -3.467917 -4.322678) (xy -3.498673 -4.300970) (xy -3.538627 -4.269115) (xy -3.573368 -4.239291) (xy -3.616282 -4.201382) (xy -3.652278 -4.169719) (xy -3.677029 -4.148100)
     (xy -3.685796 -4.140611) (xy -3.687931 -4.125301) (xy -3.683625 -4.093751) (xy -3.677618 -4.067669) (xy -3.668309 -4.028421) (xy -3.667012 -4.005593) (xy -3.674061 -3.991396) (xy -3.681173 -3.984808)
     (xy -3.700122 -3.969024) (xy -3.714864 -3.958718) (xy -3.726693 -3.956391) (xy -3.736906 -3.964546) (xy -3.746799 -3.985682) (xy -3.757665 -4.022300) (xy -3.770802 -4.076902) (xy -3.787504 -4.151989)
     (xy -3.802014 -4.218093) (xy -3.819490 -4.298474) (xy -3.834635 -4.370014) (xy -3.846736 -4.429179) (xy -3.851693 -4.454892) (xy -3.765491 -4.454892) (xy -3.764375 -4.441597) (xy -3.758457 -4.410815)
     (xy -3.749335 -4.369273) (xy -3.738607 -4.323704) (xy -3.727872 -4.280837) (xy -3.718727 -4.247401) (xy -3.712772 -4.230126) (xy -3.711867 -4.229100) (xy -3.700596 -4.236890) (xy -3.675301 -4.257558)
     (xy -3.640897 -4.287059) (xy -3.631350 -4.295426) (xy -3.595983 -4.327486) (xy -3.569520 -4.353244) (xy -3.556581 -4.368150) (xy -3.556000 -4.369639) (xy -3.566787 -4.376979) (xy -3.594794 -4.390374)
     (xy -3.633495 -4.407168) (xy -3.676363 -4.424703) (xy -3.716870 -4.440325) (xy -3.748489 -4.451376) (xy -3.764694 -4.455201) (xy -3.765491 -4.454892) (xy -3.851693 -4.454892) (xy -3.855076 -4.472433)
     (xy -3.858943 -4.496241) (xy -3.858961 -4.499757) (xy -3.847330 -4.508916) (xy -3.824845 -4.528152) (xy -3.821545 -4.531042) (xy -3.788640 -4.559933) (xy -3.554845 -4.475644) )(layer F.SilkS) (width  0.010000)
  )
  (fp_poly (pts (xy 3.842439 -4.564924) (xy 3.901685 -4.513317) (xy 3.955345 -4.466803) (xy 4.000118 -4.428226) (xy 4.032706 -4.400426) (xy 4.049810 -4.386246) (xy 4.050525 -4.385699) (xy 4.061733 -4.373448)
     (xy 4.057463 -4.358923) (xy 4.039763 -4.338289) (xy 4.009176 -4.305731) (xy 3.928136 -4.376880) (xy 3.897917 -4.404062) (xy 3.875001 -4.423138) (xy 3.855943 -4.432639) (xy 3.837298 -4.431098)
     (xy 3.815621 -4.417044) (xy 3.787466 -4.389010) (xy 3.749388 -4.345527) (xy 3.697943 -4.285125) (xy 3.689350 -4.275086) (xy 3.647491 -4.226738) (xy 3.611571 -4.186155) (xy 3.584757 -4.156848)
     (xy 3.570217 -4.142327) (xy 3.568700 -4.141377) (xy 3.555966 -4.148701) (xy 3.532577 -4.167274) (xy 3.526835 -4.172250) (xy 3.491320 -4.203497) (xy 3.625260 -4.356609) (xy 3.670563 -4.408975)
     (xy 3.709223 -4.454765) (xy 3.738431 -4.490561) (xy 3.755375 -4.512945) (xy 3.758486 -4.518636) (xy 3.749080 -4.530476) (xy 3.724809 -4.553796) (xy 3.690489 -4.584021) (xy 3.682286 -4.590961)
     (xy 3.646561 -4.621954) (xy 3.619967 -4.646901) (xy 3.607259 -4.661287) (xy 3.606800 -4.662579) (xy 3.614004 -4.677356) (xy 3.630489 -4.700042) (xy 3.654179 -4.729298) (xy 3.842439 -4.564924) )(layer F.SilkS) (width  0.010000)
  )
  (fp_poly (pts (xy 3.006628 -5.161781) (xy 3.048000 -5.139501) (xy 3.046621 -4.922426) (xy 3.045669 -4.844584) (xy 3.043929 -4.769989) (xy 3.041604 -4.704750) (xy 3.038896 -4.654976) (xy 3.037096 -4.634412)
     (xy 3.028950 -4.563473) (xy 2.990850 -4.586535) (xy 2.968471 -4.603067) (xy 2.955818 -4.623719) (xy 2.948986 -4.656910) (xy 2.946400 -4.682344) (xy 2.940050 -4.755090) (xy 2.815124 -4.828645)
     (xy 2.764427 -4.857916) (xy 2.721423 -4.881662) (xy 2.690973 -4.897271) (xy 2.678346 -4.902200) (xy 2.661339 -4.895897) (xy 2.631786 -4.879924) (xy 2.615490 -4.870003) (xy 2.583753 -4.851063)
     (xy 2.563288 -4.844886) (xy 2.544098 -4.850349) (xy 2.526842 -4.860041) (xy 2.501568 -4.877109) (xy 2.489395 -4.889531) (xy 2.489200 -4.890484) (xy 2.499607 -4.899118) (xy 2.528737 -4.918701)
     (xy 2.573456 -4.947243) (xy 2.581631 -4.952322) (xy 2.775369 -4.952322) (xy 2.789191 -4.941045) (xy 2.818409 -4.922130) (xy 2.855946 -4.899666) (xy 2.894727 -4.877746) (xy 2.927675 -4.860461)
     (xy 2.947716 -4.851902) (xy 2.949575 -4.851596) (xy 2.953756 -4.863263) (xy 2.957003 -4.894690) (xy 2.958848 -4.940243) (xy 2.959100 -4.966450) (xy 2.958295 -5.022475) (xy 2.955551 -5.056453)
     (xy 2.950370 -5.071694) (xy 2.943225 -5.072137) (xy 2.879063 -5.033069) (xy 2.828060 -4.999523) (xy 2.792858 -4.973385) (xy 2.776097 -4.956540) (xy 2.775369 -4.952322) (xy 2.581631 -4.952322)
     (xy 2.630627 -4.982759) (xy 2.697116 -5.023260) (xy 2.727228 -5.041376) (xy 2.965257 -5.184061) (xy 3.006628 -5.161781) )(layer F.SilkS) (width  0.010000)
  )
  (fp_poly (pts (xy -2.585732 -5.304325) (xy -2.562118 -5.278562) (xy -2.543360 -5.248363) (xy -2.515349 -5.198524) (xy -2.552560 -5.171012) (xy -2.578652 -5.152922) (xy -2.595021 -5.143774) (xy -2.596310 -5.143500)
     (xy -2.605739 -5.153629) (xy -2.620631 -5.178610) (xy -2.623840 -5.184775) (xy -2.638303 -5.212685) (xy -2.647001 -5.228485) (xy -2.647626 -5.229402) (xy -2.658933 -5.224945) (xy -2.686913 -5.210606)
     (xy -2.726313 -5.189334) (xy -2.771882 -5.164073) (xy -2.818369 -5.137770) (xy -2.860522 -5.113372) (xy -2.893089 -5.093824) (xy -2.910820 -5.082074) (xy -2.911922 -5.081121) (xy -2.909800 -5.067079)
     (xy -2.896861 -5.035601) (xy -2.875162 -4.991146) (xy -2.846762 -4.938173) (xy -2.842302 -4.930213) (xy -2.762710 -4.788939) (xy -2.711680 -4.818753) (xy -2.674181 -4.840244) (xy -2.625037 -4.867859)
     (xy -2.575188 -4.895455) (xy -2.489726 -4.942343) (xy -2.515892 -4.993633) (xy -2.531519 -5.030316) (xy -2.530001 -5.052388) (xy -2.509104 -5.065804) (xy -2.486413 -5.072156) (xy -2.457845 -5.071697)
     (xy -2.434009 -5.053410) (xy -2.412184 -5.014424) (xy -2.398913 -4.979880) (xy -2.390972 -4.947346) (xy -2.397125 -4.922887) (xy -2.408189 -4.906381) (xy -2.428784 -4.887851) (xy -2.466508 -4.861581)
     (xy -2.516272 -4.830421) (xy -2.572985 -4.797223) (xy -2.631557 -4.764836) (xy -2.686899 -4.736110) (xy -2.733919 -4.713897) (xy -2.767528 -4.701045) (xy -2.778527 -4.699000) (xy -2.807639 -4.708039)
     (xy -2.835882 -4.729511) (xy -2.854834 -4.754857) (xy -2.880609 -4.795574) (xy -2.910417 -4.846493) (xy -2.941472 -4.902447) (xy -2.970986 -4.958270) (xy -2.996170 -5.008794) (xy -3.014237 -5.048853)
     (xy -3.022398 -5.073278) (xy -3.022600 -5.075574) (xy -3.018185 -5.095526) (xy -3.003124 -5.116726) (xy -2.974696 -5.141359) (xy -2.930179 -5.171613) (xy -2.866852 -5.209675) (xy -2.828186 -5.231807)
     (xy -2.751482 -5.273830) (xy -2.692373 -5.301891) (xy -2.647371 -5.316192) (xy -2.612986 -5.316935) (xy -2.585732 -5.304325) )(layer F.SilkS) (width  0.010000)
  )
  (fp_poly (pts (xy 1.742415 -5.710828) (xy 1.792839 -5.700683) (xy 1.860817 -5.680716) (xy 1.910171 -5.664593) (xy 1.990083 -5.636456) (xy 2.048007 -5.611821) (xy 2.086722 -5.588545) (xy 2.109005 -5.564486)
     (xy 2.117633 -5.537500) (xy 2.115521 -5.506161) (xy 2.107992 -5.476927) (xy 2.094488 -5.464139) (xy 2.066288 -5.461049) (xy 2.057138 -5.461000) (xy 2.025453 -5.462037) (xy 2.013716 -5.468422)
     (xy 2.016477 -5.485067) (xy 2.019969 -5.494512) (xy 2.028069 -5.519504) (xy 2.029180 -5.530664) (xy 2.016546 -5.535639) (xy 1.984645 -5.547293) (xy 1.938186 -5.563926) (xy 1.881881 -5.583839)
     (xy 1.877401 -5.585415) (xy 1.729152 -5.637524) (xy 1.691128 -5.525928) (xy 1.850441 -5.472837) (xy 1.912115 -5.451111) (xy 1.966547 -5.429768) (xy 2.008318 -5.411081) (xy 2.032008 -5.397328)
     (xy 2.033577 -5.395923) (xy 2.051958 -5.367057) (xy 2.055890 -5.328579) (xy 2.045485 -5.275734) (xy 2.037070 -5.248719) (xy 2.011640 -5.191055) (xy 1.980978 -5.151073) (xy 1.947897 -5.132106)
     (xy 1.937711 -5.131013) (xy 1.916702 -5.135114) (xy 1.876798 -5.146245) (xy 1.823022 -5.162889) (xy 1.760394 -5.183528) (xy 1.734011 -5.192556) (xy 1.652308 -5.221951) (xy 1.592432 -5.246872)
     (xy 1.551682 -5.269444) (xy 1.527358 -5.291791) (xy 1.516760 -5.316040) (xy 1.517187 -5.344315) (xy 1.520651 -5.360471) (xy 1.531122 -5.389493) (xy 1.548561 -5.402856) (xy 1.580284 -5.407886)
     (xy 1.628749 -5.411922) (xy 1.620755 -5.369312) (xy 1.612762 -5.326702) (xy 1.755706 -5.277416) (xy 1.812832 -5.257716) (xy 1.861670 -5.240868) (xy 1.896915 -5.228702) (xy 1.913059 -5.223119)
     (xy 1.925043 -5.231017) (xy 1.939625 -5.256719) (xy 1.947423 -5.276668) (xy 1.958414 -5.314504) (xy 1.958629 -5.334469) (xy 1.952063 -5.340651) (xy 1.850280 -5.376763) (xy 1.769968 -5.405770)
     (xy 1.708671 -5.429086) (xy 1.663930 -5.448123) (xy 1.633288 -5.464295) (xy 1.614287 -5.479015) (xy 1.604470 -5.493697) (xy 1.601379 -5.509752) (xy 1.602556 -5.528594) (xy 1.604139 -5.540705)
     (xy 1.613945 -5.581465) (xy 1.631285 -5.628954) (xy 1.640320 -5.648725) (xy 1.658497 -5.680100) (xy 1.679041 -5.700760) (xy 1.705748 -5.710928) (xy 1.742415 -5.710828) )(layer F.SilkS) (width  0.010000)
  )
  (fp_poly (pts (xy -1.446556 -5.781842) (xy -1.439008 -5.765749) (xy -1.426291 -5.730263) (xy -1.409940 -5.680491) (xy -1.391486 -5.621540) (xy -1.372462 -5.558519) (xy -1.354399 -5.496534) (xy -1.338829 -5.440693)
     (xy -1.327286 -5.396103) (xy -1.321300 -5.367872) (xy -1.320800 -5.362637) (xy -1.325490 -5.339305) (xy -1.341493 -5.318298) (xy -1.371716 -5.297935) (xy -1.419063 -5.276533) (xy -1.486439 -5.252408)
     (xy -1.541675 -5.234681) (xy -1.625064 -5.209579) (xy -1.688183 -5.193070) (xy -1.734512 -5.184747) (xy -1.767534 -5.184207) (xy -1.790730 -5.191042) (xy -1.806682 -5.203825) (xy -1.817034 -5.223052)
     (xy -1.832941 -5.262029) (xy -1.852703 -5.316168) (xy -1.874623 -5.380878) (xy -1.890105 -5.429250) (xy -1.953609 -5.632450) (xy -1.908188 -5.648376) (xy -1.877795 -5.657493) (xy -1.859524 -5.660086)
     (xy -1.857951 -5.659484) (xy -1.852762 -5.646300) (xy -1.841597 -5.613074) (xy -1.825840 -5.564077) (xy -1.806872 -5.503578) (xy -1.795208 -5.465758) (xy -1.775103 -5.400708) (xy -1.757524 -5.344801)
     (xy -1.743829 -5.302285) (xy -1.735378 -5.277406) (xy -1.733428 -5.272745) (xy -1.720004 -5.274086) (xy -1.688332 -5.282106) (xy -1.643985 -5.295005) (xy -1.592539 -5.310980) (xy -1.539569 -5.328232)
     (xy -1.490651 -5.344958) (xy -1.451358 -5.359358) (xy -1.427267 -5.369629) (xy -1.422400 -5.373232) (xy -1.425987 -5.388119) (xy -1.435871 -5.422783) (xy -1.450737 -5.472769) (xy -1.469269 -5.533619)
     (xy -1.479550 -5.566889) (xy -1.499394 -5.631188) (xy -1.516245 -5.686527) (xy -1.528796 -5.728554) (xy -1.535740 -5.752915) (xy -1.536700 -5.757137) (xy -1.525905 -5.766439) (xy -1.500738 -5.775942)
     (xy -1.472032 -5.782676) (xy -1.450617 -5.783673) (xy -1.446556 -5.781842) )(layer F.SilkS) (width  0.010000)
  )
  (fp_poly (pts (xy 0.552013 -5.952246) (xy 0.590922 -5.948807) (xy 0.646064 -5.942957) (xy 0.712969 -5.935165) (xy 0.774700 -5.927500) (xy 0.996950 -5.899150) (xy 0.992539 -5.861050) (xy 0.988522 -5.833172)
     (xy 0.985068 -5.819713) (xy 0.972071 -5.819961) (xy 0.938418 -5.822839) (xy 0.888663 -5.827901) (xy 0.827363 -5.834700) (xy 0.801067 -5.837754) (xy 0.724472 -5.846371) (xy 0.669611 -5.850774)
     (xy 0.633033 -5.850055) (xy 0.611290 -5.843307) (xy 0.600931 -5.829622) (xy 0.598507 -5.808093) (xy 0.599941 -5.784850) (xy 0.602416 -5.766347) (xy 0.609345 -5.754394) (xy 0.625862 -5.746649)
     (xy 0.657097 -5.740767) (xy 0.708186 -5.734405) (xy 0.711200 -5.734050) (xy 0.819150 -5.721350) (xy 0.819150 -5.683250) (xy 0.816704 -5.657682) (xy 0.804234 -5.647284) (xy 0.774700 -5.645510)
     (xy 0.736153 -5.647381) (xy 0.686604 -5.651766) (xy 0.658006 -5.655054) (xy 0.585762 -5.664239) (xy 0.577045 -5.606115) (xy 0.574054 -5.569412) (xy 0.576537 -5.543604) (xy 0.579439 -5.538018)
     (xy 0.596013 -5.532532) (xy 0.632059 -5.525547) (xy 0.681774 -5.518077) (xy 0.723900 -5.512837) (xy 0.804985 -5.503456) (xy 0.864235 -5.496038) (xy 0.905065 -5.489800) (xy 0.930890 -5.483959)
     (xy 0.945127 -5.477731) (xy 0.951191 -5.470333) (xy 0.952498 -5.460982) (xy 0.952500 -5.460416) (xy 0.947291 -5.425277) (xy 0.934081 -5.403075) (xy 0.922566 -5.399130) (xy 0.905714 -5.401184)
     (xy 0.868079 -5.405859) (xy 0.814078 -5.412603) (xy 0.748127 -5.420865) (xy 0.689514 -5.428224) (xy 0.617862 -5.437543) (xy 0.555312 -5.446274) (xy 0.506082 -5.453780) (xy 0.474391 -5.459425)
     (xy 0.464447 -5.462219) (xy 0.463844 -5.476282) (xy 0.466053 -5.511544) (xy 0.470717 -5.564002) (xy 0.477478 -5.629655) (xy 0.485978 -5.704498) (xy 0.486543 -5.709255) (xy 0.497452 -5.797257)
     (xy 0.506678 -5.862661) (xy 0.514744 -5.908175) (xy 0.522177 -5.936503) (xy 0.529501 -5.950354) (xy 0.533809 -5.952805) (xy 0.552013 -5.952246) )(layer F.SilkS) (width  0.010000)
  )
  (fp_poly (pts (xy -0.253158 -5.960256) (xy -0.223116 -5.939240) (xy -0.221673 -5.937828) (xy -0.203129 -5.914685) (xy -0.193682 -5.887101) (xy -0.190598 -5.845828) (xy -0.190500 -5.832418) (xy -0.193138 -5.787672)
     (xy -0.200063 -5.754212) (xy -0.206269 -5.742412) (xy -0.214889 -5.725620) (xy -0.208171 -5.717647) (xy -0.183398 -5.687484) (xy -0.168633 -5.638098) (xy -0.165100 -5.591049) (xy -0.167142 -5.555280)
     (xy -0.175023 -5.526612) (xy -0.191380 -5.503993) (xy -0.218851 -5.486373) (xy -0.260071 -5.472702) (xy -0.317678 -5.461927) (xy -0.394307 -5.452999) (xy -0.492596 -5.444866) (xy -0.540391 -5.441474)
     (xy -0.668031 -5.432688) (xy -0.683850 -5.618089) (xy -0.584694 -5.618089) (xy -0.577462 -5.570250) (xy -0.576386 -5.564803) (xy -0.568571 -5.525730) (xy -0.484311 -5.532817) (xy -0.427914 -5.538041)
     (xy -0.370525 -5.544108) (xy -0.336550 -5.548185) (xy -0.298938 -5.554088) (xy -0.279667 -5.562697) (xy -0.271837 -5.579568) (xy -0.269203 -5.602404) (xy -0.269456 -5.639580) (xy -0.280158 -5.663296)
     (xy -0.305027 -5.675595) (xy -0.347776 -5.678519) (xy -0.401442 -5.675114) (xy -0.455473 -5.670566) (xy -0.504982 -5.667023) (xy -0.540170 -5.665178) (xy -0.542925 -5.665104) (xy -0.568955 -5.660930)
     (xy -0.582368 -5.646787) (xy -0.584694 -5.618089) (xy -0.683850 -5.618089) (xy -0.688979 -5.678197) (xy -0.695228 -5.754251) (xy -0.699068 -5.805239) (xy -0.596900 -5.805239) (xy -0.595372 -5.772596)
     (xy -0.591593 -5.752664) (xy -0.590563 -5.750996) (xy -0.574378 -5.748383) (xy -0.537151 -5.748959) (xy -0.483008 -5.752484) (xy -0.416075 -5.758714) (xy -0.368300 -5.764026) (xy -0.298450 -5.772258)
     (xy -0.298450 -5.873750) (xy -0.393700 -5.870628) (xy -0.449546 -5.868044) (xy -0.503500 -5.864303) (xy -0.542925 -5.860325) (xy -0.576700 -5.854510) (xy -0.592271 -5.844308) (xy -0.596680 -5.822530)
     (xy -0.596900 -5.805239) (xy -0.699068 -5.805239) (xy -0.700270 -5.821188) (xy -0.703845 -5.875070) (xy -0.705695 -5.911958) (xy -0.705561 -5.927912) (xy -0.705416 -5.928218) (xy -0.692051 -5.930761)
     (xy -0.658491 -5.934937) (xy -0.609850 -5.940257) (xy -0.551244 -5.946229) (xy -0.487788 -5.952363) (xy -0.424599 -5.958168) (xy -0.366790 -5.963153) (xy -0.319478 -5.966827) (xy -0.287778 -5.968700)
     (xy -0.281998 -5.968838) (xy -0.253158 -5.960256) )(layer F.SilkS) (width  0.010000)
  )
  (fp_poly (pts (xy 1.241662 3.211645) (xy 1.281004 3.215657) (xy 1.312509 3.221544) (xy 1.327150 3.227767) (xy 1.329851 3.243185) (xy 1.313947 3.259031) (xy 1.285830 3.271239) (xy 1.251894 3.275744)
     (xy 1.251697 3.275740) (xy 1.213137 3.270474) (xy 1.184275 3.261099) (xy 1.160187 3.244277) (xy 1.156894 3.223367) (xy 1.158875 3.216412) (xy 1.172371 3.211467) (xy 1.202709 3.210063)
     (xy 1.241662 3.211645) )(layer F.SilkS) (width  0.010000)
  )
  (fp_poly (pts (xy 1.882850 3.136404) (xy 1.875143 3.158452) (xy 1.864680 3.171155) (xy 1.826921 3.205502) (xy 1.797401 3.218022) (xy 1.778319 3.213297) (xy 1.770826 3.196706) (xy 1.779611 3.172916)
     (xy 1.799933 3.148983) (xy 1.827049 3.131967) (xy 1.834588 3.129556) (xy 1.868844 3.126097) (xy 1.882850 3.136404) )(layer F.SilkS) (width  0.010000)
  )
  (fp_poly (pts (xy 0.107113 2.660081) (xy 0.114300 2.680330) (xy 0.108943 2.708705) (xy 0.095926 2.741087) (xy 0.079828 2.768297) (xy 0.065230 2.781155) (xy 0.063923 2.781300) (xy 0.047157 2.772047)
     (xy 0.044003 2.767878) (xy 0.040845 2.744602) (xy 0.046995 2.711136) (xy 0.059706 2.679643) (xy 0.066076 2.670246) (xy 0.088247 2.655339) (xy 0.107113 2.660081) )(layer F.SilkS) (width  0.010000)
  )
  (fp_poly (pts (xy 0.555710 1.545669) (xy 0.557154 1.567207) (xy 0.545285 1.593256) (xy 0.533664 1.606310) (xy 0.514607 1.621002) (xy 0.504918 1.617805) (xy 0.500936 1.609271) (xy 0.500566 1.582158)
     (xy 0.513311 1.554707) (xy 0.533189 1.537981) (xy 0.540196 1.536700) (xy 0.555710 1.545669) )(layer F.SilkS) (width  0.010000)
  )
)
