ISO-10303-21;
HEADER;

/* File generated by Alibre Version V22 */

FILE_DESCRIPTION(('HOOPS Exchange Step'),'2;1');

FILE_NAME('C:\\Users\\othaa\\AppData\\Local\\Temp\\Alibre Design\\export-09082A2E-627E-4340-AE5C-4942217047F0.stp',
'2022-02-14T14:16:13+02:00',
('othaa'),
('Alibre'),
'HOOPS Exchange 2020.1',
'Alibre',
'Unknown authorisation');

FILE_SCHEMA( ('AP242_MANAGED_MODEL_BASED_3D_ENGINEERING_MIM_LF {1 0 10303 442 1 1 4 }') );

ENDSEC;

DATA;
#3=(NAMED_UNIT(*)PLANE_ANGLE_UNIT()SI_UNIT($,.RADIAN.));
#4=PLANE_ANGLE_MEASURE_WITH_UNIT(PLANE_ANGLE_MEASURE(0.0174532925),#3);
#5=(CONVERSION_BASED_UNIT('DEGREE',#4)NAMED_UNIT(#6)PLANE_ANGLE_UNIT());
#6=DIMENSIONAL_EXPONENTS(0.,0.,0.,0.,0.,0.,0.);
#7=(NAMED_UNIT(*)SI_UNIT($,.STERADIAN.)SOLID_ANGLE_UNIT());
#8=(LENGTH_UNIT()NAMED_UNIT(*)SI_UNIT(.MILLI.,.METRE.));
#9=UNCERTAINTY_MEASURE_WITH_UNIT(LENGTH_MEASURE(1.000000E-06),#8,'DISTANCE_ACCURACY_VALUE','Maximum Tolerance applied to model');
#10=(GEOMETRIC_REPRESENTATION_CONTEXT(3)GLOBAL_UNCERTAINTY_ASSIGNED_CONTEXT((#9))GLOBAL_UNIT_ASSIGNED_CONTEXT((#8,#5,#7))REPRESENTATION_CONTEXT('','Door v2 mirrored for manufacturing'));
#12=CARTESIAN_POINT('',(0.,0.,0.));
#13=DIRECTION('',(0.,0.,1.));
#14=DIRECTION('',(1.,0.,0.));
#15=AXIS2_PLACEMENT_3D('',#12,#13,#14);
#27=CARTESIAN_POINT('',(161.328446487,395.707320919,283.022380203));
#28=DIRECTION('',(0.,0.,-1.));
#29=DIRECTION('',(-1.,0.,0.));
#30=AXIS2_PLACEMENT_3D('',#27,#28,#29);
#31=CONICAL_SURFACE('',#30,1.06,45.);
#32=CARTESIAN_POINT('',(162.748446443,395.707320919,282.662380247));
#33=VERTEX_POINT('',#32);
#34=CARTESIAN_POINT('',(162.028446487,395.707320919,283.382380203));
#35=VERTEX_POINT('',#34);
#36=CARTESIAN_POINT('',(162.748446443,395.707320919,282.662380247));
#37=DIRECTION('',(-0.707106781,-0.,0.707106781));
#38=VECTOR('',#37,1.018233703);
#39=LINE('',#36,#38);
#40=EDGE_CURVE('',#33,#35,#39,.T.);
#41=ORIENTED_EDGE('',*,*,#40,.F.);
#42=CARTESIAN_POINT('',(159.908446487,395.707320919,282.662380203));
#43=VERTEX_POINT('',#42);
#44=CARTESIAN_POINT('',(161.328446487,395.707320919,282.662380247));
#45=DIRECTION('',(0.,-0.,1.));
#46=DIRECTION('',(-1.,0.,0.));
#47=AXIS2_PLACEMENT_3D('',#44,#45,#46);
#48=CIRCLE('',#47,1.419999956);
#49=EDGE_CURVE('',#43,#33,#48,.T.);
#50=ORIENTED_EDGE('',*,*,#49,.F.);
#51=CARTESIAN_POINT('',(161.328446487,395.707320919,282.662380247));
#52=DIRECTION('',(0.,-0.,1.));
#53=DIRECTION('',(-1.,0.,0.));
#54=AXIS2_PLACEMENT_3D('',#51,#52,#53);
#55=CIRCLE('',#54,1.419999956);
#56=EDGE_CURVE('',#33,#43,#55,.T.);
#57=ORIENTED_EDGE('',*,*,#56,.F.);
#58=ORIENTED_EDGE('',*,*,#40,.T.);
#59=CARTESIAN_POINT('',(160.628446487,395.707320919,283.382380203));
#60=VERTEX_POINT('',#59);
#61=CARTESIAN_POINT('',(161.328446487,395.707320919,283.382380203));
#62=DIRECTION('',(0.,0.,-1.));
#63=DIRECTION('',(1.,0.,0.));
#64=AXIS2_PLACEMENT_3D('',#61,#62,#63);
#65=CIRCLE('',#64,0.7);
#66=EDGE_CURVE('',#60,#35,#65,.T.);
#67=ORIENTED_EDGE('',*,*,#66,.F.);
#68=CARTESIAN_POINT('',(161.328446487,395.707320919,283.382380203));
#69=DIRECTION('',(0.,0.,-1.));
#70=DIRECTION('',(1.,0.,0.));
#71=AXIS2_PLACEMENT_3D('',#68,#69,#70);
#72=CIRCLE('',#71,0.7);
#73=EDGE_CURVE('',#35,#60,#72,.T.);
#74=ORIENTED_EDGE('',*,*,#73,.F.);
#75=EDGE_LOOP('',(#41,#50,#57,#58,#67,#74));
#76=FACE_BOUND('',#75,.T.);
#77=ADVANCED_FACE('',(#76),#31,.F.);
#78=CARTESIAN_POINT('',(151.328446487,395.707320919,283.022380203));
#79=DIRECTION('',(0.,0.,-1.));
#80=DIRECTION('',(-1.,0.,0.));
#81=AXIS2_PLACEMENT_3D('',#78,#79,#80);
#82=CONICAL_SURFACE('',#81,1.06,45.);
#83=CARTESIAN_POINT('',(152.748446443,395.707320919,282.662380247));
#84=VERTEX_POINT('',#83);
#85=CARTESIAN_POINT('',(152.028446487,395.707320919,283.382380203));
#86=VERTEX_POINT('',#85);
#87=CARTESIAN_POINT('',(152.748446443,395.707320919,282.662380247));
#88=DIRECTION('',(-0.707106781,-0.,0.707106781));
#89=VECTOR('',#88,1.018233703);
#90=LINE('',#87,#89);
#91=EDGE_CURVE('',#84,#86,#90,.T.);
#92=ORIENTED_EDGE('',*,*,#91,.F.);
#93=CARTESIAN_POINT('',(149.908446487,395.707320919,282.662380203));
#94=VERTEX_POINT('',#93);
#95=CARTESIAN_POINT('',(151.328446487,395.707320919,282.662380247));
#96=DIRECTION('',(0.,-0.,1.));
#97=DIRECTION('',(-1.,0.,0.));
#98=AXIS2_PLACEMENT_3D('',#95,#96,#97);
#99=CIRCLE('',#98,1.419999956);
#100=EDGE_CURVE('',#94,#84,#99,.T.);
#101=ORIENTED_EDGE('',*,*,#100,.F.);
#102=CARTESIAN_POINT('',(151.328446487,395.707320919,282.662380247));
#103=DIRECTION('',(0.,-0.,1.));
#104=DIRECTION('',(-1.,0.,0.));
#105=AXIS2_PLACEMENT_3D('',#102,#103,#104);
#106=CIRCLE('',#105,1.419999956);
#107=EDGE_CURVE('',#84,#94,#106,.T.);
#108=ORIENTED_EDGE('',*,*,#107,.F.);
#109=ORIENTED_EDGE('',*,*,#91,.T.);
#110=CARTESIAN_POINT('',(150.628446487,395.707320919,283.382380203));
#111=VERTEX_POINT('',#110);
#112=CARTESIAN_POINT('',(151.328446487,395.707320919,283.382380203));
#113=DIRECTION('',(0.,0.,-1.));
#114=DIRECTION('',(1.,0.,0.));
#115=AXIS2_PLACEMENT_3D('',#112,#113,#114);
#116=CIRCLE('',#115,0.7);
#117=EDGE_CURVE('',#111,#86,#116,.T.);
#118=ORIENTED_EDGE('',*,*,#117,.F.);
#119=CARTESIAN_POINT('',(151.328446487,395.707320919,283.382380203));
#120=DIRECTION('',(0.,0.,-1.));
#121=DIRECTION('',(1.,0.,0.));
#122=AXIS2_PLACEMENT_3D('',#119,#120,#121);
#123=CIRCLE('',#122,0.7);
#124=EDGE_CURVE('',#86,#111,#123,.T.);
#125=ORIENTED_EDGE('',*,*,#124,.F.);
#126=EDGE_LOOP('',(#92,#101,#108,#109,#118,#125));
#127=FACE_BOUND('',#126,.T.);
#128=ADVANCED_FACE('',(#127),#82,.F.);
#129=CARTESIAN_POINT('',(161.328446487,395.707320919,284.217863203));
#130=DIRECTION('',(0.,0.,-1.));
#131=DIRECTION('',(1.,0.,0.));
#132=AXIS2_PLACEMENT_3D('',#129,#130,#131);
#133=CYLINDRICAL_SURFACE('',#132,0.7);
#134=CARTESIAN_POINT('',(160.628446487,395.707320919,284.217863203));
#135=VERTEX_POINT('',#134);
#136=CARTESIAN_POINT('',(160.628446487,395.707320919,283.382380203));
#137=DIRECTION('',(-0.,-0.,1.));
#138=VECTOR('',#137,0.835483);
#139=LINE('',#136,#138);
#140=EDGE_CURVE('',#60,#135,#139,.T.);
#141=ORIENTED_EDGE('',*,*,#140,.F.);
#142=ORIENTED_EDGE('',*,*,#66,.T.);
#143=ORIENTED_EDGE('',*,*,#73,.T.);
#144=ORIENTED_EDGE('',*,*,#140,.T.);
#145=CARTESIAN_POINT('',(162.028446487,395.707320919,284.217863203));
#146=VERTEX_POINT('',#145);
#147=CARTESIAN_POINT('',(161.328446487,395.707320919,284.217863203));
#148=DIRECTION('',(0.,-0.,1.));
#149=DIRECTION('',(1.,0.,0.));
#150=AXIS2_PLACEMENT_3D('',#147,#148,#149);
#151=CIRCLE('',#150,0.7);
#152=EDGE_CURVE('',#135,#146,#151,.T.);
#153=ORIENTED_EDGE('',*,*,#152,.T.);
#154=CARTESIAN_POINT('',(161.328446487,395.707320919,284.217863203));
#155=DIRECTION('',(0.,-0.,1.));
#156=DIRECTION('',(1.,0.,0.));
#157=AXIS2_PLACEMENT_3D('',#154,#155,#156);
#158=CIRCLE('',#157,0.7);
#159=EDGE_CURVE('',#146,#135,#158,.T.);
#160=ORIENTED_EDGE('',*,*,#159,.T.);
#161=EDGE_LOOP('',(#141,#142,#143,#144,#153,#160));
#162=FACE_BOUND('',#161,.T.);
#163=ADVANCED_FACE('',(#162),#133,.F.);
#164=CARTESIAN_POINT('',(181.30459396,395.897320919,284.217863203));
#165=DIRECTION('',(0.,0.,-1.));
#166=DIRECTION('',(1.,0.,0.));
#167=AXIS2_PLACEMENT_3D('',#164,#165,#166);
#168=CYLINDRICAL_SURFACE('',#167,0.7);
#169=CARTESIAN_POINT('',(180.60459396,395.897320919,282.662380203));
#170=VERTEX_POINT('',#169);
#171=CARTESIAN_POINT('',(180.60459396,395.897320919,284.217863203));
#172=VERTEX_POINT('',#171);
#173=CARTESIAN_POINT('',(180.60459396,395.897320919,282.662380203));
#174=DIRECTION('',(-0.,-0.,1.));
#175=VECTOR('',#174,1.555483);
#176=LINE('',#173,#175);
#177=EDGE_CURVE('',#170,#172,#176,.T.);
#178=ORIENTED_EDGE('',*,*,#177,.F.);
#179=CARTESIAN_POINT('',(182.00459396,395.897320919,282.662380203));
#180=VERTEX_POINT('',#179);
#181=CARTESIAN_POINT('',(181.30459396,395.897320919,282.662380203));
#182=DIRECTION('',(0.,0.,-1.));
#183=DIRECTION('',(1.,0.,0.));
#184=AXIS2_PLACEMENT_3D('',#181,#182,#183);
#185=CIRCLE('',#184,0.7);
#186=EDGE_CURVE('',#170,#180,#185,.T.);
#187=ORIENTED_EDGE('',*,*,#186,.T.);
#188=CARTESIAN_POINT('',(181.30459396,395.897320919,282.662380203));
#189=DIRECTION('',(0.,0.,-1.));
#190=DIRECTION('',(1.,0.,0.));
#191=AXIS2_PLACEMENT_3D('',#188,#189,#190);
#192=CIRCLE('',#191,0.7);
#193=EDGE_CURVE('',#180,#170,#192,.T.);
#194=ORIENTED_EDGE('',*,*,#193,.T.);
#195=ORIENTED_EDGE('',*,*,#177,.T.);
#196=CARTESIAN_POINT('',(182.00459396,395.897320919,284.217863203));
#197=VERTEX_POINT('',#196);
#198=CARTESIAN_POINT('',(181.30459396,395.897320919,284.217863203));
#199=DIRECTION('',(0.,-0.,1.));
#200=DIRECTION('',(1.,0.,0.));
#201=AXIS2_PLACEMENT_3D('',#198,#199,#200);
#202=CIRCLE('',#201,0.7);
#203=EDGE_CURVE('',#172,#197,#202,.T.);
#204=ORIENTED_EDGE('',*,*,#203,.T.);
#205=CARTESIAN_POINT('',(181.30459396,395.897320919,284.217863203));
#206=DIRECTION('',(0.,-0.,1.));
#207=DIRECTION('',(1.,0.,0.));
#208=AXIS2_PLACEMENT_3D('',#205,#206,#207);
#209=CIRCLE('',#208,0.7);
#210=EDGE_CURVE('',#197,#172,#209,.T.);
#211=ORIENTED_EDGE('',*,*,#210,.T.);
#212=EDGE_LOOP('',(#178,#187,#194,#195,#204,#211));
#213=FACE_BOUND('',#212,.T.);
#214=ADVANCED_FACE('',(#213),#168,.F.);
#215=CARTESIAN_POINT('',(177.72269598,395.921347844,284.217863203));
#216=DIRECTION('',(0.,0.,-1.));
#217=DIRECTION('',(1.,0.,0.));
#218=AXIS2_PLACEMENT_3D('',#215,#216,#217);
#219=CYLINDRICAL_SURFACE('',#218,0.7);
#220=CARTESIAN_POINT('',(177.02269598,395.921347844,282.662380203));
#221=VERTEX_POINT('',#220);
#222=CARTESIAN_POINT('',(177.02269598,395.921347844,284.217863203));
#223=VERTEX_POINT('',#222);
#224=CARTESIAN_POINT('',(177.02269598,395.921347844,282.662380203));
#225=DIRECTION('',(-0.,-0.,1.));
#226=VECTOR('',#225,1.555483);
#227=LINE('',#224,#226);
#228=EDGE_CURVE('',#221,#223,#227,.T.);
#229=ORIENTED_EDGE('',*,*,#228,.F.);
#230=CARTESIAN_POINT('',(178.42269598,395.921347844,282.662380203));
#231=VERTEX_POINT('',#230);
#232=CARTESIAN_POINT('',(177.72269598,395.921347844,282.662380203));
#233=DIRECTION('',(0.,0.,-1.));
#234=DIRECTION('',(1.,0.,0.));
#235=AXIS2_PLACEMENT_3D('',#232,#233,#234);
#236=CIRCLE('',#235,0.7);
#237=EDGE_CURVE('',#221,#231,#236,.T.);
#238=ORIENTED_EDGE('',*,*,#237,.T.);
#239=CARTESIAN_POINT('',(177.72269598,395.921347844,282.662380203));
#240=DIRECTION('',(0.,0.,-1.));
#241=DIRECTION('',(1.,0.,0.));
#242=AXIS2_PLACEMENT_3D('',#239,#240,#241);
#243=CIRCLE('',#242,0.7);
#244=EDGE_CURVE('',#231,#221,#243,.T.);
#245=ORIENTED_EDGE('',*,*,#244,.T.);
#246=ORIENTED_EDGE('',*,*,#228,.T.);
#247=CARTESIAN_POINT('',(178.42269598,395.921347844,284.217863203));
#248=VERTEX_POINT('',#247);
#249=CARTESIAN_POINT('',(177.72269598,395.921347844,284.217863203));
#250=DIRECTION('',(0.,-0.,1.));
#251=DIRECTION('',(1.,0.,0.));
#252=AXIS2_PLACEMENT_3D('',#249,#250,#251);
#253=CIRCLE('',#252,0.7);
#254=EDGE_CURVE('',#223,#248,#253,.T.);
#255=ORIENTED_EDGE('',*,*,#254,.T.);
#256=CARTESIAN_POINT('',(177.72269598,395.921347844,284.217863203));
#257=DIRECTION('',(0.,-0.,1.));
#258=DIRECTION('',(1.,0.,0.));
#259=AXIS2_PLACEMENT_3D('',#256,#257,#258);
#260=CIRCLE('',#259,0.7);
#261=EDGE_CURVE('',#248,#223,#260,.T.);
#262=ORIENTED_EDGE('',*,*,#261,.T.);
#263=EDGE_LOOP('',(#229,#238,#245,#246,#255,#262));
#264=FACE_BOUND('',#263,.T.);
#265=ADVANCED_FACE('',(#264),#219,.F.);
#266=CARTESIAN_POINT('',(151.328446487,395.707320919,284.217863203));
#267=DIRECTION('',(0.,0.,-1.));
#268=DIRECTION('',(1.,0.,0.));
#269=AXIS2_PLACEMENT_3D('',#266,#267,#268);
#270=CYLINDRICAL_SURFACE('',#269,0.7);
#271=CARTESIAN_POINT('',(150.628446487,395.707320919,284.217863203));
#272=VERTEX_POINT('',#271);
#273=CARTESIAN_POINT('',(150.628446487,395.707320919,283.382380203));
#274=DIRECTION('',(-0.,-0.,1.));
#275=VECTOR('',#274,0.835483);
#276=LINE('',#273,#275);
#277=EDGE_CURVE('',#111,#272,#276,.T.);
#278=ORIENTED_EDGE('',*,*,#277,.F.);
#279=ORIENTED_EDGE('',*,*,#117,.T.);
#280=ORIENTED_EDGE('',*,*,#124,.T.);
#281=ORIENTED_EDGE('',*,*,#277,.T.);
#282=CARTESIAN_POINT('',(152.028446487,395.707320919,284.217863203));
#283=VERTEX_POINT('',#282);
#284=CARTESIAN_POINT('',(151.328446487,395.707320919,284.217863203));
#285=DIRECTION('',(0.,-0.,1.));
#286=DIRECTION('',(1.,0.,0.));
#287=AXIS2_PLACEMENT_3D('',#284,#285,#286);
#288=CIRCLE('',#287,0.7);
#289=EDGE_CURVE('',#272,#283,#288,.T.);
#290=ORIENTED_EDGE('',*,*,#289,.T.);
#291=CARTESIAN_POINT('',(151.328446487,395.707320919,284.217863203));
#292=DIRECTION('',(0.,-0.,1.));
#293=DIRECTION('',(1.,0.,0.));
#294=AXIS2_PLACEMENT_3D('',#291,#292,#293);
#295=CIRCLE('',#294,0.7);
#296=EDGE_CURVE('',#283,#272,#295,.T.);
#297=ORIENTED_EDGE('',*,*,#296,.T.);
#298=EDGE_LOOP('',(#278,#279,#280,#281,#290,#297));
#299=FACE_BOUND('',#298,.T.);
#300=ADVANCED_FACE('',(#299),#270,.F.);
#301=CARTESIAN_POINT('',(185.123331428,393.016871184,284.217863203));
#302=DIRECTION('',(0.,0.,-1.));
#303=DIRECTION('',(-1.,0.,-0.));
#304=AXIS2_PLACEMENT_3D('',#301,#302,#303);
#305=PLANE('',#304);
#306=ORIENTED_EDGE('',*,*,#152,.F.);
#307=ORIENTED_EDGE('',*,*,#159,.F.);
#308=EDGE_LOOP('',(#306,#307));
#309=FACE_BOUND('',#308,.T.);
#310=ORIENTED_EDGE('',*,*,#203,.F.);
#311=ORIENTED_EDGE('',*,*,#210,.F.);
#312=EDGE_LOOP('',(#310,#311));
#313=FACE_BOUND('',#312,.T.);
#314=ORIENTED_EDGE('',*,*,#254,.F.);
#315=ORIENTED_EDGE('',*,*,#261,.F.);
#316=EDGE_LOOP('',(#314,#315));
#317=FACE_BOUND('',#316,.T.);
#318=ORIENTED_EDGE('',*,*,#289,.F.);
#319=ORIENTED_EDGE('',*,*,#296,.F.);
#320=EDGE_LOOP('',(#318,#319));
#321=FACE_BOUND('',#320,.T.);
#322=CARTESIAN_POINT('',(182.834270976,394.122320919,284.217863203));
#323=VERTEX_POINT('',#322);
#324=CARTESIAN_POINT('',(146.306890291,394.122320919,284.217863203));
#325=VERTEX_POINT('',#324);
#326=CARTESIAN_POINT('',(12527.834270976,394.122320919,284.217863203));
#327=DIRECTION('',(-1.,-0.,0.));
#328=VECTOR('',#327,24690.);
#329=LINE('',#326,#328);
#330=EDGE_CURVE('',#323,#325,#329,.T.);
#331=ORIENTED_EDGE('',*,*,#330,.F.);
#332=CARTESIAN_POINT('',(182.834270976,397.291871184,284.217863203));
#333=VERTEX_POINT('',#332);
#334=CARTESIAN_POINT('',(182.834270976,397.291871184,284.217863203));
#335=DIRECTION('',(0.,-1.,0.));
#336=VECTOR('',#335,3.169550266);
#337=LINE('',#334,#336);
#338=EDGE_CURVE('',#333,#323,#337,.T.);
#339=ORIENTED_EDGE('',*,*,#338,.F.);
#340=CARTESIAN_POINT('',(147.306890291,397.291871184,284.217863203));
#341=VERTEX_POINT('',#340);
#342=CARTESIAN_POINT('',(12527.834270976,397.291871184,284.217863203));
#343=DIRECTION('',(-1.,-0.,0.));
#344=VECTOR('',#343,24690.);
#345=LINE('',#342,#344);
#346=EDGE_CURVE('',#333,#341,#345,.T.);
#347=ORIENTED_EDGE('',*,*,#346,.T.);
#348=CARTESIAN_POINT('',(146.306890291,396.291871184,284.217863203));
#349=VERTEX_POINT('',#348);
#350=CARTESIAN_POINT('',(147.306890291,396.291871184,284.217863203));
#351=DIRECTION('',(0.,-0.,1.));
#352=DIRECTION('',(-0.707106781,0.707106781,0.));
#353=AXIS2_PLACEMENT_3D('',#350,#351,#352);
#354=CIRCLE('',#353,1.);
#355=EDGE_CURVE('',#341,#349,#354,.T.);
#356=ORIENTED_EDGE('',*,*,#355,.T.);
#357=CARTESIAN_POINT('',(146.306890291,395.722320919,284.217863203));
#358=VERTEX_POINT('',#357);
#359=CARTESIAN_POINT('',(146.306890291,12738.016871184,284.217863204));
#360=DIRECTION('',(-0.,-1.,-0.));
#361=VECTOR('',#360,24690.);
#362=LINE('',#359,#361);
#363=EDGE_CURVE('',#349,#358,#362,.T.);
#364=ORIENTED_EDGE('',*,*,#363,.T.);
#365=CARTESIAN_POINT('',(144.228446487,395.722320919,284.217863203));
#366=VERTEX_POINT('',#365);
#367=CARTESIAN_POINT('',(142.678445487,395.722320919,284.217863203));
#368=DIRECTION('',(1.,-0.,0.));
#369=VECTOR('',#368,40.705826489);
#370=LINE('',#367,#369);
#371=EDGE_CURVE('',#366,#358,#370,.T.);
#372=ORIENTED_EDGE('',*,*,#371,.F.);
#373=CARTESIAN_POINT('',(144.228446487,395.597293815,284.217863203));
#374=VERTEX_POINT('',#373);
#375=CARTESIAN_POINT('',(144.228446487,396.222320919,284.217863203));
#376=DIRECTION('',(0.,-1.,0.));
#377=VECTOR('',#376,1.125);
#378=LINE('',#375,#377);
#379=EDGE_CURVE('',#366,#374,#378,.T.);
#380=ORIENTED_EDGE('',*,*,#379,.T.);
#381=CARTESIAN_POINT('',(146.306890291,395.597293815,284.217863203));
#382=VERTEX_POINT('',#381);
#383=CARTESIAN_POINT('',(183.384271976,395.597293815,284.217863203));
#384=DIRECTION('',(-1.,0.,-0.));
#385=VECTOR('',#384,40.705826489);
#386=LINE('',#383,#385);
#387=EDGE_CURVE('',#382,#374,#386,.T.);
#388=ORIENTED_EDGE('',*,*,#387,.F.);
#389=CARTESIAN_POINT('',(146.306890291,12738.016871184,284.217863204));
#390=DIRECTION('',(-0.,-1.,-0.));
#391=VECTOR('',#390,24690.);
#392=LINE('',#389,#391);
#393=EDGE_CURVE('',#382,#325,#392,.T.);
#394=ORIENTED_EDGE('',*,*,#393,.T.);
#395=EDGE_LOOP('',(#331,#339,#347,#356,#364,#372,#380,#388,#394));
#396=FACE_BOUND('',#395,.T.);
#397=ADVANCED_FACE('',(#309,#313,#317,#321,#396),#305,.F.);
#398=CARTESIAN_POINT('',(145.328446487,395.097320919,282.662380247));
#399=DIRECTION('',(0.,0.,-1.));
#400=DIRECTION('',(-1.,0.,-0.));
#401=AXIS2_PLACEMENT_3D('',#398,#399,#400);
#402=PLANE('',#401);
#403=ORIENTED_EDGE('',*,*,#49,.T.);
#404=ORIENTED_EDGE('',*,*,#56,.T.);
#405=EDGE_LOOP('',(#403,#404));
#406=FACE_BOUND('',#405,.T.);
#407=ORIENTED_EDGE('',*,*,#100,.T.);
#408=ORIENTED_EDGE('',*,*,#107,.T.);
#409=EDGE_LOOP('',(#407,#408));
#410=FACE_BOUND('',#409,.T.);
#411=ORIENTED_EDGE('',*,*,#186,.F.);
#412=ORIENTED_EDGE('',*,*,#193,.F.);
#413=EDGE_LOOP('',(#411,#412));
#414=FACE_BOUND('',#413,.T.);
#415=ORIENTED_EDGE('',*,*,#237,.F.);
#416=ORIENTED_EDGE('',*,*,#244,.F.);
#417=EDGE_LOOP('',(#415,#416));
#418=FACE_BOUND('',#417,.T.);
#419=CARTESIAN_POINT('',(144.228446486,395.097320919,282.662380247));
#420=VERTEX_POINT('',#419);
#421=CARTESIAN_POINT('',(141.628446487,395.097320919,282.662380247));
#422=VERTEX_POINT('',#421);
#423=CARTESIAN_POINT('',(144.228446486,395.097320919,282.662380247));
#424=DIRECTION('',(-1.,0.,0.));
#425=VECTOR('',#424,2.6);
#426=LINE('',#423,#425);
#427=EDGE_CURVE('',#420,#422,#426,.T.);
#428=ORIENTED_EDGE('',*,*,#427,.F.);
#429=CARTESIAN_POINT('',(144.228446486,396.897320919,282.662380247));
#430=VERTEX_POINT('',#429);
#431=CARTESIAN_POINT('',(144.228446486,396.897320919,282.662380247));
#432=DIRECTION('',(0.,-1.,0.));
#433=VECTOR('',#432,1.8);
#434=LINE('',#431,#433);
#435=EDGE_CURVE('',#430,#420,#434,.T.);
#436=ORIENTED_EDGE('',*,*,#435,.F.);
#437=CARTESIAN_POINT('',(141.628446487,396.897320919,282.662380247));
#438=VERTEX_POINT('',#437);
#439=CARTESIAN_POINT('',(141.628446487,396.897320919,282.662380247));
#440=DIRECTION('',(1.,0.,-0.));
#441=VECTOR('',#440,2.6);
#442=LINE('',#439,#441);
#443=EDGE_CURVE('',#438,#430,#442,.T.);
#444=ORIENTED_EDGE('',*,*,#443,.F.);
#445=CARTESIAN_POINT('',(141.628446487,398.197320919,282.662380247));
#446=VERTEX_POINT('',#445);
#447=CARTESIAN_POINT('',(141.628446487,396.897320919,282.662380247));
#448=DIRECTION('',(0.,1.,0.));
#449=VECTOR('',#448,1.3);
#450=LINE('',#447,#449);
#451=EDGE_CURVE('',#438,#446,#450,.T.);
#452=ORIENTED_EDGE('',*,*,#451,.T.);
#453=CARTESIAN_POINT('',(145.806890291,398.197320919,282.662380247));
#454=VERTEX_POINT('',#453);
#455=CARTESIAN_POINT('',(145.806890291,398.197320919,282.662380247));
#456=DIRECTION('',(-1.,0.,0.));
#457=VECTOR('',#456,4.178443804);
#458=LINE('',#455,#457);
#459=EDGE_CURVE('',#454,#446,#458,.T.);
#460=ORIENTED_EDGE('',*,*,#459,.F.);
#461=CARTESIAN_POINT('',(145.806890291,398.072320919,282.662380247));
#462=VERTEX_POINT('',#461);
#463=CARTESIAN_POINT('',(145.806890291,398.072320919,282.662380247));
#464=DIRECTION('',(0.,1.,0.));
#465=VECTOR('',#464,0.125);
#466=LINE('',#463,#465);
#467=EDGE_CURVE('',#462,#454,#466,.T.);
#468=ORIENTED_EDGE('',*,*,#467,.F.);
#469=CARTESIAN_POINT('',(185.528446487,398.072320919,282.662380247));
#470=VERTEX_POINT('',#469);
#471=CARTESIAN_POINT('',(185.528446487,398.072320919,282.662380247));
#472=DIRECTION('',(-1.,-0.,0.));
#473=VECTOR('',#472,39.721556196);
#474=LINE('',#471,#473);
#475=EDGE_CURVE('',#470,#462,#474,.T.);
#476=ORIENTED_EDGE('',*,*,#475,.F.);
#477=CARTESIAN_POINT('',(185.528446487,394.122320919,282.662380247));
#478=VERTEX_POINT('',#477);
#479=CARTESIAN_POINT('',(185.528446487,394.122320919,282.662380247));
#480=DIRECTION('',(0.,1.,0.));
#481=VECTOR('',#480,3.95);
#482=LINE('',#479,#481);
#483=EDGE_CURVE('',#478,#470,#482,.T.);
#484=ORIENTED_EDGE('',*,*,#483,.F.);
#485=CARTESIAN_POINT('',(145.328452417,394.122320919,282.662380246));
#486=VERTEX_POINT('',#485);
#487=CARTESIAN_POINT('',(12530.528446487,394.122320919,282.662380506));
#488=DIRECTION('',(-1.,0.,-0.));
#489=VECTOR('',#488,24690.);
#490=LINE('',#487,#489);
#491=EDGE_CURVE('',#478,#486,#490,.T.);
#492=ORIENTED_EDGE('',*,*,#491,.T.);
#493=CARTESIAN_POINT('',(145.328452417,393.997320919,282.662380246));
#494=VERTEX_POINT('',#493);
#495=CARTESIAN_POINT('',(145.328452417,394.122320919,282.662380246));
#496=DIRECTION('',(0.,-1.,0.));
#497=VECTOR('',#496,0.125);
#498=LINE('',#495,#497);
#499=EDGE_CURVE('',#486,#494,#498,.T.);
#500=ORIENTED_EDGE('',*,*,#499,.T.);
#501=CARTESIAN_POINT('',(141.628446487,393.997320919,282.662380247));
#502=VERTEX_POINT('',#501);
#503=CARTESIAN_POINT('',(145.328452417,393.997320919,282.662380246));
#504=DIRECTION('',(-1.,0.,0.));
#505=VECTOR('',#504,3.700005931);
#506=LINE('',#503,#505);
#507=EDGE_CURVE('',#494,#502,#506,.T.);
#508=ORIENTED_EDGE('',*,*,#507,.T.);
#509=CARTESIAN_POINT('',(141.628446487,393.997320919,282.662380247));
#510=DIRECTION('',(0.,1.,0.));
#511=VECTOR('',#510,1.1);
#512=LINE('',#509,#511);
#513=EDGE_CURVE('',#502,#422,#512,.T.);
#514=ORIENTED_EDGE('',*,*,#513,.T.);
#515=EDGE_LOOP('',(#428,#436,#444,#452,#460,#468,#476,#484,#492,#500,#508,#514));
#516=FACE_BOUND('',#515,.T.);
#517=ADVANCED_FACE('',(#406,#410,#414,#418,#516),#402,.T.);
#518=CARTESIAN_POINT('',(165.715110859,395.597293815,284.717863203));
#519=DIRECTION('',(-1.,0.,-0.));
#520=DIRECTION('',(0.,-0.707106781,-0.707106781));
#521=AXIS2_PLACEMENT_3D('',#518,#519,#520);
#522=CYLINDRICAL_SURFACE('',#521,0.5);
#523=CARTESIAN_POINT('',(144.228446487,395.097293815,284.717863203));
#524=VERTEX_POINT('',#523);
#525=CARTESIAN_POINT('',(144.228446487,395.097320919,284.712657195));
#526=VERTEX_POINT('',#525);
#527=CARTESIAN_POINT('',(144.228446487,395.597293815,284.717863203));
#528=DIRECTION('',(1.,-0.,0.));
#529=DIRECTION('',(0.,-0.707106781,-0.707106781));
#530=AXIS2_PLACEMENT_3D('',#527,#528,#529);
#531=CIRCLE('',#530,0.5);
#532=EDGE_CURVE('',#524,#526,#531,.T.);
#533=ORIENTED_EDGE('',*,*,#532,.F.);
#534=CARTESIAN_POINT('',(146.306890291,395.097293815,284.717863203));
#535=VERTEX_POINT('',#534);
#536=CARTESIAN_POINT('',(142.678445487,395.097293815,284.717863203));
#537=DIRECTION('',(1.,-0.,0.));
#538=VECTOR('',#537,40.705826489);
#539=LINE('',#536,#538);
#540=EDGE_CURVE('',#524,#535,#539,.T.);
#541=ORIENTED_EDGE('',*,*,#540,.T.);
#542=CARTESIAN_POINT('',(146.306890291,395.597293815,284.717863203));
#543=DIRECTION('',(1.,-0.,0.));
#544=DIRECTION('',(-0.,-0.707106781,-0.707106781));
#545=AXIS2_PLACEMENT_3D('',#542,#543,#544);
#546=CIRCLE('',#545,0.5);
#547=EDGE_CURVE('',#535,#382,#546,.T.);
#548=ORIENTED_EDGE('',*,*,#547,.T.);
#549=ORIENTED_EDGE('',*,*,#387,.T.);
#550=CARTESIAN_POINT('',(144.228446487,395.597293815,284.717863203));
#551=DIRECTION('',(-1.,0.,-0.));
#552=DIRECTION('',(0.,-0.707106781,-0.707106781));
#553=AXIS2_PLACEMENT_3D('',#550,#551,#552);
#554=CIRCLE('',#553,0.5);
#555=EDGE_CURVE('',#374,#526,#554,.T.);
#556=ORIENTED_EDGE('',*,*,#555,.T.);
#557=EDGE_LOOP('',(#533,#541,#548,#549,#556));
#558=FACE_BOUND('',#557,.T.);
#559=ADVANCED_FACE('',(#558),#522,.F.);
#560=CARTESIAN_POINT('',(146.306890291,395.597293815,285.71785936));
#561=DIRECTION('',(1.,0.,0.));
#562=DIRECTION('',(0.,-0.707106781,0.707106781));
#563=AXIS2_PLACEMENT_3D('',#560,#561,#562);
#564=CYLINDRICAL_SURFACE('',#563,0.5);
#565=CARTESIAN_POINT('',(144.228446487,395.597293815,286.21785936));
#566=VERTEX_POINT('',#565);
#567=CARTESIAN_POINT('',(144.228446487,395.394140567,286.174727785));
#568=VERTEX_POINT('',#567);
#569=CARTESIAN_POINT('',(144.228446487,395.597293815,285.71785936));
#570=DIRECTION('',(1.,0.,0.));
#571=DIRECTION('',(0.,-0.707106781,0.707106781));
#572=AXIS2_PLACEMENT_3D('',#569,#570,#571);
#573=CIRCLE('',#572,0.5);
#574=EDGE_CURVE('',#566,#568,#573,.T.);
#575=ORIENTED_EDGE('',*,*,#574,.F.);
#576=CARTESIAN_POINT('',(146.306890291,395.597293815,286.21785936));
#577=VERTEX_POINT('',#576);
#578=CARTESIAN_POINT('',(142.678445487,395.597293815,286.21785936));
#579=DIRECTION('',(1.,-0.,0.));
#580=VECTOR('',#579,5.178445804);
#581=LINE('',#578,#580);
#582=EDGE_CURVE('',#566,#577,#581,.T.);
#583=ORIENTED_EDGE('',*,*,#582,.T.);
#584=CARTESIAN_POINT('',(146.306890291,395.097293815,285.71785936));
#585=VERTEX_POINT('',#584);
#586=CARTESIAN_POINT('',(146.306890291,395.597293815,285.71785936));
#587=DIRECTION('',(1.,0.,0.));
#588=DIRECTION('',(0.,-0.707106781,0.707106781));
#589=AXIS2_PLACEMENT_3D('',#586,#587,#588);
#590=CIRCLE('',#589,0.5);
#591=EDGE_CURVE('',#577,#585,#590,.T.);
#592=ORIENTED_EDGE('',*,*,#591,.T.);
#593=CARTESIAN_POINT('',(144.228446487,395.097293815,285.71785936));
#594=VERTEX_POINT('',#593);
#595=CARTESIAN_POINT('',(147.856891291,395.097293815,285.71785936));
#596=DIRECTION('',(-1.,0.,-0.));
#597=VECTOR('',#596,5.178445804);
#598=LINE('',#595,#597);
#599=EDGE_CURVE('',#585,#594,#598,.T.);
#600=ORIENTED_EDGE('',*,*,#599,.T.);
#601=CARTESIAN_POINT('',(144.228446487,395.097320919,285.723065368));
#602=VERTEX_POINT('',#601);
#603=CARTESIAN_POINT('',(144.228446487,395.597293815,285.71785936));
#604=DIRECTION('',(1.,0.,0.));
#605=DIRECTION('',(0.,-0.707106781,0.707106781));
#606=AXIS2_PLACEMENT_3D('',#603,#604,#605);
#607=CIRCLE('',#606,0.5);
#608=EDGE_CURVE('',#602,#594,#607,.T.);
#609=ORIENTED_EDGE('',*,*,#608,.F.);
#610=CARTESIAN_POINT('',(144.277751549,395.097320919,285.723065368));
#611=VERTEX_POINT('',#610);
#612=CARTESIAN_POINT('',(-12198.693109709,395.097320919,285.723065368));
#613=DIRECTION('',(1.,-0.,0.));
#614=VECTOR('',#613,24690.);
#615=LINE('',#612,#614);
#616=EDGE_CURVE('',#602,#611,#615,.T.);
#617=ORIENTED_EDGE('',*,*,#616,.T.);
#618=CARTESIAN_POINT('',(144.219574225,395.597293815,286.21785936));
#619=CARTESIAN_POINT('',(144.219574225,395.66024971,286.21785936));
#620=CARTESIAN_POINT('',(144.222377075,395.727272957,286.20524405));
#621=CARTESIAN_POINT('',(144.232536275,395.850353746,286.154206812));
#622=CARTESIAN_POINT('',(144.239752548,395.906426833,286.115794586));
#623=CARTESIAN_POINT('',(144.25358775,395.995029746,286.027268675));
#624=CARTESIAN_POINT('',(144.261122261,396.033511492,285.971159552));
#625=CARTESIAN_POINT('',(144.272662423,396.084648537,285.847983248));
#626=CARTESIAN_POINT('',(144.276545594,396.097293815,285.780900463));
#627=CARTESIAN_POINT('',(144.279181676,396.097293815,285.655013705));
#628=CARTESIAN_POINT('',(144.278120209,396.084718614,285.588021428));
#629=CARTESIAN_POINT('',(144.271796515,396.033699017,285.464894301));
#630=CARTESIAN_POINT('',(144.266658292,395.995260972,285.408750482));
#631=CARTESIAN_POINT('',(144.256622152,395.906626402,285.320054469));
#632=CARTESIAN_POINT('',(144.251068989,395.850463378,285.281565662));
#633=CARTESIAN_POINT('',(144.243139141,395.727269365,285.230464895));
#634=CARTESIAN_POINT('',(144.240897669,395.660227046,285.21785936));
#635=CARTESIAN_POINT('',(144.240897669,395.534360585,285.21785936));
#636=CARTESIAN_POINT('',(144.243139141,395.467318265,285.230464895));
#637=CARTESIAN_POINT('',(144.251068989,395.344124253,285.281565662));
#638=CARTESIAN_POINT('',(144.256622152,395.287961229,285.320054469));
#639=CARTESIAN_POINT('',(144.266658292,395.199326658,285.408750482));
#640=CARTESIAN_POINT('',(144.271796515,395.160888613,285.464894301));
#641=CARTESIAN_POINT('',(144.278120209,395.109869017,285.588021428));
#642=CARTESIAN_POINT('',(144.279181676,395.097293815,285.655013705));
#643=CARTESIAN_POINT('',(144.276545594,395.097293815,285.780900463));
#644=CARTESIAN_POINT('',(144.272662423,395.109939094,285.847983248));
#645=CARTESIAN_POINT('',(144.261122261,395.161076139,285.971159552));
#646=CARTESIAN_POINT('',(144.25358775,395.199557885,286.027268675));
#647=CARTESIAN_POINT('',(144.239752548,395.288160798,286.115794586));
#648=CARTESIAN_POINT('',(144.232536275,395.344233885,286.154206812));
#649=CARTESIAN_POINT('',(144.222377075,395.467314674,286.20524405));
#650=CARTESIAN_POINT('',(144.219574225,395.534337921,286.21785936));
#651=CARTESIAN_POINT('',(144.219574225,395.597293815,286.21785936));
#652=B_SPLINE_CURVE_WITH_KNOTS('',3,(#618,#619,#620,#621,#622,#623,#624,#625,#626,#627,#628,#629,#630,#631,#632,#633,#634,#635,#636,#637,#638,#639,#640,#641,#642,#643,
#644,#645,#646,#647,#648,#649,#650,#651),.UNSPECIFIED.,.T.,.F.,(4,2,2,2,2,2,2,2,2,2,2,2,2,2,2,2,4),(0.,0.188867683,0.377735366,0.566900134,0.756064902,0.944643198,1.133221494,1.322021185,1.510820876,1.699620567,1.888420258,2.076998554,2.26557685,2.454741618,2.643906386,2.832774069,3.021641752),.UNSPECIFIED.);
#653=EDGE_CURVE('',#611,#568,#652,.T.);
#654=ORIENTED_EDGE('',*,*,#653,.T.);
#655=EDGE_LOOP('',(#575,#583,#592,#600,#609,#617,#654));
#656=FACE_BOUND('',#655,.T.);
#657=ADVANCED_FACE('',(#656),#564,.F.);
#658=CARTESIAN_POINT('',(146.306890291,396.322320919,286.21785936));
#659=DIRECTION('',(0.,0.,-1.));
#660=DIRECTION('',(-0.,-1.,-0.));
#661=AXIS2_PLACEMENT_3D('',#658,#659,#660);
#662=PLANE('',#661);
#663=ORIENTED_EDGE('',*,*,#582,.F.);
#664=CARTESIAN_POINT('',(144.228446487,395.722320919,286.21785936));
#665=VERTEX_POINT('',#664);
#666=CARTESIAN_POINT('',(144.228446487,395.097293815,286.21785936));
#667=DIRECTION('',(0.,1.,0.));
#668=VECTOR('',#667,1.125027103);
#669=LINE('',#666,#668);
#670=EDGE_CURVE('',#566,#665,#669,.T.);
#671=ORIENTED_EDGE('',*,*,#670,.T.);
#672=CARTESIAN_POINT('',(146.306890291,395.722320919,286.21785936));
#673=VERTEX_POINT('',#672);
#674=CARTESIAN_POINT('',(147.856891291,395.722320919,286.21785936));
#675=DIRECTION('',(-1.,0.,-0.));
#676=VECTOR('',#675,5.178445804);
#677=LINE('',#674,#676);
#678=EDGE_CURVE('',#673,#665,#677,.T.);
#679=ORIENTED_EDGE('',*,*,#678,.F.);
#680=CARTESIAN_POINT('',(146.306890291,396.222320919,286.21785936));
#681=DIRECTION('',(0.,-1.,0.));
#682=VECTOR('',#681,1.125027103);
#683=LINE('',#680,#682);
#684=EDGE_CURVE('',#673,#577,#683,.T.);
#685=ORIENTED_EDGE('',*,*,#684,.T.);
#686=EDGE_LOOP('',(#663,#671,#679,#685));
#687=FACE_BOUND('',#686,.T.);
#688=ADVANCED_FACE('',(#687),#662,.T.);
#689=CARTESIAN_POINT('',(144.228446487,396.397320919,282.662380247));
#690=DIRECTION('',(-1.,0.,-0.));
#691=DIRECTION('',(-0.,-0.,1.));
#692=AXIS2_PLACEMENT_3D('',#689,#690,#691);
#693=PLANE('',#692);
#694=ORIENTED_EDGE('',*,*,#532,.T.);
#695=CARTESIAN_POINT('',(144.228446487,395.097320919,286.174727785));
#696=DIRECTION('',(0.,0.,-1.));
#697=VECTOR('',#696,1.956864582);
#698=LINE('',#695,#697);
#699=EDGE_CURVE('',#602,#526,#698,.T.);
#700=ORIENTED_EDGE('',*,*,#699,.F.);
#701=ORIENTED_EDGE('',*,*,#608,.T.);
#702=CARTESIAN_POINT('',(144.228446487,395.097293815,284.217863203));
#703=DIRECTION('',(0.,0.,1.));
#704=VECTOR('',#703,1.999996157);
#705=LINE('',#702,#704);
#706=EDGE_CURVE('',#524,#594,#705,.T.);
#707=ORIENTED_EDGE('',*,*,#706,.F.);
#708=EDGE_LOOP('',(#694,#700,#701,#707));
#709=FACE_BOUND('',#708,.T.);
#710=ADVANCED_FACE('',(#709),#693,.F.);
#711=CARTESIAN_POINT('',(144.228446487,396.397320919,282.662380247));
#712=DIRECTION('',(-1.,0.,-0.));
#713=DIRECTION('',(-0.,-0.,1.));
#714=AXIS2_PLACEMENT_3D('',#711,#712,#713);
#715=PLANE('',#714);
#716=ORIENTED_EDGE('',*,*,#574,.T.);
#717=CARTESIAN_POINT('',(144.228446487,395.925474167,286.174727785));
#718=VERTEX_POINT('',#717);
#719=CARTESIAN_POINT('',(144.228446487,396.222320919,286.174727785));
#720=DIRECTION('',(0.,-1.,0.));
#721=VECTOR('',#720,1.125);
#722=LINE('',#719,#721);
#723=EDGE_CURVE('',#718,#568,#722,.T.);
#724=ORIENTED_EDGE('',*,*,#723,.F.);
#725=CARTESIAN_POINT('',(144.228446487,395.722320919,285.71785936));
#726=DIRECTION('',(1.,-0.,0.));
#727=DIRECTION('',(-0.,0.707106781,0.707106781));
#728=AXIS2_PLACEMENT_3D('',#725,#726,#727);
#729=CIRCLE('',#728,0.5);
#730=EDGE_CURVE('',#718,#665,#729,.T.);
#731=ORIENTED_EDGE('',*,*,#730,.T.);
#732=ORIENTED_EDGE('',*,*,#670,.F.);
#733=EDGE_LOOP('',(#716,#724,#731,#732));
#734=FACE_BOUND('',#733,.T.);
#735=ADVANCED_FACE('',(#734),#715,.F.);
#736=CARTESIAN_POINT('',(146.306890291,395.722320919,285.71785936));
#737=DIRECTION('',(-1.,0.,-0.));
#738=DIRECTION('',(-0.,0.707106781,0.707106781));
#739=AXIS2_PLACEMENT_3D('',#736,#737,#738);
#740=CYLINDRICAL_SURFACE('',#739,0.5);
#741=ORIENTED_EDGE('',*,*,#730,.F.);
#742=CARTESIAN_POINT('',(144.228446487,396.222320919,285.71785936));
#743=VERTEX_POINT('',#742);
#744=CARTESIAN_POINT('',(144.228446487,395.722320919,285.71785936));
#745=DIRECTION('',(1.,-0.,0.));
#746=DIRECTION('',(-0.,0.707106781,0.707106781));
#747=AXIS2_PLACEMENT_3D('',#744,#745,#746);
#748=CIRCLE('',#747,0.5);
#749=EDGE_CURVE('',#743,#718,#748,.T.);
#750=ORIENTED_EDGE('',*,*,#749,.F.);
#751=CARTESIAN_POINT('',(146.306890291,396.222320919,285.71785936));
#752=VERTEX_POINT('',#751);
#753=CARTESIAN_POINT('',(142.678445487,396.222320919,285.71785936));
#754=DIRECTION('',(1.,-0.,0.));
#755=VECTOR('',#754,5.178445804);
#756=LINE('',#753,#755);
#757=EDGE_CURVE('',#743,#752,#756,.T.);
#758=ORIENTED_EDGE('',*,*,#757,.T.);
#759=CARTESIAN_POINT('',(146.306890291,395.722320919,285.71785936));
#760=DIRECTION('',(1.,-0.,0.));
#761=DIRECTION('',(0.,0.707106781,0.707106781));
#762=AXIS2_PLACEMENT_3D('',#759,#760,#761);
#763=CIRCLE('',#762,0.5);
#764=EDGE_CURVE('',#752,#673,#763,.T.);
#765=ORIENTED_EDGE('',*,*,#764,.T.);
#766=ORIENTED_EDGE('',*,*,#678,.T.);
#767=EDGE_LOOP('',(#741,#750,#758,#765,#766));
#768=FACE_BOUND('',#767,.T.);
#769=ADVANCED_FACE('',(#768),#740,.F.);
#770=CARTESIAN_POINT('',(165.715110859,395.722320919,284.717863203));
#771=DIRECTION('',(1.,0.,0.));
#772=DIRECTION('',(0.,0.707106781,-0.707106781));
#773=AXIS2_PLACEMENT_3D('',#770,#771,#772);
#774=CYLINDRICAL_SURFACE('',#773,0.5);
#775=CARTESIAN_POINT('',(146.306890291,396.222320919,284.717863203));
#776=VERTEX_POINT('',#775);
#777=CARTESIAN_POINT('',(146.306890291,395.722320919,284.717863203));
#778=DIRECTION('',(1.,0.,0.));
#779=DIRECTION('',(-0.,0.707106781,-0.707106781));
#780=AXIS2_PLACEMENT_3D('',#777,#778,#779);
#781=CIRCLE('',#780,0.5);
#782=EDGE_CURVE('',#358,#776,#781,.T.);
#783=ORIENTED_EDGE('',*,*,#782,.T.);
#784=CARTESIAN_POINT('',(144.228446487,396.222320919,284.717863203));
#785=VERTEX_POINT('',#784);
#786=CARTESIAN_POINT('',(183.384271976,396.222320919,284.717863203));
#787=DIRECTION('',(-1.,0.,-0.));
#788=VECTOR('',#787,40.705826489);
#789=LINE('',#786,#788);
#790=EDGE_CURVE('',#776,#785,#789,.T.);
#791=ORIENTED_EDGE('',*,*,#790,.T.);
#792=CARTESIAN_POINT('',(144.228446487,395.722320919,284.717863203));
#793=DIRECTION('',(-1.,-0.,-0.));
#794=DIRECTION('',(0.,0.707106781,-0.707106781));
#795=AXIS2_PLACEMENT_3D('',#792,#793,#794);
#796=CIRCLE('',#795,0.5);
#797=EDGE_CURVE('',#785,#366,#796,.T.);
#798=ORIENTED_EDGE('',*,*,#797,.T.);
#799=ORIENTED_EDGE('',*,*,#371,.T.);
#800=EDGE_LOOP('',(#783,#791,#798,#799));
#801=FACE_BOUND('',#800,.T.);
#802=ADVANCED_FACE('',(#801),#774,.F.);
#803=CARTESIAN_POINT('',(146.306890291,396.222320919,284.217863203));
#804=DIRECTION('',(-0.,1.,0.));
#805=DIRECTION('',(-0.,-0.,1.));
#806=AXIS2_PLACEMENT_3D('',#803,#804,#805);
#807=PLANE('',#806);
#808=ORIENTED_EDGE('',*,*,#757,.F.);
#809=CARTESIAN_POINT('',(144.228446487,396.222320919,284.217863203));
#810=DIRECTION('',(0.,0.,1.));
#811=VECTOR('',#810,1.956864582);
#812=LINE('',#809,#811);
#813=EDGE_CURVE('',#785,#743,#812,.T.);
#814=ORIENTED_EDGE('',*,*,#813,.F.);
#815=ORIENTED_EDGE('',*,*,#790,.F.);
#816=CARTESIAN_POINT('',(146.306890291,396.222320919,286.21785936));
#817=DIRECTION('',(0.,0.,-1.));
#818=VECTOR('',#817,1.999996157);
#819=LINE('',#816,#818);
#820=EDGE_CURVE('',#752,#776,#819,.T.);
#821=ORIENTED_EDGE('',*,*,#820,.F.);
#822=EDGE_LOOP('',(#808,#814,#815,#821));
#823=FACE_BOUND('',#822,.T.);
#824=ADVANCED_FACE('',(#823),#807,.F.);
#825=CARTESIAN_POINT('',(147.306890291,396.291871184,287.052269371));
#826=DIRECTION('',(-0.,0.,-1.));
#827=DIRECTION('',(-0.707106781,0.707106781,0.));
#828=AXIS2_PLACEMENT_3D('',#825,#826,#827);
#829=CYLINDRICAL_SURFACE('',#828,1.);
#830=ORIENTED_EDGE('',*,*,#355,.F.);
#831=CARTESIAN_POINT('',(147.306890291,397.291871184,288.662380247));
#832=VERTEX_POINT('',#831);
#833=CARTESIAN_POINT('',(147.306890291,397.291871184,281.117862203));
#834=DIRECTION('',(-0.,-0.,1.));
#835=VECTOR('',#834,10.644519044);
#836=LINE('',#833,#835);
#837=EDGE_CURVE('',#341,#832,#836,.T.);
#838=ORIENTED_EDGE('',*,*,#837,.T.);
#839=CARTESIAN_POINT('',(146.306890291,396.291871184,288.662380247));
#840=VERTEX_POINT('',#839);
#841=CARTESIAN_POINT('',(147.306890291,396.291871184,288.662380247));
#842=DIRECTION('',(0.,-0.,1.));
#843=DIRECTION('',(-0.707106781,0.707106781,0.));
#844=AXIS2_PLACEMENT_3D('',#841,#842,#843);
#845=CIRCLE('',#844,1.);
#846=EDGE_CURVE('',#832,#840,#845,.T.);
#847=ORIENTED_EDGE('',*,*,#846,.T.);
#848=CARTESIAN_POINT('',(146.306890291,396.291871184,291.762381247));
#849=DIRECTION('',(0.,0.,-1.));
#850=VECTOR('',#849,10.644519044);
#851=LINE('',#848,#850);
#852=EDGE_CURVE('',#840,#349,#851,.T.);
#853=ORIENTED_EDGE('',*,*,#852,.T.);
#854=EDGE_LOOP('',(#830,#838,#847,#853));
#855=FACE_BOUND('',#854,.T.);
#856=ADVANCED_FACE('',(#855),#829,.F.);
#857=CARTESIAN_POINT('',(193.042668389,397.291871184,290.386675538));
#858=DIRECTION('',(0.,1.,0.));
#859=DIRECTION('',(0.,0.,-1.));
#860=AXIS2_PLACEMENT_3D('',#857,#858,#859);
#861=PLANE('',#860);
#862=CARTESIAN_POINT('',(172.628446485,397.291871184,284.662380247));
#863=VERTEX_POINT('',#862);
#864=CARTESIAN_POINT('',(172.628446487,397.291871184,286.662380247));
#865=VERTEX_POINT('',#864);
#866=CARTESIAN_POINT('',(172.628446487,397.291871184,285.662380247));
#867=DIRECTION('',(-0.,-1.,-0.));
#868=DIRECTION('',(0.,0.,-1.));
#869=AXIS2_PLACEMENT_3D('',#866,#867,#868);
#870=CIRCLE('',#869,1.);
#871=EDGE_CURVE('',#863,#865,#870,.T.);
#872=ORIENTED_EDGE('',*,*,#871,.F.);
#873=CARTESIAN_POINT('',(172.628446487,397.291871184,285.662380247));
#874=DIRECTION('',(-0.,-1.,-0.));
#875=DIRECTION('',(0.,0.,-1.));
#876=AXIS2_PLACEMENT_3D('',#873,#874,#875);
#877=CIRCLE('',#876,1.);
#878=EDGE_CURVE('',#865,#863,#877,.T.);
#879=ORIENTED_EDGE('',*,*,#878,.F.);
#880=EDGE_LOOP('',(#872,#879));
#881=FACE_BOUND('',#880,.T.);
#882=ORIENTED_EDGE('',*,*,#837,.F.);
#883=ORIENTED_EDGE('',*,*,#346,.F.);
#884=CARTESIAN_POINT('',(175.136141641,397.291871184,288.662380247));
#885=VERTEX_POINT('',#884);
#886=CARTESIAN_POINT('',(175.136141641,397.291871184,288.662380247));
#887=DIRECTION('',(0.866025404,0.,-0.5));
#888=VECTOR('',#887,8.889034087);
#889=LINE('',#886,#888);
#890=EDGE_CURVE('',#885,#333,#889,.T.);
#891=ORIENTED_EDGE('',*,*,#890,.F.);
#892=CARTESIAN_POINT('',(146.306890291,397.291871184,288.662380247));
#893=DIRECTION('',(1.,0.,-0.));
#894=VECTOR('',#893,28.82925135);
#895=LINE('',#892,#894);
#896=EDGE_CURVE('',#832,#885,#895,.T.);
#897=ORIENTED_EDGE('',*,*,#896,.F.);
#898=EDGE_LOOP('',(#882,#883,#891,#897));
#899=FACE_BOUND('',#898,.T.);
#900=ADVANCED_FACE('',(#881,#899),#861,.F.);
#901=CARTESIAN_POINT('',(144.228446487,396.397320919,282.662380247));
#902=DIRECTION('',(-1.,0.,-0.));
#903=DIRECTION('',(-0.,-0.,1.));
#904=AXIS2_PLACEMENT_3D('',#901,#902,#903);
#905=PLANE('',#904);
#906=CARTESIAN_POINT('',(144.228446487,396.897320919,286.174727785));
#907=VERTEX_POINT('',#906);
#908=CARTESIAN_POINT('',(144.228446487,396.897320919,286.174727785));
#909=DIRECTION('',(0.,-1.,0.));
#910=VECTOR('',#909,0.971846752);
#911=LINE('',#908,#910);
#912=EDGE_CURVE('',#907,#718,#911,.T.);
#913=ORIENTED_EDGE('',*,*,#912,.F.);
#914=CARTESIAN_POINT('',(144.228446487,396.897320919,286.174727785));
#915=DIRECTION('',(-0.,0.,-1.));
#916=VECTOR('',#915,3.512347538);
#917=LINE('',#914,#916);
#918=EDGE_CURVE('',#907,#430,#917,.T.);
#919=ORIENTED_EDGE('',*,*,#918,.T.);
#920=ORIENTED_EDGE('',*,*,#435,.T.);
#921=CARTESIAN_POINT('',(144.228446487,395.097320919,284.217863203));
#922=VERTEX_POINT('',#921);
#923=CARTESIAN_POINT('',(144.228446486,395.097320919,282.662380247));
#924=DIRECTION('',(0.,0.,1.));
#925=VECTOR('',#924,1.555482956);
#926=LINE('',#923,#925);
#927=EDGE_CURVE('',#420,#922,#926,.T.);
#928=ORIENTED_EDGE('',*,*,#927,.T.);
#929=CARTESIAN_POINT('',(144.228446487,395.097320919,286.174727785));
#930=DIRECTION('',(0.,0.,-1.));
#931=VECTOR('',#930,1.956864582);
#932=LINE('',#929,#931);
#933=EDGE_CURVE('',#526,#922,#932,.T.);
#934=ORIENTED_EDGE('',*,*,#933,.F.);
#935=ORIENTED_EDGE('',*,*,#555,.F.);
#936=ORIENTED_EDGE('',*,*,#379,.F.);
#937=ORIENTED_EDGE('',*,*,#797,.F.);
#938=ORIENTED_EDGE('',*,*,#813,.T.);
#939=ORIENTED_EDGE('',*,*,#749,.T.);
#940=EDGE_LOOP('',(#913,#919,#920,#928,#934,#935,#936,#937,#938,#939));
#941=FACE_BOUND('',#940,.T.);
#942=ADVANCED_FACE('',(#941),#905,.T.);
#943=CARTESIAN_POINT('',(145.328446487,395.097320919,282.662380247));
#944=DIRECTION('',(0.,1.,0.));
#945=DIRECTION('',(-1.,0.,-0.));
#946=AXIS2_PLACEMENT_3D('',#943,#944,#945);
#947=PLANE('',#946);
#948=CARTESIAN_POINT('',(139.443841259,395.097320919,287.162380247));
#949=VERTEX_POINT('',#948);
#950=CARTESIAN_POINT('',(141.628446487,395.097320919,285.662380247));
#951=DIRECTION('',(-0.,-1.,-0.));
#952=DIRECTION('',(1.,-0.,-0.));
#953=AXIS2_PLACEMENT_3D('',#950,#951,#952);
#954=CIRCLE('',#953,2.65);
#955=EDGE_CURVE('',#611,#949,#954,.T.);
#956=ORIENTED_EDGE('',*,*,#955,.F.);
#957=ORIENTED_EDGE('',*,*,#616,.F.);
#958=ORIENTED_EDGE('',*,*,#699,.T.);
#959=ORIENTED_EDGE('',*,*,#933,.T.);
#960=ORIENTED_EDGE('',*,*,#927,.F.);
#961=ORIENTED_EDGE('',*,*,#427,.T.);
#962=CARTESIAN_POINT('',(139.030370275,395.097320919,287.162380247));
#963=VERTEX_POINT('',#962);
#964=CARTESIAN_POINT('',(141.628446487,395.097320919,285.662380247));
#965=DIRECTION('',(-0.,1.,0.));
#966=DIRECTION('',(0.,0.,-1.));
#967=AXIS2_PLACEMENT_3D('',#964,#965,#966);
#968=CIRCLE('',#967,3.);
#969=EDGE_CURVE('',#422,#963,#968,.T.);
#970=ORIENTED_EDGE('',*,*,#969,.T.);
#971=CARTESIAN_POINT('',(139.443841259,395.097320919,287.162380247));
#972=DIRECTION('',(-1.,0.,0.));
#973=VECTOR('',#972,0.413470984);
#974=LINE('',#971,#973);
#975=EDGE_CURVE('',#949,#963,#974,.T.);
#976=ORIENTED_EDGE('',*,*,#975,.F.);
#977=EDGE_LOOP('',(#956,#957,#958,#959,#960,#961,#970,#976));
#978=FACE_BOUND('',#977,.T.);
#979=CARTESIAN_POINT('',(141.628446487,395.097320919,287.012380247));
#980=VERTEX_POINT('',#979);
#981=CARTESIAN_POINT('',(141.628446484,395.097320919,284.312380247));
#982=VERTEX_POINT('',#981);
#983=CARTESIAN_POINT('',(141.628446487,395.097320919,285.662380247));
#984=DIRECTION('',(-0.,-1.,-0.));
#985=DIRECTION('',(0.,0.,-1.));
#986=AXIS2_PLACEMENT_3D('',#983,#984,#985);
#987=CIRCLE('',#986,1.35);
#988=EDGE_CURVE('',#980,#982,#987,.T.);
#989=ORIENTED_EDGE('',*,*,#988,.T.);
#990=CARTESIAN_POINT('',(141.628446487,395.097320919,285.662380247));
#991=DIRECTION('',(-0.,-1.,-0.));
#992=DIRECTION('',(0.,0.,-1.));
#993=AXIS2_PLACEMENT_3D('',#990,#991,#992);
#994=CIRCLE('',#993,1.35);
#995=EDGE_CURVE('',#982,#980,#994,.T.);
#996=ORIENTED_EDGE('',*,*,#995,.T.);
#997=EDGE_LOOP('',(#989,#996));
#998=FACE_BOUND('',#997,.T.);
#999=ADVANCED_FACE('',(#978,#998),#947,.T.);
#1000=CARTESIAN_POINT('',(141.628446487,395.097320919,285.662380247));
#1001=DIRECTION('',(-0.,-1.,-0.));
#1002=DIRECTION('',(1.,-0.,-0.));
#1003=AXIS2_PLACEMENT_3D('',#1000,#1001,#1002);
#1004=CYLINDRICAL_SURFACE('',#1003,2.65);
#1005=ORIENTED_EDGE('',*,*,#912,.T.);
#1006=ORIENTED_EDGE('',*,*,#723,.T.);
#1007=ORIENTED_EDGE('',*,*,#653,.F.);
#1008=ORIENTED_EDGE('',*,*,#955,.T.);
#1009=CARTESIAN_POINT('',(139.443841259,396.897320919,287.162380247));
#1010=VERTEX_POINT('',#1009);
#1011=CARTESIAN_POINT('',(139.443841259,396.897320919,287.162380247));
#1012=DIRECTION('',(0.,-1.,0.));
#1013=VECTOR('',#1012,1.8);
#1014=LINE('',#1011,#1013);
#1015=EDGE_CURVE('',#1010,#949,#1014,.T.);
#1016=ORIENTED_EDGE('',*,*,#1015,.F.);
#1017=CARTESIAN_POINT('',(141.628446487,396.897320919,285.662380247));
#1018=DIRECTION('',(0.,1.,0.));
#1019=DIRECTION('',(1.,-0.,-0.));
#1020=AXIS2_PLACEMENT_3D('',#1017,#1018,#1019);
#1021=CIRCLE('',#1020,2.65);
#1022=EDGE_CURVE('',#1010,#907,#1021,.T.);
#1023=ORIENTED_EDGE('',*,*,#1022,.T.);
#1024=EDGE_LOOP('',(#1005,#1006,#1007,#1008,#1016,#1023));
#1025=FACE_BOUND('',#1024,.T.);
#1026=ADVANCED_FACE('',(#1025),#1004,.F.);
#1027=CARTESIAN_POINT('',(146.306890291,395.097293815,286.21785936));
#1028=DIRECTION('',(-0.,1.,0.));
#1029=DIRECTION('',(-0.,-0.,1.));
#1030=AXIS2_PLACEMENT_3D('',#1027,#1028,#1029);
#1031=PLANE('',#1030);
#1032=ORIENTED_EDGE('',*,*,#540,.F.);
#1033=ORIENTED_EDGE('',*,*,#706,.T.);
#1034=ORIENTED_EDGE('',*,*,#599,.F.);
#1035=CARTESIAN_POINT('',(146.306890291,395.097293815,286.21785936));
#1036=DIRECTION('',(0.,0.,-1.));
#1037=VECTOR('',#1036,1.999996157);
#1038=LINE('',#1035,#1037);
#1039=EDGE_CURVE('',#585,#535,#1038,.T.);
#1040=ORIENTED_EDGE('',*,*,#1039,.T.);
#1041=EDGE_LOOP('',(#1032,#1033,#1034,#1040));
#1042=FACE_BOUND('',#1041,.T.);
#1043=ADVANCED_FACE('',(#1042),#1031,.T.);
#1044=CARTESIAN_POINT('',(146.306890291,393.016871184,283.717863203));
#1045=DIRECTION('',(-1.,0.,-0.));
#1046=DIRECTION('',(-0.,-0.,1.));
#1047=AXIS2_PLACEMENT_3D('',#1044,#1045,#1046);
#1048=PLANE('',#1047);
#1049=ORIENTED_EDGE('',*,*,#852,.F.);
#1050=CARTESIAN_POINT('',(146.306890291,394.122320919,288.662380247));
#1051=VERTEX_POINT('',#1050);
#1052=CARTESIAN_POINT('',(146.306890291,394.122320919,288.662380247));
#1053=DIRECTION('',(0.,1.,0.));
#1054=VECTOR('',#1053,3.169550266);
#1055=LINE('',#1052,#1054);
#1056=EDGE_CURVE('',#1051,#840,#1055,.T.);
#1057=ORIENTED_EDGE('',*,*,#1056,.F.);
#1058=CARTESIAN_POINT('',(146.306890291,394.122320919,284.217863203));
#1059=DIRECTION('',(0.,0.,1.));
#1060=VECTOR('',#1059,4.444517044);
#1061=LINE('',#1058,#1060);
#1062=EDGE_CURVE('',#325,#1051,#1061,.T.);
#1063=ORIENTED_EDGE('',*,*,#1062,.F.);
#1064=ORIENTED_EDGE('',*,*,#393,.F.);
#1065=ORIENTED_EDGE('',*,*,#547,.F.);
#1066=ORIENTED_EDGE('',*,*,#1039,.F.);
#1067=ORIENTED_EDGE('',*,*,#591,.F.);
#1068=ORIENTED_EDGE('',*,*,#684,.F.);
#1069=ORIENTED_EDGE('',*,*,#764,.F.);
#1070=ORIENTED_EDGE('',*,*,#820,.T.);
#1071=ORIENTED_EDGE('',*,*,#782,.F.);
#1072=ORIENTED_EDGE('',*,*,#363,.F.);
#1073=EDGE_LOOP('',(#1049,#1057,#1063,#1064,#1065,#1066,#1067,#1068,#1069,#1070,#1071,#1072));
#1074=FACE_BOUND('',#1073,.T.);
#1075=ADVANCED_FACE('',(#1074),#1048,.F.);
#1076=CARTESIAN_POINT('',(138.144335204,396.897320919,282.662380247));
#1077=DIRECTION('',(-0.,-1.,-0.));
#1078=DIRECTION('',(1.,-0.,0.));
#1079=AXIS2_PLACEMENT_3D('',#1076,#1077,#1078);
#1080=PLANE('',#1079);
#1081=ORIENTED_EDGE('',*,*,#918,.F.);
#1082=ORIENTED_EDGE('',*,*,#1022,.F.);
#1083=CARTESIAN_POINT('',(139.030370275,396.897320919,287.162380247));
#1084=VERTEX_POINT('',#1083);
#1085=CARTESIAN_POINT('',(139.030370275,396.897320919,287.162380247));
#1086=DIRECTION('',(1.,0.,-0.));
#1087=VECTOR('',#1086,0.413470984);
#1088=LINE('',#1085,#1087);
#1089=EDGE_CURVE('',#1084,#1010,#1088,.T.);
#1090=ORIENTED_EDGE('',*,*,#1089,.F.);
#1091=CARTESIAN_POINT('',(141.628446487,396.897320919,285.662380247));
#1092=DIRECTION('',(0.,1.,0.));
#1093=DIRECTION('',(0.,0.,-1.));
#1094=AXIS2_PLACEMENT_3D('',#1091,#1092,#1093);
#1095=CIRCLE('',#1094,3.);
#1096=EDGE_CURVE('',#438,#1084,#1095,.T.);
#1097=ORIENTED_EDGE('',*,*,#1096,.F.);
#1098=ORIENTED_EDGE('',*,*,#443,.T.);
#1099=EDGE_LOOP('',(#1081,#1082,#1090,#1097,#1098));
#1100=FACE_BOUND('',#1099,.T.);
#1101=CARTESIAN_POINT('',(141.628446487,396.897320919,287.012380247));
#1102=VERTEX_POINT('',#1101);
#1103=CARTESIAN_POINT('',(141.628446489,396.897320919,284.312380247));
#1104=VERTEX_POINT('',#1103);
#1105=CARTESIAN_POINT('',(141.628446487,396.897320919,285.662380247));
#1106=DIRECTION('',(0.,1.,0.));
#1107=DIRECTION('',(0.,0.,-1.));
#1108=AXIS2_PLACEMENT_3D('',#1105,#1106,#1107);
#1109=CIRCLE('',#1108,1.35);
#1110=EDGE_CURVE('',#1102,#1104,#1109,.T.);
#1111=ORIENTED_EDGE('',*,*,#1110,.T.);
#1112=CARTESIAN_POINT('',(141.628446487,396.897320919,285.662380247));
#1113=DIRECTION('',(0.,1.,0.));
#1114=DIRECTION('',(0.,0.,-1.));
#1115=AXIS2_PLACEMENT_3D('',#1112,#1113,#1114);
#1116=CIRCLE('',#1115,1.35);
#1117=EDGE_CURVE('',#1104,#1102,#1116,.T.);
#1118=ORIENTED_EDGE('',*,*,#1117,.T.);
#1119=EDGE_LOOP('',(#1111,#1118));
#1120=FACE_BOUND('',#1119,.T.);
#1121=ADVANCED_FACE('',(#1100,#1120),#1080,.T.);
#1122=CARTESIAN_POINT('',(141.628446487,395.097320919,285.662380247));
#1123=DIRECTION('',(0.,1.,0.));
#1124=DIRECTION('',(0.,0.,-1.));
#1125=AXIS2_PLACEMENT_3D('',#1122,#1123,#1124);
#1126=CYLINDRICAL_SURFACE('',#1125,3.);
#1127=ORIENTED_EDGE('',*,*,#969,.F.);
#1128=ORIENTED_EDGE('',*,*,#513,.F.);
#1129=CARTESIAN_POINT('',(141.628446487,393.997320919,288.662380247));
#1130=VERTEX_POINT('',#1129);
#1131=CARTESIAN_POINT('',(141.628446487,393.997320919,285.662380247));
#1132=DIRECTION('',(0.,1.,0.));
#1133=DIRECTION('',(0.,0.,-1.));
#1134=AXIS2_PLACEMENT_3D('',#1131,#1132,#1133);
#1135=CIRCLE('',#1134,3.);
#1136=EDGE_CURVE('',#502,#1130,#1135,.T.);
#1137=ORIENTED_EDGE('',*,*,#1136,.T.);
#1138=CARTESIAN_POINT('',(141.628446487,398.197320919,288.662380247));
#1139=VERTEX_POINT('',#1138);
#1140=CARTESIAN_POINT('',(141.628446487,393.997320919,288.662380247));
#1141=DIRECTION('',(0.,1.,0.));
#1142=VECTOR('',#1141,4.2);
#1143=LINE('',#1140,#1142);
#1144=EDGE_CURVE('',#1130,#1139,#1143,.T.);
#1145=ORIENTED_EDGE('',*,*,#1144,.T.);
#1146=CARTESIAN_POINT('',(141.628446487,398.197320919,285.662380247));
#1147=DIRECTION('',(0.,1.,0.));
#1148=DIRECTION('',(0.,0.,-1.));
#1149=AXIS2_PLACEMENT_3D('',#1146,#1147,#1148);
#1150=CIRCLE('',#1149,3.);
#1151=EDGE_CURVE('',#446,#1139,#1150,.T.);
#1152=ORIENTED_EDGE('',*,*,#1151,.F.);
#1153=ORIENTED_EDGE('',*,*,#451,.F.);
#1154=ORIENTED_EDGE('',*,*,#1096,.T.);
#1155=CARTESIAN_POINT('',(139.030370275,395.097320919,287.162380247));
#1156=DIRECTION('',(0.,1.,0.));
#1157=VECTOR('',#1156,1.8);
#1158=LINE('',#1155,#1157);
#1159=EDGE_CURVE('',#963,#1084,#1158,.T.);
#1160=ORIENTED_EDGE('',*,*,#1159,.F.);
#1161=EDGE_LOOP('',(#1127,#1128,#1137,#1145,#1152,#1153,#1154,#1160));
#1162=FACE_BOUND('',#1161,.T.);
#1163=ADVANCED_FACE('',(#1162),#1126,.T.);
#1164=CARTESIAN_POINT('',(138.628446487,395.097320919,287.162380247));
#1165=DIRECTION('',(0.,0.,-1.));
#1166=DIRECTION('',(-1.,0.,0.));
#1167=AXIS2_PLACEMENT_3D('',#1164,#1165,#1166);
#1168=PLANE('',#1167);
#1169=ORIENTED_EDGE('',*,*,#1159,.T.);
#1170=ORIENTED_EDGE('',*,*,#1089,.T.);
#1171=ORIENTED_EDGE('',*,*,#1015,.T.);
#1172=ORIENTED_EDGE('',*,*,#975,.T.);
#1173=EDGE_LOOP('',(#1169,#1170,#1171,#1172));
#1174=FACE_BOUND('',#1173,.T.);
#1175=ADVANCED_FACE('',(#1174),#1168,.T.);
#1176=CARTESIAN_POINT('',(165.488890581,394.122320919,285.824755926));
#1177=DIRECTION('',(0.,1.,0.));
#1178=DIRECTION('',(0.,0.,-1.));
#1179=AXIS2_PLACEMENT_3D('',#1176,#1177,#1178);
#1180=PLANE('',#1179);
#1181=ORIENTED_EDGE('',*,*,#330,.T.);
#1182=ORIENTED_EDGE('',*,*,#1062,.T.);
#1183=CARTESIAN_POINT('',(145.328452417,394.122320919,288.662380247));
#1184=VERTEX_POINT('',#1183);
#1185=CARTESIAN_POINT('',(145.328452417,394.122320919,288.662380248));
#1186=DIRECTION('',(1.,0.,-0.000000001));
#1187=VECTOR('',#1186,0.978437874);
#1188=LINE('',#1185,#1187);
#1189=EDGE_CURVE('',#1184,#1051,#1188,.T.);
#1190=ORIENTED_EDGE('',*,*,#1189,.F.);
#1191=CARTESIAN_POINT('',(145.328452417,394.122320919,282.662380246));
#1192=DIRECTION('',(0.,0.,1.));
#1193=VECTOR('',#1192,6.000000002);
#1194=LINE('',#1191,#1193);
#1195=EDGE_CURVE('',#486,#1184,#1194,.T.);
#1196=ORIENTED_EDGE('',*,*,#1195,.F.);
#1197=ORIENTED_EDGE('',*,*,#491,.F.);
#1198=CARTESIAN_POINT('',(182.834270976,394.122320919,284.217863203));
#1199=DIRECTION('',(0.866025404,0.,-0.5));
#1200=VECTOR('',#1199,3.110965913);
#1201=LINE('',#1198,#1200);
#1202=EDGE_CURVE('',#323,#478,#1201,.T.);
#1203=ORIENTED_EDGE('',*,*,#1202,.F.);
#1204=EDGE_LOOP('',(#1181,#1182,#1190,#1196,#1197,#1203));
#1205=FACE_BOUND('',#1204,.T.);
#1206=ADVANCED_FACE('',(#1205),#1180,.F.);
#1207=CARTESIAN_POINT('',(175.136141641,393.797320919,288.662380247));
#1208=DIRECTION('',(0.,0.,-1.));
#1209=DIRECTION('',(-1.,0.,-0.));
#1210=AXIS2_PLACEMENT_3D('',#1207,#1208,#1209);
#1211=PLANE('',#1210);
#1212=ORIENTED_EDGE('',*,*,#1144,.F.);
#1213=CARTESIAN_POINT('',(145.328452417,393.997320919,288.662380247));
#1214=VERTEX_POINT('',#1213);
#1215=CARTESIAN_POINT('',(141.628446487,393.997320919,288.662380247));
#1216=DIRECTION('',(1.,0.,0.));
#1217=VECTOR('',#1216,3.700005931);
#1218=LINE('',#1215,#1217);
#1219=EDGE_CURVE('',#1130,#1214,#1218,.T.);
#1220=ORIENTED_EDGE('',*,*,#1219,.T.);
#1221=CARTESIAN_POINT('',(145.328452417,393.997320919,288.662380248));
#1222=DIRECTION('',(0.,1.,0.));
#1223=VECTOR('',#1222,0.125);
#1224=LINE('',#1221,#1223);
#1225=EDGE_CURVE('',#1214,#1184,#1224,.T.);
#1226=ORIENTED_EDGE('',*,*,#1225,.T.);
#1227=ORIENTED_EDGE('',*,*,#1189,.T.);
#1228=ORIENTED_EDGE('',*,*,#1056,.T.);
#1229=ORIENTED_EDGE('',*,*,#846,.F.);
#1230=ORIENTED_EDGE('',*,*,#896,.T.);
#1231=CARTESIAN_POINT('',(175.136141641,398.072320919,288.662380247));
#1232=VERTEX_POINT('',#1231);
#1233=CARTESIAN_POINT('',(175.136141641,397.291871184,288.662380247));
#1234=DIRECTION('',(0.,1.,0.));
#1235=VECTOR('',#1234,0.780449734);
#1236=LINE('',#1233,#1235);
#1237=EDGE_CURVE('',#885,#1232,#1236,.T.);
#1238=ORIENTED_EDGE('',*,*,#1237,.T.);
#1239=CARTESIAN_POINT('',(145.806890291,398.072320919,288.662380247));
#1240=VERTEX_POINT('',#1239);
#1241=CARTESIAN_POINT('',(145.806890291,398.072320919,288.662380247));
#1242=DIRECTION('',(1.,0.,0.));
#1243=VECTOR('',#1242,29.32925135);
#1244=LINE('',#1241,#1243);
#1245=EDGE_CURVE('',#1240,#1232,#1244,.T.);
#1246=ORIENTED_EDGE('',*,*,#1245,.F.);
#1247=CARTESIAN_POINT('',(145.806890291,398.197320919,288.662380247));
#1248=VERTEX_POINT('',#1247);
#1249=CARTESIAN_POINT('',(145.806890291,398.197320919,288.662380247));
#1250=DIRECTION('',(0.,-1.,0.));
#1251=VECTOR('',#1250,0.125);
#1252=LINE('',#1249,#1251);
#1253=EDGE_CURVE('',#1248,#1240,#1252,.T.);
#1254=ORIENTED_EDGE('',*,*,#1253,.F.);
#1255=CARTESIAN_POINT('',(141.628446487,398.197320919,288.662380247));
#1256=DIRECTION('',(1.,0.,-0.));
#1257=VECTOR('',#1256,4.178443804);
#1258=LINE('',#1255,#1257);
#1259=EDGE_CURVE('',#1139,#1248,#1258,.T.);
#1260=ORIENTED_EDGE('',*,*,#1259,.F.);
#1261=EDGE_LOOP('',(#1212,#1220,#1226,#1227,#1228,#1229,#1230,#1238,#1246,#1254,#1260));
#1262=FACE_BOUND('',#1261,.T.);
#1263=ADVANCED_FACE('',(#1262),#1211,.F.);
#1264=CARTESIAN_POINT('',(172.628446487,393.797320919,285.662380247));
#1265=DIRECTION('',(-0.,-1.,-0.));
#1266=DIRECTION('',(0.,0.,-1.));
#1267=AXIS2_PLACEMENT_3D('',#1264,#1265,#1266);
#1268=CYLINDRICAL_SURFACE('',#1267,1.);
#1269=CARTESIAN_POINT('',(172.628446487,398.072320919,284.662380247));
#1270=VERTEX_POINT('',#1269);
#1271=CARTESIAN_POINT('',(172.628446487,397.291871184,284.662380247));
#1272=DIRECTION('',(0.,1.,0.));
#1273=VECTOR('',#1272,0.780449734);
#1274=LINE('',#1271,#1273);
#1275=EDGE_CURVE('',#863,#1270,#1274,.T.);
#1276=ORIENTED_EDGE('',*,*,#1275,.F.);
#1277=ORIENTED_EDGE('',*,*,#871,.T.);
#1278=CARTESIAN_POINT('',(172.628446487,398.072320919,286.662380247));
#1279=VERTEX_POINT('',#1278);
#1280=CARTESIAN_POINT('',(172.628446487,397.291871184,286.662380247));
#1281=DIRECTION('',(0.,1.,0.));
#1282=VECTOR('',#1281,0.780449734);
#1283=LINE('',#1280,#1282);
#1284=EDGE_CURVE('',#865,#1279,#1283,.T.);
#1285=ORIENTED_EDGE('',*,*,#1284,.T.);
#1286=CARTESIAN_POINT('',(172.628446487,398.072320919,285.662380247));
#1287=DIRECTION('',(-0.,-1.,-0.));
#1288=DIRECTION('',(0.,0.,-1.));
#1289=AXIS2_PLACEMENT_3D('',#1286,#1287,#1288);
#1290=CIRCLE('',#1289,1.);
#1291=EDGE_CURVE('',#1270,#1279,#1290,.T.);
#1292=ORIENTED_EDGE('',*,*,#1291,.F.);
#1293=EDGE_LOOP('',(#1276,#1277,#1285,#1292));
#1294=FACE_BOUND('',#1293,.T.);
#1295=ADVANCED_FACE('',(#1294),#1268,.F.);
#1296=CARTESIAN_POINT('',(141.628446487,395.197320919,285.662380247));
#1297=DIRECTION('',(-0.,-1.,-0.));
#1298=DIRECTION('',(0.,0.,-1.));
#1299=AXIS2_PLACEMENT_3D('',#1296,#1297,#1298);
#1300=CYLINDRICAL_SURFACE('',#1299,1.35);
#1301=CARTESIAN_POINT('',(141.628446487,393.997320919,284.312380247));
#1302=VERTEX_POINT('',#1301);
#1303=CARTESIAN_POINT('',(141.628446487,393.997320919,284.312380247));
#1304=DIRECTION('',(0.,1.,0.));
#1305=VECTOR('',#1304,1.1);
#1306=LINE('',#1303,#1305);
#1307=EDGE_CURVE('',#1302,#982,#1306,.T.);
#1308=ORIENTED_EDGE('',*,*,#1307,.F.);
#1309=CARTESIAN_POINT('',(141.628446487,393.997320919,287.012380247));
#1310=VERTEX_POINT('',#1309);
#1311=CARTESIAN_POINT('',(141.628446487,393.997320919,285.662380247));
#1312=DIRECTION('',(-0.,-1.,-0.));
#1313=DIRECTION('',(0.,0.,-1.));
#1314=AXIS2_PLACEMENT_3D('',#1311,#1312,#1313);
#1315=CIRCLE('',#1314,1.35);
#1316=EDGE_CURVE('',#1302,#1310,#1315,.T.);
#1317=ORIENTED_EDGE('',*,*,#1316,.T.);
#1318=CARTESIAN_POINT('',(141.628446487,393.997320919,287.012380247));
#1319=DIRECTION('',(0.,1.,0.));
#1320=VECTOR('',#1319,1.1);
#1321=LINE('',#1318,#1320);
#1322=EDGE_CURVE('',#1310,#980,#1321,.T.);
#1323=ORIENTED_EDGE('',*,*,#1322,.T.);
#1324=ORIENTED_EDGE('',*,*,#995,.F.);
#1325=EDGE_LOOP('',(#1308,#1317,#1323,#1324));
#1326=FACE_BOUND('',#1325,.T.);
#1327=ADVANCED_FACE('',(#1326),#1300,.F.);
#1328=CARTESIAN_POINT('',(141.628446487,397.959452953,285.662380247));
#1329=DIRECTION('',(0.,1.,0.));
#1330=DIRECTION('',(0.,0.,-1.));
#1331=AXIS2_PLACEMENT_3D('',#1328,#1329,#1330);
#1332=CONICAL_SURFACE('',#1331,1.837867966,45.);
#1333=CARTESIAN_POINT('',(141.628446487,398.197320919,283.586644315));
#1334=VERTEX_POINT('',#1333);
#1335=CARTESIAN_POINT('',(141.628446487,397.471584987,284.312380247));
#1336=VERTEX_POINT('',#1335);
#1337=CARTESIAN_POINT('',(141.628446487,398.197320919,283.586644315));
#1338=DIRECTION('',(-0.,-0.707106781,0.707106781));
#1339=VECTOR('',#1338,1.026345597);
#1340=LINE('',#1337,#1339);
#1341=EDGE_CURVE('',#1334,#1336,#1340,.T.);
#1342=ORIENTED_EDGE('',*,*,#1341,.F.);
#1343=CARTESIAN_POINT('',(141.628446487,398.197320919,287.738116178));
#1344=VERTEX_POINT('',#1343);
#1345=CARTESIAN_POINT('',(141.628446487,398.197320919,285.662380247));
#1346=DIRECTION('',(-0.,-1.,-0.));
#1347=DIRECTION('',(0.,0.,-1.));
#1348=AXIS2_PLACEMENT_3D('',#1345,#1346,#1347);
#1349=CIRCLE('',#1348,2.075735931);
#1350=EDGE_CURVE('',#1344,#1334,#1349,.T.);
#1351=ORIENTED_EDGE('',*,*,#1350,.F.);
#1352=CARTESIAN_POINT('',(141.628446487,397.471584987,287.012380247));
#1353=VERTEX_POINT('',#1352);
#1354=CARTESIAN_POINT('',(141.628446487,397.471584987,287.012380247));
#1355=DIRECTION('',(-0.,0.707106781,0.707106781));
#1356=VECTOR('',#1355,1.026345597);
#1357=LINE('',#1354,#1356);
#1358=EDGE_CURVE('',#1353,#1344,#1357,.T.);
#1359=ORIENTED_EDGE('',*,*,#1358,.F.);
#1360=CARTESIAN_POINT('',(141.628446487,397.471584987,285.662380247));
#1361=DIRECTION('',(-0.,-1.,-0.));
#1362=DIRECTION('',(0.,0.,-1.));
#1363=AXIS2_PLACEMENT_3D('',#1360,#1361,#1362);
#1364=CIRCLE('',#1363,1.35);
#1365=EDGE_CURVE('',#1353,#1336,#1364,.T.);
#1366=ORIENTED_EDGE('',*,*,#1365,.T.);
#1367=EDGE_LOOP('',(#1342,#1351,#1359,#1366));
#1368=FACE_BOUND('',#1367,.T.);
#1369=ADVANCED_FACE('',(#1368),#1332,.F.);
#1370=CARTESIAN_POINT('',(141.628446487,395.197320919,285.662380247));
#1371=DIRECTION('',(-0.,-1.,-0.));
#1372=DIRECTION('',(0.,0.,-1.));
#1373=AXIS2_PLACEMENT_3D('',#1370,#1371,#1372);
#1374=CYLINDRICAL_SURFACE('',#1373,1.35);
#1375=CARTESIAN_POINT('',(141.628446487,396.897320919,284.312380247));
#1376=DIRECTION('',(0.,1.,0.));
#1377=VECTOR('',#1376,0.574264069);
#1378=LINE('',#1375,#1377);
#1379=EDGE_CURVE('',#1104,#1336,#1378,.T.);
#1380=ORIENTED_EDGE('',*,*,#1379,.F.);
#1381=ORIENTED_EDGE('',*,*,#1110,.F.);
#1382=CARTESIAN_POINT('',(141.628446487,396.897320919,287.012380247));
#1383=DIRECTION('',(0.,1.,0.));
#1384=VECTOR('',#1383,0.574264069);
#1385=LINE('',#1382,#1384);
#1386=EDGE_CURVE('',#1102,#1353,#1385,.T.);
#1387=ORIENTED_EDGE('',*,*,#1386,.T.);
#1388=CARTESIAN_POINT('',(141.628446487,397.471584987,285.662380247));
#1389=DIRECTION('',(-0.,-1.,-0.));
#1390=DIRECTION('',(0.,0.,-1.));
#1391=AXIS2_PLACEMENT_3D('',#1388,#1389,#1390);
#1392=CIRCLE('',#1391,1.35);
#1393=EDGE_CURVE('',#1336,#1353,#1392,.T.);
#1394=ORIENTED_EDGE('',*,*,#1393,.F.);
#1395=EDGE_LOOP('',(#1380,#1381,#1387,#1394));
#1396=FACE_BOUND('',#1395,.T.);
#1397=ADVANCED_FACE('',(#1396),#1374,.F.);
#1398=CARTESIAN_POINT('',(162.078446487,398.197320919,285.662380247));
#1399=DIRECTION('',(0.,1.,0.));
#1400=DIRECTION('',(0.,0.,-1.));
#1401=AXIS2_PLACEMENT_3D('',#1398,#1399,#1400);
#1402=PLANE('',#1401);
#1403=CARTESIAN_POINT('',(145.806890291,398.197320919,282.662380247));
#1404=DIRECTION('',(0.,0.,1.));
#1405=VECTOR('',#1404,6.);
#1406=LINE('',#1403,#1405);
#1407=EDGE_CURVE('',#454,#1248,#1406,.T.);
#1408=ORIENTED_EDGE('',*,*,#1407,.F.);
#1409=ORIENTED_EDGE('',*,*,#459,.T.);
#1410=ORIENTED_EDGE('',*,*,#1151,.T.);
#1411=ORIENTED_EDGE('',*,*,#1259,.T.);
#1412=EDGE_LOOP('',(#1408,#1409,#1410,#1411));
#1413=FACE_BOUND('',#1412,.T.);
#1414=ORIENTED_EDGE('',*,*,#1350,.T.);
#1415=CARTESIAN_POINT('',(141.628446487,398.197320919,285.662380247));
#1416=DIRECTION('',(-0.,-1.,-0.));
#1417=DIRECTION('',(0.,0.,-1.));
#1418=AXIS2_PLACEMENT_3D('',#1415,#1416,#1417);
#1419=CIRCLE('',#1418,2.075735931);
#1420=EDGE_CURVE('',#1334,#1344,#1419,.T.);
#1421=ORIENTED_EDGE('',*,*,#1420,.T.);
#1422=EDGE_LOOP('',(#1414,#1421));
#1423=FACE_BOUND('',#1422,.T.);
#1424=ADVANCED_FACE('',(#1413,#1423),#1402,.T.);
#1425=CARTESIAN_POINT('',(145.806890291,397.922320919,282.324755576));
#1426=DIRECTION('',(1.,-0.,0.));
#1427=DIRECTION('',(0.,0.,-1.));
#1428=AXIS2_PLACEMENT_3D('',#1425,#1426,#1427);
#1429=PLANE('',#1428);
#1430=CARTESIAN_POINT('',(145.806890291,398.072320919,288.662380247));
#1431=DIRECTION('',(0.,0.,-1.));
#1432=VECTOR('',#1431,6.);
#1433=LINE('',#1430,#1432);
#1434=EDGE_CURVE('',#1240,#462,#1433,.T.);
#1435=ORIENTED_EDGE('',*,*,#1434,.T.);
#1436=ORIENTED_EDGE('',*,*,#467,.T.);
#1437=ORIENTED_EDGE('',*,*,#1407,.T.);
#1438=ORIENTED_EDGE('',*,*,#1253,.T.);
#1439=EDGE_LOOP('',(#1435,#1436,#1437,#1438));
#1440=FACE_BOUND('',#1439,.T.);
#1441=ADVANCED_FACE('',(#1440),#1429,.T.);
#1442=CARTESIAN_POINT('',(165.488890581,398.072320919,285.824755926));
#1443=DIRECTION('',(0.,1.,0.));
#1444=DIRECTION('',(-1.,0.,-0.));
#1445=AXIS2_PLACEMENT_3D('',#1442,#1443,#1444);
#1446=PLANE('',#1445);
#1447=CARTESIAN_POINT('',(175.136141641,398.072320919,288.662380247));
#1448=DIRECTION('',(0.866025404,0.,-0.5));
#1449=VECTOR('',#1448,12.);
#1450=LINE('',#1447,#1449);
#1451=EDGE_CURVE('',#1232,#470,#1450,.T.);
#1452=ORIENTED_EDGE('',*,*,#1451,.T.);
#1453=ORIENTED_EDGE('',*,*,#475,.T.);
#1454=ORIENTED_EDGE('',*,*,#1434,.F.);
#1455=ORIENTED_EDGE('',*,*,#1245,.T.);
#1456=EDGE_LOOP('',(#1452,#1453,#1454,#1455));
#1457=FACE_BOUND('',#1456,.T.);
#1458=CARTESIAN_POINT('',(172.628446487,398.072320919,285.662380247));
#1459=DIRECTION('',(-0.,-1.,-0.));
#1460=DIRECTION('',(0.,0.,-1.));
#1461=AXIS2_PLACEMENT_3D('',#1458,#1459,#1460);
#1462=CIRCLE('',#1461,1.);
#1463=EDGE_CURVE('',#1279,#1270,#1462,.T.);
#1464=ORIENTED_EDGE('',*,*,#1463,.T.);
#1465=ORIENTED_EDGE('',*,*,#1291,.T.);
#1466=EDGE_LOOP('',(#1464,#1465));
#1467=FACE_BOUND('',#1466,.T.);
#1468=ADVANCED_FACE('',(#1457,#1467),#1446,.T.);
#1469=CARTESIAN_POINT('',(162.078446487,393.997320919,285.662380247));
#1470=DIRECTION('',(0.,1.,0.));
#1471=DIRECTION('',(0.,0.,-1.));
#1472=AXIS2_PLACEMENT_3D('',#1469,#1470,#1471);
#1473=PLANE('',#1472);
#1474=ORIENTED_EDGE('',*,*,#1136,.F.);
#1475=ORIENTED_EDGE('',*,*,#507,.F.);
#1476=CARTESIAN_POINT('',(145.328452417,393.997320919,282.662380246));
#1477=DIRECTION('',(0.,0.,1.));
#1478=VECTOR('',#1477,6.000000002);
#1479=LINE('',#1476,#1478);
#1480=EDGE_CURVE('',#494,#1214,#1479,.T.);
#1481=ORIENTED_EDGE('',*,*,#1480,.T.);
#1482=ORIENTED_EDGE('',*,*,#1219,.F.);
#1483=EDGE_LOOP('',(#1474,#1475,#1481,#1482));
#1484=FACE_BOUND('',#1483,.T.);
#1485=ORIENTED_EDGE('',*,*,#1316,.F.);
#1486=CARTESIAN_POINT('',(141.628446487,393.997320919,285.662380247));
#1487=DIRECTION('',(-0.,-1.,-0.));
#1488=DIRECTION('',(0.,0.,-1.));
#1489=AXIS2_PLACEMENT_3D('',#1486,#1487,#1488);
#1490=CIRCLE('',#1489,1.35);
#1491=EDGE_CURVE('',#1310,#1302,#1490,.T.);
#1492=ORIENTED_EDGE('',*,*,#1491,.F.);
#1493=EDGE_LOOP('',(#1485,#1492));
#1494=FACE_BOUND('',#1493,.T.);
#1495=ADVANCED_FACE('',(#1484,#1494),#1473,.F.);
#1496=CARTESIAN_POINT('',(145.328452417,393.972320919,282.662371826));
#1497=DIRECTION('',(-1.,0.,-0.));
#1498=DIRECTION('',(-0.,-0.,1.));
#1499=AXIS2_PLACEMENT_3D('',#1496,#1497,#1498);
#1500=PLANE('',#1499);
#1501=ORIENTED_EDGE('',*,*,#1480,.F.);
#1502=ORIENTED_EDGE('',*,*,#499,.F.);
#1503=ORIENTED_EDGE('',*,*,#1195,.T.);
#1504=ORIENTED_EDGE('',*,*,#1225,.F.);
#1505=EDGE_LOOP('',(#1501,#1502,#1503,#1504));
#1506=FACE_BOUND('',#1505,.T.);
#1507=ADVANCED_FACE('',(#1506),#1500,.F.);
#1508=CARTESIAN_POINT('',(185.528446487,393.797320919,282.662380247));
#1509=DIRECTION('',(-0.5,0.,-0.866025404));
#1510=DIRECTION('',(-0.866025404,-0.,0.5));
#1511=AXIS2_PLACEMENT_3D('',#1508,#1509,#1510);
#1512=PLANE('',#1511);
#1513=ORIENTED_EDGE('',*,*,#338,.T.);
#1514=ORIENTED_EDGE('',*,*,#1202,.T.);
#1515=ORIENTED_EDGE('',*,*,#483,.T.);
#1516=ORIENTED_EDGE('',*,*,#1451,.F.);
#1517=ORIENTED_EDGE('',*,*,#1237,.F.);
#1518=ORIENTED_EDGE('',*,*,#890,.T.);
#1519=EDGE_LOOP('',(#1513,#1514,#1515,#1516,#1517,#1518));
#1520=FACE_BOUND('',#1519,.T.);
#1521=ADVANCED_FACE('',(#1520),#1512,.F.);
#1522=CARTESIAN_POINT('',(172.628446487,393.797320919,285.662380247));
#1523=DIRECTION('',(-0.,-1.,-0.));
#1524=DIRECTION('',(0.,0.,-1.));
#1525=AXIS2_PLACEMENT_3D('',#1522,#1523,#1524);
#1526=CYLINDRICAL_SURFACE('',#1525,1.);
#1527=ORIENTED_EDGE('',*,*,#1275,.T.);
#1528=ORIENTED_EDGE('',*,*,#1463,.F.);
#1529=ORIENTED_EDGE('',*,*,#1284,.F.);
#1530=ORIENTED_EDGE('',*,*,#878,.T.);
#1531=EDGE_LOOP('',(#1527,#1528,#1529,#1530));
#1532=FACE_BOUND('',#1531,.T.);
#1533=ADVANCED_FACE('',(#1532),#1526,.F.);
#1534=CARTESIAN_POINT('',(141.628446487,395.197320919,285.662380247));
#1535=DIRECTION('',(-0.,-1.,-0.));
#1536=DIRECTION('',(0.,0.,-1.));
#1537=AXIS2_PLACEMENT_3D('',#1534,#1535,#1536);
#1538=CYLINDRICAL_SURFACE('',#1537,1.35);
#1539=ORIENTED_EDGE('',*,*,#1307,.T.);
#1540=ORIENTED_EDGE('',*,*,#988,.F.);
#1541=ORIENTED_EDGE('',*,*,#1322,.F.);
#1542=ORIENTED_EDGE('',*,*,#1491,.T.);
#1543=EDGE_LOOP('',(#1539,#1540,#1541,#1542));
#1544=FACE_BOUND('',#1543,.T.);
#1545=ADVANCED_FACE('',(#1544),#1538,.F.);
#1546=CARTESIAN_POINT('',(141.628446487,397.959452953,285.662380247));
#1547=DIRECTION('',(0.,1.,0.));
#1548=DIRECTION('',(0.,0.,-1.));
#1549=AXIS2_PLACEMENT_3D('',#1546,#1547,#1548);
#1550=CONICAL_SURFACE('',#1549,1.837867966,45.);
#1551=ORIENTED_EDGE('',*,*,#1341,.T.);
#1552=ORIENTED_EDGE('',*,*,#1393,.T.);
#1553=ORIENTED_EDGE('',*,*,#1358,.T.);
#1554=ORIENTED_EDGE('',*,*,#1420,.F.);
#1555=EDGE_LOOP('',(#1551,#1552,#1553,#1554));
#1556=FACE_BOUND('',#1555,.T.);
#1557=ADVANCED_FACE('',(#1556),#1550,.F.);
#1558=CARTESIAN_POINT('',(141.628446487,395.197320919,285.662380247));
#1559=DIRECTION('',(-0.,-1.,-0.));
#1560=DIRECTION('',(0.,0.,-1.));
#1561=AXIS2_PLACEMENT_3D('',#1558,#1559,#1560);
#1562=CYLINDRICAL_SURFACE('',#1561,1.35);
#1563=ORIENTED_EDGE('',*,*,#1379,.T.);
#1564=ORIENTED_EDGE('',*,*,#1365,.F.);
#1565=ORIENTED_EDGE('',*,*,#1386,.F.);
#1566=ORIENTED_EDGE('',*,*,#1117,.F.);
#1567=EDGE_LOOP('',(#1563,#1564,#1565,#1566));
#1568=FACE_BOUND('',#1567,.T.);
#1569=ADVANCED_FACE('',(#1568),#1562,.F.);
#1570=CLOSED_SHELL('',(#77,#128,#163,#214,#265,#300,#397,#517,#559,#657,#688,#710,#735,#769,#802,#824,#856,#900,#942,#999,#1026,#1043,#1075,#1121,#1163,#1175,
#1206,#1263,#1295,#1327,#1369,#1397,#1424,#1441,#1468,#1495,#1507,#1521,#1533,#1545,#1557,#1569));
#1571=MANIFOLD_SOLID_BREP('Body3',#1570);
#1572=COLOUR_RGB('',0.600000024,0.509803951,0.368627459);
#1573=FILL_AREA_STYLE_COLOUR('',#1572);
#1574=FILL_AREA_STYLE('',(#1573));
#1575=SURFACE_STYLE_FILL_AREA(#1574);
#1576=SURFACE_SIDE_STYLE('',(#1575));
#1577=SURFACE_STYLE_USAGE(.BOTH.,#1576);
#1578=PRESENTATION_STYLE_ASSIGNMENT((#1577));
#26=STYLED_ITEM('',(#1578),#1571);
#16=SHAPE_REPRESENTATION('Door v2 mirrored for manufacturing',(#15),#10);
#17=ADVANCED_BREP_SHAPE_REPRESENTATION('Door v2 mirrored for manufacturing',(#1571),#10);
#1586=SHAPE_REPRESENTATION_RELATIONSHIP('','',#16,#17);
#1587=CARTESIAN_POINT('',(0.,0.,0.));
#1588=DIRECTION('',(0.,0.,1.));
#1589=DIRECTION('',(1.,0.,0.));
#1590=AXIS2_PLACEMENT_3D('',#1587,#1588,#1589);
#1592=MAPPED_ITEM('',#1591,#1590);
#1591=REPRESENTATION_MAP(#1590,#16);
#1593=APPLICATION_CONTEXT('Managed model based 3d engineering');
#1594=APPLICATION_PROTOCOL_DEFINITION('international standard','ap242_managed_model_based_3d_engineering',2013,#1593);
#1595=PRODUCT_CONTEXT('',#1593,'mechanical');
#1596=PRODUCT_DEFINITION_CONTEXT('part definition',#1593,'design');
#24=PRODUCT('Door v2 mirrored for manufacturing','Door v2 mirrored for manufacturing','',(#1595));
#1597=PRODUCT_RELATED_PRODUCT_CATEGORY('part','',(#24));
#1598=PRODUCT_DEFINITION_FORMATION_WITH_SPECIFIED_SOURCE('','',#24,.NOT_KNOWN.);
#25=PRODUCT_DEFINITION('design','',#1598,#1596);
#23=PRODUCT_DEFINITION_SHAPE('','',#25);
#1599=SHAPE_DEFINITION_REPRESENTATION(#23,#16);
#11=DRAUGHTING_MODEL('',(#1592),#10);
#1=MECHANICAL_DESIGN_GEOMETRIC_PRESENTATION_REPRESENTATION('',(#26),#10);
ENDSEC;
END-ISO-10303-21;
