(module "FTSH-110-XX-YYY-DV" (layer F.Cu)
  (descr "FTSH-110-XX-YYY-DV")
  (tags "Connector")
  (attr smd)
  (fp_text reference J** (at 0 0) (layer F.SilkS)
    (effects (font (size 1.27 1.27) (thickness 0.254)))
  )
  (fp_text user %R (at 0 0) (layer F.Fab)
    (effects (font (size 1.27 1.27) (thickness 0.254)))
  )
  (fp_text value "FTSH-110-XX-YYY-DV" (at 0 0) (layer F.SilkS) hide
    (effects (font (size 1.27 1.27) (thickness 0.254)))
  )
  (fp_line (start -6.35 -1.715) (end 6.35 -1.715) (layer F.Fab) (width 0.2))
  (fp_line (start 6.35 -1.715) (end 6.35 1.715) (layer F.Fab) (width 0.2))
  (fp_line (start 6.35 1.715) (end -6.35 1.715) (layer F.Fab) (width 0.2))
  (fp_line (start -6.35 1.715) (end -6.35 -1.715) (layer F.Fab) (width 0.2))
  (fp_line (start 6.35 -1.715) (end 6.35 1.715) (layer F.SilkS) (width 0.1))
  (fp_line (start -6.35 1.715) (end -6.35 -1.715) (layer F.SilkS) (width 0.1))
  (fp_line (start -7.55 -4.43) (end 7.55 -4.43) (layer F.CrtYd) (width 0.05))
  (fp_line (start 7.55 -4.43) (end 7.55 4.885) (layer F.CrtYd) (width 0.05))
  (fp_line (start 7.55 4.885) (end -7.55 4.885) (layer F.CrtYd) (width 0.05))
  (fp_line (start -7.55 4.885) (end -7.55 -4.43) (layer F.CrtYd) (width 0.05))
  (fp_circle (center -5.765 3.785) (end -5.765 3.835) (layer F.SilkS) (width 0.2))
  (pad 1 smd rect (at -5.715 2.035 0) (size 0.74 2.79) (layers F.Cu F.Paste F.Mask))
  (pad 2 smd rect (at -5.715 -2.035 0) (size 0.74 2.79) (layers F.Cu F.Paste F.Mask))
  (pad 3 smd rect (at -4.445 2.035 0) (size 0.74 2.79) (layers F.Cu F.Paste F.Mask))
  (pad 4 smd rect (at -4.445 -2.035 0) (size 0.74 2.79) (layers F.Cu F.Paste F.Mask))
  (pad 5 smd rect (at -3.175 2.035 0) (size 0.74 2.79) (layers F.Cu F.Paste F.Mask))
  (pad 6 smd rect (at -3.175 -2.035 0) (size 0.74 2.79) (layers F.Cu F.Paste F.Mask))
  (pad 7 smd rect (at -1.905 2.035 0) (size 0.74 2.79) (layers F.Cu F.Paste F.Mask))
  (pad 8 smd rect (at -1.905 -2.035 0) (size 0.74 2.79) (layers F.Cu F.Paste F.Mask))
  (pad 9 smd rect (at -0.635 2.035 0) (size 0.74 2.79) (layers F.Cu F.Paste F.Mask))
  (pad 10 smd rect (at -0.635 -2.035 0) (size 0.74 2.79) (layers F.Cu F.Paste F.Mask))
  (pad 11 smd rect (at 0.635 2.035 0) (size 0.74 2.79) (layers F.Cu F.Paste F.Mask))
  (pad 12 smd rect (at 0.635 -2.035 0) (size 0.74 2.79) (layers F.Cu F.Paste F.Mask))
  (pad 13 smd rect (at 1.905 2.035 0) (size 0.74 2.79) (layers F.Cu F.Paste F.Mask))
  (pad 14 smd rect (at 1.905 -2.035 0) (size 0.74 2.79) (layers F.Cu F.Paste F.Mask))
  (pad 15 smd rect (at 3.175 2.035 0) (size 0.74 2.79) (layers F.Cu F.Paste F.Mask))
  (pad 16 smd rect (at 3.175 -2.035 0) (size 0.74 2.79) (layers F.Cu F.Paste F.Mask))
  (pad 17 smd rect (at 4.445 2.035 0) (size 0.74 2.79) (layers F.Cu F.Paste F.Mask))
  (pad 18 smd rect (at 4.445 -2.035 0) (size 0.74 2.79) (layers F.Cu F.Paste F.Mask))
  (pad 19 smd rect (at 5.715 2.035 0) (size 0.74 2.79) (layers F.Cu F.Paste F.Mask))
  (pad 20 smd rect (at 5.715 -2.035 0) (size 0.74 2.79) (layers F.Cu F.Paste F.Mask))
)
