0.095059098692729,0.806919329749619
0.117201269682162,0.816113731239743
0.124902894374139,0.821923996575199
0.132604519066115,0.827666755291785
0.141268846844589,0.83395015397341
0.15089587770956,0.840706686001204
0.160522908574531,0.847679239209382
0.172075345612496,0.854828483654778
0.181702376477467,0.861274485235768
0.190687605284774,0.867643587972655
0.203844547466901,0.874816312981135
0.22406131228334,0.879831494431574
0.245240780186276,0.884753981022742
0.266420248089212,0.889627371891094
0.287599715992148,0.894500762759447
0.308779183895084,0.898122212696025
0.32995865179802,0.900123503779718
0.351138119700956,0.902149342724818
0.372317587603893,0.904199729531325
0.393497055506829,0.906151924892203
0.414676523409765,0.907097657935379
0.435855991312701,0.907478790166187
0.457035459215637,0.907884470258401
0.478214927118573,0.908388341796245
0.49939439502151,0.908523995412979
0.520573862924446,0.908045952494528
0.541753330827382,0.90727333523919
0.562932798730318,0.906574361568074
0.584112266633254,0.905875387896958
0.60529173453619,0.905151866364434
0.626471202439126,0.904501988416132
0.647650670342062,0.90385211046783
0.668830138244999,0.903202232519529
0.690009606147935,0.90252780670982
0.711189074050871,0.901607902286037
0.732368541953807,0.900491614970996
0.753548009856743,0.899399875517362
0.774727477759679,0.89828358820232
0.794944242576119,0.897237902671284
