EESchema Schematic File Version 4
LIBS:eps_prototype-cache
EELAYER 29 0
EELAYER END
$Descr A4 11693 8268
encoding utf-8
Sheet 1 1
Title "AcubeSAT Electrical Power Subsystem"
Date "2019-07-24"
Rev "3"
Comp "Aristotle Space and Aeronautics Team"
Comment1 "TODO: Check/Redo charging module"
Comment2 "TODO: Enable battery input after complete charge (check. via MCU)"
Comment3 "TODO: Ripple check. (coop. between EPS & OBC), EPS MCU hard reset"
Comment4 "Last edited: 22:39 26/07/2019 by George Amponis"
$EndDescr
$Comp
L Connector:Conn_01x02_Female J1
U 1 1 5D29A15C
P 600 2050
F 0 "J1" H 628 2026 50  0000 L CNN
F 1 "Panels" H 628 1935 50  0000 L CNN
F 2 "Connector_PinHeader_2.54mm:PinHeader_1x02_P2.54mm_Vertical" H 600 2050 50  0001 C CNN
F 3 "~" H 600 2050 50  0001 C CNN
	1    600  2050
	-1   0    0    1   
$EndComp
Wire Wire Line
	7800 3300 7100 3300
$Comp
L power:GND #PWR0104
U 1 1 5D2F2F74
P 800 2050
F 0 "#PWR0104" H 800 1800 50  0001 C CNN
F 1 "GND" H 700 1950 50  0000 C CNN
F 2 "" H 800 2050 50  0001 C CNN
F 3 "" H 800 2050 50  0001 C CNN
	1    800  2050
	1    0    0    -1  
$EndComp
$Comp
L power:GND #PWR0105
U 1 1 5D2F934A
P 7800 3200
F 0 "#PWR0105" H 7800 2950 50  0001 C CNN
F 1 "GND" H 7805 3027 50  0000 C CNN
F 2 "" H 7800 3200 50  0001 C CNN
F 3 "" H 7800 3200 50  0001 C CNN
	1    7800 3200
	1    0    0    -1  
$EndComp
$Comp
L power:GND #PWR0106
U 1 1 5D2FF2A1
P 7800 3400
F 0 "#PWR0106" H 7800 3150 50  0001 C CNN
F 1 "GND" H 7805 3227 50  0000 C CNN
F 2 "" H 7800 3400 50  0001 C CNN
F 3 "" H 7800 3400 50  0001 C CNN
	1    7800 3400
	1    0    0    -1  
$EndComp
Wire Wire Line
	7800 3500 6500 3500
Wire Wire Line
	6500 4450 5800 4450
$Comp
L power:GND #PWR0101
U 1 1 5D1C182C
P 1000 6650
F 0 "#PWR0101" H 1000 6400 50  0001 C CNN
F 1 "GND" H 1005 6477 50  0000 C CNN
F 2 "" H 1000 6650 50  0001 C CNN
F 3 "" H 1000 6650 50  0001 C CNN
	1    1000 6650
	1    0    0    -1  
$EndComp
Wire Wire Line
	1000 6350 1000 6300
$Comp
L Device:R R8
U 1 1 5D1AB9F0
P 1000 6150
F 0 "R8" H 1070 6196 50  0000 L CNN
F 1 "50k" H 1070 6105 50  0000 L CNN
F 2 "Resistor_SMD:R_0603_1608Metric_Pad1.05x0.95mm_HandSolder" V 930 6150 50  0001 C CNN
F 3 "~" H 1000 6150 50  0001 C CNN
	1    1000 6150
	1    0    0    -1  
$EndComp
$Comp
L Transistor_FET:DMG2301L Q4
U 1 1 5D30BFC4
P 5500 2200
F 0 "Q4" H 5706 2246 50  0000 L CNN
F 1 "DMG2301L" H 5706 2155 50  0000 L CNN
F 2 "Package_TO_SOT_SMD:SOT-23" H 5700 2125 50  0001 L CIN
F 3 "https://www.diodes.com/assets/Datasheets/DMG2301L.pdf" H 5500 2200 50  0001 L CNN
	1    5500 2200
	0    1    1    0   
$EndComp
Wire Wire Line
	5700 2300 6000 2300
$Comp
L Transistor_FET:DMG2301L Q3
U 1 1 5D3BFB10
P 5450 3500
F 0 "Q3" H 5656 3546 50  0000 L CNN
F 1 "DMG2301L" V 5400 3650 50  0000 L CNN
F 2 "Package_TO_SOT_SMD:SOT-23" H 5650 3425 50  0001 L CIN
F 3 "https://www.diodes.com/assets/Datasheets/DMG2301L.pdf" H 5450 3500 50  0001 L CNN
	1    5450 3500
	0    1    1    0   
$EndComp
Wire Wire Line
	6400 3600 5650 3600
$Comp
L Transistor_FET:DMG2301L Q2
U 1 1 5D3D3590
P 4650 4850
F 0 "Q2" H 4856 4896 50  0000 L CNN
F 1 "DMG2301L" H 4400 4500 50  0000 L CNN
F 2 "Package_TO_SOT_SMD:SOT-23" H 4850 4775 50  0001 L CIN
F 3 "https://www.diodes.com/assets/Datasheets/DMG2301L.pdf" H 4650 4850 50  0001 L CNN
	1    4650 4850
	0    1    1    0   
$EndComp
$Comp
L Device:CP C3
U 1 1 5D367B9E
P 550 7250
F 0 "C3" H 668 7296 50  0000 L CNN
F 1 "1uF" H 668 7205 50  0000 L CNN
F 2 "Capacitor_SMD:C_0603_1608Metric" H 588 7100 50  0001 C CNN
F 3 "~" H 550 7250 50  0001 C CNN
	1    550  7250
	1    0    0    -1  
$EndComp
$Comp
L power:GND #PWR0110
U 1 1 5D367BA5
P 750 7450
F 0 "#PWR0110" H 750 7200 50  0001 C CNN
F 1 "GND" H 755 7277 50  0000 C CNN
F 2 "" H 750 7450 50  0001 C CNN
F 3 "" H 750 7450 50  0001 C CNN
	1    750  7450
	1    0    0    -1  
$EndComp
Wire Wire Line
	550  7100 750  7100
Connection ~ 750  7100
Wire Wire Line
	950  7100 750  7100
Wire Wire Line
	550  7400 650  7400
Connection ~ 750  7400
Wire Wire Line
	950  7400 750  7400
Wire Wire Line
	750  7450 750  7400
Wire Wire Line
	650  7450 650  7400
Connection ~ 650  7400
Wire Wire Line
	650  7400 750  7400
$Comp
L Device:CP C4
U 1 1 5D367BB5
P 750 7250
F 0 "C4" H 868 7296 50  0000 L CNN
F 1 "1uF" H 868 7205 50  0000 L CNN
F 2 "Capacitor_SMD:C_0603_1608Metric" H 788 7100 50  0001 C CNN
F 3 "~" H 750 7250 50  0001 C CNN
	1    750  7250
	1    0    0    -1  
$EndComp
$Comp
L Device:CP C5
U 1 1 5D367BBB
P 950 7250
F 0 "C5" H 1068 7296 50  0000 L CNN
F 1 "1uF" H 1068 7205 50  0000 L CNN
F 2 "Capacitor_SMD:C_0603_1608Metric" H 988 7100 50  0001 C CNN
F 3 "~" H 950 7250 50  0001 C CNN
	1    950  7250
	1    0    0    -1  
$EndComp
Wire Wire Line
	2300 2350 2600 2350
Wire Wire Line
	2300 2800 2700 2800
$Comp
L power:GND #PWR0111
U 1 1 5D5CB8A6
P 2400 2200
F 0 "#PWR0111" H 2400 1950 50  0001 C CNN
F 1 "GND" H 2405 2027 50  0000 C CNN
F 2 "" H 2400 2200 50  0001 C CNN
F 3 "" H 2400 2200 50  0001 C CNN
	1    2400 2200
	1    0    0    -1  
$EndComp
Wire Wire Line
	2700 2050 2600 2050
Wire Wire Line
	2600 1750 2700 1750
Wire Wire Line
	2300 2800 2300 2850
Connection ~ 2300 2800
Wire Wire Line
	2300 2750 2300 2800
$Comp
L Device:R R1
U 1 1 5D5CB8BC
P 2300 2600
F 0 "R1" H 2370 2646 50  0000 L CNN
F 1 "124k" H 2370 2555 50  0000 L CNN
F 2 "Resistor_SMD:R_0603_1608Metric_Pad1.05x0.95mm_HandSolder" V 2230 2600 50  0001 C CNN
F 3 "~" H 2300 2600 50  0001 C CNN
	1    2300 2600
	1    0    0    -1  
$EndComp
$Comp
L Device:R R2
U 1 1 5D5CB8C2
P 2300 3000
F 0 "R2" H 2370 3046 50  0000 L CNN
F 1 "22.1k" H 2370 2955 50  0000 L CNN
F 2 "Resistor_SMD:R_0603_1608Metric_Pad1.05x0.95mm_HandSolder" V 2230 3000 50  0001 C CNN
F 3 "~" H 2300 3000 50  0001 C CNN
	1    2300 3000
	1    0    0    -1  
$EndComp
$Comp
L Device:CP C12
U 1 1 5D5CB8C8
P 2550 2200
F 0 "C12" H 2668 2246 50  0000 L CNN
F 1 "10nF" H 2668 2155 50  0000 L CNN
F 2 "Capacitor_SMD:C_0603_1608Metric" H 2588 2050 50  0001 C CNN
F 3 "~" H 2550 2200 50  0001 C CNN
	1    2550 2200
	0    1    1    0   
$EndComp
$Comp
L Device:R R3
U 1 1 5D5CB8CE
P 2600 1900
F 0 "R3" H 2670 1946 50  0000 L CNN
F 1 "1k" H 2670 1855 50  0000 L CNN
F 2 "Resistor_SMD:R_0603_1608Metric_Pad1.05x0.95mm_HandSolder" V 2530 1900 50  0001 C CNN
F 3 "~" H 2600 1900 50  0001 C CNN
	1    2600 1900
	1    0    0    -1  
$EndComp
Wire Wire Line
	2700 1750 2700 1800
Wire Wire Line
	2700 2050 2700 2000
$Comp
L Device:CP C2
U 1 1 5D5CB8D6
P 2700 3150
F 0 "C2" H 2818 3196 50  0000 L CNN
F 1 "1uF" H 2818 3105 50  0000 L CNN
F 2 "Capacitor_SMD:C_0603_1608Metric" H 2738 3000 50  0001 C CNN
F 3 "~" H 2700 3150 50  0001 C CNN
	1    2700 3150
	1    0    0    -1  
$EndComp
$Comp
L Device:CP C1
U 1 1 5D5CB8DC
P 2600 2500
F 0 "C1" H 2718 2546 50  0000 L CNN
F 1 "1uF" H 2718 2455 50  0000 L CNN
F 2 "Capacitor_SMD:C_0603_1608Metric" H 2638 2350 50  0001 C CNN
F 3 "~" H 2600 2500 50  0001 C CNN
	1    2600 2500
	1    0    0    -1  
$EndComp
Connection ~ 2600 2350
Wire Wire Line
	2600 2350 2700 2350
Wire Wire Line
	2700 2350 2700 2400
Wire Wire Line
	2600 2650 2700 2650
Wire Wire Line
	2700 2650 2700 2600
$Comp
L power:GND #PWR0112
U 1 1 5D5CB8E7
P 4100 1800
F 0 "#PWR0112" H 4100 1550 50  0001 C CNN
F 1 "GND" H 4105 1627 50  0000 C CNN
F 2 "" H 4100 1800 50  0001 C CNN
F 3 "" H 4100 1800 50  0001 C CNN
	1    4100 1800
	1    0    0    -1  
$EndComp
$Comp
L power:GND #PWR0113
U 1 1 5D5CB8ED
P 2700 3300
F 0 "#PWR0113" H 2700 3050 50  0001 C CNN
F 1 "GND" H 2705 3127 50  0000 C CNN
F 2 "" H 2700 3300 50  0001 C CNN
F 3 "" H 2700 3300 50  0001 C CNN
	1    2700 3300
	1    0    0    -1  
$EndComp
$Comp
L Device:L L1
U 1 1 5D5CB8F3
P 2300 2200
F 0 "L1" V 2490 2200 50  0000 C CNN
F 1 "4.7uH" V 2399 2200 50  0000 C CNN
F 2 "SamacSys_Parts:WE-PD_1030_105054" H 2300 2200 50  0001 C CNN
F 3 "~" H 2300 2200 50  0001 C CNN
	1    2300 2200
	-1   0    0    1   
$EndComp
$Comp
L Device:CP C16
U 1 1 5D61EE03
P 2800 1150
F 0 "C16" H 2918 1196 50  0000 L CNN
F 1 "1uF" H 2918 1105 50  0000 L CNN
F 2 "Capacitor_SMD:C_0603_1608Metric" H 2838 1000 50  0001 C CNN
F 3 "~" H 2800 1150 50  0001 C CNN
	1    2800 1150
	1    0    0    -1  
$EndComp
Wire Wire Line
	3000 1000 3000 900 
$Comp
L power:GND #PWR0114
U 1 1 5D61EE0A
P 3000 1350
F 0 "#PWR0114" H 3000 1100 50  0001 C CNN
F 1 "GND" H 3005 1177 50  0000 C CNN
F 2 "" H 3000 1350 50  0001 C CNN
F 3 "" H 3000 1350 50  0001 C CNN
	1    3000 1350
	1    0    0    -1  
$EndComp
Wire Wire Line
	2800 1000 3000 1000
Connection ~ 3000 1000
Wire Wire Line
	3200 1000 3000 1000
Wire Wire Line
	2800 1300 2900 1300
Connection ~ 3000 1300
Wire Wire Line
	3200 1300 3000 1300
Wire Wire Line
	3000 1350 3000 1300
Wire Wire Line
	2900 1350 2900 1300
Connection ~ 2900 1300
Wire Wire Line
	2900 1300 3000 1300
$Comp
L Device:CP C17
U 1 1 5D61EE1A
P 3000 1150
F 0 "C17" H 3118 1196 50  0000 L CNN
F 1 "1uF" H 3118 1105 50  0000 L CNN
F 2 "Capacitor_SMD:C_0603_1608Metric" H 3038 1000 50  0001 C CNN
F 3 "~" H 3000 1150 50  0001 C CNN
	1    3000 1150
	1    0    0    -1  
$EndComp
$Comp
L Device:CP C18
U 1 1 5D61EE20
P 3200 1150
F 0 "C18" H 3318 1196 50  0000 L CNN
F 1 "10uF" H 3318 1105 50  0000 L CNN
F 2 "Capacitor_SMD:C_0603_1608Metric" H 3238 1000 50  0001 C CNN
F 3 "~" H 3200 1150 50  0001 C CNN
	1    3200 1150
	1    0    0    -1  
$EndComp
$Comp
L Device:CP C19
U 1 1 5D62527B
P 3400 1150
F 0 "C19" H 3518 1196 50  0000 L CNN
F 1 "10uF" H 3518 1105 50  0000 L CNN
F 2 "Capacitor_SMD:C_0805_2012Metric" H 3438 1000 50  0001 C CNN
F 3 "~" H 3400 1150 50  0001 C CNN
	1    3400 1150
	1    0    0    -1  
$EndComp
Wire Wire Line
	3600 1000 3600 900 
$Comp
L power:GND #PWR0115
U 1 1 5D625282
P 3600 1350
F 0 "#PWR0115" H 3600 1100 50  0001 C CNN
F 1 "GND" H 3605 1177 50  0000 C CNN
F 2 "" H 3600 1350 50  0001 C CNN
F 3 "" H 3600 1350 50  0001 C CNN
	1    3600 1350
	1    0    0    -1  
$EndComp
Wire Wire Line
	3400 1000 3600 1000
Connection ~ 3600 1000
Wire Wire Line
	3800 1000 3600 1000
Wire Wire Line
	3400 1300 3500 1300
Connection ~ 3600 1300
Wire Wire Line
	3800 1300 3600 1300
Wire Wire Line
	3600 1350 3600 1300
Wire Wire Line
	3500 1350 3500 1300
Connection ~ 3500 1300
Wire Wire Line
	3500 1300 3600 1300
$Comp
L Device:CP C20
U 1 1 5D625292
P 3600 1150
F 0 "C20" H 3718 1196 50  0000 L CNN
F 1 "100uF" H 3718 1105 50  0000 L CNN
F 2 "Capacitor_SMD:C_1206_3216Metric" H 3638 1000 50  0001 C CNN
F 3 "~" H 3600 1150 50  0001 C CNN
	1    3600 1150
	1    0    0    -1  
$EndComp
$Comp
L Device:CP C21
U 1 1 5D625298
P 3800 1150
F 0 "C21" H 3918 1196 50  0000 L CNN
F 1 "100uF" H 3918 1105 50  0000 L CNN
F 2 "Capacitor_SMD:C_1206_3216Metric" H 3838 1000 50  0001 C CNN
F 3 "~" H 3800 1150 50  0001 C CNN
	1    3800 1150
	1    0    0    -1  
$EndComp
Wire Wire Line
	3600 900  3300 900 
Wire Wire Line
	3300 900  3300 800 
Wire Wire Line
	3300 800  2300 800 
Wire Wire Line
	2300 800  2300 2000
Connection ~ 3300 900 
Wire Wire Line
	3300 900  3000 900 
$Comp
L power:GND #PWR0116
U 1 1 5D639F24
P 2300 3150
F 0 "#PWR0116" H 2300 2900 50  0001 C CNN
F 1 "GND" H 2305 2977 50  0000 C CNN
F 2 "" H 2300 3150 50  0001 C CNN
F 3 "" H 2300 3150 50  0001 C CNN
	1    2300 3150
	1    0    0    -1  
$EndComp
Wire Wire Line
	3300 800  4300 800 
Wire Wire Line
	4300 800  4300 2300
Connection ~ 3300 800 
Wire Wire Line
	2300 4650 2600 4650
Wire Wire Line
	2300 5100 2700 5100
$Comp
L power:GND #PWR0119
U 1 1 5D700E63
P 2400 4500
F 0 "#PWR0119" H 2400 4250 50  0001 C CNN
F 1 "GND" H 2405 4327 50  0000 C CNN
F 2 "" H 2400 4500 50  0001 C CNN
F 3 "" H 2400 4500 50  0001 C CNN
	1    2400 4500
	1    0    0    -1  
$EndComp
Wire Wire Line
	2700 4350 2600 4350
Wire Wire Line
	2300 5100 2300 5150
Connection ~ 2300 5100
Wire Wire Line
	2300 5050 2300 5100
$Comp
L TPS54339EDDA:TPS54339EDDA U2
U 1 1 5D700E73
P 3400 4800
F 0 "U2" H 3400 5770 50  0000 C CNN
F 1 "TPS54339EDDA" H 3400 5679 50  0000 C CNN
F 2 "SamacSys_Parts:SOIC127P600X170-9N" H 3400 4800 50  0001 L BNN
F 3 "" H 3400 4800 50  0001 L BNN
F 4 "Unavailable" H 3400 4800 50  0001 L BNN "Field4"
F 5 "Conv DC-DC 4.5V to 23V Step Down Single-Out 0.76V to 7V 10A 8-Pin HSOP EP Tube" H 3400 4800 50  0001 L BNN "Field5"
F 6 "Texas Instruments" H 3400 4800 50  0001 L BNN "Field6"
F 7 "SO-8 Texas Instruments" H 3400 4800 50  0001 L BNN "Field7"
F 8 "None" H 3400 4800 50  0001 L BNN "Field8"
	1    3400 4800
	1    0    0    -1  
$EndComp
$Comp
L Device:R R5
U 1 1 5D700E79
P 2300 4900
F 0 "R5" H 2370 4946 50  0000 L CNN
F 1 "73.2k" H 2370 4855 50  0000 L CNN
F 2 "Resistor_SMD:R_0603_1608Metric_Pad1.05x0.95mm_HandSolder" V 2230 4900 50  0001 C CNN
F 3 "~" H 2300 4900 50  0001 C CNN
	1    2300 4900
	1    0    0    -1  
$EndComp
$Comp
L Device:R R6
U 1 1 5D700E7F
P 2300 5300
F 0 "R6" H 2370 5346 50  0000 L CNN
F 1 "22.1k" H 2370 5255 50  0000 L CNN
F 2 "Resistor_SMD:R_0603_1608Metric_Pad1.05x0.95mm_HandSolder" V 2230 5300 50  0001 C CNN
F 3 "~" H 2300 5300 50  0001 C CNN
	1    2300 5300
	1    0    0    -1  
$EndComp
$Comp
L Device:CP C13
U 1 1 5D700E85
P 2550 4500
F 0 "C13" H 2668 4546 50  0000 L CNN
F 1 "10nF" H 2668 4455 50  0000 L CNN
F 2 "Capacitor_SMD:C_0603_1608Metric" H 2588 4350 50  0001 C CNN
F 3 "~" H 2550 4500 50  0001 C CNN
	1    2550 4500
	0    1    1    0   
$EndComp
$Comp
L Device:R R4
U 1 1 5D700E8B
P 2600 4200
F 0 "R4" H 2670 4246 50  0000 L CNN
F 1 "1k" H 2670 4155 50  0000 L CNN
F 2 "Resistor_SMD:R_0603_1608Metric_Pad1.05x0.95mm_HandSolder" V 2530 4200 50  0001 C CNN
F 3 "~" H 2600 4200 50  0001 C CNN
	1    2600 4200
	1    0    0    -1  
$EndComp
Wire Wire Line
	2700 4050 2700 4100
Wire Wire Line
	2700 4350 2700 4300
$Comp
L Device:CP C15
U 1 1 5D700E93
P 2700 5450
F 0 "C15" H 2818 5496 50  0000 L CNN
F 1 "0.1uF" H 2818 5405 50  0000 L CNN
F 2 "Capacitor_SMD:C_0603_1608Metric" H 2738 5300 50  0001 C CNN
F 3 "~" H 2700 5450 50  0001 C CNN
	1    2700 5450
	1    0    0    -1  
$EndComp
$Comp
L Device:CP C14
U 1 1 5D700E99
P 2600 4800
F 0 "C14" H 2718 4846 50  0000 L CNN
F 1 "0.1uF" H 2718 4755 50  0000 L CNN
F 2 "Capacitor_SMD:C_0603_1608Metric" H 2638 4650 50  0001 C CNN
F 3 "~" H 2600 4800 50  0001 C CNN
	1    2600 4800
	1    0    0    -1  
$EndComp
Connection ~ 2600 4650
Wire Wire Line
	2600 4650 2700 4650
Wire Wire Line
	2700 4650 2700 4700
Wire Wire Line
	2600 4950 2700 4950
Wire Wire Line
	2700 4950 2700 4900
$Comp
L power:GND #PWR0120
U 1 1 5D700EA4
P 4100 4100
F 0 "#PWR0120" H 4100 3850 50  0001 C CNN
F 1 "GND" H 4105 3927 50  0000 C CNN
F 2 "" H 4100 4100 50  0001 C CNN
F 3 "" H 4100 4100 50  0001 C CNN
	1    4100 4100
	1    0    0    -1  
$EndComp
$Comp
L power:GND #PWR0121
U 1 1 5D700EAA
P 2700 5600
F 0 "#PWR0121" H 2700 5350 50  0001 C CNN
F 1 "GND" H 2705 5427 50  0000 C CNN
F 2 "" H 2700 5600 50  0001 C CNN
F 3 "" H 2700 5600 50  0001 C CNN
	1    2700 5600
	1    0    0    -1  
$EndComp
$Comp
L Device:L L2
U 1 1 5D700EB0
P 2300 4500
F 0 "L2" V 2490 4500 50  0000 C CNN
F 1 "4.7uH" V 2399 4500 50  0000 C CNN
F 2 "SamacSys_Parts:WE-PD_1030_105054" H 2300 4500 50  0001 C CNN
F 3 "~" H 2300 4500 50  0001 C CNN
	1    2300 4500
	-1   0    0    1   
$EndComp
$Comp
L power:GND #PWR0122
U 1 1 5D700EB6
P 2300 5450
F 0 "#PWR0122" H 2300 5200 50  0001 C CNN
F 1 "GND" H 2305 5277 50  0000 C CNN
F 2 "" H 2300 5450 50  0001 C CNN
F 3 "" H 2300 5450 50  0001 C CNN
	1    2300 5450
	1    0    0    -1  
$EndComp
$Comp
L Device:CP C6
U 1 1 5D70C5BA
P 1200 3900
F 0 "C6" H 1318 3946 50  0000 L CNN
F 1 "1uF" H 1318 3855 50  0000 L CNN
F 2 "Capacitor_SMD:C_0603_1608Metric" H 1238 3750 50  0001 C CNN
F 3 "~" H 1200 3900 50  0001 C CNN
	1    1200 3900
	1    0    0    -1  
$EndComp
Wire Wire Line
	1400 3750 1400 3650
$Comp
L power:GND #PWR0124
U 1 1 5D70C5C1
P 1400 4100
F 0 "#PWR0124" H 1400 3850 50  0001 C CNN
F 1 "GND" H 1405 3927 50  0000 C CNN
F 2 "" H 1400 4100 50  0001 C CNN
F 3 "" H 1400 4100 50  0001 C CNN
	1    1400 4100
	1    0    0    -1  
$EndComp
Wire Wire Line
	1200 3750 1400 3750
Connection ~ 1400 3750
Wire Wire Line
	1600 3750 1400 3750
Wire Wire Line
	1200 4050 1300 4050
Connection ~ 1400 4050
Wire Wire Line
	1600 4050 1400 4050
Wire Wire Line
	1400 4100 1400 4050
Wire Wire Line
	1300 4100 1300 4050
Connection ~ 1300 4050
Wire Wire Line
	1300 4050 1400 4050
$Comp
L Device:CP C7
U 1 1 5D70C5D1
P 1400 3900
F 0 "C7" H 1518 3946 50  0000 L CNN
F 1 "1uF" H 1518 3855 50  0000 L CNN
F 2 "Capacitor_SMD:C_0603_1608Metric" H 1438 3750 50  0001 C CNN
F 3 "~" H 1400 3900 50  0001 C CNN
	1    1400 3900
	1    0    0    -1  
$EndComp
$Comp
L Device:CP C8
U 1 1 5D70C5D7
P 1600 3900
F 0 "C8" H 1718 3946 50  0000 L CNN
F 1 "10uF" H 1718 3855 50  0000 L CNN
F 2 "Capacitor_SMD:C_0603_1608Metric" H 1638 3750 50  0001 C CNN
F 3 "~" H 1600 3900 50  0001 C CNN
	1    1600 3900
	1    0    0    -1  
$EndComp
$Comp
L Device:CP C9
U 1 1 5D70C5DD
P 1800 3900
F 0 "C9" H 1918 3946 50  0000 L CNN
F 1 "10uF" H 1918 3855 50  0000 L CNN
F 2 "Capacitor_SMD:C_0805_2012Metric" H 1838 3750 50  0001 C CNN
F 3 "~" H 1800 3900 50  0001 C CNN
	1    1800 3900
	1    0    0    -1  
$EndComp
Wire Wire Line
	2000 3750 2000 3650
$Comp
L power:GND #PWR0125
U 1 1 5D70C5E4
P 2000 4100
F 0 "#PWR0125" H 2000 3850 50  0001 C CNN
F 1 "GND" H 2005 3927 50  0000 C CNN
F 2 "" H 2000 4100 50  0001 C CNN
F 3 "" H 2000 4100 50  0001 C CNN
	1    2000 4100
	1    0    0    -1  
$EndComp
Wire Wire Line
	1800 3750 2000 3750
Connection ~ 2000 3750
Wire Wire Line
	2200 3750 2000 3750
Wire Wire Line
	1800 4050 1900 4050
Connection ~ 2000 4050
Wire Wire Line
	2200 4050 2000 4050
Wire Wire Line
	2000 4100 2000 4050
Wire Wire Line
	1900 4100 1900 4050
Connection ~ 1900 4050
Wire Wire Line
	1900 4050 2000 4050
$Comp
L Device:CP C10
U 1 1 5D70C5F4
P 2000 3900
F 0 "C10" H 2118 3946 50  0000 L CNN
F 1 "100uF" H 2118 3855 50  0000 L CNN
F 2 "Capacitor_SMD:C_1206_3216Metric" H 2038 3750 50  0001 C CNN
F 3 "~" H 2000 3900 50  0001 C CNN
	1    2000 3900
	1    0    0    -1  
$EndComp
$Comp
L Device:CP C11
U 1 1 5D70C5FA
P 2200 3900
F 0 "C11" H 2318 3946 50  0000 L CNN
F 1 "100uF" H 2318 3855 50  0000 L CNN
F 2 "Capacitor_SMD:C_1206_3216Metric" H 2238 3750 50  0001 C CNN
F 3 "~" H 2200 3900 50  0001 C CNN
	1    2200 3900
	1    0    0    -1  
$EndComp
Wire Wire Line
	2300 4350 2000 4350
Wire Wire Line
	1400 3650 1700 3650
Wire Wire Line
	1700 3600 1700 3650
Connection ~ 1700 3650
Wire Wire Line
	1700 3650 2000 3650
Wire Wire Line
	1700 3600 1050 3600
Connection ~ 1700 3600
Wire Wire Line
	1050 3600 1050 4350
$Comp
L power:GND #PWR0127
U 1 1 5D3C51E5
P 7800 3600
F 0 "#PWR0127" H 7800 3350 50  0001 C CNN
F 1 "GND" H 7805 3427 50  0000 C CNN
F 2 "" H 7800 3600 50  0001 C CNN
F 3 "" H 7800 3600 50  0001 C CNN
	1    7800 3600
	1    0    0    -1  
$EndComp
Text GLabel 7000 3300 1    50   Output ~ 0
3.3V
Text GLabel 6900 3100 1    50   Output ~ 0
5V
Text GLabel 5800 4850 0    50   Output ~ 0
?V
Text GLabel 7100 3500 1    50   Output ~ 0
?V
Wire Wire Line
	800  1750 800  1950
Connection ~ 2600 1750
$Comp
L Device:R R_Shunt5V1
U 1 1 5D42E405
P 4950 2300
F 0 "R_Shunt5V1" V 4750 2100 50  0000 L CNN
F 1 "0.05" H 5020 2255 50  0000 L CNN
F 2 "Resistor_SMD:R_0603_1608Metric_Pad1.05x0.95mm_HandSolder" V 4880 2300 50  0001 C CNN
F 3 "~" H 4950 2300 50  0001 C CNN
	1    4950 2300
	0    1    1    0   
$EndComp
Wire Wire Line
	5100 2300 5300 2300
Wire Wire Line
	4300 2300 4800 2300
Connection ~ 4800 2300
Wire Wire Line
	5100 2450 5100 2300
Connection ~ 5100 2300
$Comp
L Device:R R_Shunt3.3V1
U 1 1 5D464F28
P 5050 3600
F 0 "R_Shunt3.3V1" V 4900 3300 50  0000 L CNN
F 1 "0.05" H 5120 3555 50  0000 L CNN
F 2 "Resistor_SMD:R_0603_1608Metric_Pad1.05x0.95mm_HandSolder" V 4980 3600 50  0001 C CNN
F 3 "~" H 5050 3600 50  0001 C CNN
	1    5050 3600
	0    1    1    0   
$EndComp
Wire Wire Line
	5200 3600 5250 3600
Wire Wire Line
	4950 3700 4900 3700
Wire Wire Line
	4900 3700 4900 3600
Connection ~ 4900 3600
Wire Wire Line
	5150 3700 5200 3700
Wire Wire Line
	5200 3700 5200 3600
Connection ~ 5200 3600
$Comp
L Device:R R_Shunt?V1
U 1 1 5D49E01C
P 3300 6450
F 0 "R_Shunt?V1" H 3370 6496 50  0000 L CNN
F 1 "0.05" H 3370 6405 50  0000 L CNN
F 2 "Resistor_SMD:R_0603_1608Metric_Pad1.05x0.95mm_HandSolder" V 3230 6450 50  0001 C CNN
F 3 "~" H 3300 6450 50  0001 C CNN
	1    3300 6450
	0    1    1    0   
$EndComp
$Comp
L LMC662CMX_NOPB:LMC662CMX_NOPB U3
U 1 1 5D330FE8
P 2000 6500
F 0 "U3" H 2000 7170 50  0000 C CNN
F 1 "LMC662CMX_NOPB" H 2000 7079 50  0000 C CNN
F 2 "SamacSys_Parts:SOIC127P600X175-8N" H 2000 6500 50  0001 L BNN
F 3 "" H 2000 6500 50  0001 L BNN
F 4 "Unavailable" H 2000 6500 50  0001 L BNN "Field4"
F 5 "OPERATIONAL AMPLIFIER, 1.4MHZ, 1.1V/ us, SOIC-8, FULL REEL" H 2000 6500 50  0001 L BNN "Field5"
F 6 "Texas Instruments" H 2000 6500 50  0001 L BNN "Field6"
F 7 "SOIC-8 Texas Instruments" H 2000 6500 50  0001 L BNN "Field7"
F 8 "None" H 2000 6500 50  0001 L BNN "Field8"
	1    2000 6500
	1    0    0    -1  
$EndComp
Wire Wire Line
	750  5950 1000 5950
Wire Wire Line
	750  5950 750  7100
Wire Wire Line
	1000 6000 1000 5950
Connection ~ 1000 5950
Wire Wire Line
	1300 6200 1300 5950
Wire Wire Line
	1000 6300 1150 6300
Wire Wire Line
	1300 6700 1150 6700
Wire Wire Line
	1150 6700 1150 6300
Wire Wire Line
	1300 6400 1200 6400
Wire Wire Line
	1200 6400 1200 7300
Wire Wire Line
	1200 7300 3000 7300
Wire Wire Line
	3000 7300 3000 6450
Connection ~ 3000 6450
Wire Wire Line
	3000 6450 3000 6400
Text GLabel 4350 2750 1    50   Input ~ 0
5V_current_monitor
Text GLabel 2050 2200 0    50   Input ~ 0
5V_check
$Comp
L power:GND #PWR0103
U 1 1 5D653450
P 4600 6600
F 0 "#PWR0103" H 4600 6350 50  0001 C CNN
F 1 "GND" H 4605 6427 50  0000 C CNN
F 2 "" H 4600 6600 50  0001 C CNN
F 3 "" H 4600 6600 50  0001 C CNN
	1    4600 6600
	1    0    0    -1  
$EndComp
Wire Wire Line
	4600 6600 4600 6550
Connection ~ 4600 6550
$Comp
L Device:CP C23
U 1 1 5D65345B
P 4800 6400
F 0 "C23" H 4918 6446 50  0000 L CNN
F 1 "3pF" H 4918 6355 50  0000 L CNN
F 2 "Capacitor_SMD:C_0603_1608Metric" H 4838 6250 50  0001 C CNN
F 3 "~" H 4800 6400 50  0001 C CNN
	1    4800 6400
	1    0    0    -1  
$EndComp
$Comp
L Device:CP C22
U 1 1 5D653461
P 4400 6400
F 0 "C22" H 4518 6446 50  0000 L CNN
F 1 "3pF" H 4518 6355 50  0000 L CNN
F 2 "Capacitor_SMD:C_0603_1608Metric" H 4438 6250 50  0001 C CNN
F 3 "~" H 4400 6400 50  0001 C CNN
	1    4400 6400
	1    0    0    -1  
$EndComp
$Comp
L power:+3.3V #PWR0107
U 1 1 5D6CA389
P 7100 3300
F 0 "#PWR0107" H 7100 3150 50  0001 C CNN
F 1 "+3.3V" H 7115 3473 50  0000 C CNN
F 2 "" H 7100 3300 50  0001 C CNN
F 3 "" H 7100 3300 50  0001 C CNN
	1    7100 3300
	1    0    0    -1  
$EndComp
Connection ~ 7100 3300
Wire Wire Line
	7100 3300 6400 3300
$Comp
L power:+3.3V #PWR0118
U 1 1 5D703F65
P 5500 2850
F 0 "#PWR0118" H 5500 2700 50  0001 C CNN
F 1 "+3.3V" H 5515 3023 50  0000 C CNN
F 2 "" H 5500 2850 50  0001 C CNN
F 3 "" H 5500 2850 50  0001 C CNN
	1    5500 2850
	0    1    1    0   
$EndComp
Wire Wire Line
	1700 3600 4300 3600
$Comp
L power:+5V #PWR0126
U 1 1 5D747BF6
P 7000 3100
F 0 "#PWR0126" H 7000 2950 50  0001 C CNN
F 1 "+5V" H 7015 3273 50  0000 C CNN
F 2 "" H 7000 3100 50  0001 C CNN
F 3 "" H 7000 3100 50  0001 C CNN
	1    7000 3100
	1    0    0    -1  
$EndComp
Wire Wire Line
	1000 5950 1300 5950
$Comp
L power:+5V #PWR0129
U 1 1 5D766014
P 1150 5950
F 0 "#PWR0129" H 1150 5800 50  0001 C CNN
F 1 "+5V" H 1165 6123 50  0000 C CNN
F 2 "" H 1150 5950 50  0001 C CNN
F 3 "" H 1150 5950 50  0001 C CNN
	1    1150 5950
	1    0    0    -1  
$EndComp
Text GLabel 4650 4650 2    50   Input ~ 0
?V_switch
Text GLabel 5450 3300 0    50   Input ~ 0
3.3V_switch
Text GLabel 5500 2000 0    50   Input ~ 0
5V_switch
Wire Wire Line
	4600 6550 4800 6550
Wire Wire Line
	4400 6550 4600 6550
$Comp
L power:GND #PWR0137
U 1 1 5D96A823
P 2700 6300
F 0 "#PWR0137" H 2700 6050 50  0001 C CNN
F 1 "GND" H 2705 6127 50  0000 C CNN
F 2 "" H 2700 6300 50  0001 C CNN
F 3 "" H 2700 6300 50  0001 C CNN
	1    2700 6300
	1    0    0    -1  
$EndComp
Text GLabel 2000 4500 0    50   Input ~ 0
3.3V_check
Text GLabel 4400 6200 0    50   Input ~ 0
Clock_in
Text GLabel 4800 6200 2    50   Input ~ 0
Clock_out
Wire Wire Line
	4400 6250 4400 6200
Wire Wire Line
	4800 6250 4800 6200
$Comp
L power:VCC #PWR0138
U 1 1 5D38EFAE
P 4300 3600
F 0 "#PWR0138" H 4300 3450 50  0001 C CNN
F 1 "VCC" H 4317 3773 50  0000 C CNN
F 2 "" H 4300 3600 50  0001 C CNN
F 3 "" H 4300 3600 50  0001 C CNN
	1    4300 3600
	1    0    0    -1  
$EndComp
Connection ~ 4300 3600
Wire Wire Line
	4300 3600 4900 3600
Text GLabel 800  1750 1    50   Input ~ 0
panels_raw
Text GLabel 900  2750 1    50   Input ~ 0
panels_current_monitor
$Comp
L Device:R R_Panels_Shunt4
U 1 1 5D3D14C7
P 1250 1750
F 0 "R_Panels_Shunt4" H 1320 1796 50  0000 L CNN
F 1 "0.05" H 1320 1705 50  0000 L CNN
F 2 "Resistor_SMD:R_0603_1608Metric_Pad1.05x0.95mm_HandSolder" V 1180 1750 50  0001 C CNN
F 3 "~" H 1250 1750 50  0001 C CNN
	1    1250 1750
	0    1    1    0   
$EndComp
$Comp
L power:GND #PWR0142
U 1 1 5D3DDD32
P 550 2750
F 0 "#PWR0142" H 550 2500 50  0001 C CNN
F 1 "GND" H 555 2577 50  0000 C CNN
F 2 "" H 550 2750 50  0001 C CNN
F 3 "" H 550 2750 50  0001 C CNN
	1    550  2750
	1    0    0    -1  
$EndComp
$Comp
L power:+3.3V #PWR0143
U 1 1 5D3DDD46
P 2050 2850
F 0 "#PWR0143" H 2050 2700 50  0001 C CNN
F 1 "+3.3V" H 2065 3023 50  0000 C CNN
F 2 "" H 2050 2850 50  0001 C CNN
F 3 "" H 2050 2850 50  0001 C CNN
	1    2050 2850
	0    1    1    0   
$EndComp
Wire Wire Line
	6400 3300 6400 3600
Connection ~ 7000 3100
Wire Wire Line
	7000 3100 7800 3100
Wire Wire Line
	6000 2300 6000 3100
Wire Wire Line
	6000 3100 7000 3100
Text GLabel 1050 1750 1    50   Input ~ 0
panels_voltage
$Comp
L ECS-80-20-4X:ECS-80-20-4X Y1
U 1 1 5D36AA47
P 4600 6200
F 0 "Y1" H 4600 6437 50  0000 C CNN
F 1 "ECS-80-20-4X" H 4600 6346 50  0000 C CNN
F 2 "XTAL_ECS-80-20-4X" H 4600 6200 50  0001 L BNN
F 3 "" H 4600 6200 50  0001 L BNN
F 4 "ECS-80-20-4X" H 4600 6200 50  0001 L BNN "Field4"
F 5 "None" H 4600 6200 50  0001 L BNN "Field5"
F 6 "HC-49USX Series 11.35 x 4.65 mm 8 MHz ±30 ppm 20 pF -10°C to +70°C Crystal" H 4600 6200 50  0001 L BNN "Field6"
F 7 "HC49/US ECS International" H 4600 6200 50  0001 L BNN "Field7"
F 8 "ECS Inc." H 4600 6200 50  0001 L BNN "Field8"
	1    4600 6200
	1    0    0    -1  
$EndComp
$Comp
L Transistor_FET:DMG2301L Q1
U 1 1 5D38ED66
P 2900 6200
F 0 "Q1" H 3106 6246 50  0000 L CNN
F 1 "DMG2301L" H 3106 6155 50  0000 L CNN
F 2 "Package_TO_SOT_SMD:SOT-23" H 3100 6125 50  0001 L CIN
F 3 "https://www.diodes.com/assets/Datasheets/DMG2301L.pdf" H 2900 6200 50  0001 L CNN
	1    2900 6200
	1    0    0    -1  
$EndComp
$Comp
L Device:R LED1_resistor1
U 1 1 5D414412
P 6800 2850
F 0 "LED1_resistor1" H 6870 2896 50  0000 L CNN
F 1 "220" H 6870 2805 50  0000 L CNN
F 2 "Resistor_SMD:R_0603_1608Metric_Pad1.05x0.95mm_HandSolder" V 6730 2850 50  0001 C CNN
F 3 "~" H 6800 2850 50  0001 C CNN
	1    6800 2850
	0    1    1    0   
$EndComp
Wire Wire Line
	6500 3500 6500 4450
$Comp
L Device:R LED3_resistor1
U 1 1 5D41F324
P 6800 2550
F 0 "LED3_resistor1" H 6870 2596 50  0000 L CNN
F 1 "220" H 6870 2505 50  0000 L CNN
F 2 "Resistor_SMD:R_0603_1608Metric_Pad1.05x0.95mm_HandSolder" V 6730 2550 50  0001 C CNN
F 3 "~" H 6800 2550 50  0001 C CNN
	1    6800 2550
	0    1    1    0   
$EndComp
$Comp
L Device:LED D5
U 1 1 5D451A1C
P 7100 2550
F 0 "D5" V 7139 2433 50  0000 R CNN
F 1 "LED3" V 7048 2433 50  0000 R CNN
F 2 "LED_SMD:LED_0805_2012Metric" H 7100 2550 50  0001 C CNN
F 3 "~" H 7100 2550 50  0001 C CNN
	1    7100 2550
	-1   0    0    1   
$EndComp
$Comp
L Device:LED D4
U 1 1 5D4522C2
P 7100 2700
F 0 "D4" V 7139 2583 50  0000 R CNN
F 1 "LED2" V 7048 2583 50  0000 R CNN
F 2 "LED_SMD:LED_0805_2012Metric" H 7100 2700 50  0001 C CNN
F 3 "~" H 7100 2700 50  0001 C CNN
	1    7100 2700
	-1   0    0    1   
$EndComp
$Comp
L Device:LED D3
U 1 1 5D452655
P 7100 2850
F 0 "D3" V 7139 2733 50  0000 R CNN
F 1 "LED1" V 7048 2733 50  0000 R CNN
F 2 "LED_SMD:LED_0805_2012Metric" H 7100 2850 50  0001 C CNN
F 3 "~" H 7100 2850 50  0001 C CNN
	1    7100 2850
	-1   0    0    1   
$EndComp
$Comp
L power:GND #PWR0148
U 1 1 5D452A27
P 7250 2550
F 0 "#PWR0148" H 7250 2300 50  0001 C CNN
F 1 "GND" H 7255 2377 50  0000 C CNN
F 2 "" H 7250 2550 50  0001 C CNN
F 3 "" H 7250 2550 50  0001 C CNN
	1    7250 2550
	0    -1   -1   0   
$EndComp
$Comp
L power:GND #PWR0149
U 1 1 5D452EE9
P 7250 2700
F 0 "#PWR0149" H 7250 2450 50  0001 C CNN
F 1 "GND" H 7255 2527 50  0000 C CNN
F 2 "" H 7250 2700 50  0001 C CNN
F 3 "" H 7250 2700 50  0001 C CNN
	1    7250 2700
	0    -1   -1   0   
$EndComp
$Comp
L power:GND #PWR0150
U 1 1 5D4533BC
P 7250 2850
F 0 "#PWR0150" H 7250 2600 50  0001 C CNN
F 1 "GND" H 7255 2677 50  0000 C CNN
F 2 "" H 7250 2850 50  0001 C CNN
F 3 "" H 7250 2850 50  0001 C CNN
	1    7250 2850
	0    -1   -1   0   
$EndComp
Text GLabel 6650 2850 0    50   Input Italic 0
GPIO_Output2
Text GLabel 6650 2700 0    50   Input ~ 0
GPIO_Output3
Text GLabel 6650 2550 0    50   Input ~ 0
GPIO_Output4
$Comp
L Device:R LED2_resistor1
U 1 1 5D41E307
P 6800 2700
F 0 "LED2_resistor1" H 6870 2746 50  0000 L CNN
F 1 "220" H 6870 2655 50  0000 L CNN
F 2 "Resistor_SMD:R_0603_1608Metric_Pad1.05x0.95mm_HandSolder" V 6730 2700 50  0001 C CNN
F 3 "~" H 6800 2700 50  0001 C CNN
	1    6800 2700
	0    1    1    0   
$EndComp
Wire Wire Line
	5250 6700 5550 6700
Wire Wire Line
	5650 6400 5550 6400
$Comp
L Device:CP C27
U 1 1 5D47BF90
P 5500 6550
F 0 "C27" H 5618 6596 50  0000 L CNN
F 1 "10nF" H 5618 6505 50  0000 L CNN
F 2 "Capacitor_SMD:C_0603_1608Metric" H 5538 6400 50  0001 C CNN
F 3 "~" H 5500 6550 50  0001 C CNN
	1    5500 6550
	0    1    1    0   
$EndComp
$Comp
L Device:R R11
U 1 1 5D47BF96
P 5550 6250
F 0 "R11" H 5620 6296 50  0000 L CNN
F 1 "1k" H 5620 6205 50  0000 L CNN
F 2 "Resistor_SMD:R_0603_1608Metric_Pad1.05x0.95mm_HandSolder" V 5480 6250 50  0001 C CNN
F 3 "~" H 5550 6250 50  0001 C CNN
	1    5550 6250
	1    0    0    -1  
$EndComp
Wire Wire Line
	5650 6100 5650 6150
Wire Wire Line
	5650 6400 5650 6350
$Comp
L Device:CP C29
U 1 1 5D47BF9E
P 5650 7500
F 0 "C29" H 5768 7546 50  0000 L CNN
F 1 "0.1uF" H 5768 7455 50  0000 L CNN
F 2 "Capacitor_SMD:C_0603_1608Metric" H 5688 7350 50  0001 C CNN
F 3 "~" H 5650 7500 50  0001 C CNN
	1    5650 7500
	1    0    0    -1  
$EndComp
$Comp
L Device:CP C28
U 1 1 5D47BFA4
P 5550 6850
F 0 "C28" H 5668 6896 50  0000 L CNN
F 1 "0.1uF" H 5668 6805 50  0000 L CNN
F 2 "Capacitor_SMD:C_0603_1608Metric" H 5588 6700 50  0001 C CNN
F 3 "~" H 5550 6850 50  0001 C CNN
	1    5550 6850
	1    0    0    -1  
$EndComp
Connection ~ 5550 6700
Wire Wire Line
	5550 6700 5650 6700
Wire Wire Line
	5650 6700 5650 6750
Wire Wire Line
	5550 7000 5650 7000
Wire Wire Line
	5650 7000 5650 6950
$Comp
L power:GND #PWR0152
U 1 1 5D47BFAF
P 5650 7650
F 0 "#PWR0152" H 5650 7400 50  0001 C CNN
F 1 "GND" H 5655 7477 50  0000 C CNN
F 2 "" H 5650 7650 50  0001 C CNN
F 3 "" H 5650 7650 50  0001 C CNN
	1    5650 7650
	1    0    0    -1  
$EndComp
Wire Wire Line
	5550 6100 5650 6100
$Comp
L Device:L L3
U 1 1 5D491A35
P 5250 6550
F 0 "L3" V 5440 6550 50  0000 C CNN
F 1 "4.7uH" V 5349 6550 50  0000 C CNN
F 2 "SamacSys_Parts:WE-PD_1030_105054" H 5250 6550 50  0001 C CNN
F 3 "~" H 5250 6550 50  0001 C CNN
	1    5250 6550
	-1   0    0    1   
$EndComp
$Comp
L Device:CP C24
U 1 1 5D49CB84
P 5100 5550
F 0 "C24" H 5218 5596 50  0000 L CNN
F 1 "1uF" H 5218 5505 50  0000 L CNN
F 2 "Capacitor_SMD:C_0603_1608Metric" H 5138 5400 50  0001 C CNN
F 3 "~" H 5100 5550 50  0001 C CNN
	1    5100 5550
	1    0    0    -1  
$EndComp
Wire Wire Line
	5300 5400 5300 5300
$Comp
L power:GND #PWR0153
U 1 1 5D49CB8B
P 5300 5750
F 0 "#PWR0153" H 5300 5500 50  0001 C CNN
F 1 "GND" H 5305 5577 50  0000 C CNN
F 2 "" H 5300 5750 50  0001 C CNN
F 3 "" H 5300 5750 50  0001 C CNN
	1    5300 5750
	1    0    0    -1  
$EndComp
Wire Wire Line
	5100 5400 5300 5400
Connection ~ 5300 5400
Wire Wire Line
	5500 5400 5300 5400
Wire Wire Line
	5100 5700 5200 5700
Connection ~ 5300 5700
Wire Wire Line
	5500 5700 5300 5700
Wire Wire Line
	5300 5750 5300 5700
Wire Wire Line
	5200 5750 5200 5700
Connection ~ 5200 5700
Wire Wire Line
	5200 5700 5300 5700
$Comp
L Device:CP C25
U 1 1 5D49CB9B
P 5300 5550
F 0 "C25" H 5418 5596 50  0000 L CNN
F 1 "1uF" H 5418 5505 50  0000 L CNN
F 2 "Capacitor_SMD:C_0603_1608Metric" H 5338 5400 50  0001 C CNN
F 3 "~" H 5300 5550 50  0001 C CNN
	1    5300 5550
	1    0    0    -1  
$EndComp
$Comp
L Device:CP C26
U 1 1 5D49CBA1
P 5500 5550
F 0 "C26" H 5618 5596 50  0000 L CNN
F 1 "10uF" H 5618 5505 50  0000 L CNN
F 2 "Capacitor_SMD:C_1210_3225Metric" H 5538 5400 50  0001 C CNN
F 3 "~" H 5500 5550 50  0001 C CNN
	1    5500 5550
	1    0    0    -1  
$EndComp
$Comp
L Device:CP C30
U 1 1 5D49CBA7
P 5700 5550
F 0 "C30" H 5818 5596 50  0000 L CNN
F 1 "10uF" H 5818 5505 50  0000 L CNN
F 2 "Capacitor_SMD:C_0805_2012Metric" H 5738 5400 50  0001 C CNN
F 3 "~" H 5700 5550 50  0001 C CNN
	1    5700 5550
	1    0    0    -1  
$EndComp
Wire Wire Line
	5900 5400 5900 5300
$Comp
L power:GND #PWR0154
U 1 1 5D49CBAE
P 5900 5750
F 0 "#PWR0154" H 5900 5500 50  0001 C CNN
F 1 "GND" H 5905 5577 50  0000 C CNN
F 2 "" H 5900 5750 50  0001 C CNN
F 3 "" H 5900 5750 50  0001 C CNN
	1    5900 5750
	1    0    0    -1  
$EndComp
Wire Wire Line
	5700 5400 5900 5400
Connection ~ 5900 5400
Wire Wire Line
	6100 5400 5900 5400
Wire Wire Line
	5700 5700 5800 5700
Connection ~ 5900 5700
Wire Wire Line
	6100 5700 5900 5700
Wire Wire Line
	5900 5750 5900 5700
Wire Wire Line
	5800 5750 5800 5700
Connection ~ 5800 5700
Wire Wire Line
	5800 5700 5900 5700
$Comp
L Device:CP C31
U 1 1 5D49CBBE
P 5900 5550
F 0 "C31" H 6018 5596 50  0000 L CNN
F 1 "100uF" H 6018 5505 50  0000 L CNN
F 2 "Capacitor_SMD:C_1206_3216Metric" H 5938 5400 50  0001 C CNN
F 3 "~" H 5900 5550 50  0001 C CNN
	1    5900 5550
	1    0    0    -1  
$EndComp
$Comp
L Device:CP C32
U 1 1 5D49CBC4
P 6100 5550
F 0 "C32" H 6218 5596 50  0000 L CNN
F 1 "100uF" H 6218 5505 50  0000 L CNN
F 2 "Capacitor_SMD:C_1206_3216Metric" H 6138 5400 50  0001 C CNN
F 3 "~" H 6100 5550 50  0001 C CNN
	1    6100 5550
	1    0    0    -1  
$EndComp
Wire Wire Line
	5300 5300 5600 5300
Wire Wire Line
	5600 5250 5600 5300
Connection ~ 5600 5300
Wire Wire Line
	5600 5300 5900 5300
Wire Wire Line
	4450 4950 4050 4950
Wire Wire Line
	4050 4950 4050 6450
Wire Wire Line
	4850 4950 5800 4950
Wire Wire Line
	5800 4450 5800 4950
Text GLabel 1650 1750 1    50   Input ~ 0
NRG_IN
Text GLabel 2650 4050 1    50   Input ~ 0
NRG_IN
Wire Wire Line
	2600 4050 2700 4050
Text GLabel 3000 6000 1    50   Input ~ 0
NRG_IN
Text GLabel 5600 6100 1    50   Input ~ 0
NRG_IN
$Comp
L power:GND #PWR0155
U 1 1 5D500C07
P 7050 6150
F 0 "#PWR0155" H 7050 5900 50  0001 C CNN
F 1 "GND" H 7055 5977 50  0000 C CNN
F 2 "" H 7050 6150 50  0001 C CNN
F 3 "" H 7050 6150 50  0001 C CNN
	1    7050 6150
	1    0    0    -1  
$EndComp
Wire Wire Line
	5250 6400 5250 6350
Wire Wire Line
	5250 6000 4950 6000
Wire Wire Line
	4950 6000 4950 5250
Wire Wire Line
	4950 5250 5600 5250
$Comp
L power:VDDA #PWR0156
U 1 1 5D522365
P 5600 5250
F 0 "#PWR0156" H 5600 5100 50  0001 C CNN
F 1 "VDDA" H 5617 5423 50  0000 C CNN
F 2 "" H 5600 5250 50  0001 C CNN
F 3 "" H 5600 5250 50  0001 C CNN
	1    5600 5250
	1    0    0    -1  
$EndComp
Connection ~ 5600 5250
$Comp
L power:GND #PWR0158
U 1 1 5D523C30
P 5350 6550
F 0 "#PWR0158" H 5350 6300 50  0001 C CNN
F 1 "GND" H 5355 6377 50  0000 C CNN
F 2 "" H 5350 6550 50  0001 C CNN
F 3 "" H 5350 6550 50  0001 C CNN
	1    5350 6550
	-1   0    0    1   
$EndComp
$Comp
L Device:R LED3_resistor2
U 1 1 5D5281A9
P 6800 2400
F 0 "LED3_resistor2" H 6870 2446 50  0000 L CNN
F 1 "220" H 6870 2355 50  0000 L CNN
F 2 "Resistor_SMD:R_0603_1608Metric_Pad1.05x0.95mm_HandSolder" V 6730 2400 50  0001 C CNN
F 3 "~" H 6800 2400 50  0001 C CNN
	1    6800 2400
	0    1    1    0   
$EndComp
$Comp
L Device:LED D6
U 1 1 5D5281AF
P 7100 2400
F 0 "D6" V 7139 2283 50  0000 R CNN
F 1 "LED3" V 7048 2283 50  0000 R CNN
F 2 "LED_SMD:LED_0805_2012Metric" H 7100 2400 50  0001 C CNN
F 3 "~" H 7100 2400 50  0001 C CNN
	1    7100 2400
	-1   0    0    1   
$EndComp
$Comp
L power:GND #PWR0160
U 1 1 5D5281B5
P 7250 2400
F 0 "#PWR0160" H 7250 2150 50  0001 C CNN
F 1 "GND" H 7255 2227 50  0000 C CNN
F 2 "" H 7250 2400 50  0001 C CNN
F 3 "" H 7250 2400 50  0001 C CNN
	1    7250 2400
	0    -1   -1   0   
$EndComp
Text GLabel 6650 2400 0    50   Input ~ 0
GPIO_Output5
Text GLabel 6650 2250 0    50   Input ~ 0
GPIO_Output6
$Comp
L power:GND #PWR0161
U 1 1 5D53EA93
P 7250 2250
F 0 "#PWR0161" H 7250 2000 50  0001 C CNN
F 1 "GND" H 7255 2077 50  0000 C CNN
F 2 "" H 7250 2250 50  0001 C CNN
F 3 "" H 7250 2250 50  0001 C CNN
	1    7250 2250
	0    -1   -1   0   
$EndComp
$Comp
L Device:LED D7
U 1 1 5D53EA8D
P 7100 2250
F 0 "D7" V 7139 2133 50  0000 R CNN
F 1 "LED3" V 7048 2133 50  0000 R CNN
F 2 "LED_SMD:LED_0805_2012Metric" H 7100 2250 50  0001 C CNN
F 3 "~" H 7100 2250 50  0001 C CNN
	1    7100 2250
	-1   0    0    1   
$EndComp
$Comp
L Device:R LED3_resistor3
U 1 1 5D53EA87
P 6800 2250
F 0 "LED3_resistor3" H 6870 2296 50  0000 L CNN
F 1 "220" H 6870 2205 50  0000 L CNN
F 2 "Resistor_SMD:R_0603_1608Metric_Pad1.05x0.95mm_HandSolder" V 6730 2250 50  0001 C CNN
F 3 "~" H 6800 2250 50  0001 C CNN
	1    6800 2250
	0    1    1    0   
$EndComp
$Comp
L Interface_CAN_LIN:SN65HVD233 U12
U 1 1 5D379F4C
P 1350 5100
F 0 "U12" H 1350 5581 50  0000 C CNN
F 1 "SN65HVD233" H 2050 5050 50  0000 C CNN
F 2 "Package_SO:SOIC-8_3.9x4.9mm_P1.27mm" H 1350 4600 50  0001 C CNN
F 3 "http://www.ti.com/lit/ds/symlink/sn65hvd234.pdf" H 1250 5500 50  0001 C CNN
	1    1350 5100
	1    0    0    -1  
$EndComp
$Comp
L power:+3.3V #PWR0162
U 1 1 5D37C50B
P 1350 4800
F 0 "#PWR0162" H 1350 4650 50  0001 C CNN
F 1 "+3.3V" H 1700 4900 50  0000 C CNN
F 2 "" H 1350 4800 50  0001 C CNN
F 3 "" H 1350 4800 50  0001 C CNN
	1    1350 4800
	1    0    0    -1  
$EndComp
$Comp
L power:GND #PWR0163
U 1 1 5D386DCB
P 1350 5500
F 0 "#PWR0163" H 1350 5250 50  0001 C CNN
F 1 "GND" H 1355 5327 50  0000 C CNN
F 2 "" H 1350 5500 50  0001 C CNN
F 3 "" H 1350 5500 50  0001 C CNN
	1    1350 5500
	1    0    0    -1  
$EndComp
Text GLabel 1750 5100 1    50   Input ~ 0
CANH
Text GLabel 1750 5200 3    50   Input ~ 0
CANL
$Comp
L power:GND #PWR0164
U 1 1 5D3A4550
P 950 5300
F 0 "#PWR0164" H 950 5050 50  0001 C CNN
F 1 "GND" H 955 5127 50  0000 C CNN
F 2 "" H 950 5300 50  0001 C CNN
F 3 "" H 950 5300 50  0001 C CNN
	1    950  5300
	0    1    1    0   
$EndComp
$Comp
L power:GND #PWR0165
U 1 1 5D3A4856
P 950 5200
F 0 "#PWR0165" H 950 4950 50  0001 C CNN
F 1 "GND" H 955 5027 50  0000 C CNN
F 2 "" H 950 5200 50  0001 C CNN
F 3 "" H 950 5200 50  0001 C CNN
	1    950  5200
	0    1    1    0   
$EndComp
Text GLabel 950  5000 0    50   Input ~ 0
CAN_RX
Text GLabel 950  5100 0    50   Input ~ 0
CAN_TX
$Comp
L Connector:Conn_01x06_Female J5
U 1 1 5D38CD60
P 8000 3300
F 0 "J5" H 8028 3276 50  0000 L CNN
F 1 "Conn_01x06_Female" H 8028 3185 50  0000 L CNN
F 2 "Connector_PinHeader_2.54mm:PinHeader_1x06_P2.54mm_Vertical" H 8000 3300 50  0001 C CNN
F 3 "~" H 8000 3300 50  0001 C CNN
	1    8000 3300
	1    0    0    -1  
$EndComp
$Comp
L SamacSys_Parts:INA139NA_250 IC2
U 1 1 5D400053
P 4400 2750
F 0 "IC2" H 4450 2900 50  0000 C CNN
F 1 "INA139NA_250" H 4950 2700 50  0000 C CNN
F 2 "SOT95P280X145-5N" H 5350 2850 50  0001 L CNN
F 3 "http://www.ti.com/lit/ds/symlink/ina139.pdf" H 5350 2750 50  0001 L CNN
F 4 "36V, High-Side, High-Speed, Current Output Current Sense Amplifier" H 5350 2650 50  0001 L CNN "Description"
F 5 "1.45" H 5350 2550 50  0001 L CNN "Height"
F 6 "Texas Instruments" H 5350 2450 50  0001 L CNN "Manufacturer_Name"
F 7 "INA139NA/250" H 5350 2350 50  0001 L CNN "Manufacturer_Part_Number"
F 8 "595-INA139NA/250" H 5350 2250 50  0001 L CNN "Mouser Part Number"
F 9 "https://www.mouser.com/Search/Refine.aspx?Keyword=595-INA139NA%2F250" H 5350 2150 50  0001 L CNN "Mouser Price/Stock"
F 10 "4616558P" H 5350 2050 50  0001 L CNN "RS Part Number"
F 11 "http://uk.rs-online.com/web/p/products/4616558P" H 5350 1950 50  0001 L CNN "RS Price/Stock"
	1    4400 2750
	1    0    0    -1  
$EndComp
Wire Wire Line
	5500 2750 5500 2450
Wire Wire Line
	5500 2450 5100 2450
$Comp
L Device:R R13
U 1 1 5D41C774
P 4150 2750
F 0 "R13" H 4220 2796 50  0000 L CNN
F 1 "20k" H 4220 2705 50  0000 L CNN
F 2 "Resistor_SMD:R_0603_1608Metric_Pad1.05x0.95mm_HandSolder" V 4080 2750 50  0001 C CNN
F 3 "~" H 4150 2750 50  0001 C CNN
	1    4150 2750
	0    -1   -1   0   
$EndComp
$Comp
L power:GND #PWR0102
U 1 1 5D4295DA
P 4000 2750
F 0 "#PWR0102" H 4000 2500 50  0001 C CNN
F 1 "GND" H 4005 2577 50  0000 C CNN
F 2 "" H 4000 2750 50  0001 C CNN
F 3 "" H 4000 2750 50  0001 C CNN
	1    4000 2750
	1    0    0    -1  
$EndComp
$Comp
L power:GND #PWR0108
U 1 1 5D429891
P 4400 2850
F 0 "#PWR0108" H 4400 2600 50  0001 C CNN
F 1 "GND" H 4405 2677 50  0000 C CNN
F 2 "" H 4400 2850 50  0001 C CNN
F 3 "" H 4400 2850 50  0001 C CNN
	1    4400 2850
	0    1    1    0   
$EndComp
$Comp
L TPS54339EDDA:TPS54339EDDA U1
U 1 1 5D5CB8B6
P 3400 2500
F 0 "U1" H 3400 3470 50  0000 C CNN
F 1 "TPS54339EDDA" H 3400 3379 50  0000 C CNN
F 2 "SamacSys_Parts:SOIC127P600X170-9N" H 3400 2500 50  0001 L BNN
F 3 "" H 3400 2500 50  0001 L BNN
F 4 "Unavailable" H 3400 2500 50  0001 L BNN "Field4"
F 5 "Conv DC-DC 4.5V to 23V Step Down Single-Out 0.76V to 7V 10A 8-Pin HSOP EP Tube" H 3400 2500 50  0001 L BNN "Field5"
F 6 "Texas Instruments" H 3400 2500 50  0001 L BNN "Field6"
F 7 "SO-8 Texas Instruments" H 3400 2500 50  0001 L BNN "Field7"
F 8 "None" H 3400 2500 50  0001 L BNN "Field8"
	1    3400 2500
	1    0    0    -1  
$EndComp
Wire Wire Line
	4400 2950 4400 3150
Wire Wire Line
	4400 3150 4800 3150
Wire Wire Line
	4800 2300 4800 3150
Wire Wire Line
	4300 2750 4400 2750
Text GLabel 4600 4150 1    50   Input ~ 0
3.3V_current_monitor
$Comp
L power:+3.3V #PWR0117
U 1 1 5D45C6DF
P 5750 4250
F 0 "#PWR0117" H 5750 4100 50  0001 C CNN
F 1 "+3.3V" H 5765 4423 50  0000 C CNN
F 2 "" H 5750 4250 50  0001 C CNN
F 3 "" H 5750 4250 50  0001 C CNN
	1    5750 4250
	0    1    1    0   
$EndComp
$Comp
L SamacSys_Parts:INA139NA_250 IC3
U 1 1 5D45C6ED
P 4650 4150
F 0 "IC3" H 4700 4300 50  0000 C CNN
F 1 "INA139NA_250" H 5200 4100 50  0000 C CNN
F 2 "SOT95P280X145-5N" H 5600 4250 50  0001 L CNN
F 3 "http://www.ti.com/lit/ds/symlink/ina139.pdf" H 5600 4150 50  0001 L CNN
F 4 "36V, High-Side, High-Speed, Current Output Current Sense Amplifier" H 5600 4050 50  0001 L CNN "Description"
F 5 "1.45" H 5600 3950 50  0001 L CNN "Height"
F 6 "Texas Instruments" H 5600 3850 50  0001 L CNN "Manufacturer_Name"
F 7 "INA139NA/250" H 5600 3750 50  0001 L CNN "Manufacturer_Part_Number"
F 8 "595-INA139NA/250" H 5600 3650 50  0001 L CNN "Mouser Part Number"
F 9 "https://www.mouser.com/Search/Refine.aspx?Keyword=595-INA139NA%2F250" H 5600 3550 50  0001 L CNN "Mouser Price/Stock"
F 10 "4616558P" H 5600 3450 50  0001 L CNN "RS Part Number"
F 11 "http://uk.rs-online.com/web/p/products/4616558P" H 5600 3350 50  0001 L CNN "RS Price/Stock"
	1    4650 4150
	1    0    0    -1  
$EndComp
Wire Wire Line
	5750 4150 5750 3850
$Comp
L Device:R R14
U 1 1 5D45C6F5
P 4400 4150
F 0 "R14" H 4470 4196 50  0000 L CNN
F 1 "20k" H 4470 4105 50  0000 L CNN
F 2 "Resistor_SMD:R_0603_1608Metric_Pad1.05x0.95mm_HandSolder" V 4330 4150 50  0001 C CNN
F 3 "~" H 4400 4150 50  0001 C CNN
	1    4400 4150
	0    -1   -1   0   
$EndComp
$Comp
L power:GND #PWR0123
U 1 1 5D45C6FB
P 4650 4250
F 0 "#PWR0123" H 4650 4000 50  0001 C CNN
F 1 "GND" H 4655 4077 50  0000 C CNN
F 2 "" H 4650 4250 50  0001 C CNN
F 3 "" H 4650 4250 50  0001 C CNN
	1    4650 4250
	0    1    1    0   
$EndComp
Wire Wire Line
	4650 4350 4650 4550
Wire Wire Line
	4650 4550 4950 4550
Wire Wire Line
	4550 4150 4650 4150
$Comp
L power:GND #PWR0128
U 1 1 5D47C64B
P 4250 4150
F 0 "#PWR0128" H 4250 3900 50  0001 C CNN
F 1 "GND" H 4255 3977 50  0000 C CNN
F 2 "" H 4250 4150 50  0001 C CNN
F 3 "" H 4250 4150 50  0001 C CNN
	1    4250 4150
	1    0    0    -1  
$EndComp
Wire Wire Line
	4950 3700 4950 4550
Wire Wire Line
	5150 3850 5150 3700
Wire Wire Line
	5150 3850 5750 3850
Text GLabel 3500 7200 1    50   Input ~ 0
?V_current_monitor
$Comp
L power:+3.3V #PWR0167
U 1 1 5D4B28EE
P 4650 7300
F 0 "#PWR0167" H 4650 7150 50  0001 C CNN
F 1 "+3.3V" H 4665 7473 50  0000 C CNN
F 2 "" H 4650 7300 50  0001 C CNN
F 3 "" H 4650 7300 50  0001 C CNN
	1    4650 7300
	0    1    1    0   
$EndComp
$Comp
L SamacSys_Parts:INA139NA_250 IC1
U 1 1 5D4B28FC
P 3550 7200
F 0 "IC1" H 3600 7350 50  0000 C CNN
F 1 "INA139NA_250" H 4100 7150 50  0000 C CNN
F 2 "SOT95P280X145-5N" H 4500 7300 50  0001 L CNN
F 3 "http://www.ti.com/lit/ds/symlink/ina139.pdf" H 4500 7200 50  0001 L CNN
F 4 "36V, High-Side, High-Speed, Current Output Current Sense Amplifier" H 4500 7100 50  0001 L CNN "Description"
F 5 "1.45" H 4500 7000 50  0001 L CNN "Height"
F 6 "Texas Instruments" H 4500 6900 50  0001 L CNN "Manufacturer_Name"
F 7 "INA139NA/250" H 4500 6800 50  0001 L CNN "Manufacturer_Part_Number"
F 8 "595-INA139NA/250" H 4500 6700 50  0001 L CNN "Mouser Part Number"
F 9 "https://www.mouser.com/Search/Refine.aspx?Keyword=595-INA139NA%2F250" H 4500 6600 50  0001 L CNN "Mouser Price/Stock"
F 10 "4616558P" H 4500 6500 50  0001 L CNN "RS Part Number"
F 11 "http://uk.rs-online.com/web/p/products/4616558P" H 4500 6400 50  0001 L CNN "RS Price/Stock"
	1    3550 7200
	1    0    0    -1  
$EndComp
Wire Wire Line
	4650 7200 4650 6900
$Comp
L Device:R R12
U 1 1 5D4B2903
P 3300 7200
F 0 "R12" H 3370 7246 50  0000 L CNN
F 1 "20k" H 3370 7155 50  0000 L CNN
F 2 "Resistor_SMD:R_0603_1608Metric_Pad1.05x0.95mm_HandSolder" V 3230 7200 50  0001 C CNN
F 3 "~" H 3300 7200 50  0001 C CNN
	1    3300 7200
	0    -1   -1   0   
$EndComp
$Comp
L power:GND #PWR0168
U 1 1 5D4B2909
P 3550 7300
F 0 "#PWR0168" H 3550 7050 50  0001 C CNN
F 1 "GND" H 3555 7127 50  0000 C CNN
F 2 "" H 3550 7300 50  0001 C CNN
F 3 "" H 3550 7300 50  0001 C CNN
	1    3550 7300
	0    1    1    0   
$EndComp
Wire Wire Line
	3550 7400 3550 7600
Wire Wire Line
	3450 7200 3550 7200
$Comp
L power:GND #PWR0169
U 1 1 5D4B2911
P 3150 7200
F 0 "#PWR0169" H 3150 6950 50  0001 C CNN
F 1 "GND" H 3155 7027 50  0000 C CNN
F 2 "" H 3150 7200 50  0001 C CNN
F 3 "" H 3150 7200 50  0001 C CNN
	1    3150 7200
	1    0    0    -1  
$EndComp
Wire Wire Line
	3850 6750 3850 7600
Wire Wire Line
	4050 6900 4650 6900
Wire Wire Line
	3850 7600 3550 7600
Wire Wire Line
	3000 6450 3150 6450
Wire Wire Line
	3450 6450 4050 6450
Wire Wire Line
	3150 6450 3150 6750
Wire Wire Line
	3150 6750 3850 6750
Connection ~ 3150 6450
Wire Wire Line
	4050 6600 3450 6600
Wire Wire Line
	3450 6600 3450 6450
Wire Wire Line
	4050 6600 4050 6900
Connection ~ 3450 6450
$Comp
L TP4056:TP4056 IC4
U 1 1 5D3F821E
P 5800 1200
F 0 "IC4" H 5800 1767 50  0000 C CNN
F 1 "TP4056" H 5800 1676 50  0000 C CNN
F 2 "SOP-8" H 5800 1200 50  0001 L BNN
F 3 "" H 5800 1200 50  0001 L BNN
F 4 "TP4056" H 5800 1200 50  0001 L BNN "Field4"
F 5 "Package Analog Devices" H 5800 1200 50  0001 L BNN "Field5"
F 6 "Unavailable" H 5800 1200 50  0001 L BNN "Field6"
F 7 "" H 5800 1200 50  0001 L BNN "Field7"
F 8 "NanJing Top Power ASIC Corp." H 5800 1200 50  0001 L BNN "Field8"
	1    5800 1200
	1    0    0    -1  
$EndComp
Text GLabel 1000 850  0    50   Input ~ 0
panels_raw
$Comp
L Device:R CHRG_LED_RES2
U 1 1 5D43F343
P 5100 750
F 0 "CHRG_LED_RES2" H 5170 796 50  0000 L CNN
F 1 "1k" H 5170 705 50  0000 L CNN
F 2 "Resistor_SMD:R_0603_1608Metric_Pad1.05x0.95mm_HandSolder" V 5030 750 50  0001 C CNN
F 3 "~" H 5100 750 50  0001 C CNN
	1    5100 750 
	-1   0    0    1   
$EndComp
$Comp
L Device:R CHRG_LED_RES1
U 1 1 5D45592D
P 4950 750
F 0 "CHRG_LED_RES1" H 5020 796 50  0000 L CNN
F 1 "1k" H 5020 705 50  0000 L CNN
F 2 "Resistor_SMD:R_0603_1608Metric_Pad1.05x0.95mm_HandSolder" V 4880 750 50  0001 C CNN
F 3 "~" H 4950 750 50  0001 C CNN
	1    4950 750 
	-1   0    0    1   
$EndComp
$Comp
L Device:LED D1
U 1 1 5D455933
P 4950 1050
F 0 "D1" V 4989 933 50  0000 R CNN
F 1 "GREEN" V 4898 933 50  0000 R CNN
F 2 "LED_SMD:LED_0805_2012Metric" H 4950 1050 50  0001 C CNN
F 3 "~" H 4950 1050 50  0001 C CNN
	1    4950 1050
	0    -1   -1   0   
$EndComp
$Comp
L Device:LED D2
U 1 1 5D43F349
P 5100 1050
F 0 "D2" V 5139 933 50  0000 R CNN
F 1 "RED" V 5048 933 50  0000 R CNN
F 2 "LED_SMD:LED_0805_2012Metric" H 5100 1050 50  0001 C CNN
F 3 "~" H 5100 1050 50  0001 C CNN
	1    5100 1050
	0    -1   -1   0   
$EndComp
Wire Wire Line
	4950 1200 4950 1300
Wire Wire Line
	5200 1000 5200 900 
Connection ~ 5200 900 
Wire Wire Line
	5200 550  4950 550 
Wire Wire Line
	5200 550  5200 900 
$Comp
L Device:CP C_CHRG1
U 1 1 5D51DA06
P 5350 550
F 0 "C_CHRG1" H 5468 596 50  0000 L CNN
F 1 "10uF" H 5468 505 50  0000 L CNN
F 2 "Capacitor_SMD:C_0603_1608Metric" H 5388 400 50  0001 C CNN
F 3 "~" H 5350 550 50  0001 C CNN
	1    5350 550 
	0    -1   -1   0   
$EndComp
Wire Wire Line
	6400 900  6450 900 
$Comp
L Device:R R_PROG1
U 1 1 5D52BA99
P 6400 1450
F 0 "R_PROG1" H 6470 1496 50  0000 L CNN
F 1 "1.2k" H 6470 1405 50  0000 L CNN
F 2 "Resistor_SMD:R_0603_1608Metric_Pad1.05x0.95mm_HandSolder" V 6330 1450 50  0001 C CNN
F 3 "~" H 6400 1450 50  0001 C CNN
	1    6400 1450
	1    0    0    1   
$EndComp
$Comp
L Device:CP C_CHRG2
U 1 1 5D53CBB0
P 6400 1850
F 0 "C_CHRG2" H 6518 1896 50  0000 L CNN
F 1 "100uF" H 6518 1805 50  0000 L CNN
F 2 "Capacitor_SMD:C_1206_3216Metric" H 6438 1700 50  0001 C CNN
F 3 "~" H 6400 1850 50  0001 C CNN
	1    6400 1850
	-1   0    0    -1  
$EndComp
$Comp
L Transistor_FET:DMG2301L Q_chrg1
U 1 1 5D53E5EB
P 6900 1550
F 0 "Q_chrg1" H 6750 1850 50  0000 L CNN
F 1 "DMG2301L" H 6500 1350 50  0000 L CNN
F 2 "Package_TO_SOT_SMD:SOT-23" H 7100 1475 50  0001 L CIN
F 3 "https://www.diodes.com/assets/Datasheets/DMG2301L.pdf" H 6900 1550 50  0001 L CNN
	1    6900 1550
	0    1    1    0   
$EndComp
$Comp
L Device:R R_temp1
U 1 1 5D55A654
P 4800 750
F 0 "R_temp1" H 4870 796 50  0000 L CNN
F 1 "10k" H 4870 705 50  0000 L CNN
F 2 "Resistor_SMD:R_0603_1608Metric_Pad1.05x0.95mm_HandSolder" V 4730 750 50  0001 C CNN
F 3 "~" H 4800 750 50  0001 C CNN
	1    4800 750 
	1    0    0    1   
$EndComp
$Comp
L Device:R R_temp2
U 1 1 5D55AF41
P 4800 1050
F 0 "R_temp2" H 4870 1096 50  0000 L CNN
F 1 "10k" H 4870 1005 50  0000 L CNN
F 2 "Resistor_SMD:R_0603_1608Metric_Pad1.05x0.95mm_HandSolder" V 4730 1050 50  0001 C CNN
F 3 "~" H 4800 1050 50  0001 C CNN
	1    4800 1050
	1    0    0    1   
$EndComp
$Comp
L Device:CP C_CHRG3
U 1 1 5D51E4BA
P 6600 900
F 0 "C_CHRG3" H 6718 946 50  0000 L CNN
F 1 "10uF" H 6718 855 50  0000 L CNN
F 2 "Capacitor_SMD:C_0603_1608Metric" H 6638 750 50  0001 C CNN
F 3 "~" H 6600 900 50  0001 C CNN
	1    6600 900 
	0    -1   1    0   
$EndComp
Text GLabel 6400 1200 2    50   Input ~ 0
TEMP1
Text GLabel 4800 900  0    50   Input ~ 0
TEMP1
Wire Wire Line
	4800 550  4800 600 
Wire Wire Line
	6400 1700 6400 1650
Wire Wire Line
	6400 1600 6400 1650
Connection ~ 6400 1650
Wire Wire Line
	7050 2000 7050 2050
Text GLabel 6900 1350 2    50   Input Italic 0
PWM1
Text GLabel 6400 900  1    50   Input ~ 0
BAT#1
Text GLabel 8700 5400 0    50   Input Italic 0
PWM3
Text GLabel 8700 5300 0    50   Input Italic 0
PWM2
Text GLabel 8700 5200 0    50   Input Italic 0
PWM1
Text GLabel 9900 5400 2    50   Input ~ 0
bat_voltage
Text GLabel 8700 4300 0    50   Input ~ 0
GPIO_Output6
$Comp
L power:GND #PWR0166
U 1 1 5D3E5BBC
P 9100 6400
F 0 "#PWR0166" H 9100 6150 50  0001 C CNN
F 1 "GND" H 9105 6227 50  0000 C CNN
F 2 "" H 9100 6400 50  0001 C CNN
F 3 "" H 9100 6400 50  0001 C CNN
	1    9100 6400
	1    0    0    -1  
$EndComp
$Comp
L Connector:Conn_01x04_Female J4
U 1 1 5D3BE5AB
P 10850 4150
F 0 "J4" H 10878 4126 50  0000 L CNN
F 1 "Conn_01x04_Female" H 10878 4035 50  0000 L CNN
F 2 "Connector_PinHeader_2.54mm:PinHeader_1x04_P2.54mm_Horizontal" H 10850 4150 50  0001 C CNN
F 3 "~" H 10850 4150 50  0001 C CNN
	1    10850 4150
	1    0    0    -1  
$EndComp
Text GLabel 9900 5800 2    50   Input ~ 0
CAN_RX
Text GLabel 9900 5900 2    50   Input ~ 0
CAN_TX
Text GLabel 10650 4050 0    50   Input ~ 0
SYS_JTCK-SWCLK
Text GLabel 9900 6100 2    50   Input ~ 0
SYS_JTCK-SWCLK
Text GLabel 10650 4150 0    50   Input ~ 0
SYS_JTMS-SWDIO
Text GLabel 10650 4250 0    50   Input ~ 0
CANL
Text GLabel 10650 4350 0    50   Input ~ 0
CANH
Text GLabel 8700 6200 0    50   Input ~ 0
GPIO_Output9
Text GLabel 8700 6100 0    50   Input ~ 0
GPIO_Output8
Text GLabel 8700 6000 0    50   Input ~ 0
GPIO_Output7
Text GLabel 8700 5800 0    50   Input ~ 0
GPIO_Output5
Text GLabel 8700 5700 0    50   Input ~ 0
GPIO_Output4
$Comp
L power:VDDA #PWR0157
U 1 1 5D522B7A
P 9400 3500
F 0 "#PWR0157" H 9400 3350 50  0001 C CNN
F 1 "VDDA" H 9417 3673 50  0000 C CNN
F 2 "" H 9400 3500 50  0001 C CNN
F 3 "" H 9400 3500 50  0001 C CNN
	1    9400 3500
	1    0    0    -1  
$EndComp
$Comp
L power:GND #PWR0151
U 1 1 5D473486
P 9400 6400
F 0 "#PWR0151" H 9400 6150 50  0001 C CNN
F 1 "GND" H 9405 6227 50  0000 C CNN
F 2 "" H 9400 6400 50  0001 C CNN
F 3 "" H 9400 6400 50  0001 C CNN
	1    9400 6400
	1    0    0    -1  
$EndComp
Wire Wire Line
	9250 6400 9300 6400
Connection ~ 9250 6400
Wire Wire Line
	9200 6400 9250 6400
$Comp
L power:GND #PWR0140
U 1 1 5D3A8E7F
P 9250 6400
F 0 "#PWR0140" H 9250 6150 50  0001 C CNN
F 1 "GND" H 9255 6227 50  0000 C CNN
F 2 "" H 9250 6400 50  0001 C CNN
F 3 "" H 9250 6400 50  0001 C CNN
	1    9250 6400
	1    0    0    -1  
$EndComp
Wire Wire Line
	9250 3500 9300 3500
Connection ~ 9250 3500
$Comp
L power:VCC #PWR0139
U 1 1 5D39757B
P 9250 3500
F 0 "#PWR0139" H 9250 3350 50  0001 C CNN
F 1 "VCC" H 9267 3673 50  0000 C CNN
F 2 "" H 9250 3500 50  0001 C CNN
F 3 "" H 9250 3500 50  0001 C CNN
	1    9250 3500
	1    0    0    -1  
$EndComp
Text GLabel 8700 4000 0    50   Input ~ 0
Clock_out
Text GLabel 8700 3900 0    50   Input ~ 0
Clock_in
Text GLabel 8700 5500 0    50   Input ~ 0
GPIO_Output2
Text GLabel 8700 5600 0    50   Input ~ 0
GPIO_Output3
Text GLabel 9900 5300 2    50   Input ~ 0
panels_current_monitor
Text GLabel 9900 5200 2    50   Input ~ 0
panels_voltage
Text GLabel 9900 6000 2    50   Input ~ 0
SYS_JTMS-SWDIO
Text GLabel 9900 5600 2    50   Input ~ 0
SCL
Text GLabel 9900 5700 2    50   Input ~ 0
SDA
$Comp
L MCU_ST_STM32L4:STM32L433CCTx U9
U 1 1 5D376BDC
P 9300 4900
F 0 "U9" H 9300 3311 50  0000 C CNN
F 1 "STM32L433CCTx" H 9300 3220 50  0000 C CNN
F 2 "Package_QFP:LQFP-48_7x7mm_P0.5mm" H 8800 3500 50  0001 R CNN
F 3 "http://www.st.com/st-web-ui/static/active/en/resource/technical/document/datasheet/DM00257192.pdf" H 9300 4900 50  0001 C CNN
	1    9300 4900
	1    0    0    -1  
$EndComp
Text GLabel 9900 5000 2    50   Input ~ 0
3.3V_check
Text GLabel 8700 4500 0    50   Input ~ 0
5V_switch
Text GLabel 8700 5900 0    50   Input ~ 0
?V_switch
Text GLabel 8700 4400 0    50   Input ~ 0
3.3V_switch
Wire Wire Line
	9200 3500 9250 3500
Text GLabel 9900 5100 2    50   Input ~ 0
5V_check
Text GLabel 9900 4900 2    50   Input ~ 0
?V_current_monitor
Text GLabel 9900 4800 2    50   Input ~ 0
3.3V_current_monitor
Text GLabel 9900 4700 2    50   Input ~ 0
5V_current_monitor
Connection ~ 7600 5400
Wire Wire Line
	7600 5250 7600 5400
Connection ~ 7500 5500
Wire Wire Line
	7500 5500 7500 5250
$Comp
L MCP9808T-E_MS:MCP9808T-E_MS U8
U 1 1 5D368FF8
P 7300 4450
F 0 "U8" H 7300 5017 50  0000 C CNN
F 1 "MCP9808T-E_MS" H 7300 4926 50  0000 C CNN
F 2 "SamacSys_Parts:SOP65P490X110-8N" H 7300 4450 50  0001 L BNN
F 3 "" H 7300 4450 50  0001 L BNN
F 4 "None" H 7300 4450 50  0001 L BNN "Field4"
F 5 "Microchip" H 7300 4450 50  0001 L BNN "Field5"
F 6 "MSOP-8 Microchip" H 7300 4450 50  0001 L BNN "Field6"
F 7 "Unavailable" H 7300 4450 50  0001 L BNN "Field7"
F 8 "MCP9808 Series 3.6 V Memory Module Digital Temperature Sensor SMT - MSOP-8" H 7300 4450 50  0001 L BNN "Field8"
	1    7300 4450
	0    -1   -1   0   
$EndComp
$Comp
L power:+3.3V #PWR0109
U 1 1 5D6CB9DE
P 7000 3650
F 0 "#PWR0109" H 7000 3500 50  0001 C CNN
F 1 "+3.3V" H 7015 3823 50  0000 C CNN
F 2 "" H 7000 3650 50  0001 C CNN
F 3 "" H 7000 3650 50  0001 C CNN
	1    7000 3650
	0    -1   -1   0   
$EndComp
$Comp
L power:GND #PWR0130
U 1 1 5D7E1801
P 7600 3650
F 0 "#PWR0130" H 7600 3400 50  0001 C CNN
F 1 "GND" H 7605 3477 50  0000 C CNN
F 2 "" H 7600 3650 50  0001 C CNN
F 3 "" H 7600 3650 50  0001 C CNN
	1    7600 3650
	1    0    0    1   
$EndComp
$Comp
L power:GND #PWR0132
U 1 1 5D7FF6F9
P 7100 5250
F 0 "#PWR0132" H 7100 5000 50  0001 C CNN
F 1 "GND" H 7105 5077 50  0000 C CNN
F 2 "" H 7100 5250 50  0001 C CNN
F 3 "" H 7100 5250 50  0001 C CNN
	1    7100 5250
	-1   0    0    -1  
$EndComp
$Comp
L power:GND #PWR0133
U 1 1 5D80E80D
P 7200 5250
F 0 "#PWR0133" H 7200 5000 50  0001 C CNN
F 1 "GND" H 7205 5077 50  0000 C CNN
F 2 "" H 7200 5250 50  0001 C CNN
F 3 "" H 7200 5250 50  0001 C CNN
	1    7200 5250
	-1   0    0    -1  
$EndComp
$Comp
L power:GND #PWR0134
U 1 1 5D81D807
P 7300 5250
F 0 "#PWR0134" H 7300 5000 50  0001 C CNN
F 1 "GND" H 7305 5077 50  0000 C CNN
F 2 "" H 7300 5250 50  0001 C CNN
F 3 "" H 7300 5250 50  0001 C CNN
	1    7300 5250
	-1   0    0    -1  
$EndComp
$Comp
L Device:R R10
U 1 1 5D866816
P 7300 5750
F 0 "R10" H 7370 5796 50  0000 L CNN
F 1 "10k" H 7370 5705 50  0000 L CNN
F 2 "Resistor_SMD:R_0603_1608Metric_Pad1.05x0.95mm_HandSolder" V 7230 5750 50  0001 C CNN
F 3 "~" H 7300 5750 50  0001 C CNN
	1    7300 5750
	0    -1   -1   0   
$EndComp
$Comp
L Device:R R9
U 1 1 5D867258
P 7300 6000
F 0 "R9" H 7370 6046 50  0000 L CNN
F 1 "10k" H 7370 5955 50  0000 L CNN
F 2 "Resistor_SMD:R_0603_1608Metric_Pad1.05x0.95mm_HandSolder" V 7230 6000 50  0001 C CNN
F 3 "~" H 7300 6000 50  0001 C CNN
	1    7300 6000
	0    -1   -1   0   
$EndComp
$Comp
L power:+3.3V #PWR0135
U 1 1 5D86813F
P 7150 6000
F 0 "#PWR0135" H 7150 5850 50  0001 C CNN
F 1 "+3.3V" H 7165 6173 50  0000 C CNN
F 2 "" H 7150 6000 50  0001 C CNN
F 3 "" H 7150 6000 50  0001 C CNN
	1    7150 6000
	0    -1   -1   0   
$EndComp
$Comp
L power:+3.3V #PWR0136
U 1 1 5D868852
P 7150 5750
F 0 "#PWR0136" H 7150 5600 50  0001 C CNN
F 1 "+3.3V" H 7165 5923 50  0000 C CNN
F 2 "" H 7150 5750 50  0001 C CNN
F 3 "" H 7150 5750 50  0001 C CNN
	1    7150 5750
	0    -1   -1   0   
$EndComp
Text GLabel 7250 5500 0    50   Input ~ 0
SCL
Text GLabel 7250 5400 0    50   Input ~ 0
SDA
Wire Wire Line
	7500 5750 7450 5750
Wire Wire Line
	7600 6000 7450 6000
Wire Wire Line
	7250 5500 7500 5500
Wire Wire Line
	7500 5500 7500 5750
Wire Wire Line
	7250 5400 7600 5400
Wire Wire Line
	7600 5400 7600 6000
Wire Wire Line
	5100 1200 5200 1200
Wire Wire Line
	4950 1300 5200 1300
Wire Wire Line
	4950 600  5100 600 
Wire Wire Line
	4950 600  4950 550 
Connection ~ 4950 600 
Connection ~ 4950 550 
Wire Wire Line
	4800 550  4950 550 
Connection ~ 5200 550 
$Comp
L Device:R R_STM1
U 1 1 5D5ADAD5
P 6550 1650
F 0 "R_STM1" H 6620 1696 50  0000 L CNN
F 1 "10k" H 6620 1605 50  0000 L CNN
F 2 "Resistor_SMD:R_0603_1608Metric_Pad1.05x0.95mm_HandSolder" V 6480 1650 50  0001 C CNN
F 3 "~" H 6550 1650 50  0001 C CNN
	1    6550 1650
	0    -1   1    0   
$EndComp
$Comp
L TP4056:TP4056 IC5
U 1 1 5D833CEE
P 8350 1200
F 0 "IC5" H 8350 1767 50  0000 C CNN
F 1 "TP4056" H 8350 1676 50  0000 C CNN
F 2 "SOP-8" H 8350 1200 50  0001 L BNN
F 3 "" H 8350 1200 50  0001 L BNN
F 4 "TP4056" H 8350 1200 50  0001 L BNN "Field4"
F 5 "Package Analog Devices" H 8350 1200 50  0001 L BNN "Field5"
F 6 "Unavailable" H 8350 1200 50  0001 L BNN "Field6"
F 7 "" H 8350 1200 50  0001 L BNN "Field7"
F 8 "NanJing Top Power ASIC Corp." H 8350 1200 50  0001 L BNN "Field8"
	1    8350 1200
	1    0    0    -1  
$EndComp
$Comp
L Device:R CHRG_LED_RES4
U 1 1 5D833CF4
P 7650 750
F 0 "CHRG_LED_RES4" H 7720 796 50  0000 L CNN
F 1 "1k" H 7720 705 50  0000 L CNN
F 2 "Resistor_SMD:R_0603_1608Metric_Pad1.05x0.95mm_HandSolder" V 7580 750 50  0001 C CNN
F 3 "~" H 7650 750 50  0001 C CNN
	1    7650 750 
	-1   0    0    1   
$EndComp
$Comp
L Device:R CHRG_LED_RES3
U 1 1 5D833CFA
P 7500 750
F 0 "CHRG_LED_RES3" H 7570 796 50  0000 L CNN
F 1 "1k" H 7570 705 50  0000 L CNN
F 2 "Resistor_SMD:R_0603_1608Metric_Pad1.05x0.95mm_HandSolder" V 7430 750 50  0001 C CNN
F 3 "~" H 7500 750 50  0001 C CNN
	1    7500 750 
	-1   0    0    1   
$EndComp
$Comp
L Device:LED D8
U 1 1 5D833D00
P 7500 1050
F 0 "D8" V 7539 933 50  0000 R CNN
F 1 "GREEN" V 7448 933 50  0000 R CNN
F 2 "LED_SMD:LED_0805_2012Metric" H 7500 1050 50  0001 C CNN
F 3 "~" H 7500 1050 50  0001 C CNN
	1    7500 1050
	0    -1   -1   0   
$EndComp
$Comp
L Device:LED D9
U 1 1 5D833D06
P 7650 1050
F 0 "D9" V 7689 933 50  0000 R CNN
F 1 "RED" V 7598 933 50  0000 R CNN
F 2 "LED_SMD:LED_0805_2012Metric" H 7650 1050 50  0001 C CNN
F 3 "~" H 7650 1050 50  0001 C CNN
	1    7650 1050
	0    -1   -1   0   
$EndComp
Wire Wire Line
	7500 1200 7500 1300
Wire Wire Line
	7750 1000 7750 900 
Connection ~ 7750 900 
Wire Wire Line
	7750 550  7500 550 
Wire Wire Line
	7750 550  7750 900 
$Comp
L Device:CP C_CHRG4
U 1 1 5D833D11
P 7900 550
F 0 "C_CHRG4" H 8018 596 50  0000 L CNN
F 1 "10uF" H 8018 505 50  0000 L CNN
F 2 "Capacitor_SMD:C_0603_1608Metric" H 7938 400 50  0001 C CNN
F 3 "~" H 7900 550 50  0001 C CNN
	1    7900 550 
	0    -1   -1   0   
$EndComp
Wire Wire Line
	8950 900  9000 900 
$Comp
L Device:R R_PROG2
U 1 1 5D833D18
P 8950 1450
F 0 "R_PROG2" H 9020 1496 50  0000 L CNN
F 1 "1.2k" H 9020 1405 50  0000 L CNN
F 2 "Resistor_SMD:R_0603_1608Metric_Pad1.05x0.95mm_HandSolder" V 8880 1450 50  0001 C CNN
F 3 "~" H 8950 1450 50  0001 C CNN
	1    8950 1450
	1    0    0    1   
$EndComp
$Comp
L Device:CP C_CHRG5
U 1 1 5D833D1E
P 8950 1850
F 0 "C_CHRG5" H 9068 1896 50  0000 L CNN
F 1 "100uF" H 9068 1805 50  0000 L CNN
F 2 "Capacitor_SMD:C_1206_3216Metric" H 8988 1700 50  0001 C CNN
F 3 "~" H 8950 1850 50  0001 C CNN
	1    8950 1850
	-1   0    0    -1  
$EndComp
$Comp
L Transistor_FET:DMG2301L Q_chrg2
U 1 1 5D833D2A
P 9450 1550
F 0 "Q_chrg2" H 9300 1850 50  0000 L CNN
F 1 "DMG2301L" H 9050 1350 50  0000 L CNN
F 2 "Package_TO_SOT_SMD:SOT-23" H 9650 1475 50  0001 L CIN
F 3 "https://www.diodes.com/assets/Datasheets/DMG2301L.pdf" H 9450 1550 50  0001 L CNN
	1    9450 1550
	0    1    1    0   
$EndComp
$Comp
L Device:R R_temp3
U 1 1 5D833D3C
P 7350 750
F 0 "R_temp3" H 7420 796 50  0000 L CNN
F 1 "10k" H 7420 705 50  0000 L CNN
F 2 "Resistor_SMD:R_0603_1608Metric_Pad1.05x0.95mm_HandSolder" V 7280 750 50  0001 C CNN
F 3 "~" H 7350 750 50  0001 C CNN
	1    7350 750 
	1    0    0    1   
$EndComp
$Comp
L Device:R R_temp4
U 1 1 5D833D42
P 7350 1050
F 0 "R_temp4" H 7420 1096 50  0000 L CNN
F 1 "10k" H 7420 1005 50  0000 L CNN
F 2 "Resistor_SMD:R_0603_1608Metric_Pad1.05x0.95mm_HandSolder" V 7280 1050 50  0001 C CNN
F 3 "~" H 7350 1050 50  0001 C CNN
	1    7350 1050
	1    0    0    1   
$EndComp
$Comp
L Device:CP C_CHRG6
U 1 1 5D833D48
P 9150 900
F 0 "C_CHRG6" H 9268 946 50  0000 L CNN
F 1 "10uF" H 9268 855 50  0000 L CNN
F 2 "Capacitor_SMD:C_0603_1608Metric" H 9188 750 50  0001 C CNN
F 3 "~" H 9150 900 50  0001 C CNN
	1    9150 900 
	0    -1   1    0   
$EndComp
Text GLabel 8950 1200 2    50   Input ~ 0
TEMP2
Text GLabel 7350 900  0    50   Input ~ 0
TEMP2
Wire Wire Line
	7350 550  7350 600 
Wire Wire Line
	8950 1700 8950 1650
Wire Wire Line
	8950 1600 8950 1650
Connection ~ 8950 1650
Text GLabel 9450 1350 2    50   Input Italic 0
PWM2
Text GLabel 8950 900  1    50   Input ~ 0
BAT#2
Wire Wire Line
	7650 1200 7750 1200
Wire Wire Line
	7500 1300 7750 1300
Wire Wire Line
	7500 600  7650 600 
Wire Wire Line
	7500 600  7500 550 
Connection ~ 7500 600 
Connection ~ 7500 550 
Wire Wire Line
	7350 550  7500 550 
Connection ~ 7750 550 
$Comp
L Device:R R_STM2
U 1 1 5D833D6A
P 9100 1650
F 0 "R_STM2" H 9170 1696 50  0000 L CNN
F 1 "10k" H 9170 1605 50  0000 L CNN
F 2 "Resistor_SMD:R_0603_1608Metric_Pad1.05x0.95mm_HandSolder" V 9030 1650 50  0001 C CNN
F 3 "~" H 9100 1650 50  0001 C CNN
	1    9100 1650
	0    -1   1    0   
$EndComp
$Comp
L TP4056:TP4056 IC6
U 1 1 5D87018A
P 10400 1900
F 0 "IC6" H 10400 2467 50  0000 C CNN
F 1 "TP4056" H 10400 2376 50  0000 C CNN
F 2 "SOP-8" H 10400 1900 50  0001 L BNN
F 3 "" H 10400 1900 50  0001 L BNN
F 4 "TP4056" H 10400 1900 50  0001 L BNN "Field4"
F 5 "Package Analog Devices" H 10400 1900 50  0001 L BNN "Field5"
F 6 "Unavailable" H 10400 1900 50  0001 L BNN "Field6"
F 7 "" H 10400 1900 50  0001 L BNN "Field7"
F 8 "NanJing Top Power ASIC Corp." H 10400 1900 50  0001 L BNN "Field8"
	1    10400 1900
	0    1    1    0   
$EndComp
$Comp
L Device:R CHRG_LED_RES6
U 1 1 5D870190
P 10850 1200
F 0 "CHRG_LED_RES6" H 10920 1246 50  0000 L CNN
F 1 "1k" H 10920 1155 50  0000 L CNN
F 2 "Resistor_SMD:R_0603_1608Metric_Pad1.05x0.95mm_HandSolder" V 10780 1200 50  0001 C CNN
F 3 "~" H 10850 1200 50  0001 C CNN
	1    10850 1200
	0    -1   -1   0   
$EndComp
$Comp
L Device:R CHRG_LED_RES5
U 1 1 5D870196
P 10850 1050
F 0 "CHRG_LED_RES5" H 10920 1096 50  0000 L CNN
F 1 "1k" H 10920 1005 50  0000 L CNN
F 2 "Resistor_SMD:R_0603_1608Metric_Pad1.05x0.95mm_HandSolder" V 10780 1050 50  0001 C CNN
F 3 "~" H 10850 1050 50  0001 C CNN
	1    10850 1050
	0    -1   -1   0   
$EndComp
$Comp
L Device:LED D10
U 1 1 5D87019C
P 10550 1050
F 0 "D10" V 10589 933 50  0000 R CNN
F 1 "GREEN" V 10498 933 50  0000 R CNN
F 2 "LED_SMD:LED_0805_2012Metric" H 10550 1050 50  0001 C CNN
F 3 "~" H 10550 1050 50  0001 C CNN
	1    10550 1050
	1    0    0    -1  
$EndComp
$Comp
L Device:LED D11
U 1 1 5D8701A2
P 10550 1200
F 0 "D11" V 10589 1083 50  0000 R CNN
F 1 "RED" V 10498 1083 50  0000 R CNN
F 2 "LED_SMD:LED_0805_2012Metric" H 10550 1200 50  0001 C CNN
F 3 "~" H 10550 1200 50  0001 C CNN
	1    10550 1200
	1    0    0    -1  
$EndComp
Wire Wire Line
	10400 1050 10300 1050
Wire Wire Line
	10600 1300 10700 1300
Connection ~ 10700 1300
Wire Wire Line
	11050 1300 11050 1050
Wire Wire Line
	11050 1300 10700 1300
$Comp
L Device:CP C_CHRG9
U 1 1 5D8701AD
P 11050 1450
F 0 "C_CHRG9" H 11168 1496 50  0000 L CNN
F 1 "10uF" H 11168 1405 50  0000 L CNN
F 2 "Capacitor_SMD:C_0603_1608Metric" H 11088 1300 50  0001 C CNN
F 3 "~" H 11050 1450 50  0001 C CNN
	1    11050 1450
	1    0    0    -1  
$EndComp
Wire Wire Line
	10700 2500 10700 2550
$Comp
L Device:R R_PROG3
U 1 1 5D8701B4
P 10150 2500
F 0 "R_PROG3" H 10220 2546 50  0000 L CNN
F 1 "1.2k" H 10220 2455 50  0000 L CNN
F 2 "Resistor_SMD:R_0603_1608Metric_Pad1.05x0.95mm_HandSolder" V 10080 2500 50  0001 C CNN
F 3 "~" H 10150 2500 50  0001 C CNN
	1    10150 2500
	0    -1   1    0   
$EndComp
$Comp
L Device:CP C_CHRG7
U 1 1 5D8701BA
P 9750 2500
F 0 "C_CHRG7" H 9868 2546 50  0000 L CNN
F 1 "100uF" H 9868 2455 50  0000 L CNN
F 2 "Capacitor_SMD:C_1206_3216Metric" H 9788 2350 50  0001 C CNN
F 3 "~" H 9750 2500 50  0001 C CNN
	1    9750 2500
	0    1    -1   0   
$EndComp
$Comp
L Transistor_FET:DMG2301L Q_chrg3
U 1 1 5D8701C6
P 10050 3000
F 0 "Q_chrg3" H 9900 3300 50  0000 L CNN
F 1 "DMG2301L" H 9650 2800 50  0000 L CNN
F 2 "Package_TO_SOT_SMD:SOT-23" H 10250 2925 50  0001 L CIN
F 3 "https://www.diodes.com/assets/Datasheets/DMG2301L.pdf" H 10050 3000 50  0001 L CNN
	1    10050 3000
	-1   0    0    1   
$EndComp
$Comp
L Device:R R_temp6
U 1 1 5D8701D8
P 10850 900
F 0 "R_temp6" H 10920 946 50  0000 L CNN
F 1 "10k" H 10920 855 50  0000 L CNN
F 2 "Resistor_SMD:R_0603_1608Metric_Pad1.05x0.95mm_HandSolder" V 10780 900 50  0001 C CNN
F 3 "~" H 10850 900 50  0001 C CNN
	1    10850 900 
	0    -1   1    0   
$EndComp
$Comp
L Device:R R_temp5
U 1 1 5D8701DE
P 10550 900
F 0 "R_temp5" H 10620 946 50  0000 L CNN
F 1 "10k" H 10620 855 50  0000 L CNN
F 2 "Resistor_SMD:R_0603_1608Metric_Pad1.05x0.95mm_HandSolder" V 10480 900 50  0001 C CNN
F 3 "~" H 10550 900 50  0001 C CNN
	1    10550 900 
	0    -1   1    0   
$EndComp
$Comp
L Device:CP C_CHRG8
U 1 1 5D8701E4
P 10700 2700
F 0 "C_CHRG8" H 10818 2746 50  0000 L CNN
F 1 "10uF" H 10818 2655 50  0000 L CNN
F 2 "Capacitor_SMD:C_0603_1608Metric" H 10738 2550 50  0001 C CNN
F 3 "~" H 10700 2700 50  0001 C CNN
	1    10700 2700
	-1   0    0    -1  
$EndComp
Text GLabel 10400 2500 3    50   Input ~ 0
TEMP3
Text GLabel 10700 900  1    50   Input ~ 0
TEMP3
Wire Wire Line
	11050 900  11000 900 
Wire Wire Line
	9900 2500 9950 2500
Wire Wire Line
	10000 2500 9950 2500
Connection ~ 9950 2500
Text GLabel 10250 3000 3    50   Input Italic 0
PWM3
Text GLabel 10700 2500 2    50   Input ~ 0
BAT#3
Wire Wire Line
	10400 1200 10400 1300
Wire Wire Line
	10300 1050 10300 1300
Wire Wire Line
	11000 1050 11000 1200
Wire Wire Line
	11000 1050 11050 1050
Connection ~ 11000 1050
Connection ~ 11050 1050
Wire Wire Line
	11050 900  11050 1050
Connection ~ 11050 1300
$Comp
L Device:R R_STM3
U 1 1 5D870206
P 9950 2650
F 0 "R_STM3" H 10020 2696 50  0000 L CNN
F 1 "10k" H 10020 2605 50  0000 L CNN
F 2 "Resistor_SMD:R_0603_1608Metric_Pad1.05x0.95mm_HandSolder" V 9880 2650 50  0001 C CNN
F 3 "~" H 9950 2650 50  0001 C CNN
	1    9950 2650
	-1   0    0    -1  
$EndComp
$Comp
L Device:R small_chrg1
U 1 1 5D8BB2BA
P 1200 750
F 0 "small_chrg1" H 1270 796 50  0000 L CNN
F 1 "0.4" H 1270 705 50  0000 L CNN
F 2 "Resistor_SMD:R_0603_1608Metric_Pad1.05x0.95mm_HandSolder" V 1130 750 50  0001 C CNN
F 3 "~" H 1200 750 50  0001 C CNN
	1    1200 750 
	0    -1   -1   0   
$EndComp
$Comp
L Device:R small_chrg2
U 1 1 5D8BB93D
P 1200 850
F 0 "small_chrg2" H 1270 896 50  0000 L CNN
F 1 "0.4" H 1270 805 50  0000 L CNN
F 2 "Resistor_SMD:R_0603_1608Metric_Pad1.05x0.95mm_HandSolder" V 1130 850 50  0001 C CNN
F 3 "~" H 1200 850 50  0001 C CNN
	1    1200 850 
	0    -1   -1   0   
$EndComp
$Comp
L Device:R small_chrg3
U 1 1 5D8BBB0C
P 1200 950
F 0 "small_chrg3" H 1270 996 50  0000 L CNN
F 1 "0.4" H 1270 905 50  0000 L CNN
F 2 "Resistor_SMD:R_0603_1608Metric_Pad1.05x0.95mm_HandSolder" V 1130 950 50  0001 C CNN
F 3 "~" H 1200 950 50  0001 C CNN
	1    1200 950 
	0    -1   -1   0   
$EndComp
Wire Wire Line
	1050 750  1050 850 
Wire Wire Line
	1050 850  1050 950 
Connection ~ 1050 850 
Wire Wire Line
	1000 850  1050 850 
Text GLabel 1350 750  2    50   Input ~ 0
panels_to_charger#1
Text GLabel 1350 850  2    50   Input ~ 0
panels_to_charger#2
Text GLabel 1350 950  2    50   Input ~ 0
panels_to_charger#3
Text GLabel 4800 550  0    50   Input ~ 0
panels_to_charger#1
Text GLabel 7350 550  0    50   Input ~ 0
panels_to_charger#2
Wire Wire Line
	11050 600  11050 900 
Connection ~ 11050 900 
$Comp
L power:GND #PWR0170
U 1 1 5D56AAEE
P 4800 1200
F 0 "#PWR0170" H 4800 950 50  0001 C CNN
F 1 "GND" H 4805 1027 50  0000 C CNN
F 2 "" H 4800 1200 50  0001 C CNN
F 3 "" H 4800 1200 50  0001 C CNN
	1    4800 1200
	-1   0    0    -1  
$EndComp
$Comp
L power:GND #PWR0146
U 1 1 5D55A26C
P 5500 550
F 0 "#PWR0146" H 5500 300 50  0001 C CNN
F 1 "GND" H 5505 377 50  0000 C CNN
F 2 "" H 5500 550 50  0001 C CNN
F 3 "" H 5500 550 50  0001 C CNN
	1    5500 550 
	0    -1   -1   0   
$EndComp
$Comp
L power:GND #PWR0145
U 1 1 5D5401D5
P 6750 900
F 0 "#PWR0145" H 6750 650 50  0001 C CNN
F 1 "GND" H 6755 727 50  0000 C CNN
F 2 "" H 6750 900 50  0001 C CNN
F 3 "" H 6750 900 50  0001 C CNN
	1    6750 900 
	0    -1   -1   0   
$EndComp
$Comp
L power:GND #PWR0141
U 1 1 5D3D0BC1
P 5800 1800
F 0 "#PWR0141" H 5800 1550 50  0001 C CNN
F 1 "GND" H 5805 1627 50  0000 C CNN
F 2 "" H 5800 1800 50  0001 C CNN
F 3 "" H 5800 1800 50  0001 C CNN
	1    5800 1800
	1    0    0    -1  
$EndComp
$Comp
L power:GND #PWR0144
U 1 1 5D53D53F
P 6400 2000
F 0 "#PWR0144" H 6400 1750 50  0001 C CNN
F 1 "GND" H 6405 1827 50  0000 C CNN
F 2 "" H 6400 2000 50  0001 C CNN
F 3 "" H 6400 2000 50  0001 C CNN
	1    6400 2000
	1    0    0    -1  
$EndComp
$Comp
L power:GND #PWR0171
U 1 1 5D5E2AB4
P 7100 1650
F 0 "#PWR0171" H 7100 1400 50  0001 C CNN
F 1 "GND" H 7105 1477 50  0000 C CNN
F 2 "" H 7100 1650 50  0001 C CNN
F 3 "" H 7100 1650 50  0001 C CNN
	1    7100 1650
	0    -1   -1   0   
$EndComp
$Comp
L power:GND #PWR0183
U 1 1 5D8701CC
P 10700 2850
F 0 "#PWR0183" H 10700 2600 50  0001 C CNN
F 1 "GND" H 10705 2677 50  0000 C CNN
F 2 "" H 10700 2850 50  0001 C CNN
F 3 "" H 10700 2850 50  0001 C CNN
	1    10700 2850
	1    0    0    -1  
$EndComp
$Comp
L power:GND #PWR0186
U 1 1 5D8701F6
P 9950 3200
F 0 "#PWR0186" H 9950 2950 50  0001 C CNN
F 1 "GND" H 9955 3027 50  0000 C CNN
F 2 "" H 9950 3200 50  0001 C CNN
F 3 "" H 9950 3200 50  0001 C CNN
	1    9950 3200
	1    0    0    -1  
$EndComp
$Comp
L power:GND #PWR0182
U 1 1 5D8701C0
P 9600 2500
F 0 "#PWR0182" H 9600 2250 50  0001 C CNN
F 1 "GND" H 9605 2327 50  0000 C CNN
F 2 "" H 9600 2500 50  0001 C CNN
F 3 "" H 9600 2500 50  0001 C CNN
	1    9600 2500
	0    1    1    0   
$EndComp
$Comp
L power:GND #PWR0181
U 1 1 5D87017F
P 9800 1900
F 0 "#PWR0181" H 9800 1650 50  0001 C CNN
F 1 "GND" H 9805 1727 50  0000 C CNN
F 2 "" H 9800 1900 50  0001 C CNN
F 3 "" H 9800 1900 50  0001 C CNN
	1    9800 1900
	0    1    1    0   
$EndComp
$Comp
L power:GND #PWR0185
U 1 1 5D8701EC
P 10400 900
F 0 "#PWR0185" H 10400 650 50  0001 C CNN
F 1 "GND" H 10405 727 50  0000 C CNN
F 2 "" H 10400 900 50  0001 C CNN
F 3 "" H 10400 900 50  0001 C CNN
	1    10400 900 
	0    1    -1   0   
$EndComp
$Comp
L power:GND #PWR0184
U 1 1 5D8701D2
P 11050 1600
F 0 "#PWR0184" H 11050 1350 50  0001 C CNN
F 1 "GND" H 11055 1427 50  0000 C CNN
F 2 "" H 11050 1600 50  0001 C CNN
F 3 "" H 11050 1600 50  0001 C CNN
	1    11050 1600
	1    0    0    -1  
$EndComp
$Comp
L power:GND #PWR0178
U 1 1 5D833D36
P 8050 550
F 0 "#PWR0178" H 8050 300 50  0001 C CNN
F 1 "GND" H 8055 377 50  0000 C CNN
F 2 "" H 8050 550 50  0001 C CNN
F 3 "" H 8050 550 50  0001 C CNN
	1    8050 550 
	0    -1   -1   0   
$EndComp
$Comp
L power:GND #PWR0179
U 1 1 5D833D50
P 7350 1200
F 0 "#PWR0179" H 7350 950 50  0001 C CNN
F 1 "GND" H 7355 1027 50  0000 C CNN
F 2 "" H 7350 1200 50  0001 C CNN
F 3 "" H 7350 1200 50  0001 C CNN
	1    7350 1200
	-1   0    0    -1  
$EndComp
$Comp
L power:GND #PWR0180
U 1 1 5D833D5A
P 9650 1650
F 0 "#PWR0180" H 9650 1400 50  0001 C CNN
F 1 "GND" H 9655 1477 50  0000 C CNN
F 2 "" H 9650 1650 50  0001 C CNN
F 3 "" H 9650 1650 50  0001 C CNN
	1    9650 1650
	0    -1   -1   0   
$EndComp
$Comp
L power:GND #PWR0177
U 1 1 5D833D30
P 9300 900
F 0 "#PWR0177" H 9300 650 50  0001 C CNN
F 1 "GND" H 9305 727 50  0000 C CNN
F 2 "" H 9300 900 50  0001 C CNN
F 3 "" H 9300 900 50  0001 C CNN
	1    9300 900 
	0    -1   -1   0   
$EndComp
$Comp
L power:GND #PWR0175
U 1 1 5D833CE3
P 8350 1800
F 0 "#PWR0175" H 8350 1550 50  0001 C CNN
F 1 "GND" H 8355 1627 50  0000 C CNN
F 2 "" H 8350 1800 50  0001 C CNN
F 3 "" H 8350 1800 50  0001 C CNN
	1    8350 1800
	1    0    0    -1  
$EndComp
$Comp
L power:GND #PWR0176
U 1 1 5D833D24
P 8950 2000
F 0 "#PWR0176" H 8950 1750 50  0001 C CNN
F 1 "GND" H 8955 1827 50  0000 C CNN
F 2 "" H 8950 2000 50  0001 C CNN
F 3 "" H 8950 2000 50  0001 C CNN
	1    8950 2000
	1    0    0    -1  
$EndComp
Text GLabel 8500 2850 0    50   Input ~ 0
BAT#3
Text GLabel 8500 2450 0    50   Input ~ 0
BAT#1
$Comp
L Connector:Conn_01x06_Female Batteries_chrg1
U 1 1 5D64FD3F
P 8700 2650
F 0 "Batteries_chrg1" H 8728 2626 50  0000 L CNN
F 1 "Conn_01x06_Female" H 8728 2535 50  0000 L CNN
F 2 "Connector_PinHeader_2.54mm:PinHeader_1x06_P2.54mm_Vertical" H 8700 2650 50  0001 C CNN
F 3 "~" H 8700 2650 50  0001 C CNN
	1    8700 2650
	1    0    0    -1  
$EndComp
Text GLabel 8500 2450 1    50   Input ~ 0
bat_voltage
Wire Wire Line
	8500 2550 8500 2650
Text GLabel 8500 2650 0    50   Input ~ 0
BAT#2
Wire Wire Line
	8500 2750 8500 2850
$Comp
L power:GND #PWR0147
U 1 1 5D45CC3B
P 8500 2950
F 0 "#PWR0147" H 8500 2700 50  0001 C CNN
F 1 "GND" H 8505 2777 50  0000 C CNN
F 2 "" H 8500 2950 50  0001 C CNN
F 3 "" H 8500 2950 50  0001 C CNN
	1    8500 2950
	1    0    0    -1  
$EndComp
Text GLabel 11050 600  0    50   Input ~ 0
panels_to_charger#3
$Comp
L power:GND #PWR0131
U 1 1 5D7F06DC
P 7300 3650
F 0 "#PWR0131" H 7300 3400 50  0001 C CNN
F 1 "GND" H 7305 3477 50  0000 C CNN
F 2 "" H 7300 3650 50  0001 C CNN
F 3 "" H 7300 3650 50  0001 C CNN
	1    7300 3650
	1    0    0    1   
$EndComp
Wire Wire Line
	800  1750 1100 1750
$Comp
L SamacSys_Parts:INA139NA_250 IC7
U 1 1 5D4BA969
P 950 2750
F 0 "IC7" H 1000 2900 50  0000 C CNN
F 1 "INA139NA_250" H 1500 2700 50  0000 C CNN
F 2 "SOT95P280X145-5N" H 1900 2850 50  0001 L CNN
F 3 "http://www.ti.com/lit/ds/symlink/ina139.pdf" H 1900 2750 50  0001 L CNN
F 4 "36V, High-Side, High-Speed, Current Output Current Sense Amplifier" H 1900 2650 50  0001 L CNN "Description"
F 5 "1.45" H 1900 2550 50  0001 L CNN "Height"
F 6 "Texas Instruments" H 1900 2450 50  0001 L CNN "Manufacturer_Name"
F 7 "INA139NA/250" H 1900 2350 50  0001 L CNN "Manufacturer_Part_Number"
F 8 "595-INA139NA/250" H 1900 2250 50  0001 L CNN "Mouser Part Number"
F 9 "https://www.mouser.com/Search/Refine.aspx?Keyword=595-INA139NA%2F250" H 1900 2150 50  0001 L CNN "Mouser Price/Stock"
F 10 "4616558P" H 1900 2050 50  0001 L CNN "RS Part Number"
F 11 "http://uk.rs-online.com/web/p/products/4616558P" H 1900 1950 50  0001 L CNN "RS Price/Stock"
	1    950  2750
	1    0    0    -1  
$EndComp
$Comp
L Device:R R15
U 1 1 5D4BA96F
P 700 2750
F 0 "R15" H 770 2796 50  0000 L CNN
F 1 "20k" H 770 2705 50  0000 L CNN
F 2 "Resistor_SMD:R_0603_1608Metric_Pad1.05x0.95mm_HandSolder" V 630 2750 50  0001 C CNN
F 3 "~" H 700 2750 50  0001 C CNN
	1    700  2750
	0    -1   -1   0   
$EndComp
$Comp
L power:GND #PWR0172
U 1 1 5D4BA975
P 950 2850
F 0 "#PWR0172" H 950 2600 50  0001 C CNN
F 1 "GND" H 955 2677 50  0000 C CNN
F 2 "" H 950 2850 50  0001 C CNN
F 3 "" H 950 2850 50  0001 C CNN
	1    950  2850
	0    1    1    0   
$EndComp
Wire Wire Line
	950  2950 950  3150
Wire Wire Line
	950  3150 1350 3150
Wire Wire Line
	850  2750 950  2750
Wire Wire Line
	1400 1750 2600 1750
Wire Wire Line
	1350 2000 1100 2000
Wire Wire Line
	1100 2000 1100 1750
Wire Wire Line
	1350 2000 1350 3150
Connection ~ 1100 1750
Wire Wire Line
	1400 1750 1400 2600
Wire Wire Line
	1400 2600 2050 2600
Wire Wire Line
	2050 2600 2050 2750
Connection ~ 1400 1750
Wire Wire Line
	5200 7150 5200 7200
Connection ~ 5200 7150
Wire Wire Line
	5200 7100 5200 7150
$Comp
L Device:R R16
U 1 1 5D8267E8
P 5200 6950
F 0 "R16" H 5270 6996 50  0000 L CNN
F 1 "73.2k" H 5270 6905 50  0000 L CNN
F 2 "Resistor_SMD:R_0603_1608Metric_Pad1.05x0.95mm_HandSolder" V 5130 6950 50  0001 C CNN
F 3 "~" H 5200 6950 50  0001 C CNN
	1    5200 6950
	1    0    0    -1  
$EndComp
$Comp
L Device:R R17
U 1 1 5D8267EE
P 5200 7350
F 0 "R17" H 5270 7396 50  0000 L CNN
F 1 "22.1k" H 5270 7305 50  0000 L CNN
F 2 "Resistor_SMD:R_0603_1608Metric_Pad1.05x0.95mm_HandSolder" V 5130 7350 50  0001 C CNN
F 3 "~" H 5200 7350 50  0001 C CNN
	1    5200 7350
	1    0    0    -1  
$EndComp
$Comp
L power:GND #PWR0159
U 1 1 5D8267F4
P 5200 7500
F 0 "#PWR0159" H 5200 7250 50  0001 C CNN
F 1 "GND" H 5205 7327 50  0000 C CNN
F 2 "" H 5200 7500 50  0001 C CNN
F 3 "" H 5200 7500 50  0001 C CNN
	1    5200 7500
	1    0    0    -1  
$EndComp
$Comp
L TPS54339EDDA:TPS54339EDDA U11
U 1 1 5D47BF8A
P 6350 6850
F 0 "U11" H 6350 7820 50  0000 C CNN
F 1 "TPS54339EDDA" H 6350 7729 50  0000 C CNN
F 2 "SamacSys_Parts:SOIC127P600X170-9N" H 6350 6850 50  0001 L BNN
F 3 "" H 6350 6850 50  0001 L BNN
F 4 "Unavailable" H 6350 6850 50  0001 L BNN "Field4"
F 5 "Conv DC-DC 4.5V to 23V Step Down Single-Out 0.76V to 7V 10A 8-Pin HSOP EP Tube" H 6350 6850 50  0001 L BNN "Field5"
F 6 "Texas Instruments" H 6350 6850 50  0001 L BNN "Field6"
F 7 "SO-8 Texas Instruments" H 6350 6850 50  0001 L BNN "Field7"
F 8 "None" H 6350 6850 50  0001 L BNN "Field8"
	1    6350 6850
	1    0    0    -1  
$EndComp
Wire Wire Line
	5200 7150 5650 7150
Wire Wire Line
	5200 6800 5200 6350
Wire Wire Line
	5200 6350 5250 6350
Connection ~ 5250 6350
Wire Wire Line
	5250 6350 5250 6000
Wire Wire Line
	2000 4350 2000 4750
Wire Wire Line
	2000 4750 2300 4750
Connection ~ 2000 4350
Wire Wire Line
	2000 4350 1050 4350
Wire Wire Line
	2300 2450 2050 2450
Wire Wire Line
	2050 2450 2050 2000
Wire Wire Line
	2050 2000 2300 2000
Connection ~ 2300 2000
Wire Wire Line
	2300 2000 2300 2050
Connection ~ 1000 6300
$Comp
L Device:RTRIM R7
U 1 1 5D1C3360
P 1000 6500
F 0 "R7" H 1128 6546 50  0000 L CNN
F 1 "RTRIM" H 1128 6455 50  0000 L CNN
F 2 "Potentiometer_THT:Potentiometer_Runtron_RM-065_Vertical" V 930 6500 50  0001 C CNN
F 3 "~" H 1000 6500 50  0001 C CNN
	1    1000 6500
	1    0    0    -1  
$EndComp
$EndSCHEMATC
