(module "SOP65P490X110-13N" (layer F.Cu)
  (descr "12-Lead Plastic MSOP-")
  (tags "Integrated Circuit")
  (attr smd)
  (fp_text reference IC** (at 0 0) (layer F.SilkS)
    (effects (font (size 1.27 1.27) (thickness 0.254)))
  )
  (fp_text user %R (at 0 0) (layer F.Fab)
    (effects (font (size 1.27 1.27) (thickness 0.254)))
  )
  (fp_text value "SOP65P490X110-13N" (at 0 0) (layer F.SilkS) hide
    (effects (font (size 1.27 1.27) (thickness 0.254)))
  )
  (fp_line (start -3.175 -2.32) (end 3.175 -2.32) (layer F.CrtYd) (width 0.05))
  (fp_line (start 3.175 -2.32) (end 3.175 2.32) (layer F.CrtYd) (width 0.05))
  (fp_line (start 3.175 2.32) (end -3.175 2.32) (layer F.CrtYd) (width 0.05))
  (fp_line (start -3.175 2.32) (end -3.175 -2.32) (layer F.CrtYd) (width 0.05))
  (fp_line (start -1.5 -2.02) (end 1.5 -2.02) (layer F.Fab) (width 0.1))
  (fp_line (start 1.5 -2.02) (end 1.5 2.02) (layer F.Fab) (width 0.1))
  (fp_line (start 1.5 2.02) (end -1.5 2.02) (layer F.Fab) (width 0.1))
  (fp_line (start -1.5 2.02) (end -1.5 -2.02) (layer F.Fab) (width 0.1))
  (fp_line (start -1.5 -1.37) (end -0.85 -2.02) (layer F.Fab) (width 0.1))
  (fp_line (start -2.925 -2.2) (end -1.5 -2.2) (layer F.SilkS) (width 0.2))
  (pad 1 smd rect (at -2.212 -1.625 90) (size 0.45 1.425) (layers F.Cu F.Paste F.Mask))
  (pad 2 smd rect (at -2.212 -0.975 90) (size 0.45 1.425) (layers F.Cu F.Paste F.Mask))
  (pad 3 smd rect (at -2.212 -0.325 90) (size 0.45 1.425) (layers F.Cu F.Paste F.Mask))
  (pad 4 smd rect (at -2.212 0.325 90) (size 0.45 1.425) (layers F.Cu F.Paste F.Mask))
  (pad 5 smd rect (at -2.212 0.975 90) (size 0.45 1.425) (layers F.Cu F.Paste F.Mask))
  (pad 6 smd rect (at -2.212 1.625 90) (size 0.45 1.425) (layers F.Cu F.Paste F.Mask))
  (pad 7 smd rect (at 2.212 1.625 90) (size 0.45 1.425) (layers F.Cu F.Paste F.Mask))
  (pad 8 smd rect (at 2.212 0.975 90) (size 0.45 1.425) (layers F.Cu F.Paste F.Mask))
  (pad 9 smd rect (at 2.212 0.325 90) (size 0.45 1.425) (layers F.Cu F.Paste F.Mask))
  (pad 10 smd rect (at 2.212 -0.325 90) (size 0.45 1.425) (layers F.Cu F.Paste F.Mask))
  (pad 11 smd rect (at 2.212 -0.975 90) (size 0.45 1.425) (layers F.Cu F.Paste F.Mask))
  (pad 12 smd rect (at 2.212 -1.625 90) (size 0.45 1.425) (layers F.Cu F.Paste F.Mask))
  (pad 13 smd rect (at 0 0 0) (size 1.753 2.947) (layers F.Cu F.Paste F.Mask))
  (model "C:\Users\gampo\OneDrive\?p?????st??\Updated_eps_prototype\SamacSys_Parts.3dshapes\\LT3652EMSE#PBF.stp"
    (at (xyz 0 0 0))
    (scale (xyz 1 1 1))
    (rotate (xyz 0 0 0))
  )
)
