(export (version "E")
  (design
    (source "/home/evangelia/VSC-files/cubesat-workshop/PCBs/OBC board/OBC board.kicad_sch")
    (date "2024-03-29T15:25:14+0200")
    (tool "Eeschema 8.0.0")
    (sheet (number "1") (name "/") (tstamps "/")
      (title_block
        (title)
        (company)
        (rev)
        (date)
        (source "OBC board.kicad_sch")
        (comment (number "1") (value ""))
        (comment (number "2") (value ""))
        (comment (number "3") (value ""))
        (comment (number "4") (value ""))
        (comment (number "5") (value ""))
        (comment (number "6") (value ""))
        (comment (number "7") (value ""))
        (comment (number "8") (value ""))
        (comment (number "9") (value "")))))
  (components
    (comp (ref "A1")
      (value "Arduino_Nano_v2.x")
      (footprint "Module:Arduino_Nano")
      (datasheet "https://www.arduino.cc/en/uploads/Main/ArduinoNanoManual23.pdf")
      (description "Arduino Nano v2.x")
      (fields
        (field (name "Footprint") "Module:Arduino_Nano")
        (field (name "Datasheet") "https://www.arduino.cc/en/uploads/Main/ArduinoNanoManual23.pdf")
        (field (name "Description") "Arduino Nano v2.x"))
      (libsource (lib "MCU_Module") (part "Arduino_Nano_v2.x") (description "Arduino Nano v2.x"))
      (property (name "Sheetname") (value "Root"))
      (property (name "Sheetfile") (value "OBC board.kicad_sch"))
      (property (name "ki_keywords") (value "Arduino nano microcontroller module USB"))
      (property (name "ki_fp_filters") (value "Arduino*Nano*"))
      (sheetpath (names "/") (tstamps "/"))
      (tstamps "7f36f551-4ab9-4be2-9556-ce1330066089"))
    (comp (ref "J1")
      (value "ADCS_Gyroscope")
      (footprint "Connector_PinHeader_2.00mm:PinHeader_1x04_P2.00mm_Vertical")
      (description "Generic connector, single row, 01x04, script generated (kicad-library-utils/schlib/autogen/connector/)")
      (fields
        (field (name "Footprint") "Connector_PinHeader_2.00mm:PinHeader_1x04_P2.00mm_Vertical")
        (field (name "Datasheet"))
        (field (name "Description") "Generic connector, single row, 01x04, script generated (kicad-library-utils/schlib/autogen/connector/)"))
      (libsource (lib "") (part "Conn_01x04_2") (description "Generic connector, single row, 01x04, script generated (kicad-library-utils/schlib/autogen/connector/)"))
      (property (name "Sheetname") (value "Root"))
      (property (name "Sheetfile") (value "OBC board.kicad_sch"))
      (property (name "ki_keywords") (value "connector"))
      (property (name "ki_fp_filters") (value "Connector*:*_1x??_*"))
      (sheetpath (names "/") (tstamps "/"))
      (tstamps "6788b79c-6607-4075-a53d-ea38bd07177f"))
    (comp (ref "J2")
      (value "ADCS_Motor_connector")
      (footprint "Connector_PinHeader_2.00mm:PinHeader_1x04_P2.00mm_Vertical")
      (description "Generic connector, single row, 01x04, script generated (kicad-library-utils/schlib/autogen/connector/)")
      (fields
        (field (name "Footprint") "Connector_PinHeader_2.00mm:PinHeader_1x04_P2.00mm_Vertical")
        (field (name "Datasheet"))
        (field (name "Description") "Generic connector, single row, 01x04, script generated (kicad-library-utils/schlib/autogen/connector/)"))
      (libsource (lib "") (part "Conn_01x04_3") (description "Generic connector, single row, 01x04, script generated (kicad-library-utils/schlib/autogen/connector/)"))
      (property (name "Sheetname") (value "Root"))
      (property (name "Sheetfile") (value "OBC board.kicad_sch"))
      (property (name "ki_keywords") (value "connector"))
      (property (name "ki_fp_filters") (value "Connector*:*_1x??_*"))
      (sheetpath (names "/") (tstamps "/"))
      (tstamps "cf26cdbf-e29a-4e7c-b769-3760cfe7fed3"))
    (comp (ref "J3")
      (value "UART-PowerSupply _connector")
      (footprint "Connector_PinHeader_2.00mm:PinHeader_1x04_P2.00mm_Vertical")
      (description "Generic connector, single row, 01x04, script generated (kicad-library-utils/schlib/autogen/connector/)")
      (fields
        (field (name "Footprint") "Connector_PinHeader_2.00mm:PinHeader_1x04_P2.00mm_Vertical")
        (field (name "Datasheet"))
        (field (name "Description") "Generic connector, single row, 01x04, script generated (kicad-library-utils/schlib/autogen/connector/)"))
      (libsource (lib "") (part "Conn_01x04_2") (description "Generic connector, single row, 01x04, script generated (kicad-library-utils/schlib/autogen/connector/)"))
      (property (name "Sheetname") (value "Root"))
      (property (name "Sheetfile") (value "OBC board.kicad_sch"))
      (property (name "ki_keywords") (value "connector"))
      (property (name "ki_fp_filters") (value "Connector*:*_1x??_*"))
      (sheetpath (names "/") (tstamps "/"))
      (tstamps "8748b005-98ba-40ff-b74d-939abaaf7ce6"))
    (comp (ref "J4")
      (value "BMP180")
      (footprint "Connector_PinHeader_2.54mm:PinHeader_1x04_P2.54mm_Vertical")
      (description "Generic connector, single row, 01x04, script generated (kicad-library-utils/schlib/autogen/connector/)")
      (fields
        (field (name "Footprint") "Connector_PinHeader_2.54mm:PinHeader_1x04_P2.54mm_Vertical")
        (field (name "Datasheet"))
        (field (name "Description") "Generic connector, single row, 01x04, script generated (kicad-library-utils/schlib/autogen/connector/)"))
      (libsource (lib "Connector_Generic") (part "Conn_01x04") (description "Generic connector, single row, 01x04, script generated (kicad-library-utils/schlib/autogen/connector/)"))
      (property (name "Sheetname") (value "Root"))
      (property (name "Sheetfile") (value "OBC board.kicad_sch"))
      (property (name "ki_keywords") (value "connector"))
      (property (name "ki_fp_filters") (value "Connector*:*_1x??_*"))
      (sheetpath (names "/") (tstamps "/"))
      (tstamps "ea9f3a57-619e-4062-919b-caa5959a723a"))
    (comp (ref "J6")
      (value "DHT11")
      (footprint "Connector_PinHeader_2.54mm:PinHeader_1x03_P2.54mm_Vertical")
      (description "Generic connector, single row, 01x03, script generated (kicad-library-utils/schlib/autogen/connector/)")
      (fields
        (field (name "Footprint") "Connector_PinHeader_2.54mm:PinHeader_1x03_P2.54mm_Vertical")
        (field (name "Datasheet"))
        (field (name "Description") "Generic connector, single row, 01x03, script generated (kicad-library-utils/schlib/autogen/connector/)"))
      (libsource (lib "") (part "Conn_01x03_1") (description "Generic connector, single row, 01x03, script generated (kicad-library-utils/schlib/autogen/connector/)"))
      (property (name "Sheetname") (value "Root"))
      (property (name "Sheetfile") (value "OBC board.kicad_sch"))
      (property (name "ki_keywords") (value "connector"))
      (property (name "ki_fp_filters") (value "Connector*:*_1x??_*"))
      (sheetpath (names "/") (tstamps "/"))
      (tstamps "0d602eff-bc5e-4dcb-aaa5-a529bb3c4c23"))
    (comp (ref "J7")
      (value "Conn_01x04")
      (footprint "Connector_PinHeader_2.54mm:PinHeader_1x04_P2.54mm_Vertical")
      (description "Generic connector, single row, 01x04, script generated (kicad-library-utils/schlib/autogen/connector/)")
      (fields
        (field (name "Footprint") "Connector_PinHeader_2.54mm:PinHeader_1x04_P2.54mm_Vertical")
        (field (name "Datasheet"))
        (field (name "Description") "Generic connector, single row, 01x04, script generated (kicad-library-utils/schlib/autogen/connector/)"))
      (libsource (lib "") (part "Conn_01x04_1") (description "Generic connector, single row, 01x04, script generated (kicad-library-utils/schlib/autogen/connector/)"))
      (property (name "Sheetname") (value "Root"))
      (property (name "Sheetfile") (value "OBC board.kicad_sch"))
      (property (name "ki_keywords") (value "connector"))
      (property (name "ki_fp_filters") (value "Connector*:*_1x??_*"))
      (sheetpath (names "/") (tstamps "/"))
      (tstamps "5b1fa4b6-4f0f-4323-bee3-3a850732cca8")))
  (libparts
    (libpart (lib "") (part "Conn_01x03_1")
      (description "Generic connector, single row, 01x03, script generated (kicad-library-utils/schlib/autogen/connector/)")
      (docs "~")
      (footprints
        (fp "Connector*:*_1x??_*"))
      (fields
        (field (name "Reference") "J6")
        (field (name "Value") "DHT11")
        (field (name "Footprint"))
        (field (name "Datasheet") "~")
        (field (name "Description") "Generic connector, single row, 01x03, script generated (kicad-library-utils/schlib/autogen/connector/)"))
      (pins
        (pin (num "1") (name "Signal") (type "passive"))
        (pin (num "2") (name "Vcc") (type "passive"))
        (pin (num "3") (name "Gnd") (type "passive"))))
    (libpart (lib "") (part "Conn_01x04_1")
      (description "Generic connector, single row, 01x04, script generated (kicad-library-utils/schlib/autogen/connector/)")
      (docs "~")
      (footprints
        (fp "Connector*:*_1x??_*"))
      (fields
        (field (name "Reference") "J7")
        (field (name "Value") "Conn_01x04")
        (field (name "Footprint") "Connector_PinHeader_2.54mm:PinHeader_1x04_P2.54mm_Vertical")
        (field (name "Datasheet") "~")
        (field (name "Description") "Generic connector, single row, 01x04, script generated (kicad-library-utils/schlib/autogen/connector/)"))
      (pins
        (pin (num "1") (name "9V") (type "passive"))
        (pin (num "2") (name "GND") (type "passive"))
        (pin (num "3") (name "D0") (type "passive"))
        (pin (num "4") (name "A0") (type "passive"))))
    (libpart (lib "") (part "Conn_01x04_2")
      (description "Generic connector, single row, 01x04, script generated (kicad-library-utils/schlib/autogen/connector/)")
      (docs "~")
      (footprints
        (fp "Connector*:*_1x??_*"))
      (fields
        (field (name "Reference") "J")
        (field (name "Value") "Conn_01x04")
        (field (name "Footprint"))
        (field (name "Datasheet") "~")
        (field (name "Description") "Generic connector, single row, 01x04, script generated (kicad-library-utils/schlib/autogen/connector/)"))
      (pins
        (pin (num "1") (name "Pin_1") (type "passive"))
        (pin (num "2") (name "Pin_2") (type "passive"))
        (pin (num "3") (name "Pin_3") (type "passive"))
        (pin (num "4") (name "Pin_4") (type "passive"))))
    (libpart (lib "") (part "Conn_01x04_3")
      (description "Generic connector, single row, 01x04, script generated (kicad-library-utils/schlib/autogen/connector/)")
      (docs "~")
      (footprints
        (fp "Connector*:*_1x??_*"))
      (fields
        (field (name "Reference") "J2")
        (field (name "Value") "Conn_01x04_ADCS_Motor")
        (field (name "Footprint") "Connector_PinHeader_2.54mm:PinHeader_1x04_P2.54mm_Vertical")
        (field (name "Datasheet") "~")
        (field (name "Description") "Generic connector, single row, 01x04, script generated (kicad-library-utils/schlib/autogen/connector/)"))
      (pins
        (pin (num "1") (name "9V") (type "passive"))
        (pin (num "2") (name "Gnd") (type "passive"))
        (pin (num "3") (name "D8") (type "passive"))
        (pin (num "4") (name "D9") (type "passive"))))
    (libpart (lib "Connector_Generic") (part "Conn_01x04")
      (description "Generic connector, single row, 01x04, script generated (kicad-library-utils/schlib/autogen/connector/)")
      (docs "~")
      (footprints
        (fp "Connector*:*_1x??_*"))
      (fields
        (field (name "Reference") "J4")
        (field (name "Value") "GY-68 , bmp180")
        (field (name "Footprint"))
        (field (name "Datasheet") "~")
        (field (name "Description") "Generic connector, single row, 01x04, script generated (kicad-library-utils/schlib/autogen/connector/)"))
      (pins
        (pin (num "1") (name "Vin") (type "passive"))
        (pin (num "2") (name "Gnd") (type "passive"))
        (pin (num "3") (name "Scl") (type "passive"))
        (pin (num "4") (name "Sda") (type "passive"))))
    (libpart (lib "MCU_Module") (part "Arduino_Nano_v2.x")
      (description "Arduino Nano v2.x")
      (docs "https://www.arduino.cc/en/uploads/Main/ArduinoNanoManual23.pdf")
      (footprints
        (fp "Arduino*Nano*"))
      (fields
        (field (name "Reference") "A")
        (field (name "Value") "Arduino_Nano_v2.x")
        (field (name "Footprint") "Module:Arduino_Nano")
        (field (name "Datasheet") "https://www.arduino.cc/en/uploads/Main/ArduinoNanoManual23.pdf")
        (field (name "Description") "Arduino Nano v2.x"))
      (pins
        (pin (num "1") (name "D1/TX") (type "bidirectional"))
        (pin (num "2") (name "D0/RX") (type "bidirectional"))
        (pin (num "3") (name "~{RESET}") (type "input"))
        (pin (num "4") (name "GND") (type "power_in"))
        (pin (num "5") (name "D2") (type "bidirectional"))
        (pin (num "6") (name "D3") (type "bidirectional"))
        (pin (num "7") (name "D4") (type "bidirectional"))
        (pin (num "8") (name "D5") (type "bidirectional"))
        (pin (num "9") (name "D6") (type "bidirectional"))
        (pin (num "10") (name "D7") (type "bidirectional"))
        (pin (num "11") (name "D8") (type "bidirectional"))
        (pin (num "12") (name "D9") (type "bidirectional"))
        (pin (num "13") (name "D10") (type "bidirectional"))
        (pin (num "14") (name "D11") (type "bidirectional"))
        (pin (num "15") (name "D12") (type "bidirectional"))
        (pin (num "16") (name "D13") (type "bidirectional"))
        (pin (num "17") (name "3V3") (type "power_out"))
        (pin (num "18") (name "AREF") (type "input"))
        (pin (num "19") (name "A0") (type "bidirectional"))
        (pin (num "20") (name "A1") (type "bidirectional"))
        (pin (num "21") (name "A2") (type "bidirectional"))
        (pin (num "22") (name "A3") (type "bidirectional"))
        (pin (num "23") (name "A4") (type "bidirectional"))
        (pin (num "24") (name "A5") (type "bidirectional"))
        (pin (num "25") (name "A6") (type "bidirectional"))
        (pin (num "26") (name "A7") (type "bidirectional"))
        (pin (num "27") (name "+5V") (type "power_out"))
        (pin (num "28") (name "~{RESET}") (type "input"))
        (pin (num "29") (name "GND") (type "power_in"))
        (pin (num "30") (name "VIN") (type "power_in")))))
  (libraries
    (library (logical "Connector_Generic")
      (uri "/usr/share/kicad/symbols//Connector_Generic.kicad_sym"))
    (library (logical "MCU_Module")
      (uri "/usr/share/kicad/symbols//MCU_Module.kicad_sym")))
  (nets
    (net (code "1") (name "+3.3V")
      (node (ref "A1") (pin "17") (pinfunction "3V3") (pintype "power_out"))
      (node (ref "J4") (pin "1") (pinfunction "Vin") (pintype "passive")))
    (net (code "2") (name "+5V")
      (node (ref "A1") (pin "27") (pinfunction "+5V") (pintype "power_out"))
      (node (ref "J1") (pin "1") (pinfunction "Pin_1") (pintype "passive"))
      (node (ref "J6") (pin "2") (pinfunction "Vcc") (pintype "passive"))
      (node (ref "J7") (pin "4") (pinfunction "A0") (pintype "passive")))
    (net (code "3") (name "+9V")
      (node (ref "A1") (pin "30") (pinfunction "VIN") (pintype "power_in"))
      (node (ref "J2") (pin "1") (pinfunction "9V") (pintype "passive"))
      (node (ref "J3") (pin "1") (pinfunction "Pin_1") (pintype "passive")))
    (net (code "4") (name "/DHT_D2")
      (node (ref "A1") (pin "5") (pinfunction "D2") (pintype "bidirectional"))
      (node (ref "J6") (pin "1") (pinfunction "Signal") (pintype "passive")))
    (net (code "5") (name "/IA1")
      (node (ref "A1") (pin "11") (pinfunction "D8") (pintype "bidirectional"))
      (node (ref "J2") (pin "3") (pinfunction "D8") (pintype "passive")))
    (net (code "6") (name "/IB1")
      (node (ref "A1") (pin "12") (pinfunction "D9") (pintype "bidirectional"))
      (node (ref "J2") (pin "4") (pinfunction "D9") (pintype "passive")))
    (net (code "7") (name "/SCL")
      (node (ref "A1") (pin "24") (pinfunction "A5") (pintype "bidirectional"))
      (node (ref "J1") (pin "3") (pinfunction "Pin_3") (pintype "passive"))
      (node (ref "J4") (pin "3") (pinfunction "Scl") (pintype "passive")))
    (net (code "8") (name "/SDA")
      (node (ref "A1") (pin "23") (pinfunction "A4") (pintype "bidirectional"))
      (node (ref "J1") (pin "4") (pinfunction "Pin_4") (pintype "passive"))
      (node (ref "J4") (pin "4") (pinfunction "Sda") (pintype "passive")))
    (net (code "9") (name "/UART_Rx")
      (node (ref "A1") (pin "2") (pinfunction "D0/RX") (pintype "bidirectional"))
      (node (ref "J3") (pin "3") (pinfunction "Pin_3") (pintype "passive")))
    (net (code "10") (name "/UART_Tx")
      (node (ref "A1") (pin "1") (pinfunction "D1/TX") (pintype "bidirectional"))
      (node (ref "J3") (pin "4") (pinfunction "Pin_4") (pintype "passive")))
    (net (code "11") (name "/photodiode_A0")
      (node (ref "A1") (pin "19") (pinfunction "A0") (pintype "bidirectional"))
      (node (ref "J7") (pin "1") (pinfunction "9V") (pintype "passive")))
    (net (code "12") (name "/photodiode_D3")
      (node (ref "A1") (pin "6") (pinfunction "D3") (pintype "bidirectional"))
      (node (ref "J7") (pin "2") (pinfunction "GND") (pintype "passive")))
    (net (code "13") (name "GND")
      (node (ref "A1") (pin "29") (pinfunction "GND") (pintype "power_in"))
      (node (ref "A1") (pin "4") (pinfunction "GND") (pintype "power_in"))
      (node (ref "J1") (pin "2") (pinfunction "Pin_2") (pintype "passive"))
      (node (ref "J2") (pin "2") (pinfunction "Gnd") (pintype "passive"))
      (node (ref "J3") (pin "2") (pinfunction "Pin_2") (pintype "passive"))
      (node (ref "J4") (pin "2") (pinfunction "Gnd") (pintype "passive"))
      (node (ref "J6") (pin "3") (pinfunction "Gnd") (pintype "passive"))
      (node (ref "J7") (pin "3") (pinfunction "D0") (pintype "passive")))
    (net (code "14") (name "unconnected-(A1-A1-Pad20)")
      (node (ref "A1") (pin "20") (pinfunction "A1") (pintype "bidirectional+no_connect")))
    (net (code "15") (name "unconnected-(A1-A2-Pad21)")
      (node (ref "A1") (pin "21") (pinfunction "A2") (pintype "bidirectional+no_connect")))
    (net (code "16") (name "unconnected-(A1-A3-Pad22)")
      (node (ref "A1") (pin "22") (pinfunction "A3") (pintype "bidirectional+no_connect")))
    (net (code "17") (name "unconnected-(A1-A6-Pad25)")
      (node (ref "A1") (pin "25") (pinfunction "A6") (pintype "bidirectional+no_connect")))
    (net (code "18") (name "unconnected-(A1-A7-Pad26)")
      (node (ref "A1") (pin "26") (pinfunction "A7") (pintype "bidirectional+no_connect")))
    (net (code "19") (name "unconnected-(A1-AREF-Pad18)")
      (node (ref "A1") (pin "18") (pinfunction "AREF") (pintype "input+no_connect")))
    (net (code "20") (name "unconnected-(A1-D4-Pad7)")
      (node (ref "A1") (pin "7") (pinfunction "D4") (pintype "bidirectional+no_connect")))
    (net (code "21") (name "unconnected-(A1-D5-Pad8)")
      (node (ref "A1") (pin "8") (pinfunction "D5") (pintype "bidirectional+no_connect")))
    (net (code "22") (name "unconnected-(A1-D6-Pad9)")
      (node (ref "A1") (pin "9") (pinfunction "D6") (pintype "bidirectional+no_connect")))
    (net (code "23") (name "unconnected-(A1-D7-Pad10)")
      (node (ref "A1") (pin "10") (pinfunction "D7") (pintype "bidirectional+no_connect")))
    (net (code "24") (name "unconnected-(A1-D10-Pad13)")
      (node (ref "A1") (pin "13") (pinfunction "D10") (pintype "bidirectional+no_connect")))
    (net (code "25") (name "unconnected-(A1-D11-Pad14)")
      (node (ref "A1") (pin "14") (pinfunction "D11") (pintype "bidirectional+no_connect")))
    (net (code "26") (name "unconnected-(A1-D12-Pad15)")
      (node (ref "A1") (pin "15") (pinfunction "D12") (pintype "bidirectional+no_connect")))
    (net (code "27") (name "unconnected-(A1-D13-Pad16)")
      (node (ref "A1") (pin "16") (pinfunction "D13") (pintype "bidirectional+no_connect")))
    (net (code "28") (name "unconnected-(A1-~{RESET}-Pad3)")
      (node (ref "A1") (pin "3") (pinfunction "~{RESET}") (pintype "input+no_connect")))
    (net (code "29") (name "unconnected-(A1-~{RESET}-Pad28)")
      (node (ref "A1") (pin "28") (pinfunction "~{RESET}") (pintype "input+no_connect")))))