(export (version "E")
  (design
    (source "/home/evangelia/VSC-files/cubesat-workshop/PCBs/COMMS board/COMMS board.kicad_sch")
    (date "2024-03-27T18:35:07+0200")
    (tool "Eeschema 8.0.0")
    (sheet (number "1") (name "/") (tstamps "/")
      (title_block
        (title)
        (company)
        (rev)
        (date)
        (source "COMMS board.kicad_sch")
        (comment (number "1") (value ""))
        (comment (number "2") (value ""))
        (comment (number "3") (value ""))
        (comment (number "4") (value ""))
        (comment (number "5") (value ""))
        (comment (number "6") (value ""))
        (comment (number "7") (value ""))
        (comment (number "8") (value ""))
        (comment (number "9") (value "")))))
  (components
    (comp (ref "A1")
      (value "Arduino_Nano_v2.x")
      (footprint "Module:Arduino_Nano")
      (datasheet "https://www.arduino.cc/en/uploads/Main/ArduinoNanoManual23.pdf")
      (description "Arduino Nano v2.x")
      (fields
        (field (name "Footprint") "Module:Arduino_Nano")
        (field (name "Datasheet") "https://www.arduino.cc/en/uploads/Main/ArduinoNanoManual23.pdf")
        (field (name "Description") "Arduino Nano v2.x"))
      (libsource (lib "MCU_Module") (part "Arduino_Nano_v2.x") (description "Arduino Nano v2.x"))
      (property (name "Sheetname") (value "Root"))
      (property (name "Sheetfile") (value "COMMS board.kicad_sch"))
      (property (name "ki_keywords") (value "Arduino nano microcontroller module USB"))
      (property (name "ki_fp_filters") (value "Arduino*Nano*"))
      (sheetpath (names "/") (tstamps "/"))
      (tstamps "cd465d65-ae64-4995-b8dd-0c128b9ee0f6"))
    (comp (ref "J1")
      (value "Conn_01x04")
      (footprint "Connector_PinHeader_2.00mm:PinHeader_1x04_P2.00mm_Vertical")
      (description "Generic connector, single row, 01x04, script generated (kicad-library-utils/schlib/autogen/connector/)")
      (fields
        (field (name "Footprint") "Connector_PinHeader_2.00mm:PinHeader_1x04_P2.00mm_Vertical")
        (field (name "Datasheet"))
        (field (name "Description") "Generic connector, single row, 01x04, script generated (kicad-library-utils/schlib/autogen/connector/)"))
      (libsource (lib "Connector_Generic") (part "Conn_01x04") (description "Generic connector, single row, 01x04, script generated (kicad-library-utils/schlib/autogen/connector/)"))
      (property (name "Sheetname") (value "Root"))
      (property (name "Sheetfile") (value "COMMS board.kicad_sch"))
      (property (name "ki_keywords") (value "connector"))
      (property (name "ki_fp_filters") (value "Connector*:*_1x??_*"))
      (sheetpath (names "/") (tstamps "/"))
      (tstamps "a676647b-7855-4da0-9c06-e18b3340e714"))
    (comp (ref "J2")
      (value "Conn_01x02")
      (footprint "Connector_PinHeader_2.00mm:PinHeader_1x02_P2.00mm_Vertical")
      (description "Generic connector, single row, 01x02, script generated (kicad-library-utils/schlib/autogen/connector/)")
      (fields
        (field (name "Footprint") "Connector_PinHeader_2.00mm:PinHeader_1x02_P2.00mm_Vertical")
        (field (name "Datasheet"))
        (field (name "Description") "Generic connector, single row, 01x02, script generated (kicad-library-utils/schlib/autogen/connector/)"))
      (libsource (lib "Connector_Generic") (part "Conn_01x02") (description "Generic connector, single row, 01x02, script generated (kicad-library-utils/schlib/autogen/connector/)"))
      (property (name "Sheetname") (value "Root"))
      (property (name "Sheetfile") (value "COMMS board.kicad_sch"))
      (property (name "ki_keywords") (value "connector"))
      (property (name "ki_fp_filters") (value "Connector*:*_1x??_*"))
      (sheetpath (names "/") (tstamps "/"))
      (tstamps "dd4bc5d1-88db-4466-8b46-87a0229b8b97"))
    (comp (ref "U1")
      (value "NRF24L01_Breakout")
      (footprint "RF_Module:nRF24L01_Breakout")
      (datasheet "http://www.nordicsemi.com/eng/content/download/2730/34105/file/nRF24L01_Product_Specification_v2_0.pdf")
      (description "Ultra low power 2.4GHz RF Transceiver, Carrier PCB")
      (fields
        (field (name "Footprint") "RF_Module:nRF24L01_Breakout")
        (field (name "Datasheet") "http://www.nordicsemi.com/eng/content/download/2730/34105/file/nRF24L01_Product_Specification_v2_0.pdf")
        (field (name "Description") "Ultra low power 2.4GHz RF Transceiver, Carrier PCB"))
      (libsource (lib "RF") (part "NRF24L01_Breakout") (description "Ultra low power 2.4GHz RF Transceiver, Carrier PCB"))
      (property (name "Sheetname") (value "Root"))
      (property (name "Sheetfile") (value "COMMS board.kicad_sch"))
      (property (name "ki_keywords") (value "Low Power RF Transceiver breakout carrier"))
      (property (name "ki_fp_filters") (value "nRF24L01*Breakout*"))
      (sheetpath (names "/") (tstamps "/"))
      (tstamps "2c654abc-ef03-419a-bd36-3cb856697b51")))
  (libparts
    (libpart (lib "Connector_Generic") (part "Conn_01x02")
      (description "Generic connector, single row, 01x02, script generated (kicad-library-utils/schlib/autogen/connector/)")
      (docs "~")
      (footprints
        (fp "Connector*:*_1x??_*"))
      (fields
        (field (name "Reference") "J2")
        (field (name "Value") "Conn_01x02")
        (field (name "Footprint") "Connector_PinHeader_2.00mm:PinHeader_1x02_P2.00mm_Vertical")
        (field (name "Datasheet") "~")
        (field (name "Description") "Generic connector, single row, 01x02, script generated (kicad-library-utils/schlib/autogen/connector/)"))
      (pins
        (pin (num "1") (name "Vin") (type "passive"))
        (pin (num "2") (name "Gnd") (type "passive"))))
    (libpart (lib "Connector_Generic") (part "Conn_01x04")
      (description "Generic connector, single row, 01x04, script generated (kicad-library-utils/schlib/autogen/connector/)")
      (docs "~")
      (footprints
        (fp "Connector*:*_1x??_*"))
      (fields
        (field (name "Reference") "J3")
        (field (name "Value") "Conn_01x04")
        (field (name "Footprint") "Connector_PinHeader_2.54mm:PinHeader_1x04_P2.54mm_Vertical")
        (field (name "Datasheet") "~")
        (field (name "Description") "Generic connector, single row, 01x04, script generated (kicad-library-utils/schlib/autogen/connector/)"))
      (pins
        (pin (num "1") (name "Rx") (type "passive"))
        (pin (num "2") (name "Tx") (type "passive"))
        (pin (num "3") (name "Gnd") (type "passive"))
        (pin (num "4") (name "Vin") (type "passive"))))
    (libpart (lib "MCU_Module") (part "Arduino_Nano_v2.x")
      (description "Arduino Nano v2.x")
      (docs "https://www.arduino.cc/en/uploads/Main/ArduinoNanoManual23.pdf")
      (footprints
        (fp "Arduino*Nano*"))
      (fields
        (field (name "Reference") "A")
        (field (name "Value") "Arduino_Nano_v2.x")
        (field (name "Footprint") "Module:Arduino_Nano")
        (field (name "Datasheet") "https://www.arduino.cc/en/uploads/Main/ArduinoNanoManual23.pdf")
        (field (name "Description") "Arduino Nano v2.x"))
      (pins
        (pin (num "1") (name "D1/TX") (type "bidirectional"))
        (pin (num "2") (name "D0/RX") (type "bidirectional"))
        (pin (num "3") (name "~{RESET}") (type "input"))
        (pin (num "4") (name "GND") (type "power_in"))
        (pin (num "5") (name "D2") (type "bidirectional"))
        (pin (num "6") (name "D3") (type "bidirectional"))
        (pin (num "7") (name "D4") (type "bidirectional"))
        (pin (num "8") (name "D5") (type "bidirectional"))
        (pin (num "9") (name "D6") (type "bidirectional"))
        (pin (num "10") (name "D7") (type "bidirectional"))
        (pin (num "11") (name "D8") (type "bidirectional"))
        (pin (num "12") (name "D9") (type "bidirectional"))
        (pin (num "13") (name "D10") (type "bidirectional"))
        (pin (num "14") (name "D11") (type "bidirectional"))
        (pin (num "15") (name "D12") (type "bidirectional"))
        (pin (num "16") (name "D13") (type "bidirectional"))
        (pin (num "17") (name "3V3") (type "power_out"))
        (pin (num "18") (name "AREF") (type "input"))
        (pin (num "19") (name "A0") (type "bidirectional"))
        (pin (num "20") (name "A1") (type "bidirectional"))
        (pin (num "21") (name "A2") (type "bidirectional"))
        (pin (num "22") (name "A3") (type "bidirectional"))
        (pin (num "23") (name "A4") (type "bidirectional"))
        (pin (num "24") (name "A5") (type "bidirectional"))
        (pin (num "25") (name "A6") (type "bidirectional"))
        (pin (num "26") (name "A7") (type "bidirectional"))
        (pin (num "27") (name "+5V") (type "power_out"))
        (pin (num "28") (name "~{RESET}") (type "input"))
        (pin (num "29") (name "GND") (type "power_in"))
        (pin (num "30") (name "VIN") (type "power_in"))))
    (libpart (lib "RF") (part "NRF24L01_Breakout")
      (description "Ultra low power 2.4GHz RF Transceiver, Carrier PCB")
      (docs "http://www.nordicsemi.com/eng/content/download/2730/34105/file/nRF24L01_Product_Specification_v2_0.pdf")
      (footprints
        (fp "nRF24L01*Breakout*"))
      (fields
        (field (name "Reference") "U")
        (field (name "Value") "NRF24L01_Breakout")
        (field (name "Footprint") "RF_Module:nRF24L01_Breakout")
        (field (name "Datasheet") "http://www.nordicsemi.com/eng/content/download/2730/34105/file/nRF24L01_Product_Specification_v2_0.pdf")
        (field (name "Description") "Ultra low power 2.4GHz RF Transceiver, Carrier PCB"))
      (pins
        (pin (num "1") (name "GND") (type "power_in"))
        (pin (num "2") (name "VCC") (type "power_in"))
        (pin (num "3") (name "CE") (type "input"))
        (pin (num "4") (name "~{CSN}") (type "input"))
        (pin (num "5") (name "SCK") (type "input"))
        (pin (num "6") (name "MOSI") (type "input"))
        (pin (num "7") (name "MISO") (type "output"))
        (pin (num "8") (name "IRQ") (type "output")))))
  (libraries
    (library (logical "Connector_Generic")
      (uri "/usr/share/kicad/symbols//Connector_Generic.kicad_sym"))
    (library (logical "MCU_Module")
      (uri "/usr/share/kicad/symbols//MCU_Module.kicad_sym"))
    (library (logical "RF")
      (uri "/usr/share/kicad/symbols//RF.kicad_sym")))
  (nets
    (net (code "1") (name "+3.3V")
      (node (ref "A1") (pin "17") (pinfunction "3V3") (pintype "power_out"))
      (node (ref "U1") (pin "2") (pinfunction "VCC") (pintype "power_in")))
    (net (code "2") (name "+9V")
      (node (ref "A1") (pin "30") (pinfunction "VIN") (pintype "power_in"))
      (node (ref "J1") (pin "4") (pinfunction "Vin") (pintype "passive"))
      (node (ref "J2") (pin "1") (pinfunction "Vin") (pintype "passive")))
    (net (code "3") (name "/CE")
      (node (ref "A1") (pin "10") (pinfunction "D7") (pintype "bidirectional"))
      (node (ref "U1") (pin "3") (pinfunction "CE") (pintype "input")))
    (net (code "4") (name "/CSN")
      (node (ref "A1") (pin "11") (pinfunction "D8") (pintype "bidirectional"))
      (node (ref "U1") (pin "4") (pinfunction "~{CSN}") (pintype "input")))
    (net (code "5") (name "/MISO")
      (node (ref "A1") (pin "15") (pinfunction "D12") (pintype "bidirectional"))
      (node (ref "U1") (pin "7") (pinfunction "MISO") (pintype "output")))
    (net (code "6") (name "/MOSI")
      (node (ref "A1") (pin "14") (pinfunction "D11") (pintype "bidirectional"))
      (node (ref "U1") (pin "6") (pinfunction "MOSI") (pintype "input")))
    (net (code "7") (name "/RX")
      (node (ref "A1") (pin "2") (pinfunction "D0/RX") (pintype "bidirectional"))
      (node (ref "J1") (pin "1") (pinfunction "Rx") (pintype "passive")))
    (net (code "8") (name "/SCK")
      (node (ref "A1") (pin "16") (pinfunction "D13") (pintype "bidirectional"))
      (node (ref "U1") (pin "5") (pinfunction "SCK") (pintype "input")))
    (net (code "9") (name "/TX")
      (node (ref "A1") (pin "1") (pinfunction "D1/TX") (pintype "bidirectional"))
      (node (ref "J1") (pin "2") (pinfunction "Tx") (pintype "passive")))
    (net (code "10") (name "GND")
      (node (ref "A1") (pin "29") (pinfunction "GND") (pintype "power_in"))
      (node (ref "A1") (pin "4") (pinfunction "GND") (pintype "power_in"))
      (node (ref "J1") (pin "3") (pinfunction "Gnd") (pintype "passive"))
      (node (ref "J2") (pin "2") (pinfunction "Gnd") (pintype "passive"))
      (node (ref "U1") (pin "1") (pinfunction "GND") (pintype "power_in")))
    (net (code "11") (name "unconnected-(A1-+5V-Pad27)")
      (node (ref "A1") (pin "27") (pinfunction "+5V") (pintype "power_out+no_connect")))
    (net (code "12") (name "unconnected-(A1-A0-Pad19)")
      (node (ref "A1") (pin "19") (pinfunction "A0") (pintype "bidirectional+no_connect")))
    (net (code "13") (name "unconnected-(A1-A1-Pad20)")
      (node (ref "A1") (pin "20") (pinfunction "A1") (pintype "bidirectional+no_connect")))
    (net (code "14") (name "unconnected-(A1-A2-Pad21)")
      (node (ref "A1") (pin "21") (pinfunction "A2") (pintype "bidirectional+no_connect")))
    (net (code "15") (name "unconnected-(A1-A3-Pad22)")
      (node (ref "A1") (pin "22") (pinfunction "A3") (pintype "bidirectional+no_connect")))
    (net (code "16") (name "unconnected-(A1-A4-Pad23)")
      (node (ref "A1") (pin "23") (pinfunction "A4") (pintype "bidirectional+no_connect")))
    (net (code "17") (name "unconnected-(A1-A5-Pad24)")
      (node (ref "A1") (pin "24") (pinfunction "A5") (pintype "bidirectional+no_connect")))
    (net (code "18") (name "unconnected-(A1-A6-Pad25)")
      (node (ref "A1") (pin "25") (pinfunction "A6") (pintype "bidirectional+no_connect")))
    (net (code "19") (name "unconnected-(A1-A7-Pad26)")
      (node (ref "A1") (pin "26") (pinfunction "A7") (pintype "bidirectional+no_connect")))
    (net (code "20") (name "unconnected-(A1-AREF-Pad18)")
      (node (ref "A1") (pin "18") (pinfunction "AREF") (pintype "input+no_connect")))
    (net (code "21") (name "unconnected-(A1-D2-Pad5)")
      (node (ref "A1") (pin "5") (pinfunction "D2") (pintype "bidirectional+no_connect")))
    (net (code "22") (name "unconnected-(A1-D3-Pad6)")
      (node (ref "A1") (pin "6") (pinfunction "D3") (pintype "bidirectional+no_connect")))
    (net (code "23") (name "unconnected-(A1-D4-Pad7)")
      (node (ref "A1") (pin "7") (pinfunction "D4") (pintype "bidirectional+no_connect")))
    (net (code "24") (name "unconnected-(A1-D5-Pad8)")
      (node (ref "A1") (pin "8") (pinfunction "D5") (pintype "bidirectional+no_connect")))
    (net (code "25") (name "unconnected-(A1-D6-Pad9)")
      (node (ref "A1") (pin "9") (pinfunction "D6") (pintype "bidirectional+no_connect")))
    (net (code "26") (name "unconnected-(A1-D9-Pad12)")
      (node (ref "A1") (pin "12") (pinfunction "D9") (pintype "bidirectional+no_connect")))
    (net (code "27") (name "unconnected-(A1-D10-Pad13)")
      (node (ref "A1") (pin "13") (pinfunction "D10") (pintype "bidirectional+no_connect")))
    (net (code "28") (name "unconnected-(A1-~{RESET}-Pad3)")
      (node (ref "A1") (pin "3") (pinfunction "~{RESET}") (pintype "input+no_connect")))
    (net (code "29") (name "unconnected-(A1-~{RESET}-Pad28)")
      (node (ref "A1") (pin "28") (pinfunction "~{RESET}") (pintype "input+no_connect")))
    (net (code "30") (name "unconnected-(U1-IRQ-Pad8)")
      (node (ref "U1") (pin "8") (pinfunction "IRQ") (pintype "output+no_connect")))))