Target: LEDSAT

Observer: Ten
Start Time (UTC)            Stop Time (UTC)               Duration (s)         
01 Jul 2023 19:20:23.408    01 Jul 2023 19:27:26.229      422.82076754    
01 Jul 2023 20:56:35.746    01 Jul 2023 21:00:18.597      222.85122913    
02 Jul 2023 08:28:16.665    02 Jul 2023 08:35:51.098      454.43300712    
02 Jul 2023 19:10:35.811    02 Jul 2023 19:17:12.230      396.41905529    
02 Jul 2023 20:45:44.882    02 Jul 2023 20:50:52.465      307.58361976    
03 Jul 2023 08:18:17.738    03 Jul 2023 08:25:40.659      442.92152353    
03 Jul 2023 09:54:20.508    03 Jul 2023 09:57:31.670      191.16210969    
03 Jul 2023 19:00:54.182    03 Jul 2023 19:06:53.954      359.77184284    
03 Jul 2023 20:35:09.651    03 Jul 2023 20:41:12.378      362.72706751    
04 Jul 2023 08:08:22.373    04 Jul 2023 08:15:25.049      422.67600338    
04 Jul 2023 09:43:37.610    04 Jul 2023 09:48:19.358      281.74811534    
04 Jul 2023 18:51:20.207    04 Jul 2023 18:56:29.749      309.54204808    
04 Jul 2023 20:24:43.672    04 Jul 2023 20:31:24.688      401.01629826    
05 Jul 2023 07:58:31.380    05 Jul 2023 08:05:03.449      392.06877745    
05 Jul 2023 09:33:09.272    05 Jul 2023 09:38:50.713      341.44156011    
05 Jul 2023 18:41:57.947    05 Jul 2023 18:45:55.587      237.64027051    
05 Jul 2023 20:14:24.515    05 Jul 2023 20:21:31.806      427.29101399    
06 Jul 2023 07:48:46.281    06 Jul 2023 07:54:34.323      348.04259017    
06 Jul 2023 09:22:48.313    06 Jul 2023 09:29:12.952      384.63873358    
06 Jul 2023 18:33:05.602    06 Jul 2023 18:34:53.308      107.70615017    
06 Jul 2023 20:04:10.980    06 Jul 2023 20:11:34.920      443.94072817    
07 Jul 2023 07:39:10.367    07 Jul 2023 07:43:54.354      283.98662192    
07 Jul 2023 09:12:32.280    07 Jul 2023 09:19:28.561      416.28033078    
07 Jul 2023 19:54:02.417    07 Jul 2023 20:01:34.675      452.25782624    
08 Jul 2023 07:29:54.150    08 Jul 2023 07:32:52.999      178.84854114    
08 Jul 2023 09:02:20.037    08 Jul 2023 09:09:38.705      438.66782124    
08 Jul 2023 19:43:58.493    08 Jul 2023 19:51:31.407      452.91435400    
09 Jul 2023 08:52:11.005    09 Jul 2023 08:59:43.984      452.97941569    
09 Jul 2023 19:33:59.093    09 Jul 2023 19:41:25.241      446.14817603    
10 Jul 2023 08:42:04.914    10 Jul 2023 08:49:44.690      459.77651377    
10 Jul 2023 19:24:04.297    10 Jul 2023 19:31:16.109      431.81246150    
10 Jul 2023 21:00:50.541    10 Jul 2023 21:03:40.927      170.38603015    
11 Jul 2023 08:32:01.702    11 Jul 2023 08:39:40.897      459.19539956    
11 Jul 2023 19:14:14.409    11 Jul 2023 19:21:03.729      409.32009614    
11 Jul 2023 20:49:47.697    11 Jul 2023 20:54:26.096      278.39919875    
12 Jul 2023 08:22:01.492    12 Jul 2023 08:29:32.491      450.99902322    
12 Jul 2023 09:58:31.772    12 Jul 2023 10:00:49.255      137.48273158    
12 Jul 2023 19:04:30.058    12 Jul 2023 19:10:47.497      377.43876760    
12 Jul 2023 20:39:07.233    12 Jul 2023 20:44:50.581      343.34806191    
13 Jul 2023 08:12:04.614    13 Jul 2023 08:19:19.143      434.52921684    
13 Jul 2023 09:47:36.800    13 Jul 2023 09:51:49.856      253.05544948    
13 Jul 2023 18:54:52.473    13 Jul 2023 19:00:26.216      333.74340828    
13 Jul 2023 20:28:37.813    13 Jul 2023 20:35:05.686      387.87268619    
14 Jul 2023 08:02:11.692    14 Jul 2023 08:09:00.222      408.52969042    
14 Jul 2023 09:37:04.311    14 Jul 2023 09:42:26.180      321.86934713    
14 Jul 2023 18:45:24.318    14 Jul 2023 18:49:57.255      272.93663974    
14 Jul 2023 20:18:15.993    14 Jul 2023 20:25:14.830      418.83706134    
15 Jul 2023 07:52:23.873    15 Jul 2023 07:58:34.571      370.69795788    
15 Jul 2023 09:26:40.956    15 Jul 2023 09:32:51.614      370.65861616    
15 Jul 2023 18:36:13.712    15 Jul 2023 18:39:12.533      178.82091387    
15 Jul 2023 20:08:00.199    15 Jul 2023 20:15:19.576      439.37732127    
16 Jul 2023 07:42:43.444    16 Jul 2023 07:47:59.883      316.43867288    
16 Jul 2023 09:16:23.232    16 Jul 2023 09:23:09.694      406.46181508    
16 Jul 2023 19:57:49.596    16 Jul 2023 20:05:20.749      451.15268802    
17 Jul 2023 07:33:16.238    17 Jul 2023 07:37:10.293      234.05527719    
17 Jul 2023 09:06:09.642    17 Jul 2023 09:13:21.949      432.30652157    
17 Jul 2023 19:47:43.737    17 Jul 2023 19:55:18.797      455.05907022    
18 Jul 2023 07:24:47.613    18 Jul 2023 07:25:20.407      32.794340956    
18 Jul 2023 08:55:59.437    18 Jul 2023 09:03:29.153      449.71611081    
18 Jul 2023 19:37:42.422    18 Jul 2023 19:45:13.926      451.50438754    
19 Jul 2023 08:45:52.242    19 Jul 2023 08:53:31.702      459.45941946    
19 Jul 2023 19:27:45.646    19 Jul 2023 19:35:06.153      440.50679676    
19 Jul 2023 21:05:20.351    19 Jul 2023 21:06:48.846      88.495082071    
20 Jul 2023 08:35:47.920    20 Jul 2023 08:43:29.750      461.82971533    
20 Jul 2023 19:17:53.611    20 Jul 2023 19:24:55.296      421.68522250    
20 Jul 2023 20:53:53.077    20 Jul 2023 20:57:57.798      244.72092009    
21 Jul 2023 08:25:46.517    21 Jul 2023 08:33:23.259      456.74174567    
21 Jul 2023 19:08:06.780    21 Jul 2023 19:14:40.913      394.13208885    
21 Jul 2023 20:43:06.099    21 Jul 2023 20:48:28.166      322.06665765    
22 Jul 2023 08:15:48.272    22 Jul 2023 08:23:11.996      443.72382034    
22 Jul 2023 09:51:39.885    22 Jul 2023 09:55:16.656      216.77101889    
22 Jul 2023 18:58:26.063    22 Jul 2023 19:04:22.124      356.06149501    
22 Jul 2023 20:32:32.836    22 Jul 2023 20:38:46.498      373.66197916    
23 Jul 2023 08:05:53.670    23 Jul 2023 08:12:55.473      421.80289153    
23 Jul 2023 09:41:01.577    23 Jul 2023 09:45:59.590      298.01314512    
23 Jul 2023 18:48:53.297    23 Jul 2023 18:53:57.124      303.82705444    
23 Jul 2023 20:22:08.192    23 Jul 2023 20:28:57.863      409.67123177    
24 Jul 2023 07:56:03.596    24 Jul 2023 08:02:32.797      389.20055976    
24 Jul 2023 09:30:35.282    24 Jul 2023 09:36:28.730      353.44851287    
24 Jul 2023 18:39:33.071    24 Jul 2023 18:43:21.359      228.28832968    
24 Jul 2023 20:11:50.075    24 Jul 2023 20:19:04.334      434.25953885    
25 Jul 2023 07:46:19.728    25 Jul 2023 07:52:02.271      342.54310909    
25 Jul 2023 09:20:15.619    25 Jul 2023 09:26:49.497      393.87755203    
25 Jul 2023 18:30:50.163    25 Jul 2023 18:32:10.094      79.930945323    
25 Jul 2023 20:01:37.421    25 Jul 2023 20:09:06.966      449.54481226    
26 Jul 2023 07:36:45.818    26 Jul 2023 07:41:20.119      274.30135491    
26 Jul 2023 09:10:00.552    26 Jul 2023 09:17:03.956      423.40402259    
26 Jul 2023 19:51:29.652    26 Jul 2023 19:59:06.333      456.68108636    
27 Jul 2023 07:27:35.158    27 Jul 2023 07:30:13.015      157.85775811    
27 Jul 2023 08:59:49.105    27 Jul 2023 09:07:13.115      444.00977640    
27 Jul 2023 19:41:26.476    27 Jul 2023 19:49:02.732      456.25608332    
28 Jul 2023 08:49:40.779    28 Jul 2023 08:57:17.494      456.71425386    
28 Jul 2023 19:31:27.809    28 Jul 2023 19:38:56.255      448.44618207    
29 Jul 2023 08:39:35.352    29 Jul 2023 08:47:17.334      461.98177238    
29 Jul 2023 19:21:33.760    29 Jul 2023 19:28:46.810      433.04917684    
29 Jul 2023 20:58:02.845    29 Jul 2023 21:01:26.009      203.16418230    
30 Jul 2023 08:29:32.798    30 Jul 2023 08:37:12.673      459.87489070    
30 Jul 2023 19:11:44.667    30 Jul 2023 19:18:34.081      409.41416058    
30 Jul 2023 20:47:06.995    30 Jul 2023 20:52:04.627      297.63158695    
31 Jul 2023 08:19:33.276    31 Jul 2023 08:27:03.361      450.08506594    
31 Jul 2023 09:55:49.490    31 Jul 2023 09:58:36.836      167.34676128    
31 Jul 2023 19:02:01.205    31 Jul 2023 19:08:17.418      376.21347941    
31 Jul 2023 20:36:29.281    31 Jul 2023 20:42:26.803      357.52123771    
01 Aug 2023 08:09:37.159    01 Aug 2023 08:16:49.024      431.86506538    
01 Aug 2023 09:45:01.680    01 Aug 2023 09:49:30.016      268.33570884    
01 Aug 2023 18:52:24.695    01 Aug 2023 18:57:55.532      330.83618707    
01 Aug 2023 20:26:01.574    01 Aug 2023 20:32:40.633      399.05877896    
02 Aug 2023 07:59:45.143    02 Aug 2023 08:06:28.962      403.81919023    
02 Aug 2023 09:34:31.523    02 Aug 2023 09:40:03.744      332.22161760    
02 Aug 2023 18:42:58.056    02 Aug 2023 18:47:25.538      267.48179637    
02 Aug 2023 20:15:41.033    02 Aug 2023 20:22:48.940      427.90681890    
03 Aug 2023 07:49:58.506    03 Aug 2023 07:56:01.880      363.37424767    
03 Aug 2023 09:24:09.519    03 Aug 2023 09:30:27.555      378.03638714    
03 Aug 2023 18:33:50.702    03 Aug 2023 18:36:38.059      167.35727533    
03 Aug 2023 20:05:26.293    03 Aug 2023 20:12:53.072      446.77948641    
04 Aug 2023 07:40:19.878    04 Aug 2023 07:45:25.130      305.25170756    
04 Aug 2023 09:13:52.760    04 Aug 2023 09:20:44.393      411.63352059    
04 Aug 2023 19:55:16.619    04 Aug 2023 20:02:53.758      457.13917518    
05 Aug 2023 07:30:56.474    05 Aug 2023 07:34:31.465      214.99025632    
05 Aug 2023 09:03:39.943    05 Aug 2023 09:10:55.590      435.64701278    
05 Aug 2023 19:45:11.621    05 Aug 2023 19:52:51.392      459.77074283    
06 Aug 2023 08:53:30.411    06 Aug 2023 09:01:01.830      451.41926680    
06 Aug 2023 19:35:11.134    06 Aug 2023 19:42:46.142      455.00777706    
07 Aug 2023 08:43:23.841    07 Aug 2023 08:51:03.456      459.61416489    
07 Aug 2023 19:25:15.187    07 Aug 2023 19:32:37.995      442.80803591    
07 Aug 2023 21:02:21.337    07 Aug 2023 21:04:46.487      145.15040744    
08 Aug 2023 08:33:20.134    08 Aug 2023 08:41:00.583      460.44859886    
08 Aug 2023 19:15:24.010    08 Aug 2023 19:22:26.739      422.72838346    
08 Aug 2023 20:51:10.956    08 Aug 2023 20:55:38.998      268.04183281    
09 Aug 2023 08:23:19.372    09 Aug 2023 08:30:53.138      453.76608915    
09 Aug 2023 10:00:15.565    09 Aug 2023 10:01:40.090      84.524894832    
09 Aug 2023 19:05:38.111    09 Aug 2023 19:12:11.890      393.77846788    
09 Aug 2023 20:40:27.770    09 Aug 2023 20:46:06.021      338.25108286    
10 Aug 2023 08:13:21.836    10 Aug 2023 08:20:40.846      439.00969665    
10 Aug 2023 09:49:05.464    10 Aug 2023 09:52:56.264      230.80015315    
10 Aug 2023 18:55:58.469    10 Aug 2023 19:01:52.498      354.02876049    
10 Aug 2023 20:29:56.620    10 Aug 2023 20:36:22.680      386.06031578    
11 Aug 2023 08:03:28.075    11 Aug 2023 08:10:23.154      415.07904982    
11 Aug 2023 09:38:29.816    11 Aug 2023 09:43:36.165      306.34832389    
11 Aug 2023 18:46:27.089    11 Aug 2023 18:51:26.590      299.50104158    
11 Aug 2023 20:19:33.477    11 Aug 2023 20:26:32.979      419.50262206    
12 Aug 2023 07:53:39.088    12 Aug 2023 07:59:59.051      379.96371556    
12 Aug 2023 09:28:04.861    12 Aug 2023 09:34:03.591      358.73080889    
12 Aug 2023 18:37:09.153    12 Aug 2023 18:40:49.021      219.86822850    
12 Aug 2023 20:09:16.565    12 Aug 2023 20:16:38.677      442.11256939    
13 Aug 2023 07:43:56.817    13 Aug 2023 07:49:26.579      329.76204848    
13 Aug 2023 09:17:46.095    13 Aug 2023 09:24:23.083      396.98789682    
13 Aug 2023 18:28:43.134    13 Aug 2023 18:29:21.358      38.224753691    
13 Aug 2023 19:59:04.955    13 Aug 2023 20:06:40.694      455.73987836    
14 Aug 2023 07:34:25.865    14 Aug 2023 07:38:41.111      255.24593813    
14 Aug 2023 09:07:31.722    14 Aug 2023 09:14:36.467      424.74549464    
14 Aug 2023 19:48:58.139    14 Aug 2023 19:56:39.536      461.39689323    
15 Aug 2023 07:25:26.712    15 Aug 2023 07:27:22.127      115.41471735    
15 Aug 2023 08:57:20.865    15 Aug 2023 09:04:44.651      443.78600348    
15 Aug 2023 19:38:55.871    15 Aug 2023 19:46:35.452      459.58183286    
16 Aug 2023 08:47:13.081    16 Aug 2023 08:54:48.101      455.02008211    
16 Aug 2023 19:28:58.101    16 Aug 2023 19:36:28.504      450.40259559    
17 Aug 2023 08:37:08.183    17 Aug 2023 08:44:47.020      458.83647662    
17 Aug 2023 19:19:04.972    17 Aug 2023 19:26:18.563      433.59108071    
17 Aug 2023 20:55:19.500    17 Aug 2023 20:59:09.629      230.12946993    
18 Aug 2023 08:27:06.182    18 Aug 2023 08:34:41.412      455.23006230    
18 Aug 2023 19:09:16.862    18 Aug 2023 19:16:05.276      408.41444952    
18 Aug 2023 20:44:28.951    18 Aug 2023 20:49:43.352      314.40157526    
19 Aug 2023 08:17:07.272    19 Aug 2023 08:24:31.087      443.81438324    
19 Aug 2023 09:53:14.679    19 Aug 2023 09:56:16.275      181.59572971    
19 Aug 2023 18:59:34.511    19 Aug 2023 19:05:47.925      373.41364076    
19 Aug 2023 20:33:53.736    19 Aug 2023 20:40:03.424      369.68769191    
20 Aug 2023 08:07:11.885    20 Aug 2023 08:14:15.615      423.73073482    
20 Aug 2023 09:42:30.305    20 Aug 2023 09:47:05.561      275.25598317    
20 Aug 2023 18:49:59.379    20 Aug 2023 18:55:25.084      325.70531506    
20 Aug 2023 20:23:27.701    20 Aug 2023 20:30:15.968      408.26717707    
21 Aug 2023 07:57:20.809    21 Aug 2023 08:03:54.200      393.39114506    
21 Aug 2023 09:32:01.481    21 Aug 2023 09:37:37.497      336.01662379    
21 Aug 2023 18:40:34.776    21 Aug 2023 18:44:53.476      258.70083414    
21 Aug 2023 20:13:08.462    21 Aug 2023 20:20:23.350      434.88817845    
22 Aug 2023 07:47:35.527    22 Aug 2023 07:53:25.346      349.81968618    
22 Aug 2023 09:21:40.288    22 Aug 2023 09:28:00.042      379.75357758    
22 Aug 2023 18:31:32.486    22 Aug 2023 18:34:01.355      148.86915016    
22 Aug 2023 20:02:54.829    22 Aug 2023 20:10:26.744      451.91595114    
23 Aug 2023 07:37:59.219    23 Aug 2023 07:42:45.849      286.62913959    
23 Aug 2023 09:11:24.123    23 Aug 2023 09:18:15.833      411.71021217    
23 Aug 2023 19:52:46.154    23 Aug 2023 20:00:26.795      460.64061904    
24 Aug 2023 07:28:41.805    24 Aug 2023 07:31:45.759      183.95417598    
24 Aug 2023 09:01:11.794    24 Aug 2023 09:08:26.091      434.29727376    
24 Aug 2023 19:42:42.099    24 Aug 2023 19:50:23.842      461.74365194    
25 Aug 2023 08:51:02.700    25 Aug 2023 08:58:31.444      448.74451517    
25 Aug 2023 19:32:42.537    25 Aug 2023 19:40:18.020      455.48300394    
26 Aug 2023 08:40:56.556    26 Aug 2023 08:48:32.198      455.64205715    
26 Aug 2023 19:22:47.531    26 Aug 2023 19:30:09.278      441.74676407    
26 Aug 2023 20:59:35.551    26 Aug 2023 21:02:33.308      177.75710199    
27 Aug 2023 08:30:53.292    27 Aug 2023 08:38:28.436      455.14414256    
27 Aug 2023 19:12:57.355    27 Aug 2023 19:19:57.364      420.00903779    
27 Aug 2023 20:48:33.522    27 Aug 2023 20:53:17.798      284.27674557    
28 Aug 2023 08:20:53.026    28 Aug 2023 08:28:20.052      447.02577858    
28 Aug 2023 09:57:35.615    28 Aug 2023 09:59:23.584      107.96877542    
28 Aug 2023 19:03:12.577    28 Aug 2023 19:09:41.731      389.15378560    
28 Aug 2023 20:37:53.213    28 Aug 2023 20:43:42.261      349.04782794    
29 Aug 2023 08:10:56.085    29 Aug 2023 08:18:06.722      430.63686029    
29 Aug 2023 09:46:33.350    29 Aug 2023 09:50:31.418      238.06852615    
29 Aug 2023 18:53:34.298    29 Aug 2023 18:59:21.308      347.01051879    
29 Aug 2023 20:27:23.836    29 Aug 2023 20:33:57.452      393.61607909    
30 Aug 2023 08:01:03.091    30 Aug 2023 08:07:47.816      404.72499904    
30 Aug 2023 09:35:59.222    30 Aug 2023 09:41:09.302      310.08011189    


Number of events : 203


