(module "BPJC252R" (layer F.Cu)
  (descr "BPJC-252R+-6")
  (tags "Filter")
  (attr smd)
  (fp_text reference FL** (at 0.000 -0) (layer F.SilkS)
    (effects (font (size 1.27 1.27) (thickness 0.254)))
  )
  (fp_text user %R (at 0.000 -0) (layer F.Fab)
    (effects (font (size 1.27 1.27) (thickness 0.254)))
  )
  (fp_text value "BPJC252R" (at 0.000 -0) (layer F.SilkS) hide
    (effects (font (size 1.27 1.27) (thickness 0.254)))
  )
  (fp_line (start -0.8 0.395) (end 0.8 0.395) (layer F.Fab) (width 0.1))
  (fp_line (start 0.8 0.395) (end 0.8 -0.395) (layer F.Fab) (width 0.1))
  (fp_line (start 0.8 -0.395) (end -0.8 -0.395) (layer F.Fab) (width 0.1))
  (fp_line (start -0.8 -0.395) (end -0.8 0.395) (layer F.Fab) (width 0.1))
  (fp_line (start -2.28 -1.915) (end 2.28 -1.915) (layer F.CrtYd) (width 0.1))
  (fp_line (start 2.28 -1.915) (end 2.28 1.915) (layer F.CrtYd) (width 0.1))
  (fp_line (start 2.28 1.915) (end -2.28 1.915) (layer F.CrtYd) (width 0.1))
  (fp_line (start -2.28 1.915) (end -2.28 -1.915) (layer F.CrtYd) (width 0.1))
  (fp_line (start -1.8 -0) (end -1.8 -0) (layer F.SilkS) (width 0.1))
  (fp_line (start -1.7 -0) (end -1.7 -0) (layer F.SilkS) (width 0.1))
  (fp_arc (start -1.75 -0) (end -1.800 -0) (angle -180) (layer F.SilkS) (width 0.1))
  (fp_arc (start -1.75 -0) (end -1.700 -0) (angle -180) (layer F.SilkS) (width 0.1))
  (pad 1 smd rect (at -0.950 -0 90) (size 0.300 0.660) (layers F.Cu F.Paste F.Mask))
  (pad 2 smd rect (at 0.000 0.56 90) (size 0.710 0.810) (layers F.Cu F.Paste F.Mask))
  (pad 3 smd rect (at 0.950 -0 90) (size 0.300 0.660) (layers F.Cu F.Paste F.Mask))
  (pad 4 smd rect (at 0.000 -0.56 90) (size 0.710 0.810) (layers F.Cu F.Paste F.Mask))
  (model BPJC-252R+.stp
    (at (xyz 0 0 0))
    (scale (xyz 1 1 1))
    (rotate (xyz 0 0 0))
  )
)
