(module "LFCG2500" (layer F.Cu)
  (descr "LFCG-2500+-1")
  (tags "Filter")
  (attr smd)
  (fp_text reference FL** (at 0.000 -0) (layer F.SilkS)
    (effects (font (size 1.27 1.27) (thickness 0.254)))
  )
  (fp_text user %R (at 0.000 -0) (layer F.Fab)
    (effects (font (size 1.27 1.27) (thickness 0.254)))
  )
  (fp_text value "LFCG2500" (at 0.000 -0) (layer F.SilkS) hide
    (effects (font (size 1.27 1.27) (thickness 0.254)))
  )
  (fp_line (start -1 -0.625) (end 1 -0.625) (layer F.Fab) (width 0.1))
  (fp_line (start 1 -0.625) (end 1 0.625) (layer F.Fab) (width 0.1))
  (fp_line (start 1 0.625) (end -1 0.625) (layer F.Fab) (width 0.1))
  (fp_line (start -1 0.625) (end -1 -0.625) (layer F.Fab) (width 0.1))
  (fp_line (start -2.7 -2.4) (end 2.7 -2.4) (layer F.CrtYd) (width 0.1))
  (fp_line (start 2.7 -2.4) (end 2.7 2.4) (layer F.CrtYd) (width 0.1))
  (fp_line (start 2.7 2.4) (end -2.7 2.4) (layer F.CrtYd) (width 0.1))
  (fp_line (start -2.7 2.4) (end -2.7 -2.4) (layer F.CrtYd) (width 0.1))
  (fp_line (start -0.65 1.8) (end -0.65 1.8) (layer F.SilkS) (width 0.1))
  (fp_line (start -0.65 1.9) (end -0.65 1.9) (layer F.SilkS) (width 0.1))
  (fp_arc (start -0.65 1.85) (end -0.650 1.8) (angle -180) (layer F.SilkS) (width 0.1))
  (fp_arc (start -0.65 1.85) (end -0.650 1.9) (angle -180) (layer F.SilkS) (width 0.1))
  (pad 1 smd rect (at -0.650 0.9 0) (size 0.350 1.000) (layers F.Cu F.Paste F.Mask))
  (pad 2 smd rect (at -0.000 0.9 0) (size 0.350 1.000) (layers F.Cu F.Paste F.Mask))
  (pad 3 smd rect (at 0.650 0.9 0) (size 0.350 1.000) (layers F.Cu F.Paste F.Mask))
  (pad 4 smd rect (at 1.200 -0 90) (size 0.350 1.000) (layers F.Cu F.Paste F.Mask))
  (pad 5 smd rect (at 0.650 -0.9 0) (size 0.350 1.000) (layers F.Cu F.Paste F.Mask))
  (pad 6 smd rect (at -0.000 -0.9 0) (size 0.350 1.000) (layers F.Cu F.Paste F.Mask))
  (pad 7 smd rect (at -0.650 -0.9 0) (size 0.350 1.000) (layers F.Cu F.Paste F.Mask))
  (pad 8 smd rect (at -1.200 -0 90) (size 0.350 1.000) (layers F.Cu F.Paste F.Mask))
  (model LFCG-2500+.stp
    (at (xyz 0 0 0))
    (scale (xyz 1 1 1))
    (rotate (xyz 0 0 0))
  )
)
