%TF.GenerationSoftware,KiCad,Pcbnew,7.0.0-da2b9df05c~171~ubuntu22.04.1*%
%TF.CreationDate,2023-04-06T22:29:12+03:00*%
%TF.ProjectId,satnogs-comms,7361746e-6f67-4732-9d63-6f6d6d732e6b,rev?*%
%TF.SameCoordinates,Original*%
%TF.FileFunction,Drillmap*%
%TF.FilePolarity,Positive*%
%FSLAX45Y45*%
G04 Gerber Fmt 4.5, Leading zero omitted, Abs format (unit mm)*
G04 Created by KiCad (PCBNEW 7.0.0-da2b9df05c~171~ubuntu22.04.1) date 2023-04-06 22:29:12*
%MOMM*%
%LPD*%
G01*
G04 APERTURE LIST*
%ADD10C,0.100000*%
%ADD11C,0.200000*%
%ADD12C,0.080000*%
G04 APERTURE END LIST*
D10*
X8350250Y-9936480D02*
G75*
G03*
X8255000Y-10031730I0J-95250D01*
G01*
X8350250Y-9936480D02*
G75*
G03*
X8445500Y-9841230I0J95250D01*
G01*
X8445500Y-8002270D02*
G75*
G03*
X8350250Y-7907020I-95250J0D01*
G01*
X8255000Y-7811770D02*
G75*
G03*
X8350250Y-7907020I95250J0D01*
G01*
X8350250Y-4127500D02*
G75*
G03*
X8255000Y-4222750I0J-95250D01*
G01*
X17272000Y-4222750D02*
G75*
G03*
X17176750Y-4127500I-95250J0D01*
G01*
X17176750Y-13716000D02*
G75*
G03*
X17272000Y-13620750I0J95250D01*
G01*
X17176750Y-7907020D02*
G75*
G03*
X17272000Y-7811770I0J95250D01*
G01*
X17272000Y-10031730D02*
G75*
G03*
X17176750Y-9936480I-95250J0D01*
G01*
X17081500Y-8002270D02*
X17081500Y-9841230D01*
X17272000Y-4222750D02*
X17272000Y-7811770D01*
X17176750Y-7907020D02*
G75*
G03*
X17081500Y-8002270I0J-95250D01*
G01*
X11766550Y-13716000D02*
G75*
G03*
X11861800Y-13620750I0J95250D01*
G01*
X11957050Y-13525500D02*
G75*
G03*
X11861800Y-13620750I0J-95250D01*
G01*
X13893800Y-13620750D02*
G75*
G03*
X13798550Y-13525500I-95250J0D01*
G01*
X13893800Y-13620750D02*
G75*
G03*
X13989050Y-13716000I95250J0D01*
G01*
X8350250Y-13716000D02*
X11766550Y-13716000D01*
X11957050Y-13525500D02*
X13798550Y-13525500D01*
X13989050Y-13716000D02*
X17176750Y-13716000D01*
X11861800Y-4222750D02*
G75*
G03*
X11766550Y-4127500I-95250J0D01*
G01*
X8350250Y-4127500D02*
X11766550Y-4127500D01*
X13989050Y-4127500D02*
X17176750Y-4127500D01*
X13989050Y-4127500D02*
G75*
G03*
X13893800Y-4222750I0J-95250D01*
G01*
X11861800Y-4222750D02*
G75*
G03*
X11957050Y-4318000I95250J0D01*
G01*
X11957050Y-4318000D02*
X13798550Y-4318000D01*
X13798550Y-4318000D02*
G75*
G03*
X13893800Y-4222750I0J95250D01*
G01*
X17081500Y-9841230D02*
G75*
G03*
X17176750Y-9936480I95250J0D01*
G01*
X8355090Y-12120840D02*
G75*
G03*
X8450340Y-12025588I0J95250D01*
G01*
X8355090Y-11480842D02*
X8255000Y-11480800D01*
X8450340Y-12025588D02*
X8450340Y-11975840D01*
X17170750Y-11480840D02*
G75*
G03*
X17075500Y-11576092I0J-95250D01*
G01*
X17075500Y-12025630D02*
G75*
G03*
X17170750Y-12120880I95250J0D01*
G01*
X17075500Y-12025630D02*
X17075500Y-11975840D01*
X17272000Y-11480800D02*
X17272000Y-10031730D01*
X8255000Y-12120880D02*
X8355090Y-12120838D01*
X17272000Y-12120880D02*
X17272000Y-13620750D01*
X8450338Y-11576092D02*
G75*
G03*
X8355090Y-11480842I-95248J2D01*
G01*
X8450340Y-11625840D02*
X8450340Y-11576092D01*
X17272000Y-12120880D02*
X17170750Y-12120880D01*
X8255000Y-4222750D02*
X8255000Y-7811770D01*
X17075500Y-11576092D02*
X17075500Y-11625840D01*
X8255000Y-13620750D02*
G75*
G03*
X8350250Y-13716000I95250J0D01*
G01*
X8255000Y-12120880D02*
X8255000Y-13620750D01*
X17272000Y-11480800D02*
X17170750Y-11480842D01*
X8445500Y-8002270D02*
X8445500Y-9841230D01*
X8255000Y-11480800D02*
X8255000Y-10031730D01*
D11*
D12*
X9163720Y-6094300D02*
X9243720Y-6174300D01*
X9243720Y-6094300D02*
X9163720Y-6174300D01*
X9163720Y-9304300D02*
X9243720Y-9384300D01*
X9243720Y-9304300D02*
X9163720Y-9384300D01*
X11943720Y-6094300D02*
X12023720Y-6174300D01*
X12023720Y-6094300D02*
X11943720Y-6174300D01*
X11943720Y-9304300D02*
X12023720Y-9384300D01*
X12023720Y-9304300D02*
X11943720Y-9384300D01*
D11*
X9023720Y-5839300D02*
G75*
G03*
X9023720Y-5839300I-100000J0D01*
G01*
X9023720Y-9639300D02*
G75*
G03*
X9023720Y-9639300I-100000J0D01*
G01*
X12123720Y-5839300D02*
G75*
G03*
X12123720Y-5839300I-100000J0D01*
G01*
X12123720Y-9639300D02*
G75*
G03*
X12123720Y-9639300I-100000J0D01*
G01*
X8497619Y-14014476D02*
X8497619Y-13814476D01*
X8497619Y-13814476D02*
X8545238Y-13814476D01*
X8545238Y-13814476D02*
X8573810Y-13824000D01*
X8573810Y-13824000D02*
X8592857Y-13843048D01*
X8592857Y-13843048D02*
X8602381Y-13862095D01*
X8602381Y-13862095D02*
X8611905Y-13900190D01*
X8611905Y-13900190D02*
X8611905Y-13928762D01*
X8611905Y-13928762D02*
X8602381Y-13966857D01*
X8602381Y-13966857D02*
X8592857Y-13985905D01*
X8592857Y-13985905D02*
X8573810Y-14004952D01*
X8573810Y-14004952D02*
X8545238Y-14014476D01*
X8545238Y-14014476D02*
X8497619Y-14014476D01*
X8697619Y-14014476D02*
X8697619Y-13881143D01*
X8697619Y-13919238D02*
X8707143Y-13900190D01*
X8707143Y-13900190D02*
X8716667Y-13890667D01*
X8716667Y-13890667D02*
X8735714Y-13881143D01*
X8735714Y-13881143D02*
X8754762Y-13881143D01*
X8821429Y-14014476D02*
X8821429Y-13881143D01*
X8821429Y-13814476D02*
X8811905Y-13824000D01*
X8811905Y-13824000D02*
X8821429Y-13833524D01*
X8821429Y-13833524D02*
X8830952Y-13824000D01*
X8830952Y-13824000D02*
X8821429Y-13814476D01*
X8821429Y-13814476D02*
X8821429Y-13833524D01*
X8945238Y-14014476D02*
X8926190Y-14004952D01*
X8926190Y-14004952D02*
X8916667Y-13985905D01*
X8916667Y-13985905D02*
X8916667Y-13814476D01*
X9050000Y-14014476D02*
X9030952Y-14004952D01*
X9030952Y-14004952D02*
X9021429Y-13985905D01*
X9021429Y-13985905D02*
X9021429Y-13814476D01*
X9246190Y-14014476D02*
X9246190Y-13814476D01*
X9246190Y-13814476D02*
X9312857Y-13957333D01*
X9312857Y-13957333D02*
X9379524Y-13814476D01*
X9379524Y-13814476D02*
X9379524Y-14014476D01*
X9560476Y-14014476D02*
X9560476Y-13909714D01*
X9560476Y-13909714D02*
X9550952Y-13890667D01*
X9550952Y-13890667D02*
X9531905Y-13881143D01*
X9531905Y-13881143D02*
X9493809Y-13881143D01*
X9493809Y-13881143D02*
X9474762Y-13890667D01*
X9560476Y-14004952D02*
X9541429Y-14014476D01*
X9541429Y-14014476D02*
X9493809Y-14014476D01*
X9493809Y-14014476D02*
X9474762Y-14004952D01*
X9474762Y-14004952D02*
X9465238Y-13985905D01*
X9465238Y-13985905D02*
X9465238Y-13966857D01*
X9465238Y-13966857D02*
X9474762Y-13947809D01*
X9474762Y-13947809D02*
X9493809Y-13938286D01*
X9493809Y-13938286D02*
X9541429Y-13938286D01*
X9541429Y-13938286D02*
X9560476Y-13928762D01*
X9655714Y-13881143D02*
X9655714Y-14081143D01*
X9655714Y-13890667D02*
X9674762Y-13881143D01*
X9674762Y-13881143D02*
X9712857Y-13881143D01*
X9712857Y-13881143D02*
X9731905Y-13890667D01*
X9731905Y-13890667D02*
X9741429Y-13900190D01*
X9741429Y-13900190D02*
X9750952Y-13919238D01*
X9750952Y-13919238D02*
X9750952Y-13976381D01*
X9750952Y-13976381D02*
X9741429Y-13995428D01*
X9741429Y-13995428D02*
X9731905Y-14004952D01*
X9731905Y-14004952D02*
X9712857Y-14014476D01*
X9712857Y-14014476D02*
X9674762Y-14014476D01*
X9674762Y-14014476D02*
X9655714Y-14004952D01*
X9836667Y-13995428D02*
X9846190Y-14004952D01*
X9846190Y-14004952D02*
X9836667Y-14014476D01*
X9836667Y-14014476D02*
X9827143Y-14004952D01*
X9827143Y-14004952D02*
X9836667Y-13995428D01*
X9836667Y-13995428D02*
X9836667Y-14014476D01*
X9836667Y-13890667D02*
X9846190Y-13900190D01*
X9846190Y-13900190D02*
X9836667Y-13909714D01*
X9836667Y-13909714D02*
X9827143Y-13900190D01*
X9827143Y-13900190D02*
X9836667Y-13890667D01*
X9836667Y-13890667D02*
X9836667Y-13909714D01*
D12*
X8170000Y-14321000D02*
X8250000Y-14401000D01*
X8250000Y-14321000D02*
X8170000Y-14401000D01*
D11*
X8535714Y-14234476D02*
X8554762Y-14234476D01*
X8554762Y-14234476D02*
X8573810Y-14244000D01*
X8573810Y-14244000D02*
X8583333Y-14253524D01*
X8583333Y-14253524D02*
X8592857Y-14272571D01*
X8592857Y-14272571D02*
X8602381Y-14310667D01*
X8602381Y-14310667D02*
X8602381Y-14358286D01*
X8602381Y-14358286D02*
X8592857Y-14396381D01*
X8592857Y-14396381D02*
X8583333Y-14415428D01*
X8583333Y-14415428D02*
X8573810Y-14424952D01*
X8573810Y-14424952D02*
X8554762Y-14434476D01*
X8554762Y-14434476D02*
X8535714Y-14434476D01*
X8535714Y-14434476D02*
X8516667Y-14424952D01*
X8516667Y-14424952D02*
X8507143Y-14415428D01*
X8507143Y-14415428D02*
X8497619Y-14396381D01*
X8497619Y-14396381D02*
X8488095Y-14358286D01*
X8488095Y-14358286D02*
X8488095Y-14310667D01*
X8488095Y-14310667D02*
X8497619Y-14272571D01*
X8497619Y-14272571D02*
X8507143Y-14253524D01*
X8507143Y-14253524D02*
X8516667Y-14244000D01*
X8516667Y-14244000D02*
X8535714Y-14234476D01*
X8688095Y-14415428D02*
X8697619Y-14424952D01*
X8697619Y-14424952D02*
X8688095Y-14434476D01*
X8688095Y-14434476D02*
X8678571Y-14424952D01*
X8678571Y-14424952D02*
X8688095Y-14415428D01*
X8688095Y-14415428D02*
X8688095Y-14434476D01*
X8811905Y-14320190D02*
X8792857Y-14310667D01*
X8792857Y-14310667D02*
X8783333Y-14301143D01*
X8783333Y-14301143D02*
X8773810Y-14282095D01*
X8773810Y-14282095D02*
X8773810Y-14272571D01*
X8773810Y-14272571D02*
X8783333Y-14253524D01*
X8783333Y-14253524D02*
X8792857Y-14244000D01*
X8792857Y-14244000D02*
X8811905Y-14234476D01*
X8811905Y-14234476D02*
X8850000Y-14234476D01*
X8850000Y-14234476D02*
X8869048Y-14244000D01*
X8869048Y-14244000D02*
X8878571Y-14253524D01*
X8878571Y-14253524D02*
X8888095Y-14272571D01*
X8888095Y-14272571D02*
X8888095Y-14282095D01*
X8888095Y-14282095D02*
X8878571Y-14301143D01*
X8878571Y-14301143D02*
X8869048Y-14310667D01*
X8869048Y-14310667D02*
X8850000Y-14320190D01*
X8850000Y-14320190D02*
X8811905Y-14320190D01*
X8811905Y-14320190D02*
X8792857Y-14329714D01*
X8792857Y-14329714D02*
X8783333Y-14339238D01*
X8783333Y-14339238D02*
X8773810Y-14358286D01*
X8773810Y-14358286D02*
X8773810Y-14396381D01*
X8773810Y-14396381D02*
X8783333Y-14415428D01*
X8783333Y-14415428D02*
X8792857Y-14424952D01*
X8792857Y-14424952D02*
X8811905Y-14434476D01*
X8811905Y-14434476D02*
X8850000Y-14434476D01*
X8850000Y-14434476D02*
X8869048Y-14424952D01*
X8869048Y-14424952D02*
X8878571Y-14415428D01*
X8878571Y-14415428D02*
X8888095Y-14396381D01*
X8888095Y-14396381D02*
X8888095Y-14358286D01*
X8888095Y-14358286D02*
X8878571Y-14339238D01*
X8878571Y-14339238D02*
X8869048Y-14329714D01*
X8869048Y-14329714D02*
X8850000Y-14320190D01*
X9011905Y-14234476D02*
X9030952Y-14234476D01*
X9030952Y-14234476D02*
X9050000Y-14244000D01*
X9050000Y-14244000D02*
X9059524Y-14253524D01*
X9059524Y-14253524D02*
X9069048Y-14272571D01*
X9069048Y-14272571D02*
X9078571Y-14310667D01*
X9078571Y-14310667D02*
X9078571Y-14358286D01*
X9078571Y-14358286D02*
X9069048Y-14396381D01*
X9069048Y-14396381D02*
X9059524Y-14415428D01*
X9059524Y-14415428D02*
X9050000Y-14424952D01*
X9050000Y-14424952D02*
X9030952Y-14434476D01*
X9030952Y-14434476D02*
X9011905Y-14434476D01*
X9011905Y-14434476D02*
X8992857Y-14424952D01*
X8992857Y-14424952D02*
X8983333Y-14415428D01*
X8983333Y-14415428D02*
X8973810Y-14396381D01*
X8973810Y-14396381D02*
X8964286Y-14358286D01*
X8964286Y-14358286D02*
X8964286Y-14310667D01*
X8964286Y-14310667D02*
X8973810Y-14272571D01*
X8973810Y-14272571D02*
X8983333Y-14253524D01*
X8983333Y-14253524D02*
X8992857Y-14244000D01*
X8992857Y-14244000D02*
X9011905Y-14234476D01*
X9202381Y-14234476D02*
X9221429Y-14234476D01*
X9221429Y-14234476D02*
X9240476Y-14244000D01*
X9240476Y-14244000D02*
X9250000Y-14253524D01*
X9250000Y-14253524D02*
X9259524Y-14272571D01*
X9259524Y-14272571D02*
X9269048Y-14310667D01*
X9269048Y-14310667D02*
X9269048Y-14358286D01*
X9269048Y-14358286D02*
X9259524Y-14396381D01*
X9259524Y-14396381D02*
X9250000Y-14415428D01*
X9250000Y-14415428D02*
X9240476Y-14424952D01*
X9240476Y-14424952D02*
X9221429Y-14434476D01*
X9221429Y-14434476D02*
X9202381Y-14434476D01*
X9202381Y-14434476D02*
X9183333Y-14424952D01*
X9183333Y-14424952D02*
X9173810Y-14415428D01*
X9173810Y-14415428D02*
X9164286Y-14396381D01*
X9164286Y-14396381D02*
X9154762Y-14358286D01*
X9154762Y-14358286D02*
X9154762Y-14310667D01*
X9154762Y-14310667D02*
X9164286Y-14272571D01*
X9164286Y-14272571D02*
X9173810Y-14253524D01*
X9173810Y-14253524D02*
X9183333Y-14244000D01*
X9183333Y-14244000D02*
X9202381Y-14234476D01*
X9354762Y-14434476D02*
X9354762Y-14301143D01*
X9354762Y-14320190D02*
X9364286Y-14310667D01*
X9364286Y-14310667D02*
X9383333Y-14301143D01*
X9383333Y-14301143D02*
X9411905Y-14301143D01*
X9411905Y-14301143D02*
X9430952Y-14310667D01*
X9430952Y-14310667D02*
X9440476Y-14329714D01*
X9440476Y-14329714D02*
X9440476Y-14434476D01*
X9440476Y-14329714D02*
X9450000Y-14310667D01*
X9450000Y-14310667D02*
X9469048Y-14301143D01*
X9469048Y-14301143D02*
X9497619Y-14301143D01*
X9497619Y-14301143D02*
X9516667Y-14310667D01*
X9516667Y-14310667D02*
X9526191Y-14329714D01*
X9526191Y-14329714D02*
X9526191Y-14434476D01*
X9621429Y-14434476D02*
X9621429Y-14301143D01*
X9621429Y-14320190D02*
X9630952Y-14310667D01*
X9630952Y-14310667D02*
X9650000Y-14301143D01*
X9650000Y-14301143D02*
X9678572Y-14301143D01*
X9678572Y-14301143D02*
X9697619Y-14310667D01*
X9697619Y-14310667D02*
X9707143Y-14329714D01*
X9707143Y-14329714D02*
X9707143Y-14434476D01*
X9707143Y-14329714D02*
X9716667Y-14310667D01*
X9716667Y-14310667D02*
X9735714Y-14301143D01*
X9735714Y-14301143D02*
X9764286Y-14301143D01*
X9764286Y-14301143D02*
X9783333Y-14310667D01*
X9783333Y-14310667D02*
X9792857Y-14329714D01*
X9792857Y-14329714D02*
X9792857Y-14434476D01*
X10150952Y-14224952D02*
X9979524Y-14482095D01*
X10375714Y-14234476D02*
X10394762Y-14234476D01*
X10394762Y-14234476D02*
X10413810Y-14244000D01*
X10413810Y-14244000D02*
X10423333Y-14253524D01*
X10423333Y-14253524D02*
X10432857Y-14272571D01*
X10432857Y-14272571D02*
X10442381Y-14310667D01*
X10442381Y-14310667D02*
X10442381Y-14358286D01*
X10442381Y-14358286D02*
X10432857Y-14396381D01*
X10432857Y-14396381D02*
X10423333Y-14415428D01*
X10423333Y-14415428D02*
X10413810Y-14424952D01*
X10413810Y-14424952D02*
X10394762Y-14434476D01*
X10394762Y-14434476D02*
X10375714Y-14434476D01*
X10375714Y-14434476D02*
X10356667Y-14424952D01*
X10356667Y-14424952D02*
X10347143Y-14415428D01*
X10347143Y-14415428D02*
X10337619Y-14396381D01*
X10337619Y-14396381D02*
X10328095Y-14358286D01*
X10328095Y-14358286D02*
X10328095Y-14310667D01*
X10328095Y-14310667D02*
X10337619Y-14272571D01*
X10337619Y-14272571D02*
X10347143Y-14253524D01*
X10347143Y-14253524D02*
X10356667Y-14244000D01*
X10356667Y-14244000D02*
X10375714Y-14234476D01*
X10528095Y-14415428D02*
X10537619Y-14424952D01*
X10537619Y-14424952D02*
X10528095Y-14434476D01*
X10528095Y-14434476D02*
X10518572Y-14424952D01*
X10518572Y-14424952D02*
X10528095Y-14415428D01*
X10528095Y-14415428D02*
X10528095Y-14434476D01*
X10661429Y-14234476D02*
X10680476Y-14234476D01*
X10680476Y-14234476D02*
X10699524Y-14244000D01*
X10699524Y-14244000D02*
X10709048Y-14253524D01*
X10709048Y-14253524D02*
X10718572Y-14272571D01*
X10718572Y-14272571D02*
X10728095Y-14310667D01*
X10728095Y-14310667D02*
X10728095Y-14358286D01*
X10728095Y-14358286D02*
X10718572Y-14396381D01*
X10718572Y-14396381D02*
X10709048Y-14415428D01*
X10709048Y-14415428D02*
X10699524Y-14424952D01*
X10699524Y-14424952D02*
X10680476Y-14434476D01*
X10680476Y-14434476D02*
X10661429Y-14434476D01*
X10661429Y-14434476D02*
X10642381Y-14424952D01*
X10642381Y-14424952D02*
X10632857Y-14415428D01*
X10632857Y-14415428D02*
X10623333Y-14396381D01*
X10623333Y-14396381D02*
X10613810Y-14358286D01*
X10613810Y-14358286D02*
X10613810Y-14310667D01*
X10613810Y-14310667D02*
X10623333Y-14272571D01*
X10623333Y-14272571D02*
X10632857Y-14253524D01*
X10632857Y-14253524D02*
X10642381Y-14244000D01*
X10642381Y-14244000D02*
X10661429Y-14234476D01*
X10794762Y-14234476D02*
X10918572Y-14234476D01*
X10918572Y-14234476D02*
X10851905Y-14310667D01*
X10851905Y-14310667D02*
X10880476Y-14310667D01*
X10880476Y-14310667D02*
X10899524Y-14320190D01*
X10899524Y-14320190D02*
X10909048Y-14329714D01*
X10909048Y-14329714D02*
X10918572Y-14348762D01*
X10918572Y-14348762D02*
X10918572Y-14396381D01*
X10918572Y-14396381D02*
X10909048Y-14415428D01*
X10909048Y-14415428D02*
X10899524Y-14424952D01*
X10899524Y-14424952D02*
X10880476Y-14434476D01*
X10880476Y-14434476D02*
X10823333Y-14434476D01*
X10823333Y-14434476D02*
X10804286Y-14424952D01*
X10804286Y-14424952D02*
X10794762Y-14415428D01*
X11109048Y-14434476D02*
X10994762Y-14434476D01*
X11051905Y-14434476D02*
X11051905Y-14234476D01*
X11051905Y-14234476D02*
X11032857Y-14263048D01*
X11032857Y-14263048D02*
X11013810Y-14282095D01*
X11013810Y-14282095D02*
X10994762Y-14291619D01*
X11290000Y-14234476D02*
X11194762Y-14234476D01*
X11194762Y-14234476D02*
X11185238Y-14329714D01*
X11185238Y-14329714D02*
X11194762Y-14320190D01*
X11194762Y-14320190D02*
X11213810Y-14310667D01*
X11213810Y-14310667D02*
X11261429Y-14310667D01*
X11261429Y-14310667D02*
X11280476Y-14320190D01*
X11280476Y-14320190D02*
X11290000Y-14329714D01*
X11290000Y-14329714D02*
X11299524Y-14348762D01*
X11299524Y-14348762D02*
X11299524Y-14396381D01*
X11299524Y-14396381D02*
X11290000Y-14415428D01*
X11290000Y-14415428D02*
X11280476Y-14424952D01*
X11280476Y-14424952D02*
X11261429Y-14434476D01*
X11261429Y-14434476D02*
X11213810Y-14434476D01*
X11213810Y-14434476D02*
X11194762Y-14424952D01*
X11194762Y-14424952D02*
X11185238Y-14415428D01*
X11375714Y-14234476D02*
X11375714Y-14272571D01*
X11451905Y-14234476D02*
X11451905Y-14272571D01*
X11714762Y-14510667D02*
X11705238Y-14501143D01*
X11705238Y-14501143D02*
X11686191Y-14472571D01*
X11686191Y-14472571D02*
X11676667Y-14453524D01*
X11676667Y-14453524D02*
X11667143Y-14424952D01*
X11667143Y-14424952D02*
X11657619Y-14377333D01*
X11657619Y-14377333D02*
X11657619Y-14339238D01*
X11657619Y-14339238D02*
X11667143Y-14291619D01*
X11667143Y-14291619D02*
X11676667Y-14263048D01*
X11676667Y-14263048D02*
X11686191Y-14244000D01*
X11686191Y-14244000D02*
X11705238Y-14215428D01*
X11705238Y-14215428D02*
X11714762Y-14205905D01*
X11876667Y-14301143D02*
X11876667Y-14434476D01*
X11829048Y-14224952D02*
X11781429Y-14367809D01*
X11781429Y-14367809D02*
X11905238Y-14367809D01*
X12101429Y-14434476D02*
X12101429Y-14234476D01*
X12187143Y-14434476D02*
X12187143Y-14329714D01*
X12187143Y-14329714D02*
X12177619Y-14310667D01*
X12177619Y-14310667D02*
X12158572Y-14301143D01*
X12158572Y-14301143D02*
X12130000Y-14301143D01*
X12130000Y-14301143D02*
X12110952Y-14310667D01*
X12110952Y-14310667D02*
X12101429Y-14320190D01*
X12310952Y-14434476D02*
X12291905Y-14424952D01*
X12291905Y-14424952D02*
X12282381Y-14415428D01*
X12282381Y-14415428D02*
X12272857Y-14396381D01*
X12272857Y-14396381D02*
X12272857Y-14339238D01*
X12272857Y-14339238D02*
X12282381Y-14320190D01*
X12282381Y-14320190D02*
X12291905Y-14310667D01*
X12291905Y-14310667D02*
X12310952Y-14301143D01*
X12310952Y-14301143D02*
X12339524Y-14301143D01*
X12339524Y-14301143D02*
X12358572Y-14310667D01*
X12358572Y-14310667D02*
X12368095Y-14320190D01*
X12368095Y-14320190D02*
X12377619Y-14339238D01*
X12377619Y-14339238D02*
X12377619Y-14396381D01*
X12377619Y-14396381D02*
X12368095Y-14415428D01*
X12368095Y-14415428D02*
X12358572Y-14424952D01*
X12358572Y-14424952D02*
X12339524Y-14434476D01*
X12339524Y-14434476D02*
X12310952Y-14434476D01*
X12491905Y-14434476D02*
X12472857Y-14424952D01*
X12472857Y-14424952D02*
X12463333Y-14405905D01*
X12463333Y-14405905D02*
X12463333Y-14234476D01*
X12644286Y-14424952D02*
X12625238Y-14434476D01*
X12625238Y-14434476D02*
X12587143Y-14434476D01*
X12587143Y-14434476D02*
X12568095Y-14424952D01*
X12568095Y-14424952D02*
X12558572Y-14405905D01*
X12558572Y-14405905D02*
X12558572Y-14329714D01*
X12558572Y-14329714D02*
X12568095Y-14310667D01*
X12568095Y-14310667D02*
X12587143Y-14301143D01*
X12587143Y-14301143D02*
X12625238Y-14301143D01*
X12625238Y-14301143D02*
X12644286Y-14310667D01*
X12644286Y-14310667D02*
X12653810Y-14329714D01*
X12653810Y-14329714D02*
X12653810Y-14348762D01*
X12653810Y-14348762D02*
X12558572Y-14367809D01*
X12730000Y-14424952D02*
X12749048Y-14434476D01*
X12749048Y-14434476D02*
X12787143Y-14434476D01*
X12787143Y-14434476D02*
X12806191Y-14424952D01*
X12806191Y-14424952D02*
X12815714Y-14405905D01*
X12815714Y-14405905D02*
X12815714Y-14396381D01*
X12815714Y-14396381D02*
X12806191Y-14377333D01*
X12806191Y-14377333D02*
X12787143Y-14367809D01*
X12787143Y-14367809D02*
X12758572Y-14367809D01*
X12758572Y-14367809D02*
X12739524Y-14358286D01*
X12739524Y-14358286D02*
X12730000Y-14339238D01*
X12730000Y-14339238D02*
X12730000Y-14329714D01*
X12730000Y-14329714D02*
X12739524Y-14310667D01*
X12739524Y-14310667D02*
X12758572Y-14301143D01*
X12758572Y-14301143D02*
X12787143Y-14301143D01*
X12787143Y-14301143D02*
X12806191Y-14310667D01*
X12882381Y-14510667D02*
X12891905Y-14501143D01*
X12891905Y-14501143D02*
X12910953Y-14472571D01*
X12910953Y-14472571D02*
X12920476Y-14453524D01*
X12920476Y-14453524D02*
X12930000Y-14424952D01*
X12930000Y-14424952D02*
X12939524Y-14377333D01*
X12939524Y-14377333D02*
X12939524Y-14339238D01*
X12939524Y-14339238D02*
X12930000Y-14291619D01*
X12930000Y-14291619D02*
X12920476Y-14263048D01*
X12920476Y-14263048D02*
X12910953Y-14244000D01*
X12910953Y-14244000D02*
X12891905Y-14215428D01*
X12891905Y-14215428D02*
X12882381Y-14205905D01*
X13211905Y-14510667D02*
X13202381Y-14501143D01*
X13202381Y-14501143D02*
X13183333Y-14472571D01*
X13183333Y-14472571D02*
X13173810Y-14453524D01*
X13173810Y-14453524D02*
X13164286Y-14424952D01*
X13164286Y-14424952D02*
X13154762Y-14377333D01*
X13154762Y-14377333D02*
X13154762Y-14339238D01*
X13154762Y-14339238D02*
X13164286Y-14291619D01*
X13164286Y-14291619D02*
X13173810Y-14263048D01*
X13173810Y-14263048D02*
X13183333Y-14244000D01*
X13183333Y-14244000D02*
X13202381Y-14215428D01*
X13202381Y-14215428D02*
X13211905Y-14205905D01*
X13288095Y-14301143D02*
X13288095Y-14434476D01*
X13288095Y-14320190D02*
X13297619Y-14310667D01*
X13297619Y-14310667D02*
X13316667Y-14301143D01*
X13316667Y-14301143D02*
X13345238Y-14301143D01*
X13345238Y-14301143D02*
X13364286Y-14310667D01*
X13364286Y-14310667D02*
X13373810Y-14329714D01*
X13373810Y-14329714D02*
X13373810Y-14434476D01*
X13497619Y-14434476D02*
X13478572Y-14424952D01*
X13478572Y-14424952D02*
X13469048Y-14415428D01*
X13469048Y-14415428D02*
X13459524Y-14396381D01*
X13459524Y-14396381D02*
X13459524Y-14339238D01*
X13459524Y-14339238D02*
X13469048Y-14320190D01*
X13469048Y-14320190D02*
X13478572Y-14310667D01*
X13478572Y-14310667D02*
X13497619Y-14301143D01*
X13497619Y-14301143D02*
X13526191Y-14301143D01*
X13526191Y-14301143D02*
X13545238Y-14310667D01*
X13545238Y-14310667D02*
X13554762Y-14320190D01*
X13554762Y-14320190D02*
X13564286Y-14339238D01*
X13564286Y-14339238D02*
X13564286Y-14396381D01*
X13564286Y-14396381D02*
X13554762Y-14415428D01*
X13554762Y-14415428D02*
X13545238Y-14424952D01*
X13545238Y-14424952D02*
X13526191Y-14434476D01*
X13526191Y-14434476D02*
X13497619Y-14434476D01*
X13621429Y-14301143D02*
X13697619Y-14301143D01*
X13650000Y-14234476D02*
X13650000Y-14405905D01*
X13650000Y-14405905D02*
X13659524Y-14424952D01*
X13659524Y-14424952D02*
X13678572Y-14434476D01*
X13678572Y-14434476D02*
X13697619Y-14434476D01*
X13884286Y-14301143D02*
X13884286Y-14501143D01*
X13884286Y-14310667D02*
X13903333Y-14301143D01*
X13903333Y-14301143D02*
X13941429Y-14301143D01*
X13941429Y-14301143D02*
X13960476Y-14310667D01*
X13960476Y-14310667D02*
X13970000Y-14320190D01*
X13970000Y-14320190D02*
X13979524Y-14339238D01*
X13979524Y-14339238D02*
X13979524Y-14396381D01*
X13979524Y-14396381D02*
X13970000Y-14415428D01*
X13970000Y-14415428D02*
X13960476Y-14424952D01*
X13960476Y-14424952D02*
X13941429Y-14434476D01*
X13941429Y-14434476D02*
X13903333Y-14434476D01*
X13903333Y-14434476D02*
X13884286Y-14424952D01*
X14093810Y-14434476D02*
X14074762Y-14424952D01*
X14074762Y-14424952D02*
X14065238Y-14405905D01*
X14065238Y-14405905D02*
X14065238Y-14234476D01*
X14255714Y-14434476D02*
X14255714Y-14329714D01*
X14255714Y-14329714D02*
X14246191Y-14310667D01*
X14246191Y-14310667D02*
X14227143Y-14301143D01*
X14227143Y-14301143D02*
X14189048Y-14301143D01*
X14189048Y-14301143D02*
X14170000Y-14310667D01*
X14255714Y-14424952D02*
X14236667Y-14434476D01*
X14236667Y-14434476D02*
X14189048Y-14434476D01*
X14189048Y-14434476D02*
X14170000Y-14424952D01*
X14170000Y-14424952D02*
X14160476Y-14405905D01*
X14160476Y-14405905D02*
X14160476Y-14386857D01*
X14160476Y-14386857D02*
X14170000Y-14367809D01*
X14170000Y-14367809D02*
X14189048Y-14358286D01*
X14189048Y-14358286D02*
X14236667Y-14358286D01*
X14236667Y-14358286D02*
X14255714Y-14348762D01*
X14322381Y-14301143D02*
X14398572Y-14301143D01*
X14350953Y-14234476D02*
X14350953Y-14405905D01*
X14350953Y-14405905D02*
X14360476Y-14424952D01*
X14360476Y-14424952D02*
X14379524Y-14434476D01*
X14379524Y-14434476D02*
X14398572Y-14434476D01*
X14541429Y-14424952D02*
X14522381Y-14434476D01*
X14522381Y-14434476D02*
X14484286Y-14434476D01*
X14484286Y-14434476D02*
X14465238Y-14424952D01*
X14465238Y-14424952D02*
X14455714Y-14405905D01*
X14455714Y-14405905D02*
X14455714Y-14329714D01*
X14455714Y-14329714D02*
X14465238Y-14310667D01*
X14465238Y-14310667D02*
X14484286Y-14301143D01*
X14484286Y-14301143D02*
X14522381Y-14301143D01*
X14522381Y-14301143D02*
X14541429Y-14310667D01*
X14541429Y-14310667D02*
X14550953Y-14329714D01*
X14550953Y-14329714D02*
X14550953Y-14348762D01*
X14550953Y-14348762D02*
X14455714Y-14367809D01*
X14722381Y-14434476D02*
X14722381Y-14234476D01*
X14722381Y-14424952D02*
X14703334Y-14434476D01*
X14703334Y-14434476D02*
X14665238Y-14434476D01*
X14665238Y-14434476D02*
X14646191Y-14424952D01*
X14646191Y-14424952D02*
X14636667Y-14415428D01*
X14636667Y-14415428D02*
X14627143Y-14396381D01*
X14627143Y-14396381D02*
X14627143Y-14339238D01*
X14627143Y-14339238D02*
X14636667Y-14320190D01*
X14636667Y-14320190D02*
X14646191Y-14310667D01*
X14646191Y-14310667D02*
X14665238Y-14301143D01*
X14665238Y-14301143D02*
X14703334Y-14301143D01*
X14703334Y-14301143D02*
X14722381Y-14310667D01*
X14798572Y-14510667D02*
X14808095Y-14501143D01*
X14808095Y-14501143D02*
X14827143Y-14472571D01*
X14827143Y-14472571D02*
X14836667Y-14453524D01*
X14836667Y-14453524D02*
X14846191Y-14424952D01*
X14846191Y-14424952D02*
X14855714Y-14377333D01*
X14855714Y-14377333D02*
X14855714Y-14339238D01*
X14855714Y-14339238D02*
X14846191Y-14291619D01*
X14846191Y-14291619D02*
X14836667Y-14263048D01*
X14836667Y-14263048D02*
X14827143Y-14244000D01*
X14827143Y-14244000D02*
X14808095Y-14215428D01*
X14808095Y-14215428D02*
X14798572Y-14205905D01*
X8250000Y-14625000D02*
G75*
G03*
X8250000Y-14625000I-100000J0D01*
G01*
X8488095Y-14517524D02*
X8497619Y-14508000D01*
X8497619Y-14508000D02*
X8516667Y-14498476D01*
X8516667Y-14498476D02*
X8564286Y-14498476D01*
X8564286Y-14498476D02*
X8583333Y-14508000D01*
X8583333Y-14508000D02*
X8592857Y-14517524D01*
X8592857Y-14517524D02*
X8602381Y-14536571D01*
X8602381Y-14536571D02*
X8602381Y-14555619D01*
X8602381Y-14555619D02*
X8592857Y-14584190D01*
X8592857Y-14584190D02*
X8478571Y-14698476D01*
X8478571Y-14698476D02*
X8602381Y-14698476D01*
X8688095Y-14679428D02*
X8697619Y-14688952D01*
X8697619Y-14688952D02*
X8688095Y-14698476D01*
X8688095Y-14698476D02*
X8678571Y-14688952D01*
X8678571Y-14688952D02*
X8688095Y-14679428D01*
X8688095Y-14679428D02*
X8688095Y-14698476D01*
X8821429Y-14498476D02*
X8840476Y-14498476D01*
X8840476Y-14498476D02*
X8859524Y-14508000D01*
X8859524Y-14508000D02*
X8869048Y-14517524D01*
X8869048Y-14517524D02*
X8878571Y-14536571D01*
X8878571Y-14536571D02*
X8888095Y-14574667D01*
X8888095Y-14574667D02*
X8888095Y-14622286D01*
X8888095Y-14622286D02*
X8878571Y-14660381D01*
X8878571Y-14660381D02*
X8869048Y-14679428D01*
X8869048Y-14679428D02*
X8859524Y-14688952D01*
X8859524Y-14688952D02*
X8840476Y-14698476D01*
X8840476Y-14698476D02*
X8821429Y-14698476D01*
X8821429Y-14698476D02*
X8802381Y-14688952D01*
X8802381Y-14688952D02*
X8792857Y-14679428D01*
X8792857Y-14679428D02*
X8783333Y-14660381D01*
X8783333Y-14660381D02*
X8773810Y-14622286D01*
X8773810Y-14622286D02*
X8773810Y-14574667D01*
X8773810Y-14574667D02*
X8783333Y-14536571D01*
X8783333Y-14536571D02*
X8792857Y-14517524D01*
X8792857Y-14517524D02*
X8802381Y-14508000D01*
X8802381Y-14508000D02*
X8821429Y-14498476D01*
X9011905Y-14498476D02*
X9030952Y-14498476D01*
X9030952Y-14498476D02*
X9050000Y-14508000D01*
X9050000Y-14508000D02*
X9059524Y-14517524D01*
X9059524Y-14517524D02*
X9069048Y-14536571D01*
X9069048Y-14536571D02*
X9078571Y-14574667D01*
X9078571Y-14574667D02*
X9078571Y-14622286D01*
X9078571Y-14622286D02*
X9069048Y-14660381D01*
X9069048Y-14660381D02*
X9059524Y-14679428D01*
X9059524Y-14679428D02*
X9050000Y-14688952D01*
X9050000Y-14688952D02*
X9030952Y-14698476D01*
X9030952Y-14698476D02*
X9011905Y-14698476D01*
X9011905Y-14698476D02*
X8992857Y-14688952D01*
X8992857Y-14688952D02*
X8983333Y-14679428D01*
X8983333Y-14679428D02*
X8973810Y-14660381D01*
X8973810Y-14660381D02*
X8964286Y-14622286D01*
X8964286Y-14622286D02*
X8964286Y-14574667D01*
X8964286Y-14574667D02*
X8973810Y-14536571D01*
X8973810Y-14536571D02*
X8983333Y-14517524D01*
X8983333Y-14517524D02*
X8992857Y-14508000D01*
X8992857Y-14508000D02*
X9011905Y-14498476D01*
X9202381Y-14498476D02*
X9221429Y-14498476D01*
X9221429Y-14498476D02*
X9240476Y-14508000D01*
X9240476Y-14508000D02*
X9250000Y-14517524D01*
X9250000Y-14517524D02*
X9259524Y-14536571D01*
X9259524Y-14536571D02*
X9269048Y-14574667D01*
X9269048Y-14574667D02*
X9269048Y-14622286D01*
X9269048Y-14622286D02*
X9259524Y-14660381D01*
X9259524Y-14660381D02*
X9250000Y-14679428D01*
X9250000Y-14679428D02*
X9240476Y-14688952D01*
X9240476Y-14688952D02*
X9221429Y-14698476D01*
X9221429Y-14698476D02*
X9202381Y-14698476D01*
X9202381Y-14698476D02*
X9183333Y-14688952D01*
X9183333Y-14688952D02*
X9173810Y-14679428D01*
X9173810Y-14679428D02*
X9164286Y-14660381D01*
X9164286Y-14660381D02*
X9154762Y-14622286D01*
X9154762Y-14622286D02*
X9154762Y-14574667D01*
X9154762Y-14574667D02*
X9164286Y-14536571D01*
X9164286Y-14536571D02*
X9173810Y-14517524D01*
X9173810Y-14517524D02*
X9183333Y-14508000D01*
X9183333Y-14508000D02*
X9202381Y-14498476D01*
X9354762Y-14698476D02*
X9354762Y-14565143D01*
X9354762Y-14584190D02*
X9364286Y-14574667D01*
X9364286Y-14574667D02*
X9383333Y-14565143D01*
X9383333Y-14565143D02*
X9411905Y-14565143D01*
X9411905Y-14565143D02*
X9430952Y-14574667D01*
X9430952Y-14574667D02*
X9440476Y-14593714D01*
X9440476Y-14593714D02*
X9440476Y-14698476D01*
X9440476Y-14593714D02*
X9450000Y-14574667D01*
X9450000Y-14574667D02*
X9469048Y-14565143D01*
X9469048Y-14565143D02*
X9497619Y-14565143D01*
X9497619Y-14565143D02*
X9516667Y-14574667D01*
X9516667Y-14574667D02*
X9526191Y-14593714D01*
X9526191Y-14593714D02*
X9526191Y-14698476D01*
X9621429Y-14698476D02*
X9621429Y-14565143D01*
X9621429Y-14584190D02*
X9630952Y-14574667D01*
X9630952Y-14574667D02*
X9650000Y-14565143D01*
X9650000Y-14565143D02*
X9678572Y-14565143D01*
X9678572Y-14565143D02*
X9697619Y-14574667D01*
X9697619Y-14574667D02*
X9707143Y-14593714D01*
X9707143Y-14593714D02*
X9707143Y-14698476D01*
X9707143Y-14593714D02*
X9716667Y-14574667D01*
X9716667Y-14574667D02*
X9735714Y-14565143D01*
X9735714Y-14565143D02*
X9764286Y-14565143D01*
X9764286Y-14565143D02*
X9783333Y-14574667D01*
X9783333Y-14574667D02*
X9792857Y-14593714D01*
X9792857Y-14593714D02*
X9792857Y-14698476D01*
X10150952Y-14488952D02*
X9979524Y-14746095D01*
X10375714Y-14498476D02*
X10394762Y-14498476D01*
X10394762Y-14498476D02*
X10413810Y-14508000D01*
X10413810Y-14508000D02*
X10423333Y-14517524D01*
X10423333Y-14517524D02*
X10432857Y-14536571D01*
X10432857Y-14536571D02*
X10442381Y-14574667D01*
X10442381Y-14574667D02*
X10442381Y-14622286D01*
X10442381Y-14622286D02*
X10432857Y-14660381D01*
X10432857Y-14660381D02*
X10423333Y-14679428D01*
X10423333Y-14679428D02*
X10413810Y-14688952D01*
X10413810Y-14688952D02*
X10394762Y-14698476D01*
X10394762Y-14698476D02*
X10375714Y-14698476D01*
X10375714Y-14698476D02*
X10356667Y-14688952D01*
X10356667Y-14688952D02*
X10347143Y-14679428D01*
X10347143Y-14679428D02*
X10337619Y-14660381D01*
X10337619Y-14660381D02*
X10328095Y-14622286D01*
X10328095Y-14622286D02*
X10328095Y-14574667D01*
X10328095Y-14574667D02*
X10337619Y-14536571D01*
X10337619Y-14536571D02*
X10347143Y-14517524D01*
X10347143Y-14517524D02*
X10356667Y-14508000D01*
X10356667Y-14508000D02*
X10375714Y-14498476D01*
X10528095Y-14679428D02*
X10537619Y-14688952D01*
X10537619Y-14688952D02*
X10528095Y-14698476D01*
X10528095Y-14698476D02*
X10518572Y-14688952D01*
X10518572Y-14688952D02*
X10528095Y-14679428D01*
X10528095Y-14679428D02*
X10528095Y-14698476D01*
X10661429Y-14498476D02*
X10680476Y-14498476D01*
X10680476Y-14498476D02*
X10699524Y-14508000D01*
X10699524Y-14508000D02*
X10709048Y-14517524D01*
X10709048Y-14517524D02*
X10718572Y-14536571D01*
X10718572Y-14536571D02*
X10728095Y-14574667D01*
X10728095Y-14574667D02*
X10728095Y-14622286D01*
X10728095Y-14622286D02*
X10718572Y-14660381D01*
X10718572Y-14660381D02*
X10709048Y-14679428D01*
X10709048Y-14679428D02*
X10699524Y-14688952D01*
X10699524Y-14688952D02*
X10680476Y-14698476D01*
X10680476Y-14698476D02*
X10661429Y-14698476D01*
X10661429Y-14698476D02*
X10642381Y-14688952D01*
X10642381Y-14688952D02*
X10632857Y-14679428D01*
X10632857Y-14679428D02*
X10623333Y-14660381D01*
X10623333Y-14660381D02*
X10613810Y-14622286D01*
X10613810Y-14622286D02*
X10613810Y-14574667D01*
X10613810Y-14574667D02*
X10623333Y-14536571D01*
X10623333Y-14536571D02*
X10632857Y-14517524D01*
X10632857Y-14517524D02*
X10642381Y-14508000D01*
X10642381Y-14508000D02*
X10661429Y-14498476D01*
X10794762Y-14498476D02*
X10928095Y-14498476D01*
X10928095Y-14498476D02*
X10842381Y-14698476D01*
X11032857Y-14584190D02*
X11013810Y-14574667D01*
X11013810Y-14574667D02*
X11004286Y-14565143D01*
X11004286Y-14565143D02*
X10994762Y-14546095D01*
X10994762Y-14546095D02*
X10994762Y-14536571D01*
X10994762Y-14536571D02*
X11004286Y-14517524D01*
X11004286Y-14517524D02*
X11013810Y-14508000D01*
X11013810Y-14508000D02*
X11032857Y-14498476D01*
X11032857Y-14498476D02*
X11070953Y-14498476D01*
X11070953Y-14498476D02*
X11090000Y-14508000D01*
X11090000Y-14508000D02*
X11099524Y-14517524D01*
X11099524Y-14517524D02*
X11109048Y-14536571D01*
X11109048Y-14536571D02*
X11109048Y-14546095D01*
X11109048Y-14546095D02*
X11099524Y-14565143D01*
X11099524Y-14565143D02*
X11090000Y-14574667D01*
X11090000Y-14574667D02*
X11070953Y-14584190D01*
X11070953Y-14584190D02*
X11032857Y-14584190D01*
X11032857Y-14584190D02*
X11013810Y-14593714D01*
X11013810Y-14593714D02*
X11004286Y-14603238D01*
X11004286Y-14603238D02*
X10994762Y-14622286D01*
X10994762Y-14622286D02*
X10994762Y-14660381D01*
X10994762Y-14660381D02*
X11004286Y-14679428D01*
X11004286Y-14679428D02*
X11013810Y-14688952D01*
X11013810Y-14688952D02*
X11032857Y-14698476D01*
X11032857Y-14698476D02*
X11070953Y-14698476D01*
X11070953Y-14698476D02*
X11090000Y-14688952D01*
X11090000Y-14688952D02*
X11099524Y-14679428D01*
X11099524Y-14679428D02*
X11109048Y-14660381D01*
X11109048Y-14660381D02*
X11109048Y-14622286D01*
X11109048Y-14622286D02*
X11099524Y-14603238D01*
X11099524Y-14603238D02*
X11090000Y-14593714D01*
X11090000Y-14593714D02*
X11070953Y-14584190D01*
X11175714Y-14498476D02*
X11309048Y-14498476D01*
X11309048Y-14498476D02*
X11223333Y-14698476D01*
X11375714Y-14498476D02*
X11375714Y-14536571D01*
X11451905Y-14498476D02*
X11451905Y-14536571D01*
X11714762Y-14774667D02*
X11705238Y-14765143D01*
X11705238Y-14765143D02*
X11686191Y-14736571D01*
X11686191Y-14736571D02*
X11676667Y-14717524D01*
X11676667Y-14717524D02*
X11667143Y-14688952D01*
X11667143Y-14688952D02*
X11657619Y-14641333D01*
X11657619Y-14641333D02*
X11657619Y-14603238D01*
X11657619Y-14603238D02*
X11667143Y-14555619D01*
X11667143Y-14555619D02*
X11676667Y-14527048D01*
X11676667Y-14527048D02*
X11686191Y-14508000D01*
X11686191Y-14508000D02*
X11705238Y-14479428D01*
X11705238Y-14479428D02*
X11714762Y-14469905D01*
X11876667Y-14565143D02*
X11876667Y-14698476D01*
X11829048Y-14488952D02*
X11781429Y-14631809D01*
X11781429Y-14631809D02*
X11905238Y-14631809D01*
X12101429Y-14698476D02*
X12101429Y-14498476D01*
X12187143Y-14698476D02*
X12187143Y-14593714D01*
X12187143Y-14593714D02*
X12177619Y-14574667D01*
X12177619Y-14574667D02*
X12158572Y-14565143D01*
X12158572Y-14565143D02*
X12130000Y-14565143D01*
X12130000Y-14565143D02*
X12110952Y-14574667D01*
X12110952Y-14574667D02*
X12101429Y-14584190D01*
X12310952Y-14698476D02*
X12291905Y-14688952D01*
X12291905Y-14688952D02*
X12282381Y-14679428D01*
X12282381Y-14679428D02*
X12272857Y-14660381D01*
X12272857Y-14660381D02*
X12272857Y-14603238D01*
X12272857Y-14603238D02*
X12282381Y-14584190D01*
X12282381Y-14584190D02*
X12291905Y-14574667D01*
X12291905Y-14574667D02*
X12310952Y-14565143D01*
X12310952Y-14565143D02*
X12339524Y-14565143D01*
X12339524Y-14565143D02*
X12358572Y-14574667D01*
X12358572Y-14574667D02*
X12368095Y-14584190D01*
X12368095Y-14584190D02*
X12377619Y-14603238D01*
X12377619Y-14603238D02*
X12377619Y-14660381D01*
X12377619Y-14660381D02*
X12368095Y-14679428D01*
X12368095Y-14679428D02*
X12358572Y-14688952D01*
X12358572Y-14688952D02*
X12339524Y-14698476D01*
X12339524Y-14698476D02*
X12310952Y-14698476D01*
X12491905Y-14698476D02*
X12472857Y-14688952D01*
X12472857Y-14688952D02*
X12463333Y-14669905D01*
X12463333Y-14669905D02*
X12463333Y-14498476D01*
X12644286Y-14688952D02*
X12625238Y-14698476D01*
X12625238Y-14698476D02*
X12587143Y-14698476D01*
X12587143Y-14698476D02*
X12568095Y-14688952D01*
X12568095Y-14688952D02*
X12558572Y-14669905D01*
X12558572Y-14669905D02*
X12558572Y-14593714D01*
X12558572Y-14593714D02*
X12568095Y-14574667D01*
X12568095Y-14574667D02*
X12587143Y-14565143D01*
X12587143Y-14565143D02*
X12625238Y-14565143D01*
X12625238Y-14565143D02*
X12644286Y-14574667D01*
X12644286Y-14574667D02*
X12653810Y-14593714D01*
X12653810Y-14593714D02*
X12653810Y-14612762D01*
X12653810Y-14612762D02*
X12558572Y-14631809D01*
X12730000Y-14688952D02*
X12749048Y-14698476D01*
X12749048Y-14698476D02*
X12787143Y-14698476D01*
X12787143Y-14698476D02*
X12806191Y-14688952D01*
X12806191Y-14688952D02*
X12815714Y-14669905D01*
X12815714Y-14669905D02*
X12815714Y-14660381D01*
X12815714Y-14660381D02*
X12806191Y-14641333D01*
X12806191Y-14641333D02*
X12787143Y-14631809D01*
X12787143Y-14631809D02*
X12758572Y-14631809D01*
X12758572Y-14631809D02*
X12739524Y-14622286D01*
X12739524Y-14622286D02*
X12730000Y-14603238D01*
X12730000Y-14603238D02*
X12730000Y-14593714D01*
X12730000Y-14593714D02*
X12739524Y-14574667D01*
X12739524Y-14574667D02*
X12758572Y-14565143D01*
X12758572Y-14565143D02*
X12787143Y-14565143D01*
X12787143Y-14565143D02*
X12806191Y-14574667D01*
X12882381Y-14774667D02*
X12891905Y-14765143D01*
X12891905Y-14765143D02*
X12910953Y-14736571D01*
X12910953Y-14736571D02*
X12920476Y-14717524D01*
X12920476Y-14717524D02*
X12930000Y-14688952D01*
X12930000Y-14688952D02*
X12939524Y-14641333D01*
X12939524Y-14641333D02*
X12939524Y-14603238D01*
X12939524Y-14603238D02*
X12930000Y-14555619D01*
X12930000Y-14555619D02*
X12920476Y-14527048D01*
X12920476Y-14527048D02*
X12910953Y-14508000D01*
X12910953Y-14508000D02*
X12891905Y-14479428D01*
X12891905Y-14479428D02*
X12882381Y-14469905D01*
X13211905Y-14774667D02*
X13202381Y-14765143D01*
X13202381Y-14765143D02*
X13183333Y-14736571D01*
X13183333Y-14736571D02*
X13173810Y-14717524D01*
X13173810Y-14717524D02*
X13164286Y-14688952D01*
X13164286Y-14688952D02*
X13154762Y-14641333D01*
X13154762Y-14641333D02*
X13154762Y-14603238D01*
X13154762Y-14603238D02*
X13164286Y-14555619D01*
X13164286Y-14555619D02*
X13173810Y-14527048D01*
X13173810Y-14527048D02*
X13183333Y-14508000D01*
X13183333Y-14508000D02*
X13202381Y-14479428D01*
X13202381Y-14479428D02*
X13211905Y-14469905D01*
X13288095Y-14565143D02*
X13288095Y-14698476D01*
X13288095Y-14584190D02*
X13297619Y-14574667D01*
X13297619Y-14574667D02*
X13316667Y-14565143D01*
X13316667Y-14565143D02*
X13345238Y-14565143D01*
X13345238Y-14565143D02*
X13364286Y-14574667D01*
X13364286Y-14574667D02*
X13373810Y-14593714D01*
X13373810Y-14593714D02*
X13373810Y-14698476D01*
X13497619Y-14698476D02*
X13478572Y-14688952D01*
X13478572Y-14688952D02*
X13469048Y-14679428D01*
X13469048Y-14679428D02*
X13459524Y-14660381D01*
X13459524Y-14660381D02*
X13459524Y-14603238D01*
X13459524Y-14603238D02*
X13469048Y-14584190D01*
X13469048Y-14584190D02*
X13478572Y-14574667D01*
X13478572Y-14574667D02*
X13497619Y-14565143D01*
X13497619Y-14565143D02*
X13526191Y-14565143D01*
X13526191Y-14565143D02*
X13545238Y-14574667D01*
X13545238Y-14574667D02*
X13554762Y-14584190D01*
X13554762Y-14584190D02*
X13564286Y-14603238D01*
X13564286Y-14603238D02*
X13564286Y-14660381D01*
X13564286Y-14660381D02*
X13554762Y-14679428D01*
X13554762Y-14679428D02*
X13545238Y-14688952D01*
X13545238Y-14688952D02*
X13526191Y-14698476D01*
X13526191Y-14698476D02*
X13497619Y-14698476D01*
X13621429Y-14565143D02*
X13697619Y-14565143D01*
X13650000Y-14498476D02*
X13650000Y-14669905D01*
X13650000Y-14669905D02*
X13659524Y-14688952D01*
X13659524Y-14688952D02*
X13678572Y-14698476D01*
X13678572Y-14698476D02*
X13697619Y-14698476D01*
X13884286Y-14565143D02*
X13884286Y-14765143D01*
X13884286Y-14574667D02*
X13903333Y-14565143D01*
X13903333Y-14565143D02*
X13941429Y-14565143D01*
X13941429Y-14565143D02*
X13960476Y-14574667D01*
X13960476Y-14574667D02*
X13970000Y-14584190D01*
X13970000Y-14584190D02*
X13979524Y-14603238D01*
X13979524Y-14603238D02*
X13979524Y-14660381D01*
X13979524Y-14660381D02*
X13970000Y-14679428D01*
X13970000Y-14679428D02*
X13960476Y-14688952D01*
X13960476Y-14688952D02*
X13941429Y-14698476D01*
X13941429Y-14698476D02*
X13903333Y-14698476D01*
X13903333Y-14698476D02*
X13884286Y-14688952D01*
X14093810Y-14698476D02*
X14074762Y-14688952D01*
X14074762Y-14688952D02*
X14065238Y-14669905D01*
X14065238Y-14669905D02*
X14065238Y-14498476D01*
X14255714Y-14698476D02*
X14255714Y-14593714D01*
X14255714Y-14593714D02*
X14246191Y-14574667D01*
X14246191Y-14574667D02*
X14227143Y-14565143D01*
X14227143Y-14565143D02*
X14189048Y-14565143D01*
X14189048Y-14565143D02*
X14170000Y-14574667D01*
X14255714Y-14688952D02*
X14236667Y-14698476D01*
X14236667Y-14698476D02*
X14189048Y-14698476D01*
X14189048Y-14698476D02*
X14170000Y-14688952D01*
X14170000Y-14688952D02*
X14160476Y-14669905D01*
X14160476Y-14669905D02*
X14160476Y-14650857D01*
X14160476Y-14650857D02*
X14170000Y-14631809D01*
X14170000Y-14631809D02*
X14189048Y-14622286D01*
X14189048Y-14622286D02*
X14236667Y-14622286D01*
X14236667Y-14622286D02*
X14255714Y-14612762D01*
X14322381Y-14565143D02*
X14398572Y-14565143D01*
X14350953Y-14498476D02*
X14350953Y-14669905D01*
X14350953Y-14669905D02*
X14360476Y-14688952D01*
X14360476Y-14688952D02*
X14379524Y-14698476D01*
X14379524Y-14698476D02*
X14398572Y-14698476D01*
X14541429Y-14688952D02*
X14522381Y-14698476D01*
X14522381Y-14698476D02*
X14484286Y-14698476D01*
X14484286Y-14698476D02*
X14465238Y-14688952D01*
X14465238Y-14688952D02*
X14455714Y-14669905D01*
X14455714Y-14669905D02*
X14455714Y-14593714D01*
X14455714Y-14593714D02*
X14465238Y-14574667D01*
X14465238Y-14574667D02*
X14484286Y-14565143D01*
X14484286Y-14565143D02*
X14522381Y-14565143D01*
X14522381Y-14565143D02*
X14541429Y-14574667D01*
X14541429Y-14574667D02*
X14550953Y-14593714D01*
X14550953Y-14593714D02*
X14550953Y-14612762D01*
X14550953Y-14612762D02*
X14455714Y-14631809D01*
X14722381Y-14698476D02*
X14722381Y-14498476D01*
X14722381Y-14688952D02*
X14703334Y-14698476D01*
X14703334Y-14698476D02*
X14665238Y-14698476D01*
X14665238Y-14698476D02*
X14646191Y-14688952D01*
X14646191Y-14688952D02*
X14636667Y-14679428D01*
X14636667Y-14679428D02*
X14627143Y-14660381D01*
X14627143Y-14660381D02*
X14627143Y-14603238D01*
X14627143Y-14603238D02*
X14636667Y-14584190D01*
X14636667Y-14584190D02*
X14646191Y-14574667D01*
X14646191Y-14574667D02*
X14665238Y-14565143D01*
X14665238Y-14565143D02*
X14703334Y-14565143D01*
X14703334Y-14565143D02*
X14722381Y-14574667D01*
X14798572Y-14774667D02*
X14808095Y-14765143D01*
X14808095Y-14765143D02*
X14827143Y-14736571D01*
X14827143Y-14736571D02*
X14836667Y-14717524D01*
X14836667Y-14717524D02*
X14846191Y-14688952D01*
X14846191Y-14688952D02*
X14855714Y-14641333D01*
X14855714Y-14641333D02*
X14855714Y-14603238D01*
X14855714Y-14603238D02*
X14846191Y-14555619D01*
X14846191Y-14555619D02*
X14836667Y-14527048D01*
X14836667Y-14527048D02*
X14827143Y-14508000D01*
X14827143Y-14508000D02*
X14808095Y-14479428D01*
X14808095Y-14479428D02*
X14798572Y-14469905D01*
M02*
