!	created	by	azisi	at	Mon	Jul	20	20:14:54	EEST	2020
!	generated	using	vna/J	Version	3.4.3
#	Hz	S	DB	R	50
800000000 -4.00771978 -33.51081547 -12.60648277 54.84255395 0 0 -7.86441603 102.71094387
800197432 -4.00195045 -33.65669488 -12.61237762 54.76845886 0 0 -7.86315661 102.6188126
800394864 -4.01986681 -33.83329229 -12.5981503 54.57391844 0 0 -7.85227525 102.68754976
800592296 -4.01519758 -33.89244068 -12.57869338 54.39637881 0 0 -7.89165667 102.56673625
800789728 -4.02979759 -33.9106163 -12.56680181 54.25073628 0 0 -7.86317544 102.64437385
800987160 -4.03383526 -34.15590315 -12.57083307 53.98935328 0 0 -7.87369022 102.62258261
801184592 -4.03875149 -34.22033702 -12.53934409 54.04824235 0 0 -7.89438883 102.60067104
801382024 -4.05632912 -34.4383601 -12.55822209 53.73673466 0 0 -7.89233972 102.41934099
801579456 -4.06655204 -34.6522499 -12.54688449 53.67903934 0 0 -7.86715974 102.73253758
801776888 -4.05879396 -34.65853155 -12.55338768 53.52794071 0 0 -7.9010765 102.50437799
801974320 -4.08411107 -34.83185552 -12.51689668 53.39019292 0 0 -7.89566469 102.67542988
802171752 -4.0897311 -34.97860777 -12.51860427 53.19748193 0 0 -7.9228013 102.49649017
802369184 -4.0763141 -35.15853767 -12.51241807 53.1678884 0 0 -7.91695985 102.4313805
802566616 -4.07222927 -35.20189408 -12.51565032 52.91153483 0 0 -7.89735689 102.60363391
802764048 -4.10358443 -35.30429683 -12.51194335 52.69687958 0 0 -7.91894679 102.49969833
802961480 -4.11951951 -35.43407981 -12.47660223 52.7391321 0 0 -7.90137828 102.56582106
803158912 -4.12345403 -35.76717196 -12.47859619 52.37163565 0 0 -7.92135754 102.55960583
803356344 -4.13090555 -35.91783762 -12.46045374 52.30277869 0 0 -7.93778037 102.40710612
803553776 -4.12913272 -36.05717068 -12.45605532 52.20140075 0 0 -7.92504018 102.61384828
803751208 -4.14753151 -36.14831098 -12.45186954 52.10678314 0 0 -7.93714418 102.59750156
803948640 -4.1300053 -36.28455244 -12.44351085 51.866487 0 0 -7.92382479 102.79713366
804146072 -4.15803846 -36.38873579 -12.43947779 51.80117121 0 0 -7.9366936 102.65983656
804343504 -4.13626909 -36.64841742 -12.43171752 51.4539425 0 0 -7.90773446 102.6100998
804540936 -4.18658342 -36.68253667 -12.41523883 51.57928163 0 0 -7.91297596 102.67381278
804738368 -4.17113796 -36.82015277 -12.39288813 51.16019636 0 0 -7.95649364 102.66409435
804935800 -4.16471236 -37.01462369 -12.39969593 51.06478642 0 0 -7.93658155 102.50957382
805133232 -4.18523141 -37.2338917 -12.39765828 50.94104133 0 0 -7.96540737 102.57159747
805330664 -4.19848453 -37.44385487 -12.40147803 50.75429049 0 0 -7.95837712 102.69762373
805528096 -4.20767123 -37.42033237 -12.38387097 50.72881415 0 0 -7.93878989 102.62540616
805725528 -4.23006761 -37.64424938 -12.36562398 50.53419076 0 0 -7.95070248 102.4137723
805922960 -4.20985438 -37.77734183 -12.35397611 50.42528663 0 0 -7.94206671 102.80224589
806120392 -4.22124632 -37.79781036 -12.33895237 50.30455135 0 0 -7.94499653 102.57441351
806317824 -4.22501179 -38.14538044 -12.33809796 49.9559852 0 0 -7.9606445 102.81231764
806515256 -4.22829773 -38.10509151 -12.35040074 49.88414805 0 0 -7.95819171 102.58660331
806712688 -4.23558705 -38.33091842 -12.31185888 49.94080175 0 0 -7.97731233 102.61033558
806910120 -4.23759791 -38.32952475 -12.31669822 49.57829495 0 0 -7.98469553 102.67307394
807107552 -4.23217996 -38.50867769 -12.30812443 49.35163378 0 0 -7.97390022 102.65052209
807304984 -4.23974855 -38.62837105 -12.28126572 49.4436578 0 0 -7.98165332 102.45043628
807502416 -4.24132469 -38.73975278 -12.28437776 49.23855893 0 0 -8.01697206 102.49328409
807699848 -4.25543612 -38.81246263 -12.2706869 49.07687089 0 0 -7.99565493 102.65471875
807897280 -4.24150721 -39.07009602 -12.25612858 48.82516703 0 0 -7.99578072 102.46985318
808094712 -4.27862291 -39.20081964 -12.26547559 48.85960072 0 0 -7.99408413 102.82347463
808292144 -4.26418983 -39.22089388 -12.25145836 48.58155969 0 0 -8.01656081 102.54707782
808489576 -4.28129106 -39.36987621 -12.26533682 48.3293634 0 0 -8.0410108 102.57394528
808687008 -4.29783044 -39.4978747 -12.22342716 48.25258908 0 0 -8.01333688 102.54372503
808884440 -4.2970609 -39.74459001 -12.22959608 48.04296432 0 0 -8.02348768 102.42242769
809081872 -4.29884028 -39.86552066 -12.20586915 47.90444144 0 0 -8.02603884 102.615907
809279304 -4.32382417 -40.08090024 -12.21586804 47.88407342 0 0 -8.0110298 102.70920544
809476736 -4.32785312 -40.15857404 -12.18819826 47.65917204 0 0 -7.99964869 102.57459286
809674168 -4.33298358 -40.29296765 -12.16559977 47.43021987 0 0 -8.02514881 102.7608392
809871600 -4.32368806 -40.42995748 -12.18268696 47.33714376 0 0 -8.01913163 102.55272501
810069032 -4.32513011 -40.79110279 -12.15678764 47.21890751 0 0 -8.03358973 102.93867123
810266464 -4.34936431 -40.76828688 -12.16873952 47.13794934 0 0 -8.03560573 102.758927
810463896 -4.35472484 -40.96773506 -12.14356078 46.9364647 0 0 -8.02465988 102.67184613
810661328 -4.34838342 -41.07291088 -12.1518612 46.91873632 0 0 -8.00883892 102.80164037
810858760 -4.37428031 -41.26805999 -12.13349302 46.69485269 0 0 -8.00334789 102.94664024
811056192 -4.36928626 -41.46215744 -12.14611282 46.67227326 0 0 -8.01260223 102.98522291
811253624 -4.39561802 -41.66101045 -12.13154953 46.47918213 0 0 -8.01663717 103.09753633
811451056 -4.39507401 -41.79973301 -12.13035759 46.26323809 0 0 -8.02836366 102.95927595
811648488 -4.3875619 -41.98429023 -12.12042741 46.03232942 0 0 -8.00817986 102.85934507
811845920 -4.41737961 -42.16877157 -12.09560649 46.03558175 0 0 -8.04985442 103.03754293
812043352 -4.42246092 -42.15048741 -12.1019644 45.86809821 0 0 -8.02772702 102.95667562
812240784 -4.41769163 -42.39610423 -12.08095154 45.56719608 0 0 -8.01692427 102.93767274
812438216 -4.4172383 -42.54786398 -12.07618001 45.57224799 0 0 -8.02351482 102.87037211
812635648 -4.4314243 -42.56607838 -12.08270551 45.30536426 0 0 -8.03081983 102.71405022
812833080 -4.43261389 -42.62358355 -12.04978787 45.3047512 0 0 -8.01903857 102.77100538
813030512 -4.45562577 -42.95453083 -12.04064369 45.07620491 0 0 -8.04643964 102.79465433
813227944 -4.43226362 -43.01179243 -12.02965778 44.89968882 0 0 -8.05198654 103.02610252
813425376 -4.44898267 -43.17495514 -12.01856888 44.92246877 0 0 -8.05857827 102.7583873
813622808 -4.44842051 -43.18117687 -12.01817805 44.66888295 0 0 -8.07007033 102.87880836
813820240 -4.49208625 -43.40366694 -12.00327605 44.58274609 0 0 -8.04608086 102.76861517
814017672 -4.50353928 -43.67100155 -11.99380158 44.30757879 0 0 -8.01567318 102.7916503
814215104 -4.49670751 -43.62876029 -11.99544829 44.39025704 0 0 -8.06522749 102.70809186
814412536 -4.48531616 -43.78196659 -11.98939762 44.0568027 0 0 -8.07217548 102.61619264
814609968 -4.50696443 -44.00821124 -11.98603115 44.03452321 0 0 -8.05710718 102.78870886
814807400 -4.50235211 -44.01731596 -11.97343846 43.87950379 0 0 -8.07855703 102.72082343
815004832 -4.50842526 -44.30133489 -11.95618779 43.61709507 0 0 -8.09620296 102.79771698
815202264 -4.50690164 -44.33918872 -11.94829503 43.54965831 0 0 -8.0439465 102.56202394
815399696 -4.53921916 -44.60664239 -11.94864004 43.31131791 0 0 -8.08195876 102.69043054
815597128 -4.51694828 -44.59729297 -11.95099212 43.25976648 0 0 -8.05696056 102.6774604
815794560 -4.52373977 -44.80070856 -11.91821778 42.93621134 0 0 -8.07191814 102.95410375
815991992 -4.53482393 -45.01669438 -11.92655918 42.92732964 0 0 -8.0905836 102.82906535
816189424 -4.54444892 -45.09519444 -11.90345039 42.56595985 0 0 -8.10265843 102.76844564
816386856 -4.55011477 -45.41158568 -11.90540377 42.37141663 0 0 -8.07682751 102.77829989
816584288 -4.55471787 -45.38055606 -11.89572263 42.3596796 0 0 -8.0850493 102.82346041
816781720 -4.58037055 -45.60765803 -11.88441035 42.14021819 0 0 -8.07416789 102.77689274
816979152 -4.57456468 -45.58965663 -11.86784488 42.05279102 0 0 -8.10855393 102.60969217
817176584 -4.59358327 -45.82406889 -11.85987274 41.9040161 0 0 -8.1082229 102.70825774
817374016 -4.57974334 -46.07172368 -11.86152779 41.76204447 0 0 -8.11724254 102.85567182
817571448 -4.60765318 -46.23032592 -11.86983029 41.69682097 0 0 -8.0676284 102.7692856
817768880 -4.60916689 -46.24738667 -11.84730097 41.449719 0 0 -8.1293019 102.65687389
817966312 -4.62755161 -46.46458493 -11.83617809 41.26405556 0 0 -8.09272675 102.65591778
818163744 -4.63129858 -46.55304618 -11.8263776 41.15716346 0 0 -8.12107918 102.79037016
818361176 -4.62813389 -46.79081894 -11.79882419 40.93636169 0 0 -8.1006301 102.90971268
818558608 -4.62171563 -46.76888474 -11.7924052 40.953958 0 0 -8.12910469 102.77079683
818756040 -4.64630134 -47.03613896 -11.79920468 40.77432367 0 0 -8.12877899 103.04108807
818953472 -4.65251663 -47.12468922 -11.77685795 40.67400594 0 0 -8.12816022 102.7306
819150904 -4.65568851 -47.37709843 -11.78491559 40.39613655 0 0 -8.12723923 102.76354569
819348336 -4.65789349 -47.59498057 -11.76873417 40.31638523 0 0 -8.12961399 102.80024895
819545768 -4.66644944 -47.71090585 -11.76259562 40.10946307 0 0 -8.14301062 102.80468524
819743200 -4.66687745 -47.954186 -11.7448589 39.93620303 0 0 -8.11796161 102.93963546
819940632 -4.67661844 -48.10187896 -11.76110079 39.92672571 0 0 -8.1851142 102.90863524
820138064 -4.70402044 -48.09654428 -11.75213213 39.72751328 0 0 -8.14303785 103.13254251
820335496 -4.69568658 -48.26981967 -11.71333978 39.37955147 0 0 -8.17807848 103.0064056
820532928 -4.71867019 -48.35362025 -11.72502988 39.3729257 0 0 -8.18465594 102.90272
820730360 -4.7323427 -48.74506906 -11.73135566 39.27977135 0 0 -8.17683545 102.96695739
820927792 -4.72821694 -48.61745303 -11.72735701 39.18683861 0 0 -8.16370292 102.94749685
821125224 -4.71195752 -48.85612246 -11.6890011 39.02404001 0 0 -8.16255819 103.09168576
821322656 -4.72244892 -49.04029303 -11.6866372 38.87948777 0 0 -8.18893364 103.25276442
821520088 -4.73747681 -49.13943335 -11.68972048 38.71391917 0 0 -8.15716926 103.25675528
821717520 -4.72554301 -49.26384788 -11.67277695 38.52351047 0 0 -8.19188064 102.95027657
821914952 -4.7394205 -49.30589904 -11.65882357 38.24193699 0 0 -8.19488736 102.86044703
822112384 -4.74523425 -49.57440016 -11.67014422 38.29138463 0 0 -8.19707398 102.99358465
822309816 -4.76737135 -49.72538683 -11.63897627 38.20743752 0 0 -8.16687294 103.12750302
822507248 -4.76907262 -49.75297644 -11.65475104 37.91938098 0 0 -8.17094787 102.93662077
822704680 -4.78641251 -49.82313054 -11.63740792 37.64882995 0 0 -8.20147605 102.76394034
822902112 -4.79857759 -50.14468638 -11.63821779 37.57341041 0 0 -8.16194988 102.94350148
823099544 -4.79142129 -50.07046957 -11.61732568 37.56221559 0 0 -8.19301091 102.85493502
823296976 -4.80302857 -50.19234004 -11.61604153 37.33181175 0 0 -8.17688944 102.79268986
823494408 -4.80913002 -50.50867044 -11.62285064 37.11908945 0 0 -8.19000916 102.90966318
823691840 -4.81291784 -50.56743501 -11.61208922 36.97912453 0 0 -8.16075718 102.94409711
823889272 -4.82455261 -50.63791895 -11.59725937 36.80476883 0 0 -8.19666952 102.85686333
824086704 -4.83412108 -50.98755557 -11.5644241 36.71309847 0 0 -8.15182561 102.84055738
824284136 -4.83654592 -51.12038646 -11.57231395 36.47266759 0 0 -8.19014958 102.81962938
824481568 -4.85007972 -51.29681743 -11.55882744 36.42478854 0 0 -8.19876805 102.79574842
824679000 -4.84643801 -51.22048336 -11.5430596 36.24126101 0 0 -8.21274324 102.71106942
824876432 -4.83271687 -51.3838624 -11.55018665 36.08040579 0 0 -8.18773648 102.92668208
825073864 -4.84604383 -51.58531917 -11.52905017 35.98942029 0 0 -8.19490231 102.62022369
825271296 -4.84885907 -51.70132862 -11.50899732 35.75574801 0 0 -8.21989393 102.88775114
825468728 -4.8686276 -51.8017581 -11.51897893 35.51578951 0 0 -8.21245945 102.66368354
825666160 -4.86555872 -51.95951298 -11.51928458 35.65287696 0 0 -8.21155699 102.80943711
825863592 -4.87728433 -52.07260462 -11.5043793 35.30808337 0 0 -8.24650719 102.90363529
826061024 -4.89479072 -52.25344195 -11.49888671 35.18345672 0 0 -8.22014269 102.92044111
826258456 -4.89730994 -52.47332098 -11.48441712 35.2479214 0 0 -8.22665445 102.79446718
826455888 -4.90372634 -52.54878049 -11.49391893 34.96192619 0 0 -8.23130849 102.73053281
826653320 -4.91483746 -52.67468412 -11.48266416 34.94655582 0 0 -8.22501236 102.9040882
826850752 -4.91396959 -52.77331706 -11.47811019 34.62679443 0 0 -8.24903224 102.75606408
827048184 -4.91951109 -52.98240868 -11.45423302 34.53594229 0 0 -8.23374404 102.68626704
827245616 -4.92834679 -53.19086274 -11.45496596 34.28289967 0 0 -8.24026138 102.57915184
827443048 -4.93838944 -53.24197737 -11.43930446 34.30621289 0 0 -8.2489488 102.70603567
827640480 -4.94964209 -53.36954793 -11.44058364 33.94882236 0 0 -8.24084429 102.74130992
827837912 -4.94308631 -53.58309905 -11.44683394 33.92935451 0 0 -8.23147588 102.70482145
828035344 -4.962142 -53.73834547 -11.41522034 33.69997515 0 0 -8.2281772 102.74551852
828232776 -4.95950933 -53.86767044 -11.39035758 33.67139249 0 0 -8.24605823 102.64180873
828430208 -4.96141315 -53.96111262 -11.39123773 33.38053978 0 0 -8.256381 102.59126865
828627640 -4.97749148 -53.97244369 -11.37342367 33.33229644 0 0 -8.23476102 102.7186366
828825072 -4.99445265 -54.10930893 -11.37807868 33.12570451 0 0 -8.23645478 102.50636102
829022504 -4.99347179 -54.44425435 -11.36877221 33.02664687 0 0 -8.23711504 102.49249707
829219936 -4.99484718 -54.59660762 -11.34976339 32.90060179 0 0 -8.2446092 102.66736074
829417368 -4.99972576 -54.64338315 -11.35286466 32.66710154 0 0 -8.25980039 102.49678295
829614800 -5.01001477 -54.70667137 -11.35782643 32.62864215 0 0 -8.24859926 102.49408272
829812232 -5.01669801 -54.96373977 -11.32799224 32.47027228 0 0 -8.25242983 102.67527993
830009664 -5.03186957 -55.19798421 -11.33454492 32.16066944 0 0 -8.24929673 102.81301409
830207096 -5.02912503 -55.30647107 -11.34560713 32.02237222 0 0 -8.26165145 102.65206344
830404528 -5.04706352 -55.67007372 -11.3189009 32.04485247 0 0 -8.27336443 102.72207378
830601960 -5.02035354 -55.70356551 -11.29641666 31.97328902 0 0 -8.27478168 102.69484792
830799392 -5.0367216 -55.85243411 -11.31875838 31.59905177 0 0 -8.27113806 102.64208189
830996824 -5.05482642 -55.83264361 -11.29447418 31.51464422 0 0 -8.29474246 102.6337513
831194256 -5.05216028 -56.11931053 -11.28434777 31.34134446 0 0 -8.29124814 102.83578442
831391688 -5.04453508 -56.2261861 -11.28484401 31.13590505 0 0 -8.27663607 102.71900836
831589120 -5.07515713 -56.50384183 -11.27363509 30.97604067 0 0 -8.31261765 102.83143243
831786552 -5.05733928 -56.64596799 -11.26800386 30.89615267 0 0 -8.30968371 102.65874722
831983984 -5.07793414 -56.84127485 -11.26443201 30.86444723 0 0 -8.32508753 103.02169716
832181416 -5.08277187 -56.90708259 -11.25101393 30.52718764 0 0 -8.34983233 102.77926946
832378848 -5.07639502 -57.15214571 -11.28077978 30.58224177 0 0 -8.33242066 102.64518814
832576280 -5.09031542 -57.35388248 -11.24468086 30.32898107 0 0 -8.34929589 102.74485834
832773712 -5.08851012 -57.35329034 -11.23367894 30.25519218 0 0 -8.3120646 102.54336593
832971144 -5.11430972 -57.49553385 -11.23867459 29.98316902 0 0 -8.33905003 103.02289507
833168576 -5.1254749 -57.66394248 -11.21128 29.89728018 0 0 -8.31829383 102.87463554
833366008 -5.12391062 -57.9428395 -11.20092798 29.67147472 0 0 -8.32758062 102.8362833
833563440 -5.12989451 -57.944584 -11.19653858 29.52860735 0 0 -8.3469845 102.64702983
833760872 -5.14546258 -58.10902425 -11.19729466 29.54781967 0 0 -8.35304359 102.8405113
833958304 -5.16060432 -58.22630382 -11.1597947 29.32117871 0 0 -8.33037087 102.65780742
834155736 -5.13976953 -58.38270614 -11.18108424 29.05797881 0 0 -8.35629382 102.73395443
834353168 -5.15755977 -58.55869251 -11.17005869 28.96104143 0 0 -8.33902551 102.78383535
834550600 -5.17801389 -58.69739569 -11.16633139 28.82217681 0 0 -8.34342082 102.86270495
834748032 -5.19245097 -58.76963396 -11.14890045 28.70288495 0 0 -8.36583326 102.60099298
834945464 -5.18317272 -58.89996336 -11.15796352 28.50810943 0 0 -8.33990884 102.85025361
835142896 -5.17767247 -59.2333216 -11.11743334 28.45943142 0 0 -8.33824048 102.6651845
835340328 -5.21173791 -59.21787124 -11.13635761 28.25463026 0 0 -8.34720589 102.62302333
835537760 -5.24453196 -59.37463671 -11.13150631 27.99530897 0 0 -8.35272614 102.64899078
835735192 -5.21651773 -59.67472321 -11.11902013 28.01572449 0 0 -8.38220921 102.76155259
835932624 -5.24632896 -59.73834622 -11.09943658 27.73360083 0 0 -8.32916944 102.47640393
836130056 -5.24428435 -59.7988609 -11.10516175 27.68704171 0 0 -8.34469399 102.81220896
836327488 -5.2564186 -60.10888244 -11.09677333 27.49245116 0 0 -8.36725861 102.72921759
836524920 -5.26761553 -60.14579092 -11.07926571 27.34354503 0 0 -8.38239839 102.80338575
836722352 -5.27353457 -60.33311296 -11.07542022 27.18950413 0 0 -8.38236202 102.78106466
836919784 -5.25751139 -60.46127679 -11.07295582 27.06062854 0 0 -8.32613663 102.8417903
837117216 -5.27847895 -60.58834971 -11.07379805 26.9574329 0 0 -8.35532703 102.64097669
837314648 -5.29261534 -60.77242505 -11.06075783 26.68015907 0 0 -8.37848408 102.869151
837512080 -5.29162235 -60.94837301 -11.04336835 26.6280619 0 0 -8.3708634 102.83248268
837709512 -5.29465579 -61.03849929 -11.06574225 26.51148158 0 0 -8.36771498 102.72924626
837906944 -5.31960083 -61.10962412 -11.03135301 26.22799074 0 0 -8.37477066 102.80661709
838104376 -5.33013491 -61.27596394 -11.02553901 26.1438562 0 0 -8.37022972 102.73341489
838301808 -5.3348753 -61.37435484 -11.02242568 25.9513908 0 0 -8.39788556 102.58829308
838499240 -5.33526333 -61.88197488 -11.03554278 25.9405777 0 0 -8.37215958 102.83280555
838696672 -5.33690377 -61.85629977 -11.03141015 25.77540026 0 0 -8.37099135 102.69974917
838894104 -5.3735461 -62.04465834 -11.01816993 25.59046639 0 0 -8.39879722 102.85063769
839091536 -5.39130471 -62.22268521 -11.00968201 25.28499952 0 0 -8.384808 102.77933986
839288968 -5.37686052 -62.43435397 -10.98101813 25.29856532 0 0 -8.36998498 102.77210073
839486400 -5.37219506 -62.3899384 -10.97718095 25.15145476 0 0 -8.35885456 102.62182895
839683832 -5.40028425 -62.64733929 -10.96555473 24.97051723 0 0 -8.3805771 102.85600214
839881264 -5.4119272 -62.79299002 -10.96442129 24.88964621 0 0 -8.37438387 102.97028722
840078696 -5.42417044 -62.91018822 -10.9537898 24.6734383 0 0 -8.3984485 102.8318775
840276128 -5.41718946 -63.10561707 -10.97053125 24.58548879 0 0 -8.35447497 102.82453985
840473560 -5.44924907 -63.42272442 -10.95449698 24.5289414 0 0 -8.37866558 102.8140042
840670992 -5.44484963 -63.46021961 -10.9566029 24.30169598 0 0 -8.35747729 102.85331314
840868424 -5.46456394 -63.61222673 -10.92902447 24.07817639 0 0 -8.37598358 102.76917058
841065856 -5.47094456 -63.7879024 -10.91361864 23.90427885 0 0 -8.40997268 103.00521362
841263288 -5.48781891 -63.94420716 -10.93373568 23.86541496 0 0 -8.38154802 102.7145678
841460720 -5.50500806 -64.24138338 -10.9215418 23.63557079 0 0 -8.35327215 102.618976
841658152 -5.48731887 -64.12461065 -10.90401366 23.52021786 0 0 -8.41209651 102.82091796
841855584 -5.50760529 -64.40210365 -10.90431649 23.34652551 0 0 -8.39523367 102.86996106
842053016 -5.52967765 -64.58228476 -10.89069011 23.22620035 0 0 -8.39747543 102.98703735
842250448 -5.53069803 -64.81192966 -10.89938423 23.087395 0 0 -8.39618297 102.72603125
842447880 -5.51094035 -64.86529859 -10.86559664 22.94417161 0 0 -8.37882451 102.68062451
842645312 -5.53739416 -65.09468214 -10.85977933 22.5895373 0 0 -8.39982602 102.8840369
842842744 -5.55856013 -65.23913149 -10.85480957 22.65097703 0 0 -8.39882543 102.77285222
843040176 -5.55504251 -65.50661067 -10.86215534 22.5728687 0 0 -8.39129583 102.7822826
843237608 -5.52875735 -65.65076421 -10.85449325 22.37714909 0 0 -8.38532042 102.85772349
843435040 -5.54979712 -65.73085293 -10.84202516 22.1872071 0 0 -8.41107315 102.82967322
843632472 -5.5533988 -65.82432992 -10.83683495 22.07422769 0 0 -8.44843154 102.79092997
843829904 -5.56383475 -66.02296008 -10.82184838 21.75526205 0 0 -8.4097079 102.68271322
844027336 -5.58458706 -66.20308204 -10.81131847 21.63769594 0 0 -8.4489514 102.83578618
844224768 -5.56285318 -66.45158334 -10.80911272 21.5276573 0 0 -8.48299986 103.01501903
844422200 -5.59322509 -66.56087197 -10.80515317 21.42611677 0 0 -8.43011305 102.8833087
844619632 -5.59797867 -66.58620374 -10.79066708 21.2658023 0 0 -8.472365 102.89565366
844817064 -5.60789993 -66.97173096 -10.7869215 21.15035774 0 0 -8.48310834 102.89536918
845014496 -5.59933646 -66.98561907 -10.79196735 21.02745204 0 0 -8.4883401 102.84666439
845211928 -5.61564466 -67.08169563 -10.78426144 20.81383925 0 0 -8.47039574 102.73510075
845409360 -5.64543106 -67.27275361 -10.78598297 20.5909606 0 0 -8.47825075 102.79560954
845606792 -5.65398273 -67.45652814 -10.78330645 20.55248829 0 0 -8.49513159 102.72374222
845804224 -5.67257383 -67.39901652 -10.76962964 20.26287278 0 0 -8.48405659 102.75802419
846001656 -5.66679268 -67.77333553 -10.75624574 20.17605651 0 0 -8.51657146 102.71802209
846199088 -5.64446734 -67.87756736 -10.76967106 19.95459242 0 0 -8.49939009 102.62984375
846396520 -5.66339013 -67.96141631 -10.73221145 19.83982157 0 0 -8.49355107 102.74360944
846593952 -5.67822105 -68.17421174 -10.73437836 19.61400392 0 0 -8.50252297 102.64202093
846791384 -5.71560034 -68.33675955 -10.75975748 19.45197364 0 0 -8.50063878 102.60830665
846988816 -5.72104288 -68.54470385 -10.75279547 19.52723238 0 0 -8.49032 102.59097973
847186248 -5.71067213 -68.7914042 -10.72895067 19.11033593 0 0 -8.4767217 102.45451803
847383680 -5.71675428 -68.85674631 -10.72907242 19.15928009 0 0 -8.49561273 102.43277406
847581112 -5.70884186 -69.09475471 -10.71603464 18.94435176 0 0 -8.48447625 102.60879509
847778544 -5.75530809 -68.92178944 -10.70891129 18.76580331 0 0 -8.51220445 102.36240714
847975976 -5.75975871 -69.23414134 -10.70258716 18.63408691 0 0 -8.48517078 102.17682129
848173408 -5.75755647 -69.45268521 -10.71212663 18.48378336 0 0 -8.49056818 102.47779756
848370840 -5.7766499 -69.52327587 -10.70487698 18.30941828 0 0 -8.52277167 102.55433344
848568272 -5.76220285 -69.81344038 -10.68768176 18.1342022 0 0 -8.50062494 102.35011693
848765704 -5.77670915 -69.89481665 -10.68177701 18.04505174 0 0 -8.48807725 102.33322024
848963136 -5.80072091 -69.93455256 -10.67296249 17.92540377 0 0 -8.51112534 102.33928938
849160568 -5.7851429 -70.22399278 -10.65874639 17.59221524 0 0 -8.52519742 102.23377159
849358000 -5.82969734 -70.39372356 -10.66763281 17.55247028 0 0 -8.49049164 102.08293378
849555432 -5.82659944 -70.43587723 -10.6540455 17.29294093 0 0 -8.51676797 102.37748282
849752864 -5.84403783 -70.66099243 -10.66778356 17.13578704 0 0 -8.53901373 102.23996611
849950296 -5.83555288 -70.77370226 -10.64389992 17.04529771 0 0 -8.54098471 102.22685857
850147728 -5.84261651 -70.90344644 -10.64180834 16.80352307 0 0 -8.51060936 102.11155401
850345160 -5.86920349 -71.00746517 -10.6223782 16.77272701 0 0 -8.52832068 102.2623757
850542592 -5.86477223 -71.11970177 -10.63627519 16.61767074 0 0 -8.54531838 102.09959332
850740024 -5.87561364 -71.37054583 -10.61786205 16.44045021 0 0 -8.57546839 102.25009528
850937456 -5.8926048 -71.55867125 -10.62259182 16.23961368 0 0 -8.557861 102.22980764
851134888 -5.90231816 -71.48538901 -10.60865947 16.04434473 0 0 -8.52886604 102.00519121
851332320 -5.89693921 -71.90616364 -10.60418289 15.95567331 0 0 -8.49159236 102.3318022
851529752 -5.89821194 -72.06562913 -10.60953686 15.84117317 0 0 -8.54761 102.2708369
851727184 -5.92739436 -72.20917072 -10.59355488 15.64565841 0 0 -8.57917583 102.18576019
851924616 -5.93386305 -72.29425806 -10.58923407 15.48984158 0 0 -8.53012445 102.10516675
852122048 -5.94522312 -72.50977955 -10.57009816 15.37816515 0 0 -8.5535451 102.14921231
852319480 -5.93660027 -72.80346274 -10.57798809 15.13249613 0 0 -8.57409283 102.30160837
852516912 -5.9479793 -72.71691815 -10.5553412 15.04727448 0 0 -8.53157948 102.23387764
852714344 -5.95234197 -73.13780884 -10.56709055 14.9049034 0 0 -8.60130937 102.25811217
852911776 -5.95815624 -73.1946206 -10.55828681 14.7495794 0 0 -8.54958526 102.04156522
853109208 -6.00092653 -73.26545138 -10.56262522 14.5849299 0 0 -8.56065698 102.20471299
853306640 -5.99554914 -73.53972473 -10.5455437 14.49390439 0 0 -8.58502859 102.35396591
853504072 -6.01641407 -73.67452764 -10.5346302 14.35952995 0 0 -8.5828229 102.18188329
853701504 -6.02175271 -73.75483049 -10.54795473 14.32471512 0 0 -8.58112595 102.04734993
853898936 -5.99917299 -74.10574084 -10.5417833 13.97827346 0 0 -8.58400338 102.23016537
854096368 -6.01512403 -74.28725971 -10.52785035 13.90110457 0 0 -8.61093385 102.07639386
854293800 -6.04421722 -74.38449067 -10.53459646 13.78046764 0 0 -8.59249985 102.07000051
854491232 -6.02976905 -74.56085295 -10.51127023 13.65299058 0 0 -8.62246773 102.08842156
854688664 -6.03952472 -74.764908 -10.51478581 13.48188862 0 0 -8.63541292 102.05784176
854886096 -6.05483647 -74.98152796 -10.51683084 13.26660092 0 0 -8.63977305 102.00851448
855083528 -6.03829472 -75.15701081 -10.48446814 13.10276005 0 0 -8.63834589 102.19321839
855280960 -6.04916331 -75.25625321 -10.51327801 12.99081021 0 0 -8.64707203 101.94288938
855478392 -6.05683105 -75.38809456 -10.47305428 12.8207222 0 0 -8.65391305 101.96872642
855675824 -6.08816055 -75.6085955 -10.46976155 12.75242665 0 0 -8.63590541 102.14077747
855873256 -6.09665165 -75.75763596 -10.4824309 12.60272238 0 0 -8.6521319 102.1060568
856070688 -6.09213081 -75.88903108 -10.4739188 12.27902047 0 0 -8.65749462 101.90003778
856268120 -6.07204894 -76.12316422 -10.47619527 12.21745564 0 0 -8.69842363 101.83589453
856465552 -6.09085907 -76.20934452 -10.46290424 12.14436957 0 0 -8.70555187 101.98206983
856662984 -6.09546896 -76.39029744 -10.43496111 11.87944292 0 0 -8.6857277 102.11118505
856860416 -6.10611999 -76.62047014 -10.45034139 11.83033017 0 0 -8.67909939 102.10055655
857057848 -6.13910484 -76.72751986 -10.44826606 11.67815431 0 0 -8.69803314 102.10479015
857255280 -6.1399746 -77.01477765 -10.44241625 11.41170346 0 0 -8.68393219 101.86555627
857452712 -6.14137112 -77.08127381 -10.41543054 11.25393462 0 0 -8.67442098 101.71244921
857650144 -6.14493592 -77.29259889 -10.42385213 11.16914862 0 0 -8.67750723 101.694181
857847576 -6.18526567 -77.46107891 -10.43710256 10.92221729 0 0 -8.69500778 101.88691092
858045008 -6.19053949 -77.65211392 -10.41936705 10.84857576 0 0 -8.6843165 101.68993464
858242440 -6.19592224 -77.72865897 -10.42169012 10.66465922 0 0 -8.68077617 102.00210943
858439872 -6.22177165 -77.89415629 -10.40284629 10.45333624 0 0 -8.6911779 101.84198168
858637304 -6.20839392 -78.15203145 -10.40835167 10.2553352 0 0 -8.69216761 101.57739402
858834736 -6.2332654 -78.20480238 -10.3871792 10.14816123 0 0 -8.68418326 101.89518458
859032168 -6.23503005 -78.37503528 -10.38734016 9.99366075 0 0 -8.70589604 101.72156566
859229600 -6.25085501 -78.64330912 -10.37125507 9.74010081 0 0 -8.6923003 101.65138
859427032 -6.26734885 -78.91386104 -10.37150208 9.66805486 0 0 -8.68555064 101.58585941
859624464 -6.27422686 -78.95699946 -10.36398669 9.52490593 0 0 -8.68575894 101.65949375
859821896 -6.26055288 -79.1129027 -10.36630408 9.27349773 0 0 -8.70932572 101.50077219
860019328 -6.31197013 -79.21167428 -10.37345291 9.09979581 0 0 -8.70011906 101.59447555
860216760 -6.30411833 -79.49634611 -10.35421536 8.98832523 0 0 -8.68914988 101.49795681
860414192 -6.31754511 -79.59215321 -10.35153281 8.81807464 0 0 -8.71146792 101.24609172
860611624 -6.33493878 -79.87203697 -10.34237967 8.65619426 0 0 -8.72364671 101.30170171
860809056 -6.32796734 -79.82189867 -10.34107708 8.58815703 0 0 -8.70061159 101.27778652
861006488 -6.35201542 -80.03110106 -10.34800667 8.3729706 0 0 -8.71659044 101.51108133
861203920 -6.36976726 -80.18233974 -10.35013959 8.1371556 0 0 -8.7151697 101.34445935
861401352 -6.36687327 -80.22246193 -10.34052634 7.99711741 0 0 -8.71757363 101.41275192
861598784 -6.360306 -80.43239464 -10.3149521 7.80077728 0 0 -8.72196117 101.27171709
861796216 -6.38803801 -80.64420791 -10.31366709 7.69304588 0 0 -8.73464097 101.17550682
861993648 -6.40772347 -80.93018307 -10.3231648 7.48809981 0 0 -8.74779266 101.14655693
862191080 -6.4392037 -80.92094865 -10.30806096 7.40148721 0 0 -8.74441961 101.2461418
862388512 -6.41219365 -81.16724055 -10.30208301 7.31613541 0 0 -8.73270886 101.05821493
862585944 -6.46790853 -81.29327689 -10.32746735 7.06170118 0 0 -8.74130747 100.95397107
862783376 -6.44705895 -81.69535551 -10.29773835 6.97101274 0 0 -8.75917691 101.15207799
862980808 -6.45332072 -81.76355906 -10.28035736 6.82382386 0 0 -8.77457081 101.07255615
863178240 -6.46345321 -81.98246731 -10.29709253 6.62038225 0 0 -8.77742 101.08268425
863375672 -6.47754116 -82.14404037 -10.28737099 6.32647826 0 0 -8.77118079 101.17819964
863573104 -6.48511835 -82.2735267 -10.2622289 6.29295248 0 0 -8.76610389 101.1201407
863770536 -6.46946512 -82.32111525 -10.27361536 5.9848459 0 0 -8.76322301 101.16380388
863967968 -6.46942572 -82.6592614 -10.26320623 5.86434637 0 0 -8.80480527 101.11793682
864165400 -6.49560667 -82.83671615 -10.26809475 5.90288256 0 0 -8.78073197 101.33959621
864362832 -6.50603484 -83.22886679 -10.24527613 5.64298883 0 0 -8.85372576 101.09366415
864560264 -6.51082268 -83.33485961 -10.2573848 5.50292729 0 0 -8.79812268 100.94942383
864757696 -6.48958262 -83.37151088 -10.24079942 5.36546854 0 0 -8.83797598 100.98346746
864955128 -6.52258092 -83.63544977 -10.23068677 5.12022933 0 0 -8.81402161 100.99533227
865152560 -6.53022035 -83.84018705 -10.25011508 5.08075169 0 0 -8.87304195 101.25333051
865349992 -6.53153378 -84.06754957 -10.23479628 4.99675259 0 0 -8.87756314 101.09033295
865547424 -6.53437843 -84.22409281 -10.23075836 4.64605197 0 0 -8.87287535 101.08862314
865744856 -6.56190461 -84.39710108 -10.22836408 4.56149977 0 0 -8.84978788 101.03195442
865942288 -6.55842852 -84.50134435 -10.22138722 4.37358386 0 0 -8.82242988 101.06285805
866139720 -6.57878273 -84.68915822 -10.20760846 4.21962011 0 0 -8.89562248 100.87435702
866337152 -6.60279434 -85.00598183 -10.21225945 4.04503399 0 0 -8.89731967 100.90451549
866534584 -6.61325286 -85.0500752 -10.22174846 3.81691591 0 0 -8.88703659 101.17783996
866732016 -6.58957564 -85.23047783 -10.19369205 3.75088955 0 0 -8.90989543 101.22420149
866929448 -6.63108239 -85.44094658 -10.16970478 3.5896408 0 0 -8.89040521 101.00913361
867126880 -6.61880942 -85.58841578 -10.19574264 3.37982423 0 0 -8.87721468 100.81720163
867324312 -6.63386827 -85.87023118 -10.17023658 3.09772795 0 0 -8.90925309 100.75448283
867521744 -6.64757208 -86.09980729 -10.17912848 3.06659367 0 0 -8.91258849 101.09846531
867719176 -6.64375379 -86.28688837 -10.1732312 2.8394782 0 0 -8.9083076 100.79923633
867916608 -6.67940233 -86.40325182 -10.1751607 2.64386119 0 0 -8.88383221 100.75539281
868114040 -6.71064331 -86.572183 -10.17128813 2.39534072 0 0 -8.92852815 100.54715283
868311472 -6.69925951 -86.91015996 -10.15766086 2.34108394 0 0 -8.9261599 100.53619725
868508904 -6.71599472 -87.02707415 -10.15900945 2.14090056 0 0 -8.92973797 100.59752063
868706336 -6.73516267 -87.12879324 -10.15187432 2.01962198 0 0 -8.92148787 100.52409159
868903768 -6.72769496 -87.28692153 -10.14675445 1.80053082 0 0 -8.94767851 100.54357219
869101200 -6.72431905 -87.59968348 -10.15090886 1.78123051 0 0 -8.94920914 100.46256526
869298632 -6.77487398 -87.65467502 -10.15139299 1.55753802 0 0 -8.91998879 100.53583387
869496064 -6.77893534 -87.85125927 -10.14490447 1.36951355 0 0 -8.9318732 100.50332802
869693496 -6.79509966 -88.10531547 -10.11890304 1.25951872 0 0 -8.93608953 100.25158872
869890928 -6.80792634 -88.07812462 -10.12018294 1.02435865 0 0 -8.96340938 100.37745216
870088360 -6.78403201 -88.38147804 -10.10960969 0.93557253 0 0 -8.97125579 100.61876742
870285792 -6.81466221 -88.56071647 -10.09705656 0.77947908 0 0 -8.974838 100.3274532
870483224 -6.81881273 -88.75659131 -10.1026706 0.6174663 0 0 -8.98079345 100.47298979
870680656 -6.82023656 -89.01888834 -10.09404754 0.43857631 0 0 -8.96913919 100.13300277
870878088 -6.81785047 -89.2698413 -10.08476432 0.12364633 0 0 -9.00767008 100.12159856
871075520 -6.85913461 -89.29277493 -10.09253995 0.09956456 0 0 -8.94009759 100.12023866
871272952 -6.84907966 -89.49204944 -10.09582976 0.01338386 0 0 -8.98517377 100.17801102
871470384 -6.86962966 -89.76604064 -10.07749186 -0.30938055 0 0 -8.99552959 100.20801553
871667816 -6.89772138 -89.94981328 -10.07654755 -0.33773768 0 0 -8.99967174 100.17907048
871865248 -6.89424523 -90.07295077 -10.06448993 -0.56076832 0 0 -9.00306526 100.2992646
872062680 -6.89628426 -90.36228541 -10.05557555 -0.67062652 0 0 -8.98283332 100.05060393
872260112 -6.92455001 -90.48572837 -10.05528963 -0.93312516 0 0 -8.99343421 100.18804628
872457544 -6.9391777 -90.74315316 -10.04569768 -1.00615706 0 0 -8.99688652 100.1394153
872654976 -6.94276801 -91.06721132 -10.04199588 -1.22039009 0 0 -9.03424361 99.98362456
872852408 -6.95472942 -91.17196121 -10.06905225 -1.31964299 0 0 -9.03511913 100.25651809
873049840 -6.94695765 -91.43360542 -10.04461956 -1.55075879 0 0 -9.01499346 99.91307882
873247272 -6.99342793 -91.53903619 -10.04465398 -1.66434128 0 0 -8.98278499 100.00445218
873444704 -6.98835542 -91.76699436 -10.03255761 -1.84575922 0 0 -9.02683276 99.96665305
873642136 -6.99737364 -91.98765609 -10.03235399 -2.01793664 0 0 -9.03481188 99.90015382
873839568 -7.0394203 -92.18585217 -10.02033226 -2.13701845 0 0 -9.03642041 100.0405533
874037000 -7.02277805 -92.30618318 -10.02738002 -2.32243085 0 0 -9.04108086 99.93094474
874234432 -7.0559081 -92.57393022 -10.02399921 -2.46358057 0 0 -9.06308039 100.0964044
874431864 -7.05854574 -92.93262899 -10.00874167 -2.74426379 0 0 -9.03549156 100.01557956
874629296 -7.06327267 -93.02177627 -9.99200676 -2.81443341 0 0 -9.06265658 99.93450443
874826728 -7.08060291 -93.20160568 -10.00283323 -3.05091972 0 0 -9.05745788 99.78902955
875024160 -7.09942809 -93.44659841 -9.98645853 -3.11444029 0 0 -9.06969561 99.95839073
875221592 -7.09187571 -93.77719558 -9.99256984 -3.30088678 0 0 -9.07976558 99.97285969
875419024 -7.11894438 -93.87779859 -9.99481198 -3.46485818 0 0 -9.06198382 99.92383488
875616456 -7.13937372 -94.07723909 -9.99471191 -3.59759416 0 0 -9.09007753 99.83167613
875813888 -7.14809651 -94.37246752 -9.97972136 -3.81129209 0 0 -9.09130436 99.74012629
876011320 -7.11686023 -94.56684327 -9.96488564 -3.91306127 0 0 -9.11272148 99.64163866
876208752 -7.16946747 -94.77356387 -9.97875929 -4.19625746 0 0 -9.10399526 99.55814706
876406184 -7.18183475 -94.9654367 -9.9817982 -4.27062665 0 0 -9.11829473 99.59515508
876603616 -7.15814053 -94.95743607 -9.95877533 -4.5762376 0 0 -9.06832894 99.64195582
876801048 -7.17374672 -95.1480126 -9.95685366 -4.61604723 0 0 -9.10879857 99.52245041
876998480 -7.19518737 -95.39855728 -9.95463299 -4.73627841 0 0 -9.09101362 99.53028025
877195912 -7.20772095 -95.63640259 -9.9552681 -4.90418742 0 0 -9.1306449 99.70506456
877393344 -7.1966524 -95.87692297 -9.94875851 -5.20580421 0 0 -9.13946654 99.39646998
877590776 -7.21552686 -95.93671806 -9.95510468 -5.32079197 0 0 -9.14704314 99.47213682
877788208 -7.22883422 -96.36951939 -9.95168097 -5.52537467 0 0 -9.09405265 99.43681408
877985640 -7.2469529 -96.38075872 -9.92938541 -5.69073191 0 0 -9.12719574 99.50388383
878183072 -7.26602077 -96.68867995 -9.93103364 -5.81961532 0 0 -9.1697366 99.46085863
878380504 -7.27976943 -96.95622376 -9.92160758 -5.96431934 0 0 -9.18805536 99.22897753
878577936 -7.26584922 -97.04670144 -9.9318753 -6.07393786 0 0 -9.16954465 99.25075177
878775368 -7.25174188 -97.27165849 -9.91825939 -6.38526845 0 0 -9.15353242 99.32083592
878972800 -7.29317888 -97.57401246 -9.9142426 -6.49515083 0 0 -9.12977728 99.22284702
879170232 -7.30936932 -97.71039799 -9.90672132 -6.71447335 0 0 -9.18504554 99.43693988
879367664 -7.31117374 -98.08149195 -9.91148901 -6.81179739 0 0 -9.20434084 99.15096486
879565096 -7.32876038 -98.19621436 -9.92157479 -7.05308698 0 0 -9.20630398 99.06966415
879762528 -7.30335301 -98.38079789 -9.91597356 -7.24197083 0 0 -9.228344 99.11975306
879959960 -7.3333675 -98.4200766 -9.90498026 -7.43851374 0 0 -9.21307579 98.93693163
880157392 -7.36265852 -98.66747881 -9.88887257 -7.50681784 0 0 -9.22470281 99.16664194
880354824 -7.33880338 -98.97618886 -9.88498642 -7.69792324 0 0 -9.20819541 98.97447203
880552256 -7.35098684 -99.22544723 -9.87498434 -7.81221733 0 0 -9.24230055 99.2214406
880749688 -7.36462055 -99.29057805 -9.88131681 -7.98117667 0 0 -9.22769427 98.97038731
880947120 -7.38749525 -99.68469977 -9.87242115 -8.13730095 0 0 -9.17835158 98.98171794
881144552 -7.35326799 -99.76801446 -9.87830348 -8.40134787 0 0 -9.30542368 99.03904537
881341984 -7.39392761 -100.10824408 -9.88490847 -8.5536728 0 0 -9.29933998 98.68983304
881539416 -7.395043 -100.27214543 -9.86812388 -8.65941487 0 0 -9.30931582 98.95168671
881736848 -7.42254556 -100.50189648 -9.8528796 -8.75816436 0 0 -9.27127501 98.86307965
881934280 -7.45088229 -100.62733786 -9.85129373 -9.03411211 0 0 -9.27556537 98.61505773
882131712 -7.42691269 -100.89318878 -9.84492867 -9.14197787 0 0 -9.29226549 98.45735083
882329144 -7.44464988 -101.21630149 -9.84518432 -9.2552582 0 0 -9.31715067 98.67807268
882526576 -7.49242621 -101.43888973 -9.86205466 -9.4766635 0 0 -9.31824783 98.69061944
882724008 -7.48710488 -101.47404638 -9.85734319 -9.66880699 0 0 -9.336947 98.62962245
882921440 -7.4962889 -101.70534745 -9.83102455 -9.86206955 0 0 -9.33206243 98.67223773
883118872 -7.48547508 -102.08255989 -9.84552169 -9.98986 0 0 -9.30502736 98.60879923
883316304 -7.50752004 -102.24153789 -9.83649484 -10.17411797 0 0 -9.34150946 98.59568047
883513736 -7.51498158 -102.42304618 -9.83031886 -10.27455623 0 0 -9.31429444 98.53336516
883711168 -7.52269336 -102.68991409 -9.82695792 -10.3491902 0 0 -9.3311348 98.3251722
883908600 -7.51206028 -102.73442907 -9.80447002 -10.64092182 0 0 -9.34858417 98.44753221
884106032 -7.5444846 -103.27172446 -9.81620206 -10.77866604 0 0 -9.36309854 98.32722705
884303464 -7.55498496 -103.23640112 -9.823021 -10.95448423 0 0 -9.35377277 98.44934444
884500896 -7.55835869 -103.3487446 -9.81013951 -11.24360293 0 0 -9.38521069 98.16848594
884698328 -7.58857646 -103.73595868 -9.79918324 -11.35875377 0 0 -9.35175834 98.17934137
884895760 -7.58166711 -103.70788027 -9.79175178 -11.50922707 0 0 -9.36049396 98.05383165
885093192 -7.60372601 -104.12736183 -9.79023648 -11.64663194 0 0 -9.40098814 98.09509664
885290624 -7.61776859 -104.37673833 -9.79934748 -11.89362104 0 0 -9.38029404 98.16768903
885488056 -7.67202939 -104.65567079 -9.76834593 -11.93459382 0 0 -9.36549685 98.07434455
885685488 -7.67893514 -104.91206638 -9.77899321 -12.11001948 0 0 -9.41123588 98.15061966
885882920 -7.67763405 -104.99787726 -9.77652489 -12.28613712 0 0 -9.39723009 97.94982855
886080352 -7.70136985 -105.12014742 -9.76317539 -12.55343306 0 0 -9.37679418 98.00707327
886277784 -7.67305183 -105.46556999 -9.77432394 -12.7375873 0 0 -9.39188892 97.85389992
886475216 -7.67017865 -105.76075581 -9.76261044 -12.93264202 0 0 -9.40936947 97.92403485
886672648 -7.71295024 -105.92357031 -9.7681155 -12.87463761 0 0 -9.40569943 97.91583273
886870080 -7.72272761 -106.15211667 -9.75788411 -13.21438302 0 0 -9.41355183 97.72811541
887067512 -7.72698446 -106.37719516 -9.75641561 -13.42857339 0 0 -9.41944294 97.8983961
887264944 -7.73125353 -106.47852023 -9.73268755 -13.50719935 0 0 -9.45276082 97.7955581
887462376 -7.7394679 -106.659941 -9.74762998 -13.69705293 0 0 -9.45581436 97.7213551
887659808 -7.73490069 -107.04300603 -9.74197409 -13.73568723 0 0 -9.52497953 97.54698468
887857240 -7.76069811 -106.92707404 -9.73533964 -13.93775055 0 0 -9.44540209 97.49862694
888054672 -7.74311528 -107.24524899 -9.73200325 -14.18459024 0 0 -9.48087453 97.49870024
888252104 -7.75691499 -107.65328464 -9.74024648 -14.28351755 0 0 -9.49596542 97.37849538
888449536 -7.74266516 -107.63337075 -9.72853119 -14.42702162 0 0 -9.50816741 97.22068825
888646968 -7.76854428 -107.88660532 -9.73258165 -14.58369614 0 0 -9.52308547 97.26183097
888844400 -7.77690894 -108.18810604 -9.72877175 -14.77992458 0 0 -9.45547598 97.2338749
889041832 -7.78203811 -108.26646215 -9.71086117 -14.99255542 0 0 -9.57762816 97.10285699
889239264 -7.7667195 -108.51737918 -9.70147921 -15.15585368 0 0 -9.58066839 96.83132584
889436696 -7.79311543 -108.6823462 -9.71705544 -15.30056067 0 0 -9.59118315 97.19986161
889634128 -7.83222242 -108.99941116 -9.72309055 -15.41785145 0 0 -9.5727129 96.81229584
889831560 -7.82467365 -109.13257937 -9.70004048 -15.5714022 0 0 -9.56938755 97.13234053
890028992 -7.81026145 -109.45007875 -9.70477963 -15.75197583 0 0 -9.61695183 96.95349373
890226424 -7.83169438 -109.68465954 -9.69278536 -15.830241 0 0 -9.59287747 96.955071
890423856 -7.83693916 -109.93599362 -9.70792468 -16.09768992 0 0 -9.58150643 96.98183561
890621288 -7.83589367 -110.13070455 -9.69053543 -16.22299689 0 0 -9.61316572 96.96886767
890818720 -7.8651669 -110.53013721 -9.6908644 -16.41491633 0 0 -9.56802 96.60211283
891016152 -7.88818258 -110.74620864 -9.6823332 -16.56453929 0 0 -9.61562081 97.01441073
891213584 -7.90271989 -110.95053417 -9.67308185 -16.6711665 0 0 -9.6371117 96.93704175
891411016 -7.88543104 -111.08659324 -9.69544286 -16.86855599 0 0 -9.65134148 96.6938216
891608448 -7.95010289 -111.24914033 -9.67661138 -16.99471088 0 0 -9.63231589 96.53881219
891805880 -7.90508871 -111.78867973 -9.67237636 -17.20850203 0 0 -9.61691318 96.85623017
892003312 -7.95838545 -111.95883082 -9.6773022 -17.42784082 0 0 -9.64219307 96.88567833
892200744 -7.93742485 -112.3134629 -9.66168986 -17.51311416 0 0 -9.63645916 96.78983829
892398176 -7.94864781 -112.41788769 -9.66355219 -17.66649628 0 0 -9.61415848 96.61999556
892595608 -7.97846824 -112.63266565 -9.65714332 -17.90665112 0 0 -9.61568051 96.6698364
892793040 -8.0024529 -112.91466931 -9.64796977 -18.03370103 0 0 -9.65297209 96.60193642
892990472 -7.98776624 -113.085787 -9.66104473 -18.21055432 0 0 -9.66738785 96.59546039
893187904 -7.99348019 -113.44383948 -9.65732624 -18.40278331 0 0 -9.70385345 96.53618542
893385336 -7.98015902 -113.43371101 -9.65095103 -18.58804475 0 0 -9.68246011 96.25122821
893582768 -8.03388453 -113.84007666 -9.63804783 -18.86406993 0 0 -9.68040157 96.12257273
893780200 -8.01433936 -113.99374093 -9.61818267 -18.85743685 0 0 -9.70701164 96.24511873
893977632 -8.05201063 -114.23839723 -9.61978481 -19.0854947 0 0 -9.73469499 96.10091795
894175064 -8.07874426 -114.47888052 -9.62548513 -19.21134376 0 0 -9.74016362 96.07766629
894372496 -8.05607007 -114.80094626 -9.63617502 -19.45901346 0 0 -9.70630605 95.88860084
894569928 -8.08054033 -114.9180016 -9.61420016 -19.54809643 0 0 -9.72942418 95.75424028
894767360 -8.07750652 -115.22936469 -9.61696501 -19.79135893 0 0 -9.74881981 95.78380074
894964792 -8.07176182 -115.35535372 -9.60510195 -19.91278105 0 0 -9.74626435 95.60432244
895162224 -8.11152698 -115.53279344 -9.60112238 -20.12303471 0 0 -9.75052106 95.5421105
895359656 -8.11427492 -115.57405973 -9.61189679 -20.17891523 0 0 -9.79913382 95.51031774
895557088 -8.1024076 -116.09842745 -9.58698334 -20.31135751 0 0 -9.80362757 95.28172381
895754520 -8.16172824 -116.0458278 -9.59301302 -20.55471908 0 0 -9.78837341 95.49633819
895951952 -8.13801226 -116.58726298 -9.59809465 -20.75620316 0 0 -9.8122616 95.18152483
896149384 -8.15152013 -116.71113274 -9.56965695 -21.0636219 0 0 -9.79270288 95.17640539
896346816 -8.1769234 -116.84038021 -9.57695427 -21.04049494 0 0 -9.81750812 95.50705061
896544248 -8.17414166 -117.17227551 -9.57263268 -21.13941496 0 0 -9.82889705 95.23220882
896741680 -8.17562308 -117.56158355 -9.56535762 -21.46490147 0 0 -9.81380841 95.28093316
896939112 -8.18091987 -117.75188571 -9.57432632 -21.54041827 0 0 -9.83071305 95.21186398
897136544 -8.19403191 -118.04989632 -9.55007852 -21.76204854 0 0 -9.83953966 95.26939738
897333976 -8.19137324 -118.31261098 -9.55552312 -21.95520291 0 0 -9.82109899 95.20626249
897531408 -8.22444033 -118.59066472 -9.5593199 -21.98654913 0 0 -9.81690139 95.32007414
897728840 -8.22828726 -118.83469579 -9.53964384 -22.2801447 0 0 -9.83709998 95.21535669
897926272 -8.21199853 -118.93992438 -9.55303613 -22.39348234 0 0 -9.86776568 95.25158157
898123704 -8.23456622 -119.39373964 -9.54023715 -22.50707589 0 0 -9.86069483 95.27116081
898321136 -8.24315228 -119.59977964 -9.55020571 -22.72127002 0 0 -9.866202 95.26313665
898518568 -8.23789043 -119.76461441 -9.53378495 -22.91297606 0 0 -9.87482735 95.17133394
898716000 -8.27627172 -120.19601219 -9.52456103 -23.03112795 0 0 -9.91847782 94.96252895
898913432 -8.25473402 -120.13181892 -9.53434809 -23.23253234 0 0 -9.90524323 94.8789664
899110864 -8.2501035 -120.5021439 -9.52393067 -23.4091122 0 0 -9.93693776 94.99414359
899308296 -8.28018818 -120.98669629 -9.53111042 -23.58201764 0 0 -9.92987133 95.08042182
899505728 -8.28139226 -120.90863062 -9.51462883 -23.57362893 0 0 -9.9434249 94.94366645
899703160 -8.28247868 -121.41583923 -9.51810293 -23.95116264 0 0 -9.94635295 94.73262667
899900592 -8.27469946 -121.56562169 -9.51559713 -23.99104139 0 0 -9.93248579 94.76072446
900098024 -8.29251342 -121.73009447 -9.52311931 -24.1165603 0 0 -9.95352909 94.66862603
900295456 -8.30038326 -121.93089245 -9.5142337 -24.39778732 0 0 -9.96066851 94.65022383
900492888 -8.31769262 -122.47563025 -9.50863636 -24.52195213 0 0 -10.0226573 94.50192502
900690320 -8.30145363 -122.4980171 -9.5090886 -24.70005496 0 0 -9.99529783 94.54439296
900887752 -8.31249014 -122.71471332 -9.49257643 -24.91686189 0 0 -9.98834825 94.37677351
901085184 -8.35532157 -122.87855574 -9.50753297 -24.99094223 0 0 -10.01664761 94.10012925
901282616 -8.34651208 -123.12308963 -9.50463825 -25.2059941 0 0 -10.03878798 94.2441513
901480048 -8.34707075 -123.34539435 -9.50295734 -25.35719473 0 0 -10.05034617 94.25404874
901677480 -8.34291343 -123.55321432 -9.49683491 -25.61597345 0 0 -10.08557294 94.29924877
901874912 -8.38311702 -123.73812188 -9.50069622 -25.68270601 0 0 -10.0849928 94.38976053
902072344 -8.36622505 -124.12382831 -9.48746446 -25.84580344 0 0 -10.07257218 94.20240442
902269776 -8.35466134 -124.28645181 -9.4856525 -25.98822341 0 0 -10.07336211 93.93530632
902467208 -8.39108699 -124.58136177 -9.4820552 -26.07631966 0 0 -10.10963519 94.009468
902664640 -8.42366034 -125.04442484 -9.47942036 -26.35905514 0 0 -10.06784363 93.75861972
902862072 -8.44012444 -125.23790179 -9.46942923 -26.57640733 0 0 -10.11077194 94.18430573
903059504 -8.41458294 -125.53092166 -9.46253987 -26.59370985 0 0 -10.11942051 93.70549761
903256936 -8.42294656 -125.56678927 -9.454508 -26.87919576 0 0 -10.13122357 93.94725505
903454368 -8.45328384 -125.93437148 -9.45285124 -27.03131643 0 0 -10.12958915 93.56201873
903651800 -8.47485994 -126.17539682 -9.44209187 -27.16379822 0 0 -10.13985575 93.82875421
903849232 -8.43358347 -126.39941957 -9.44946025 -27.22224083 0 0 -10.11885507 93.57262849
904046664 -8.49856799 -126.79426338 -9.44223677 -27.4745613 0 0 -10.14298194 93.61444225
904244096 -8.46966067 -126.96352618 -9.4191885 -27.54923242 0 0 -10.16301809 93.57941029
904441528 -8.46521298 -127.24058247 -9.43085974 -27.88049928 0 0 -10.16803889 93.45103556
904638960 -8.46243703 -127.46735601 -9.4308992 -27.95785901 0 0 -10.17445666 93.26435976
904836392 -8.47871178 -127.5545746 -9.43357058 -28.19118122 0 0 -10.20132474 93.33654475
905033824 -8.48974152 -128.00088578 -9.4231578 -28.28250985 0 0 -10.22541602 93.3110466
905231256 -8.51409398 -128.32634439 -9.40630605 -28.55704009 0 0 -10.22059901 93.32653302
905428688 -8.51925737 -128.52623741 -9.40915106 -28.69118557 0 0 -10.2590848 93.04192487
905626120 -8.52263359 -128.62437918 -9.42665071 -28.7626057 0 0 -10.21586031 93.24717628
905823552 -8.52370765 -129.0838023 -9.42043073 -28.98331718 0 0 -10.27041044 93.22509378
906020984 -8.54073705 -129.1382354 -9.41290203 -29.13664585 0 0 -10.22163868 92.80849504
906218416 -8.55682402 -129.73013776 -9.42005098 -29.27905245 0 0 -10.31108979 92.82768146
906415848 -8.54627676 -129.84440011 -9.4188134 -29.45201727 0 0 -10.29626326 92.76933553
906613280 -8.54050364 -130.10600966 -9.38863527 -29.60067524 0 0 -10.31024525 92.50586063
906810712 -8.54195423 -130.29680043 -9.40615623 -29.81812327 0 0 -10.32095815 92.73337235
907008144 -8.57939614 -130.40278804 -9.41941654 -30.02262847 0 0 -10.34864705 92.47180395
907205576 -8.5840546 -130.81254753 -9.409167 -30.16537305 0 0 -10.29660523 92.60261739
907403008 -8.5714499 -130.85495646 -9.42105518 -30.31969113 0 0 -10.33586277 92.16760142
907600440 -8.60158126 -131.09878475 -9.4205061 -30.32169757 0 0 -10.38354483 92.42026622
907797872 -8.56917806 -131.60383602 -9.40847497 -30.60375181 0 0 -10.41803205 92.24445771
907995304 -8.59414161 -131.50080009 -9.40425786 -30.77202132 0 0 -10.38045443 92.08499775
908192736 -8.61043436 -132.11092466 -9.40577352 -30.93862101 0 0 -10.44915081 92.01766309
908390168 -8.59646837 -132.23159761 -9.39101435 -31.16616687 0 0 -10.40162124 91.99388355
908587600 -8.60714184 -132.50177437 -9.39858891 -31.32868428 0 0 -10.43351577 91.85468359
908785032 -8.61440998 -132.76388833 -9.3915441 -31.36320559 0 0 -10.41552962 92.040252
908982464 -8.60961481 -133.03616377 -9.37883735 -31.56830898 0 0 -10.4048137 91.85259147
909179896 -8.59959613 -133.43648207 -9.38169672 -31.80157292 0 0 -10.44362686 91.80358947
909377328 -8.63401588 -133.57101877 -9.3750763 -31.90335617 0 0 -10.45066698 91.87217274
909574760 -8.63258982 -134.00863762 -9.37971523 -32.15232404 0 0 -10.47769908 91.57574049
909772192 -8.63320902 -134.21166674 -9.37739313 -32.22063116 0 0 -10.53255815 91.53724536
909969624 -8.61685565 -134.30378657 -9.35940518 -32.45646838 0 0 -10.4815366 91.83000666
910167056 -8.64149319 -134.61213578 -9.36842726 -32.50236586 0 0 -10.49645583 91.31842877
910364488 -8.66833855 -134.8716789 -9.3575246 -32.78883833 0 0 -10.52846135 91.46482247
910561920 -8.67314044 -135.16253596 -9.36770329 -32.9704194 0 0 -10.53362531 91.41673584
910759352 -8.63366729 -135.49659885 -9.35754546 -33.00575953 0 0 -10.57531123 91.05027566
910956784 -8.6762292 -135.68558394 -9.3391535 -33.27499151 0 0 -10.55633188 91.40408445
911154216 -8.67656633 -136.11341537 -9.35980884 -33.35726728 0 0 -10.50963656 91.29936609
911351648 -8.68807627 -136.17979868 -9.34356272 -33.62669118 0 0 -10.54591697 91.19105003
911549080 -8.70622892 -136.77155004 -9.34832789 -33.81090504 0 0 -10.5675766 91.1481475
911746512 -8.6878912 -136.89379188 -9.34122566 -33.91190583 0 0 -10.56562867 91.21973086
911943944 -8.67853046 -137.00335664 -9.34252399 -34.11911885 0 0 -10.60087923 91.07274909
912141376 -8.72577019 -137.50662869 -9.34807854 -34.23032794 0 0 -10.60185989 91.00738526
912338808 -8.71087571 -137.56722873 -9.34308385 -34.40155454 0 0 -10.59438128 90.97512233
912536240 -8.71202801 -137.9997629 -9.33407251 -34.52328759 0 0 -10.61972841 90.76066017
912733672 -8.69907533 -138.11039838 -9.34942853 -34.67476076 0 0 -10.60432018 90.81026856
912931104 -8.70391322 -138.67781923 -9.34511962 -34.84075449 0 0 -10.62221377 90.92769391
913128536 -8.71929037 -138.94859394 -9.33345089 -34.99809151 0 0 -10.62896611 90.61925353
913325968 -8.72245028 -138.96548634 -9.33768773 -35.21384652 0 0 -10.58598383 90.98853122
913523400 -8.73352524 -139.51420101 -9.33369467 -35.35697709 0 0 -10.6566316 90.68085397
913720832 -8.75835492 -139.73539468 -9.33306123 -35.63362207 0 0 -10.65620602 90.78452606
913918264 -8.7621998 -139.72119645 -9.33575518 -35.6070438 0 0 -10.65576768 90.78342257
914115696 -8.74098531 -140.12794728 -9.34417681 -35.93054189 0 0 -10.7329637 90.74826734
914313128 -8.72513082 -140.66906699 -9.32969565 -36.00614114 0 0 -10.71268382 90.76566848
914510560 -8.74873346 -140.66979702 -9.31998457 -36.11504903 0 0 -10.71643475 90.46850778
914707992 -8.72058963 -140.69362358 -9.31908509 -36.38317003 0 0 -10.75184679 90.46487899
914905424 -8.75321744 -141.20744311 -9.3208169 -36.40609491 0 0 -10.7881951 90.34907183
915102856 -8.73824494 -141.48955448 -9.33272165 -36.75198237 0 0 -10.79339925 90.47895144
915300288 -8.74659121 -141.58549083 -9.31622751 -36.82093644 0 0 -10.82767884 90.2617638
915497720 -8.72413718 -141.97671205 -9.33111385 -37.03443043 0 0 -10.85818132 90.08505616
915695152 -8.73970822 -142.30686387 -9.32584816 -37.08572962 0 0 -10.87705721 90.06912604
915892584 -8.75332765 -142.52194704 -9.33347571 -37.35804782 0 0 -10.87942985 90.03418027
916090016 -8.73695364 -142.76232695 -9.33116661 -37.5710284 0 0 -10.89122295 90.00917053
916287448 -8.74639445 -142.86162582 -9.31845069 -37.57326614 0 0 -10.93459447 90.29033656
916484880 -8.77262716 -143.37956765 -9.3254184 -37.85687228 0 0 -10.95367995 89.96464882
916682312 -8.73285926 -143.43497342 -9.33039004 -37.98755383 0 0 -10.94533716 89.96534777
916879744 -8.73604608 -143.74630924 -9.32546707 -38.10158878 0 0 -10.97931064 89.84286889
917077176 -8.74293528 -143.86186165 -9.31918623 -38.37873214 0 0 -10.98332064 89.85133279
917274608 -8.7485595 -144.30030746 -9.31777806 -38.50627211 0 0 -10.96854286 89.93972429
917472040 -8.78248819 -144.67289212 -9.32954836 -38.65950481 0 0 -11.00863075 89.86687453
917669472 -8.76318869 -145.02589703 -9.30653191 -38.94245055 0 0 -11.01881801 89.81475946
917866904 -8.78248776 -145.19944819 -9.30952672 -38.90505278 0 0 -11.04260636 89.28494965
918064336 -8.79183865 -145.47290842 -9.31346972 -39.26723291 0 0 -11.03857292 89.31771863
918261768 -8.78881854 -145.56504836 -9.30441435 -39.36553243 0 0 -11.11145861 89.34124715
918459200 -8.8176343 -146.09341574 -9.31432714 -39.48784341 0 0 -11.06530176 89.37565051
918656632 -8.77942531 -146.29649277 -9.28643567 -39.7352433 0 0 -11.07662974 89.22263982
918854064 -8.79981275 -146.51910997 -9.2911818 -39.82547414 0 0 -11.07090687 89.20491455
919051496 -8.77998247 -146.73405203 -9.30420896 -40.13013187 0 0 -11.05358054 89.13152467
919248928 -8.84578583 -146.96869142 -9.29787177 -40.23741747 0 0 -11.0944375 89.14204147
919446360 -8.82885105 -147.12325533 -9.30018146 -40.4559527 0 0 -11.12503609 89.19386055
919643792 -8.84297781 -147.6153765 -9.29560052 -40.49737122 0 0 -11.15018396 88.66526183
919841224 -8.83774085 -147.97331024 -9.29411695 -40.76002894 0 0 -11.16760681 88.67978201
920038656 -8.83655299 -148.31188875 -9.28421572 -40.84734612 0 0 -11.17425878 88.6308949
920236088 -8.86222766 -148.37419549 -9.27638844 -41.07162467 0 0 -11.16185363 88.98642752
920433520 -8.84422063 -148.66208124 -9.284305 -41.16953951 0 0 -11.16169675 88.88499717
920630952 -8.86917673 -148.82530808 -9.29291392 -41.4300158 0 0 -11.23369332 88.54562406
920828384 -8.86845996 -149.04679864 -9.28012834 -41.50117709 0 0 -11.19993893 88.4974264
921025816 -8.88010561 -149.52651731 -9.29228015 -41.73001057 0 0 -11.25293184 88.2771781
921223248 -8.83233404 -149.84489057 -9.26514549 -42.00404112 0 0 -11.27444595 88.22818549
921420680 -8.87123627 -149.79009054 -9.28813238 -42.15004206 0 0 -11.27335809 88.59082292
921618112 -8.86904497 -150.27904721 -9.29384297 -42.37491635 0 0 -11.2693767 88.10063543
921815544 -8.86911246 -150.58200425 -9.29005301 -42.52418436 0 0 -11.23738014 88.10713908
922012976 -8.89603219 -150.74053661 -9.29347761 -42.57232073 0 0 -11.33329159 87.71295483
922210408 -8.8724667 -151.03843107 -9.28810716 -42.80039226 0 0 -11.34889288 87.94392226
922407840 -8.9108611 -151.48516278 -9.29551405 -43.0076981 0 0 -11.33952773 87.93638987
922605272 -8.89391341 -151.68678673 -9.30393348 -43.08090667 0 0 -11.36882329 87.57671058
922802704 -8.91108656 -152.04232448 -9.28192034 -43.29724807 0 0 -11.37626467 87.74186616
923000136 -8.94409267 -152.17884843 -9.2800573 -43.4249504 0 0 -11.39986267 87.42162998
923197568 -8.92556786 -152.57079714 -9.288905 -43.61932551 0 0 -11.40325698 87.62734425
923395000 -8.92503274 -152.69179792 -9.28890798 -43.65153029 0 0 -11.4599702 87.24881893
923592432 -8.908397 -153.07074638 -9.29374318 -43.92110305 0 0 -11.46606311 87.40264764
923789864 -8.92439151 -153.26551906 -9.2937175 -44.07599385 0 0 -11.40096178 87.14001466
923987296 -8.90173214 -153.82331678 -9.26534603 -44.19564809 0 0 -11.47981057 86.74868189
924184728 -8.92243783 -153.82466702 -9.27680217 -44.37923973 0 0 -11.46723739 87.28352059
924382160 -8.92865849 -154.15072081 -9.29204947 -44.540837 0 0 -11.51427388 87.20448537
924579592 -8.92062412 -154.50457798 -9.29915547 -44.63849339 0 0 -11.48435711 86.93558726
924777024 -8.95195131 -154.61813666 -9.27998727 -45.00207747 0 0 -11.51016734 86.84102694
924974456 -8.92226182 -155.19325207 -9.28139438 -45.05604294 0 0 -11.56457211 87.04769518
925171888 -8.94867141 -155.3352953 -9.28289385 -45.2491885 0 0 -11.57206612 86.93865244
925369320 -8.89195362 -155.52195287 -9.28405051 -45.31452452 0 0 -11.5672547 86.38079696
925566752 -8.94253407 -155.98969187 -9.27484194 -45.55187539 0 0 -11.60969201 86.37630767
925764184 -8.96755835 -156.26240638 -9.27950894 -45.70733755 0 0 -11.59837772 86.34274036
925961616 -8.96394341 -156.64690141 -9.28399192 -45.93194591 0 0 -11.65849393 86.5344965
926159048 -8.95706471 -156.4272464 -9.27817387 -46.10513274 0 0 -11.65154771 86.44180554
926356480 -8.97595915 -156.89437096 -9.28557478 -46.11950249 0 0 -11.65949425 86.27038714
926553912 -8.99423474 -157.15263365 -9.2650096 -46.28859923 0 0 -11.66261747 86.15407067
926751344 -8.92919422 -157.86297362 -9.2777678 -46.36056309 0 0 -11.6993468 86.1402867
926948776 -8.98080966 -157.91463829 -9.29452589 -46.55780862 0 0 -11.70627692 86.10838629
927146208 -8.96342239 -158.1722231 -9.27225302 -46.73002296 0 0 -11.70519737 86.25979333
927343640 -8.95874178 -158.39005125 -9.29009345 -46.84015437 0 0 -11.74419483 86.02639461
927541072 -8.96297957 -158.82282806 -9.27379907 -47.181049 0 0 -11.7254226 86.08312606
927738504 -8.96972334 -158.89534793 -9.29735418 -47.26866566 0 0 -11.80226826 85.68953787
927935936 -9.02187451 -159.16955859 -9.29542492 -47.34875968 0 0 -11.82819821 85.8008552
928133368 -8.96560809 -159.63425329 -9.29210307 -47.51776759 0 0 -11.77491017 85.77789575
928330800 -8.97632937 -159.88373694 -9.30499493 -47.72018713 0 0 -11.81042565 85.95299303
928528232 -8.98741604 -160.15763348 -9.30068259 -47.91157845 0 0 -11.86031344 85.45915839
928725664 -8.9733711 -160.36081935 -9.30745511 -48.17922481 0 0 -11.84166622 85.40794706
928923096 -8.98786637 -160.87978068 -9.30454648 -48.27800052 0 0 -11.84436845 85.66196739
929120528 -8.99247187 -161.07278495 -9.31172957 -48.40391187 0 0 -11.87472689 85.28501578
929317960 -9.00174673 -161.30848036 -9.31022735 -48.60764915 0 0 -11.94348913 85.00996536
929515392 -9.030891 -161.54412217 -9.30753274 -48.77093451 0 0 -11.88832485 84.93901323
929712824 -9.0093965 -161.83178094 -9.28644792 -49.04579292 0 0 -11.95038546 85.18386392
929910256 -9.01878006 -161.98405516 -9.29127574 -49.15441868 0 0 -11.98091261 85.1663478
930107688 -9.01985196 -162.47434352 -9.30991725 -49.29052506 0 0 -11.96360206 84.94142951
930305120 -9.0387055 -162.5938583 -9.29849232 -49.54165018 0 0 -11.97222956 84.64814689
930502552 -8.98653768 -162.83370355 -9.32110718 -49.6742903 0 0 -12.00274372 84.83220282
930699984 -9.01306389 -163.07968339 -9.30800167 -49.74657629 0 0 -12.09142536 85.03896167
930897416 -9.03764275 -163.62150536 -9.29715342 -50.02709877 0 0 -12.06552546 84.74415309
931094848 -9.03788745 -163.6029776 -9.31352295 -50.14398735 0 0 -12.07989928 84.28293306
931292280 -9.05237692 -163.97431518 -9.28197419 -50.38990779 0 0 -12.11646624 84.72252335
931489712 -8.99326538 -164.15583046 -9.312341 -50.46583666 0 0 -12.1496136 84.13295905
931687144 -9.008645 -164.42833012 -9.30877537 -50.63732333 0 0 -12.08259204 84.49010655
931884576 -9.01105942 -164.93407684 -9.31373191 -50.82864765 0 0 -12.16369145 84.39294861
932082008 -9.03133783 -165.13142681 -9.30899002 -50.94193439 0 0 -12.16605854 84.41189857
932279440 -9.02650262 -165.41517656 -9.30528127 -51.138205 0 0 -12.2401337 83.8737511
932476872 -9.03350537 -165.64536873 -9.29999302 -51.32040781 0 0 -12.14847937 84.23234008
932674304 -9.00514758 -165.64664766 -9.30270081 -51.4936591 0 0 -12.24388013 83.81043949
932871736 -9.043735 -166.00009748 -9.30163428 -51.70765953 0 0 -12.23334756 84.12204904
933069168 -9.03334303 -166.62557586 -9.32413265 -51.82006809 0 0 -12.33064218 83.88356831
933266600 -9.04184214 -166.79764771 -9.3076212 -52.0067965 0 0 -12.23028536 84.03116072
933464032 -8.99891358 -167.10975467 -9.29308731 -52.22003746 0 0 -12.30005346 84.01246034
933661464 -8.97392508 -167.64579796 -9.30437119 -52.34949505 0 0 -12.29239065 83.62825777
933858896 -9.06221904 -167.62453663 -9.30561688 -52.44185666 0 0 -12.29125373 83.70888982
934056328 -8.99919107 -167.79657781 -9.30915691 -52.70556686 0 0 -12.36008805 83.7233181
934253760 -9.0330438 -168.20445777 -9.33113861 -52.88018525 0 0 -12.39517174 83.00997636
934451192 -9.00898553 -168.08305658 -9.31026119 -53.05718782 0 0 -12.3574766 83.58275499
934648624 -9.01427402 -169.13532162 -9.32719402 -53.14602919 0 0 -12.44195665 83.58109381
934846056 -9.02124124 -169.15753376 -9.31438104 -53.43128227 0 0 -12.48051685 83.10768196
935043488 -9.05983472 -169.71151998 -9.31515742 -53.52158064 0 0 -12.45399014 83.14085551
935240920 -9.03488504 -169.81317349 -9.32885321 -53.77091959 0 0 -12.42488832 83.11880793
935438352 -9.02512886 -169.87125269 -9.3028246 -53.82640391 0 0 -12.47397717 83.57424945
935635784 -9.03175475 -170.41696726 -9.30644713 -54.01622756 0 0 -12.5226518 82.62574297
935833216 -9.0234894 -170.73422738 -9.31758948 -54.24534987 0 0 -12.51258545 82.9372354
936030648 -9.0292232 -171.07337227 -9.32024106 -54.35017932 0 0 -12.54961422 82.73099055
936228080 -9.01922703 -171.08113297 -9.31076853 -54.55780989 0 0 -12.5817987 82.93084596
936425512 -9.02394429 -171.53268396 -9.33376709 -54.73258961 0 0 -12.62178861 82.65006733
936622944 -9.00232043 -171.74088973 -9.31937541 -54.94689385 0 0 -12.55384112 82.27394876
936820376 -9.06546073 -171.93540129 -9.32634817 -55.12972302 0 0 -12.61115117 82.39144477
937017808 -9.08236251 -172.34397853 -9.3080995 -55.27720605 0 0 -12.67571233 82.21385332
937215240 -9.04122101 -172.59672856 -9.31780885 -55.30185667 0 0 -12.70563789 82.28722989
937412672 -9.05433945 -172.94151239 -9.32964458 -55.52784861 0 0 -12.71769407 82.03590102
937610104 -9.07010883 -173.38066597 -9.30759893 -55.90241224 0 0 -12.70241939 82.00206406
937807536 -9.05239052 -173.7665359 -9.328995 -55.86782153 0 0 -12.71708319 82.36530473
938004968 -9.08853887 -173.76457594 -9.32848508 -56.2126939 0 0 -12.7272708 81.85726397
938202400 -9.05633003 -174.24793623 -9.31762813 -56.21375396 0 0 -12.81028904 82.1437974
938399832 -9.05276448 -174.64171721 -9.33402347 -56.47741023 0 0 -12.7912694 81.43659271
938597264 -9.02420657 -174.71980568 -9.32325681 -56.73538249 0 0 -12.77748038 81.92951976
938794696 -9.02563681 -175.04449832 -9.32488928 -56.84371633 0 0 -12.8637797 81.69307364
938992128 -9.02563219 -175.17651606 -9.3458947 -57.0017869 0 0 -12.88011969 81.68478765
939189560 -9.07059596 -175.50950379 -9.33476739 -57.10600874 0 0 -12.89869481 81.60201434
939386992 -9.0239373 -175.97852012 -9.34609533 -57.3178339 0 0 -12.95351125 81.98343028
939584424 -9.04297783 -176.14610156 -9.35946389 -57.57264516 0 0 -13.02790722 81.629639
939781856 -9.00951656 -176.29941059 -9.36237596 -57.67881065 0 0 -13.06141266 81.49892061
939979288 -8.99528072 -176.82152986 -9.36571117 -58.00669357 0 0 -13.04856538 81.1981886
940176720 -9.0443524 -176.99956943 -9.34654771 -58.01598905 0 0 -13.05362678 81.37742615
940374152 -9.05079568 -177.0718266 -9.35674869 -58.24710009 0 0 -13.07544329 80.97267742
940571584 -9.00506482 -177.32750865 -9.36822842 -58.43903094 0 0 -13.13409332 81.41299018
940769016 -9.03026435 -177.58325171 -9.36907732 -58.66434741 0 0 -13.18273896 81.39072446
940966448 -9.02994177 -178.13224921 -9.37419499 -58.75355092 0 0 -13.18916824 80.78312068
941163880 -9.02386878 -178.14293863 -9.35337852 -58.86402049 0 0 -13.15808179 80.6711988
941361312 -9.00051635 -178.78933385 -9.37672328 -59.1767623 0 0 -13.28654874 81.10935004
941558744 -9.0266175 -178.94229282 -9.36191568 -59.35535414 0 0 -13.24554787 80.7119747
941756176 -9.02772946 -179.25184779 -9.36818296 -59.36423131 0 0 -13.26851492 80.30049122
941953608 -9.04279847 -179.45028959 -9.35356723 -59.60691486 0 0 -13.32675966 80.5492454
942151040 -9.02997795 -179.94474961 -9.36585767 -59.74931618 0 0 -13.41093018 80.88787827
942348472 -9.01782507 179.76060564 -9.37680359 -59.87360138 0 0 -13.48192224 80.20160841
942545904 -9.02304624 179.62260448 -9.35384194 -60.10225942 0 0 -13.40562036 80.20937918
942743336 -9.03729663 178.97873124 -9.37064913 -60.25760932 0 0 -13.40819118 79.92373687
942940768 -8.99001381 178.9725227 -9.36964313 -60.49410171 0 0 -13.41310437 80.38032173
943138200 -9.03035058 178.81209485 -9.39341954 -60.65315817 0 0 -13.40719278 79.89746932
943335632 -9.0394698 178.40689372 -9.38906986 -60.79830247 0 0 -13.52378347 80.16350065
943533064 -9.03178156 178.10456996 -9.38598677 -60.98721116 0 0 -13.51492343 79.60233292
943730496 -9.05064296 177.91448463 -9.37720918 -61.08959373 0 0 -13.51657632 79.59069105
943927928 -9.07841693 177.52071052 -9.37775536 -61.29635782 0 0 -13.59968726 79.54960352
944125360 -9.00701691 177.30180927 -9.38581003 -61.35488343 0 0 -13.61870826 79.03047128
944322792 -9.05389504 176.80806056 -9.38414021 -61.59366632 0 0 -13.65226002 79.26704104
944520224 -9.04973337 176.694397 -9.39631157 -61.82773135 0 0 -13.69574682 79.06837075
944717656 -9.04855172 176.48360204 -9.39677871 -61.91721067 0 0 -13.67554279 79.32878333
944915088 -9.05179969 176.16877396 -9.37831176 -62.1527273 0 0 -13.71088295 78.461036
945112520 -9.02459268 175.78641636 -9.3834601 -62.1405258 0 0 -13.75406137 78.87462525
945309952 -9.0571353 175.38715575 -9.40766708 -62.39183476 0 0 -13.7448531 78.63402217
945507384 -9.05082449 175.00924914 -9.39897894 -62.6504125 0 0 -13.80641145 78.61975024
945704816 -9.03311389 174.86644089 -9.38087538 -62.96457712 0 0 -13.82209446 78.38052085
945902248 -9.04086815 174.68347993 -9.4041534 -62.93165142 0 0 -13.84484473 78.30291937
946099680 -9.01880277 174.03244528 -9.40810696 -63.20221858 0 0 -13.88667946 78.02973697
946297112 -9.03515919 173.85369349 -9.40611971 -63.38363367 0 0 -13.87972958 77.56895093
946494544 -9.06957794 173.71872815 -9.39464968 -63.61986219 0 0 -13.97164335 78.17395119
946691976 -9.07928218 173.16233392 -9.42710163 -63.58644243 0 0 -13.91449575 77.55822471
946889408 -9.0854081 173.25183347 -9.41579827 -63.83142419 0 0 -14.00359947 77.6667303
947086840 -9.0564634 172.73994514 -9.42608314 -64.02030893 0 0 -14.03174708 77.55567252
947284272 -9.07285651 172.38146593 -9.41970354 -64.25110564 0 0 -14.06822716 77.52124993
947481704 -9.0595376 171.99605879 -9.41598342 -64.49408 0 0 -14.0417869 77.68783828
947679136 -9.05956907 171.94303715 -9.4315946 -64.63612965 0 0 -14.14073454 78.07223467
947876568 -9.0353093 171.55824272 -9.41212855 -64.69882922 0 0 -14.1142832 77.43973308
948074000 -9.06121804 171.21690685 -9.41498992 -64.92640141 0 0 -14.21358684 77.22076982
948271432 -9.03579522 170.94581051 -9.42286008 -65.18501331 0 0 -14.19742392 76.94624654
948468864 -9.01018528 170.44708701 -9.42382393 -65.38019481 0 0 -14.20051911 77.21617995
948666296 -8.99782242 170.23859719 -9.41715214 -65.39837506 0 0 -14.18186397 76.92361743
948863728 -8.9841826 170.08555707 -9.43168981 -65.63685104 0 0 -14.19488063 77.11537958
949061160 -9.02118772 169.71131707 -9.43888234 -65.81535334 0 0 -14.2795179 77.07464674
949258592 -8.97877711 169.37563881 -9.43287782 -66.06713649 0 0 -14.28765709 77.26073933
949456024 -8.98554652 169.17319529 -9.43145882 -66.17529095 0 0 -14.42183915 76.52345486
949653456 -9.00004122 168.75332304 -9.41704974 -66.38393579 0 0 -14.42902822 76.77890777
949850888 -8.96372843 168.54969026 -9.43041512 -66.61375383 0 0 -14.43133989 76.89775759
950048320 -8.99081131 168.44082702 -9.43129615 -66.73474128 0 0 -14.44175566 76.45419633
950245752 -8.96161723 167.86032041 -9.42601361 -66.83472542 0 0 -14.53302313 76.71314866
950443184 -8.96759956 167.67756438 -9.43480373 -67.0924828 0 0 -14.51427968 76.51330424
950640616 -8.92989342 167.28345508 -9.43404095 -67.26366404 0 0 -14.57581735 76.43900856
950838048 -8.9809242 167.11722513 -9.424916 -67.39391264 0 0 -14.68081861 76.05600941
951035480 -8.96846191 166.60820987 -9.44716945 -67.65470852 0 0 -14.70234564 76.09523168
951232912 -8.9519079 166.43114466 -9.46261192 -67.75086633 0 0 -14.6515414 75.89266321
951430344 -8.96257114 165.83157827 -9.44774285 -67.87608663 0 0 -14.70619924 75.70774992
951627776 -8.91340701 165.83386273 -9.4478898 -68.05897479 0 0 -14.64878238 75.81859376
951825208 -8.97244227 165.66029023 -9.45427732 -68.26214034 0 0 -14.84940357 76.2164302
952022640 -8.93619788 165.44280939 -9.4571039 -68.39420538 0 0 -14.8821493 75.76576968
952220072 -8.93520276 164.86132862 -9.45754406 -68.69420346 0 0 -14.85800977 75.53546752
952417504 -8.93580957 164.68386965 -9.47323639 -68.78868536 0 0 -14.92371317 76.4509158
952614936 -8.90954102 164.33171808 -9.47205061 -68.98618387 0 0 -14.99114462 75.60506285
952812368 -8.91737236 164.15307208 -9.48513053 -69.09822173 0 0 -15.0338128 75.69652062
953009800 -8.90766931 163.89832284 -9.48495196 -69.22356408 0 0 -15.04719557 75.7661446
953207232 -8.91565361 163.52368773 -9.46908305 -69.42089361 0 0 -15.04926435 75.79420671
953404664 -8.95868715 163.39595705 -9.47796166 -69.64662783 0 0 -15.13966444 75.72705604
953602096 -8.85548855 162.89288286 -9.48802277 -69.90204163 0 0 -15.13652914 75.63556334
953799528 -8.89048124 162.75732814 -9.488006 -70.06479324 0 0 -15.21516384 74.79402061
953996960 -8.89481802 162.15830872 -9.48965897 -70.10919183 0 0 -15.27262538 75.27436721
954194392 -8.87633315 162.2083587 -9.48522656 -70.48760198 0 0 -15.27202101 75.11919396
954391824 -8.83051746 162.00416841 -9.47081607 -70.49541662 0 0 -15.37018741 75.22630015
954589256 -8.83887411 161.19755119 -9.48448134 -70.73298954 0 0 -15.44209102 75.3503583
954786688 -8.86758952 161.288632 -9.50234065 -70.80508959 0 0 -15.47501676 75.00660913
954984120 -8.86123781 160.96554562 -9.49561138 -71.14412496 0 0 -15.40697966 75.00681144
955181552 -8.85217519 160.72968426 -9.49087636 -71.35101765 0 0 -15.59382274 75.62990488
955378984 -8.84162337 160.50494826 -9.48158021 -71.5046714 0 0 -15.56404403 74.7475787
955576416 -8.80920448 160.32554272 -9.50001363 -71.66329738 0 0 -15.62879456 74.91984539
955773848 -8.81303029 159.88787052 -9.51139359 -71.94730304 0 0 -15.68563742 74.47030678
955971280 -8.81578792 159.59564321 -9.49793494 -71.96315387 0 0 -15.75263589 74.46213147
956168712 -8.80321082 159.32901574 -9.49232309 -72.00442183 0 0 -15.7219341 74.78205148
956366144 -8.82200747 159.0738628 -9.48925573 -72.3560645 0 0 -15.75807935 74.54473044
956563576 -8.80132078 158.68532641 -9.50978248 -72.49963765 0 0 -15.84654685 74.49904707
956761008 -8.79734299 158.3850896 -9.50824716 -72.70526932 0 0 -15.77117863 74.79291994
956958440 -8.79446707 158.16790484 -9.48429808 -72.85157221 0 0 -15.88317854 74.39769123
957155872 -8.79775146 157.48971871 -9.51991894 -72.87877747 0 0 -15.94494492 74.50059791
957353304 -8.74530673 157.51082019 -9.51332939 -73.15619384 0 0 -15.94110244 73.81126635
957550736 -8.74151921 156.99774014 -9.50786674 -73.29093554 0 0 -15.96790714 73.66427661
957748168 -8.75387959 156.54696681 -9.48752421 -73.50505635 0 0 -16.05253345 73.67997111
957945600 -8.75322262 156.40786914 -9.5039356 -73.68125791 0 0 -16.07257435 73.77055761
958143032 -8.75594906 156.25169305 -9.5194289 -73.67231786 0 0 -16.11396338 73.69561565
958340464 -8.73310533 155.93409311 -9.49986603 -73.94488732 0 0 -16.08379274 73.26606289
958537896 -8.75940405 155.57940297 -9.52205348 -74.15225684 0 0 -16.1702252 73.31070421
958735328 -8.73494666 154.99960016 -9.52545159 -74.27924704 0 0 -16.16666935 73.14723821
958932760 -8.7206116 154.69172578 -9.52942727 -74.53638297 0 0 -16.26229272 72.72874247
959130192 -8.72700182 154.74743043 -9.51755926 -74.65164492 0 0 -16.37619281 72.48499
959327624 -8.73474691 154.25598487 -9.5143607 -74.82209719 0 0 -16.25695149 72.97052451
959525056 -8.67738468 154.06204225 -9.51529928 -75.03964106 0 0 -16.35150331 73.35419198
959722488 -8.73695955 153.71351086 -9.53119762 -75.25518179 0 0 -16.51680033 72.78663359
959919920 -8.69335195 153.46690491 -9.51024076 -75.41824237 0 0 -16.41598093 72.05074378
960117352 -8.70368736 152.9480118 -9.5148839 -75.49907576 0 0 -16.51236577 72.21232818
960314784 -8.69365956 152.77309444 -9.52490602 -75.83523938 0 0 -16.60366966 72.09734144
960512216 -8.6944068 152.34509068 -9.52539974 -75.98175074 0 0 -16.6695916 71.93227518
960709648 -8.69639909 151.87947582 -9.5261813 -76.14003098 0 0 -16.59565476 72.80667208
960907080 -8.67543781 151.72442562 -9.51552925 -76.37040903 0 0 -16.70231454 72.22220333
961104512 -8.66960646 151.52429506 -9.55350901 -76.45164196 0 0 -16.81533695 71.73154811
961301944 -8.71230698 151.089955 -9.54887529 -76.82181962 0 0 -16.8302726 71.27040707
961499376 -8.69019202 150.97873381 -9.54440907 -76.81248488 0 0 -16.92484146 71.41279129
961696808 -8.708599 150.77951269 -9.55834296 -77.09834562 0 0 -17.02103102 70.80815813
961894240 -8.65752867 150.35882927 -9.55245202 -77.27547706 0 0 -17.02818417 71.06730773
962091672 -8.66383313 150.16575157 -9.54643281 -77.42872358 0 0 -17.10987343 71.88928178
962289104 -8.66103418 149.76018026 -9.55407719 -77.67890192 0 0 -17.13527261 70.95228474
962486536 -8.65053769 149.68532036 -9.5757107 -77.90849976 0 0 -17.22351314 70.2398468
962683968 -8.6555544 149.31133177 -9.56587225 -77.94762149 0 0 -17.31640511 71.25969949
962881400 -8.62005848 148.60206623 -9.55438231 -78.08199391 0 0 -17.26681354 70.58181396
963078832 -8.61510647 148.86933152 -9.5702767 -78.40260426 0 0 -17.38655986 70.73486762
963276264 -8.57333061 148.28072463 -9.5725117 -78.60492496 0 0 -17.38411668 70.00060302
963473696 -8.62173507 148.04141764 -9.57256284 -78.67894764 0 0 -17.45351404 70.35591817
963671128 -8.61653467 147.79094586 -9.6009502 -78.92438799 0 0 -17.4838761 70.51183816
963868560 -8.60256575 147.48694351 -9.59067453 -79.08605783 0 0 -17.62967101 69.74822968
964065992 -8.55426837 146.91770103 -9.59024841 -79.27305055 0 0 -17.68758771 69.74405349
964263424 -8.56532229 146.4947977 -9.58386208 -79.42250636 0 0 -17.64989617 70.23343051
964460856 -8.56917508 146.72078575 -9.59493288 -79.60332825 0 0 -17.76553384 70.09988191
964658288 -8.50644757 146.29153236 -9.61098777 -79.76761391 0 0 -17.8577525 70.69950205
964855720 -8.59041425 145.93875887 -9.60534647 -79.91099644 0 0 -17.95672586 69.77591945
965053152 -8.57011072 145.45319066 -9.59121158 -80.23248186 0 0 -17.95659775 69.76166498
965250584 -8.55691492 145.35419752 -9.60685359 -80.3168779 0 0 -17.98771442 69.77280258
965448016 -8.45987041 144.9773978 -9.58300739 -80.56971868 0 0 -18.12268889 70.56423783
965645448 -8.50303971 144.61028479 -9.60475376 -80.70672235 0 0 -18.1370313 69.47515203
965842880 -8.47350965 144.57936098 -9.59140592 -80.90037477 0 0 -18.21157808 69.53903022
966040312 -8.46582639 144.00171158 -9.61019463 -81.19682416 0 0 -18.2937775 69.08094442
966237744 -8.51474964 143.95108885 -9.5875057 -81.23948278 0 0 -18.32310268 69.20376804
966435176 -8.49189356 143.54484959 -9.59847109 -81.50415213 0 0 -18.33313154 69.48713963
966632608 -8.48745256 143.42052731 -9.60882298 -81.67116329 0 0 -18.54644566 69.0328628
966830040 -8.45750934 143.2516559 -9.606203 -81.69562533 0 0 -18.57403723 69.00297296
967027472 -8.42702421 142.84774447 -9.6112964 -81.9527865 0 0 -18.66419477 69.08082883
967224904 -8.47428203 142.40107073 -9.60219495 -82.26464679 0 0 -18.69811072 69.15922143
967422336 -8.40822783 142.31057371 -9.61222463 -82.427803 0 0 -18.8186168 70.3764443
967619768 -8.38893359 141.97307122 -9.60038231 -82.59680087 0 0 -18.89928986 68.97433064
967817200 -8.40644822 141.66671892 -9.6171742 -82.7220733 0 0 -18.91612392 68.17887603
968014632 -8.40399499 141.34344047 -9.62099751 -83.02516109 0 0 -19.12752545 68.87844705
968212064 -8.35361649 140.96633338 -9.60015688 -83.04504683 0 0 -19.14201244 68.09843264
968409496 -8.3924325 140.83984538 -9.60960149 -83.2109052 0 0 -19.12423729 68.5355262
968606928 -8.36103804 140.3932645 -9.61405474 -83.48968811 0 0 -19.24680372 68.21559588
968804360 -8.36913034 140.34902893 -9.61066705 -83.60083446 0 0 -19.30190576 67.7849029
969001792 -8.36631029 139.88275094 -9.60870542 -83.83635055 0 0 -19.45242952 67.60993707
969199224 -8.356472 139.33748343 -9.62279996 -83.94354959 0 0 -19.44993222 67.94928649
969396656 -8.35978208 139.23866959 -9.62993246 -84.10060965 0 0 -19.65420876 68.05592686
969594088 -8.30953509 139.31288734 -9.61942373 -84.32298314 0 0 -19.73366792 67.34054229
969791520 -8.33573165 138.87236932 -9.60810024 -84.46320925 0 0 -19.87404381 68.433615
969988952 -8.28386802 138.5077161 -9.62814936 -84.68179796 0 0 -19.78916956 68.34360073
970186384 -8.29131594 138.23887308 -9.61871118 -84.75999213 0 0 -20.01603076 66.72807559
970383816 -8.27544442 137.81874866 -9.6239089 -84.98124665 0 0 -20.06530398 67.99920198
970581248 -8.25055819 137.37731289 -9.63323385 -85.22416827 0 0 -20.01197687 67.05241097
970778680 -8.27470401 137.17851312 -9.64363417 -85.34335972 0 0 -20.27671337 66.556736
970976112 -8.26965351 137.29611763 -9.62970875 -85.51937736 0 0 -20.29240109 67.51350486
971173544 -8.24299345 136.85580846 -9.61601202 -85.70234209 0 0 -20.43895438 66.80827554
971370976 -8.24049251 136.36456085 -9.62735915 -85.97038928 0 0 -20.53644863 67.01283327
971568408 -8.23764834 136.332275 -9.64588445 -86.18238943 0 0 -20.64891383 66.79935986
971765840 -8.25789328 135.73137643 -9.66350522 -86.21213013 0 0 -20.72942799 66.21856639
971963272 -8.20794439 135.65376961 -9.6401484 -86.48288802 0 0 -20.72953438 65.84982377
972160704 -8.21006858 134.94626045 -9.64905538 -86.60221239 0 0 -20.84054488 65.65456552
972358136 -8.24987835 134.88975646 -9.62913869 -86.8043122 0 0 -21.00122616 65.71991476
972555568 -8.19896818 134.62191543 -9.64483109 -87.03286352 0 0 -21.0125994 65.8199415
972753000 -8.18507952 134.50740669 -9.6672618 -87.20666135 0 0 -21.0871586 64.70849562
972950432 -8.20667351 134.19885034 -9.64466586 -87.27148423 0 0 -21.29200711 64.21870045
973147864 -8.16050316 133.77448405 -9.66050578 -87.49814814 0 0 -21.26665974 65.19253112
973345296 -8.12259716 133.54381067 -9.66148218 -87.83175418 0 0 -21.35451615 64.77147165
973542728 -8.16064685 133.02547885 -9.65511402 -87.8107952 0 0 -21.39570379 63.89857614
973740160 -8.16842911 132.95246343 -9.67068236 -87.94500377 0 0 -21.40240261 63.14506204
973937592 -8.13630719 132.77044658 -9.67422701 -88.12860514 0 0 -21.62480463 63.54308968
974135024 -8.09576612 132.22974417 -9.67914414 -88.47595341 0 0 -21.81933338 63.34542874
974332456 -8.1291807 132.25303387 -9.66510406 -88.50696201 0 0 -21.87122636 64.29665243
974529888 -8.08129777 131.55104627 -9.65838551 -88.61232081 0 0 -22.2058549 63.65116273
974727320 -8.09909944 131.54001113 -9.68141195 -88.9370371 0 0 -21.92390628 62.7830663
974924752 -8.1149582 131.14060866 -9.66744645 -89.06473158 0 0 -22.10639234 63.4087328
975122184 -8.07725061 130.96220657 -9.67369998 -89.11941455 0 0 -22.26375291 63.42034967
975319616 -8.0578812 130.43193423 -9.68911069 -89.4580813 0 0 -22.41475099 62.74616154
975517048 -8.02926493 130.20176123 -9.67860811 -89.55215383 0 0 -22.56410913 63.18718967
975714480 -8.0228114 129.78376412 -9.67620736 -89.73872523 0 0 -22.6397039 62.71268571
975911912 -7.99719648 129.73963495 -9.66156802 -89.92348511 0 0 -22.7410215 63.15360028
976109344 -8.01729437 129.39074948 -9.70050214 -90.087423 0 0 -23.07909635 63.26424322
976306776 -7.99897354 128.93934558 -9.68415086 -90.25026684 0 0 -22.93530609 62.20337171
976504208 -7.96504323 128.69812283 -9.69062946 -90.39018105 0 0 -23.00944151 63.02893188
976701640 -7.94441974 128.48499027 -9.71101196 -90.68569587 0 0 -23.22006777 62.00052372
976899072 -7.93818236 128.05537909 -9.70716265 -90.82773065 0 0 -23.51560236 61.02222731
977096504 -7.91989207 128.16742739 -9.70022381 -90.8810288 0 0 -23.63364689 62.1877794
977293936 -7.90080734 127.83148067 -9.69887225 -91.04664228 0 0 -23.33261316 62.25854413
977491368 -7.94198107 127.54448153 -9.70304073 -91.4206471 0 0 -23.80426232 63.43037935
977688800 -7.91180706 127.10903073 -9.69767086 -91.49142802 0 0 -24.12336874 61.83957804
977886232 -7.89383785 126.86558675 -9.71617469 -91.69171055 0 0 -24.20252201 61.89080425
978083664 -7.87983641 126.62633805 -9.71889672 -91.91192219 0 0 -24.23122742 62.6283816
978281096 -7.87307027 126.40979795 -9.69050514 -91.99671091 0 0 -24.38464282 59.93968349
978478528 -7.88331937 126.13328973 -9.71179903 -92.1335955 0 0 -24.6516956 60.32658666
978675960 -7.88841995 125.71447438 -9.70583506 -92.36220383 0 0 -24.7070403 61.35565608
978873392 -7.86235073 125.45104298 -9.7252696 -92.56057183 0 0 -24.9531299 61.23000207
979070824 -7.83379166 125.35052369 -9.72698131 -92.87455424 0 0 -25.25226064 60.74985699
979268256 -7.80101422 124.96994747 -9.71974404 -92.91589248 0 0 -25.40546487 61.2535715
979465688 -7.83885174 124.60322849 -9.72192109 -93.10811651 0 0 -25.45850754 61.97908566
979663120 -7.84582308 124.38234678 -9.71660162 -93.3295462 0 0 -25.57934379 59.73632282
979860552 -7.81652083 124.18459054 -9.71765851 -93.50894294 0 0 -25.91462098 58.1490813
980057984 -7.79327422 124.02198016 -9.71097433 -93.72008389 0 0 -26.01603667 60.93150872
980255416 -7.7343971 123.76244407 -9.73674582 -93.93696805 0 0 -26.01763363 59.62474814
980452848 -7.77218193 123.55880826 -9.72723565 -94.08569925 0 0 -26.277445 60.1977101
980650280 -7.77683758 122.92848399 -9.73654856 -94.17852256 0 0 -26.65854632 60.73284402
980847712 -7.70594817 122.71544271 -9.72014451 -94.37084479 0 0 -26.86136278 60.66640307
981045144 -7.70887735 122.82548756 -9.74017147 -94.52145872 0 0 -27.09956584 61.04657849
981242576 -7.69981718 122.38404956 -9.72615519 -94.64323591 0 0 -27.18724626 57.96124594
981440008 -7.68660584 122.11539275 -9.74222831 -94.81343562 0 0 -27.53793542 60.1524668
981637440 -7.67302848 121.64237946 -9.74114379 -95.10316305 0 0 -28.14312112 58.44107946
981834872 -7.65601202 121.37142452 -9.7328441 -95.25296707 0 0 -28.00909819 56.48937481
982032304 -7.62137206 121.36029134 -9.73998697 -95.44242433 0 0 -28.11573809 58.91724235
982229736 -7.63876012 121.05858538 -9.73803293 -95.53499086 0 0 -28.10130115 59.85032954
982427168 -7.66672506 120.87454472 -9.75888064 -95.85140647 0 0 -28.74582921 55.31861044
982624600 -7.6245321 120.40271869 -9.78140553 -96.1042521 0 0 -29.0676603 59.44516827
982822032 -7.63179833 120.3430314 -9.78238163 -96.182173 0 0 -29.31400614 59.46880041
983019464 -7.60058207 119.91176381 -9.74225961 -96.2466663 0 0 -30.12876892 56.38552816
983216896 -7.60175616 119.79480597 -9.77528967 -96.50007542 0 0 -29.92006704 57.83988203
983414328 -7.5895442 119.47625703 -9.76052508 -96.59307467 0 0 -29.58952125 55.33484141
983611760 -7.54674853 119.04751743 -9.79014255 -96.89352001 0 0 -30.63101826 55.49964917
983809192 -7.56005969 118.8107061 -9.75800669 -97.01688706 0 0 -31.29602437 58.14421615
984006624 -7.54496177 118.63984424 -9.77156794 -97.13443487 0 0 -30.99697992 52.83106983
984204056 -7.52114013 118.47880515 -9.78051006 -97.31192836 0 0 -31.47294701 54.74022191
984401488 -7.54615995 117.94544203 -9.79504834 -97.53900849 0 0 -32.07436707 58.40148118
984598920 -7.49562998 117.59800354 -9.79592511 -97.75734056 0 0 -31.97339085 55.35434596
984796352 -7.48519622 117.52826236 -9.77822552 -97.80122841 0 0 -32.84968314 54.78161227
984993784 -7.49849136 117.10171431 -9.78103551 -97.9826114 0 0 -33.33408306 50.69859378
985191216 -7.48045833 116.90932849 -9.80036525 -98.02559643 0 0 -34.02557786 50.33350776
985388648 -7.46264386 116.53908787 -9.7929002 -98.34757412 0 0 -34.28934259 48.96184644
985586080 -7.44356879 116.28685004 -9.81702138 -98.50523874 0 0 -34.89524448 49.73850142
985783512 -7.45242475 116.30667306 -9.80465282 -98.76111351 0 0 -34.54200987 48.39863973
985980944 -7.38074297 115.73780835 -9.79800294 -98.96666124 0 0 -35.30718678 46.72161
986178376 -7.41213712 115.68272507 -9.81218035 -98.99923184 0 0 -35.91635327 47.4044873
986375808 -7.40200342 115.14768957 -9.80332367 -99.35603236 0 0 -37.14312721 38.219412
986573240 -7.36032987 114.93825723 -9.82153067 -99.46205875 0 0 -38.03297466 40.00182956
986770672 -7.37961311 114.94475761 -9.83375307 -99.59817598 0 0 -37.4625758 39.02353257
986968104 -7.38259953 114.18676386 -9.81729195 -99.66379103 0 0 -37.06033717 40.11295578
987165536 -7.32764032 113.97221733 -9.83296774 -100.06683049 0 0 -39.13381794 35.95080252
987362968 -7.35775315 114.09430544 -9.82518024 -100.07749044 0 0 -39.2919107 38.81198928
987560400 -7.3111879 113.48809359 -9.80514305 -100.36378693 0 0 -42.43211388 22.90003292
987757832 -7.31540003 113.3547974 -9.81925971 -100.47727931 0 0 -43.61227256 23.98907768
987955264 -7.31439706 113.0966763 -9.8069208 -100.65364307 0 0 -42.76359844 10.02730471
988152696 -7.29294937 112.74037143 -9.81452828 -100.67295963 0 0 -44.55803152 0.87994235
988350128 -7.29094257 112.4654355 -9.81678556 -100.85534376 0 0 -46.48535418 -4.22386724
988547560 -7.32217524 112.30362237 -9.82381924 -101.12062986 0 0 -45.35922287 -25.80266497
988744992 -7.28708541 111.99503205 -9.8339876 -101.31022015 0 0 -45.29345443 -32.46292124
988942424 -7.25348473 111.82029143 -9.82969842 -101.60995985 0 0 -45.05302712 -29.10191038
989139856 -7.23777557 111.48448629 -9.8297682 -101.6547368 0 0 -45.02146023 -52.48521137
989337288 -7.26521255 111.31528865 -9.82624134 -101.84163042 0 0 -45.41716537 -76.63141988
989534720 -7.22239201 110.89085156 -9.83066239 -102.13542839 0 0 -42.0360761 -59.15712174
989732152 -7.2191571 110.82647832 -9.84258696 -102.2402439 0 0 -41.94316278 -76.22112871
989929584 -7.19410548 110.56815107 -9.83016555 -102.41416799 0 0 -41.62878229 -85.64822621
990127016 -7.1989029 110.2720057 -9.84883832 -102.48212528 0 0 -41.33001671 -93.08728769
990324448 -7.15028144 109.7912826 -9.84236206 -102.56578088 0 0 -38.87848472 -82.24481215
990521880 -7.13569833 109.63852648 -9.85717391 -102.75384494 0 0 -40.14114534 -89.28211964
990719312 -7.12877361 109.38538511 -9.85032464 -102.85628009 0 0 -38.27713483 -106.9046437
990916744 -7.1124432 109.06861057 -9.87821734 -103.06236062 0 0 -37.48761967 -100.8728779
991114176 -7.11219946 108.79386085 -9.85858381 -103.1961983 0 0 -36.93520119 -101.15627754
991311608 -7.0754491 108.66092567 -9.84679237 -103.44392622 0 0 -37.09986759 -103.49134022
991509040 -7.05200831 108.397358 -9.86827705 -103.58617504 0 0 -35.75374469 -104.85902165
991706472 -7.03320089 108.25398858 -9.85382476 -103.59069629 0 0 -35.42043576 -100.24521057
991903904 -7.06573868 107.903519 -9.88211454 -103.98092454 0 0 -34.96822203 -107.91261015
992101336 -7.03516627 107.59899095 -9.88107289 -104.00900286 0 0 -33.84810803 -107.8562387
992298768 -7.02783814 107.45746027 -9.87428816 -104.1681 0 0 -33.84710165 -107.73655947
992496200 -7.02854827 106.94694182 -9.87045091 -104.36179476 0 0 -33.84290358 -107.11801224
992693632 -7.01126466 106.91320836 -9.86286806 -104.53908518 0 0 -33.26876839 -110.64176919
992891064 -6.96267685 106.36341577 -9.86044566 -104.73819169 0 0 -32.08599923 -110.77678908
993088496 -6.96285241 106.44298699 -9.87147088 -104.88879258 0 0 -31.96402768 -109.82176899
993285928 -6.93453901 105.86423532 -9.87839287 -105.00906099 0 0 -32.11545024 -108.67893535
993483360 -6.96432876 105.69267002 -9.88449587 -105.12472844 0 0 -31.0125713 -110.53314865
993680792 -6.93012005 105.49247424 -9.88349892 -105.42340196 0 0 -31.05950052 -113.82213793
993878224 -6.94296707 105.14707133 -9.85736867 -105.5570236 0 0 -30.79424977 -110.19264435
994075656 -6.91760226 105.03371333 -9.8821676 -105.65146478 0 0 -30.24177247 -113.69842784
994273088 -6.91542101 104.55855877 -9.88167242 -105.83120853 0 0 -29.93981355 -112.08101654
994470520 -6.87769048 104.0603096 -9.88127975 -105.99211425 0 0 -30.02192263 -115.66590906
994667952 -6.86164442 104.14870617 -9.87432033 -106.2338179 0 0 -29.16979027 -112.27313642
994865384 -6.86734949 103.73222616 -9.89559644 -106.29643038 0 0 -29.18042383 -114.03794423
995062816 -6.83896556 103.58815951 -9.89294804 -106.39875361 0 0 -29.085199 -114.17235691
995260248 -6.80467418 103.34148295 -9.89734926 -106.75794121 0 0 -28.2294443 -115.76408084
995457680 -6.80650752 103.16249393 -9.90027901 -106.90680527 0 0 -28.09993343 -116.70961312
995655112 -6.83432001 102.99531142 -9.89826137 -106.96199711 0 0 -28.10342491 -115.58111985
995852544 -6.81382476 102.72353561 -9.92835304 -107.1865958 0 0 -27.42993229 -114.18167994
996049976 -6.77268899 102.36964825 -9.91797416 -107.31059573 0 0 -27.36938166 -117.01715697
996247408 -6.79110799 102.22538627 -9.90389692 -107.473306 0 0 -27.28726714 -114.4349238
996444840 -6.77091881 101.99096175 -9.91147641 -107.69620626 0 0 -26.96769656 -116.87089946
996642272 -6.7454213 101.84992184 -9.91424002 -107.72030706 0 0 -26.73584289 -116.90571543
996839704 -6.71319587 101.60888386 -9.92980956 -107.9578253 0 0 -26.61658858 -117.74464131
997037136 -6.73425208 101.3015756 -9.91846802 -107.95098349 0 0 -26.41965431 -120.07287972
997234568 -6.68510094 100.89501026 -9.93008361 -108.17958063 0 0 -25.89905814 -116.07718833
997432000 -6.68691457 100.75666609 -9.93079368 -108.38701879 0 0 -25.99399088 -120.45827444
997629432 -6.74332439 100.63727011 -9.94901157 -108.46997521 0 0 -25.44857137 -120.02128306
997826864 -6.67171637 100.30738692 -9.95265686 -108.76029925 0 0 -25.23643818 -117.78382162
998024296 -6.64327296 100.20206103 -9.95059975 -108.74535088 0 0 -24.83152851 -117.17374874
998221728 -6.67038875 99.97912929 -9.94904029 -108.97275138 0 0 -24.91218189 -119.43822376
998419160 -6.67420688 99.65040877 -9.95551317 -109.13024327 0 0 -24.64304481 -121.38850267
998616592 -6.62517465 99.37370178 -9.96287604 -109.3314929 0 0 -24.2764287 -120.09702238
998814024 -6.6375152 99.24014039 -9.96302403 -109.44827426 0 0 -23.97872079 -120.92965641
999011456 -6.63811472 98.84416663 -9.96449594 -109.79335466 0 0 -23.97562051 -120.49909092
999208888 -6.65942233 98.74601428 -9.95697849 -109.86456296 0 0 -23.84286256 -120.12971429
999406320 -6.65836479 98.52671201 -9.96384256 -109.87943773 0 0 -23.58688904 -120.0684292
999603752 -6.63802799 98.19714214 -9.95361064 -110.30512883 0 0 -23.43517965 -120.20846614
999801184 -6.6034635 98.1541598 -9.970863 -110.35554713 0 0 -23.27527108 -120.31342913
999998616 -6.61344217 97.75062421 -9.97366378 -110.52939729 0 0 -23.06256741 -119.67449664
