<?xml version="1.0" encoding="ASCII"?>
<sdkproject:SdkProject xmi:version="2.0" xmlns:xmi="http://www.omg.org/XMI" xmlns:xsi="http://www.w3.org/2001/XMLSchema-instance" xmlns:sdkproject="http://www.xilinx.com/sdkproject" name="Scheduling" location="C:/Users/nikos/SpaceDot/FPGADevel/MixedDevelopment/Scheduling" platform="C:/Users/nikos/SpaceDot/FPGADevel/MixedDevelopment/PModIPs_wrapper_2/export/PModIPs_wrapper_2/PModIPs_wrapper_2.xpfm" platformUID="xilinx:pynq-z2::0.0(custom)" systemProject="Scheduling_system" sysConfig="PModIPs_wrapper_2" runtime="cpp" cpu="freertos10_xilinx_ps7_cortexa9_0" cpuInstance="ps7_cortexa9_0" os="freertos10_xilinx" language="CPP" mssSignature="08d4b09496dae7bbca0881c48814753c">
  <configuration name="Debug" id="xilinx.gnu.armv7.exe.debug.1647659679">
    <configBuildOptions xsi:type="sdkproject:SdkOptions"/>
    <lastBuildOptions xsi:type="sdkproject:SdkOptions"/>
  </configuration>
  <configuration name="Release" id="xilinx.gnu.armv7.exe.release.1646174603" dirty="true">
    <configBuildOptions xsi:type="sdkproject:SdkOptions"/>
  </configuration>
  <template appTemplateName="empty_application"/>
</sdkproject:SdkProject>
