<?xml version="1.0" encoding="ASCII"?>
<sdkproject:SdkProject xmi:version="2.0" xmlns:xmi="http://www.omg.org/XMI" xmlns:xsi="http://www.w3.org/2001/XMLSchema-instance" xmlns:sdkproject="http://www.xilinx.com/sdkproject" name="PModIPs_cpp_wrapper" location="C:/Users/nikos/SpaceDot/FPGADevel/MixedDevelopment/PModIPs_cpp_wrapper" platform="C:/Users/nikos/SpaceDot/FPGADevel/MixedDevelopment/PModIPs_wrapper_1/export/PModIPs_wrapper_1/PModIPs_wrapper_1.xpfm" platformUID="xilinx:pynq-z2::0.0(custom)" systemProject="PModIPs_cpp_wrapper_system" sysConfig="PModIPs_wrapper_1" runtime="cpp" cpu="standalone_ps7_cortexa9_0" cpuInstance="ps7_cortexa9_0" os="standalone" language="CPP" mssSignature="6aac6a46bd52abf0b090d0b871d26ec8">
  <configuration name="Debug" id="xilinx.gnu.armv7.exe.debug.1419828752">
    <configBuildOptions xsi:type="sdkproject:SdkOptions"/>
    <lastBuildOptions xsi:type="sdkproject:SdkOptions"/>
  </configuration>
  <configuration name="Release" id="xilinx.gnu.armv7.exe.release.1407314849" dirty="true">
    <configBuildOptions xsi:type="sdkproject:SdkOptions"/>
  </configuration>
  <template appTemplateName="empty_application"/>
</sdkproject:SdkProject>
