02 Jul 2023 00:39:32.540    02 Jul 2023 00:40:58.438      85.898572882
02 Jul 2023 05:31:51.005    02 Jul 2023 05:34:22.046      151.04097251
02 Jul 2023 23:51:25.278    02 Jul 2023 23:54:03.351      158.07284665
03 Jul 2023 04:45:02.043    03 Jul 2023 04:46:06.520      64.476784214
03 Jul 2023 06:21:54.455    03 Jul 2023 06:22:48.736      54.281303845
03 Jul 2023 23:03:43.614    03 Jul 2023 23:06:43.155      179.54159273
04 Jul 2023 05:33:34.950    04 Jul 2023 05:36:17.337      162.38618261
04 Jul 2023 22:16:23.963    04 Jul 2023 22:19:01.631      157.66793252
05 Jul 2023 04:45:55.366    05 Jul 2023 04:48:53.274      177.90743090
05 Jul 2023 23:06:14.825    05 Jul 2023 23:07:40.249      85.423734505
06 Jul 2023 03:58:30.601    06 Jul 2023 04:01:01.623      151.02153048
06 Jul 2023 22:17:54.898    06 Jul 2023 22:20:33.204      158.30613220
07 Jul 2023 03:11:29.927    07 Jul 2023 03:12:33.239      63.312206254
07 Jul 2023 04:48:20.412    07 Jul 2023 04:49:15.868      55.455592764
07 Jul 2023 21:30:01.114    07 Jul 2023 21:33:00.763      179.64913339
08 Jul 2023 03:59:49.133    08 Jul 2023 04:02:31.932      162.79832456
08 Jul 2023 20:42:29.908    08 Jul 2023 20:45:06.655      156.74669619
09 Jul 2023 03:11:57.731    09 Jul 2023 03:14:55.365      177.63410993
09 Jul 2023 21:32:05.352    09 Jul 2023 21:33:34.414      89.061915397
10 Jul 2023 02:24:21.417    10 Jul 2023 02:26:50.894      149.47639358
10 Jul 2023 20:43:34.438    10 Jul 2023 20:46:14.328      159.88932084
11 Jul 2023 01:37:11.361    11 Jul 2023 01:38:07.443      56.082052225
11 Jul 2023 03:13:52.796    11 Jul 2023 03:14:58.521      65.725063125
11 Jul 2023 19:55:29.434    11 Jul 2023 19:58:29.189      179.75480666
12 Jul 2023 02:25:13.586    12 Jul 2023 02:27:58.149      164.56303443
12 Jul 2023 19:07:47.747    12 Jul 2023 19:10:21.711      153.96401163
13 Jul 2023 01:37:11.064    13 Jul 2023 01:40:08.163      177.09898880
13 Jul 2023 19:57:04.717    13 Jul 2023 19:58:40.909      96.192081599
14 Jul 2023 00:49:23.724    14 Jul 2023 00:51:49.975      146.25047660
14 Jul 2023 19:08:23.964    14 Jul 2023 19:11:06.602      162.63797132
15 Jul 2023 00:02:07.993    15 Jul 2023 00:02:47.235      39.242164814
15 Jul 2023 01:38:33.398    15 Jul 2023 01:39:54.610      81.212276383
15 Jul 2023 18:20:08.347    15 Jul 2023 18:23:07.997      179.64955803
16 Jul 2023 00:49:48.001    16 Jul 2023 00:52:35.389      167.38763783
16 Jul 2023 17:32:17.111    16 Jul 2023 17:34:45.937      148.82599697
17 Jul 2023 00:01:34.739    17 Jul 2023 00:04:30.807      176.06729240
17 Jul 2023 18:21:12.444    17 Jul 2023 18:22:58.397      105.95330405
17 Jul 2023 23:13:36.706    17 Jul 2023 23:15:57.671      140.96528693
18 Jul 2023 17:32:22.482    18 Jul 2023 17:35:08.756      166.27391173
19 Jul 2023 00:02:22.518    19 Jul 2023 00:04:01.357      98.839114176
19 Jul 2023 16:43:56.711    19 Jul 2023 16:46:55.690      178.97878743
19 Jul 2023 23:13:31.173    19 Jul 2023 23:16:22.004      170.83091936
20 Jul 2023 15:55:57.010    20 Jul 2023 15:58:17.395      140.38457160
20 Jul 2023 22:25:07.373    20 Jul 2023 22:28:01.547      174.17313399
21 Jul 2023 16:44:27.393    21 Jul 2023 16:46:24.863      117.46935190
21 Jul 2023 21:36:59.024    21 Jul 2023 21:39:12.005      132.98055228
22 Jul 2023 15:55:28.576    22 Jul 2023 15:58:18.973      170.39690096
22 Jul 2023 22:25:19.363    22 Jul 2023 22:27:16.177      116.81356688
23 Jul 2023 15:06:53.198    23 Jul 2023 15:09:50.389      177.19073324
23 Jul 2023 21:36:21.712    23 Jul 2023 21:39:16.030      174.31763507
24 Jul 2023 14:18:46.777    24 Jul 2023 14:20:53.665      126.88885076
24 Jul 2023 20:47:47.604    24 Jul 2023 20:50:38.503      170.89866505
25 Jul 2023 15:06:48.533    25 Jul 2023 15:08:58.436      129.90254802
25 Jul 2023 19:59:29.692    25 Jul 2023 20:01:30.919      121.22759256
26 Jul 2023 14:17:41.215    26 Jul 2023 14:20:35.670      174.45571362
26 Jul 2023 20:47:23.148    26 Jul 2023 20:49:37.121      133.97314082
27 Jul 2023 13:28:57.080    27 Jul 2023 13:31:50.545      173.46475987
27 Jul 2023 19:58:18.761    27 Jul 2023 20:01:15.906      177.14501865
28 Jul 2023 12:40:47.294    28 Jul 2023 12:42:31.959      104.66474768
28 Jul 2023 19:09:34.749    28 Jul 2023 19:12:20.300      165.55022921
29 Jul 2023 13:28:15.505    29 Jul 2023 13:30:37.971      142.46582886
29 Jul 2023 18:21:08.835    29 Jul 2023 18:22:52.611      103.77523550
30 Jul 2023 12:39:00.205    30 Jul 2023 12:41:57.936      177.73123900
30 Jul 2023 19:08:33.690    30 Jul 2023 19:11:03.095      149.40423074
31 Jul 2023 11:50:08.603    31 Jul 2023 11:52:55.187      166.58410229
31 Jul 2023 18:19:22.261    31 Jul 2023 18:22:20.768      178.50704606
01 Aug 2023 11:02:04.417    01 Aug 2023 11:03:06.041      61.624298932
01 Aug 2023 12:38:44.345    01 Aug 2023 12:39:48.539      64.193671499
01 Aug 2023 17:30:28.966    01 Aug 2023 17:33:06.174      157.20793923
02 Aug 2023 11:48:48.666    02 Aug 2023 11:51:23.043      154.37692712
02 Aug 2023 16:41:58.620    02 Aug 2023 16:43:14.587      75.967317342
02 Aug 2023 18:19:04.841    02 Aug 2023 18:19:28.086      23.244645470
03 Aug 2023 10:59:26.095    03 Aug 2023 11:02:25.396      179.30131510
03 Aug 2023 17:28:51.327    03 Aug 2023 17:31:33.640      162.31300451
04 Aug 2023 10:10:28.888    04 Aug 2023 10:13:03.530      154.64221342
04 Aug 2023 16:39:32.662    04 Aug 2023 16:42:30.170      177.50797874
05 Aug 2023 10:58:24.676    05 Aug 2023 11:00:03.349      98.672866146
05 Aug 2023 15:50:30.938    05 Aug 2023 15:52:55.503      144.56516462
06 Aug 2023 10:08:28.631    06 Aug 2023 10:11:13.450      164.81911488
06 Aug 2023 16:38:11.892    06 Aug 2023 16:39:49.339      97.447211773
07 Aug 2023 09:18:59.641    07 Aug 2023 09:21:57.604      177.96259965
07 Aug 2023 15:48:16.359    07 Aug 2023 15:51:08.316      171.95764957
08 Aug 2023 08:29:59.728    08 Aug 2023 08:32:13.894      134.16564820
08 Aug 2023 14:58:50.294    08 Aug 2023 15:01:43.416      173.12263740
09 Aug 2023 09:17:15.111    09 Aug 2023 09:19:19.669      124.55864407
09 Aug 2023 14:09:41.405    09 Aug 2023 14:11:46.873      125.46811975
10 Aug 2023 08:27:15.582    10 Aug 2023 08:30:08.458      172.87583195
10 Aug 2023 14:56:43.709    10 Aug 2023 14:58:56.619      132.91032314
11 Aug 2023 07:37:41.207    11 Aug 2023 07:40:33.221      172.01332657
11 Aug 2023 14:06:48.392    11 Aug 2023 14:09:45.961      177.56858713
12 Aug 2023 06:48:44.819    12 Aug 2023 06:50:21.136      96.317200677
12 Aug 2023 13:17:14.774    12 Aug 2023 13:19:58.837      164.06328074
13 Aug 2023 07:35:12.944    13 Aug 2023 07:37:38.207      145.26340251
13 Aug 2023 12:28:01.473    13 Aug 2023 12:29:36.607      95.134130877
14 Aug 2023 06:45:08.848    14 Aug 2023 06:48:06.227      177.37935906
14 Aug 2023 13:14:25.330    14 Aug 2023 13:17:01.737      156.40672148
15 Aug 2023 05:55:30.660    15 Aug 2023 05:58:09.352      158.69142388
15 Aug 2023 12:24:26.037    15 Aug 2023 12:27:24.280      178.24307301
16 Aug 2023 06:42:54.541    16 Aug 2023 06:44:21.680      87.138797936
16 Aug 2023 11:34:44.961    16 Aug 2023 11:37:13.391      148.43032986
17 Aug 2023 05:52:15.910    17 Aug 2023 05:54:57.205      161.29525015
17 Aug 2023 10:45:42.619    17 Aug 2023 10:46:08.599      25.980173028
17 Aug 2023 12:21:50.318    17 Aug 2023 12:23:19.713      89.395815216
18 Aug 2023 05:02:07.062    18 Aug 2023 05:05:03.710      176.64844432
18 Aug 2023 11:31:12.604    18 Aug 2023 11:34:03.778      171.17454460
19 Aug 2023 04:12:28.430    19 Aug 2023 04:14:40.827      132.39721488
19 Aug 2023 10:41:07.203    19 Aug 2023 10:43:59.966      172.76385025
20 Aug 2023 04:59:00.858    20 Aug 2023 05:01:04.911      124.05247508
20 Aug 2023 09:51:19.807    20 Aug 2023 09:53:22.484      122.67702174
21 Aug 2023 04:08:21.720    21 Aug 2023 04:11:13.783      172.06210076
21 Aug 2023 10:37:36.238    21 Aug 2023 10:39:53.469      137.23080897
22 Aug 2023 03:18:08.984    22 Aug 2023 03:20:56.915      167.93031431
22 Aug 2023 09:47:02.328    22 Aug 2023 09:50:00.074      177.74632109
23 Aug 2023 02:28:41.594    23 Aug 2023 02:29:55.360      73.766043701
23 Aug 2023 04:05:36.001    23 Aug 2023 04:06:14.300      38.298653474
23 Aug 2023 08:56:49.904    23 Aug 2023 08:59:29.167      159.26317130
24 Aug 2023 03:14:10.979    24 Aug 2023 03:16:40.661      149.68187395
24 Aug 2023 08:07:01.792    24 Aug 2023 08:08:17.934      76.142738212
25 Aug 2023 02:23:28.708    25 Aug 2023 02:26:24.724      176.01677498
25 Aug 2023 08:52:29.489    25 Aug 2023 08:55:12.817      163.32736358
26 Aug 2023 01:33:14.999    26 Aug 2023 01:35:40.843      145.84361902
26 Aug 2023 08:01:52.196    26 Aug 2023 08:04:47.696      175.49983514
27 Aug 2023 02:19:35.202    27 Aug 2023 02:21:21.842      106.63991802
27 Aug 2023 07:11:33.424    27 Aug 2023 07:13:47.685      134.26094132
28 Aug 2023 01:28:21.632    28 Aug 2023 01:31:08.301      166.66987493
28 Aug 2023 07:57:32.036    28 Aug 2023 07:59:33.616      121.57979436
29 Aug 2023 00:37:36.581    29 Aug 2023 00:40:26.786      170.20489775
29 Aug 2023 07:06:24.036    29 Aug 2023 07:09:19.587      175.55125372
29 Aug 2023 23:47:31.511    29 Aug 2023 23:49:05.899      94.388561219
30 Aug 2023 06:15:41.118    30 Aug 2023 06:18:23.860      162.74135413
31 Aug 2023 00:32:45.764    31 Aug 2023 00:35:08.083      142.31812736
31 Aug 2023 05:25:20.982    31 Aug 2023 05:26:48.746      87.763894186
31 Aug 2023 23:41:31.942    31 Aug 2023 23:44:26.131      174.18947902
01 Sep 2023 06:10:25.435    01 Sep 2023 06:13:03.986      158.55110579
01 Sep 2023 22:50:47.205    01 Sep 2023 22:53:15.689      148.48401092
02 Sep 2023 05:19:17.646    02 Sep 2023 05:22:12.787      175.14049164
02 Sep 2023 23:36:42.229    02 Sep 2023 23:38:21.401      99.172366178
03 Sep 2023 04:28:29.426    03 Sep 2023 04:30:45.061      135.63466715
03 Sep 2023 22:44:57.087    03 Sep 2023 22:47:41.272      164.18486182
04 Sep 2023 05:13:59.599    04 Sep 2023 05:15:56.683      117.08447230
04 Sep 2023 21:53:42.281    04 Sep 2023 21:56:31.255      168.97450938
05 Sep 2023 04:22:21.058    05 Sep 2023 04:25:15.201      174.14346457
05 Sep 2023 21:03:09.117    05 Sep 2023 21:04:40.065      90.948049491
06 Sep 2023 03:31:09.047    06 Sep 2023 03:33:49.854      160.80647728
06 Sep 2023 21:47:49.984    06 Sep 2023 21:50:11.992      142.00793838
07 Sep 2023 02:40:21.651    07 Sep 2023 02:41:42.507      80.855805776
07 Sep 2023 20:56:06.925    07 Sep 2023 20:58:59.886      172.96017852
08 Sep 2023 03:24:50.544    08 Sep 2023 03:27:29.880      159.33577262
08 Sep 2023 20:04:54.520    08 Sep 2023 20:07:17.360      142.84028305
09 Sep 2023 02:33:13.923    09 Sep 2023 02:36:06.607      172.68416852
09 Sep 2023 20:50:10.056    09 Sep 2023 20:51:55.532      105.47675199
10 Sep 2023 01:41:57.569    10 Sep 2023 01:44:05.047      127.47736943
10 Sep 2023 19:57:56.690    10 Sep 2023 20:00:42.318      165.62778486
11 Sep 2023 02:26:46.582    11 Sep 2023 02:28:53.131      126.54843098
11 Sep 2023 19:06:13.889    11 Sep 2023 19:08:58.350      164.46073602
12 Sep 2023 01:34:40.932    12 Sep 2023 01:37:34.757      173.82539335
12 Sep 2023 18:15:24.022    12 Sep 2023 18:16:21.168      57.145821350
12 Sep 2023 19:52:08.076    12 Sep 2023 19:52:36.485      28.409107437
13 Sep 2023 00:43:00.040    13 Sep 2023 00:45:32.894      152.85420385
13 Sep 2023 18:59:08.012    13 Sep 2023 19:01:37.103      149.09155641
13 Sep 2023 23:51:52.993    13 Sep 2023 23:52:38.341      45.348214160
14 Sep 2023 01:28:19.513    14 Sep 2023 01:29:10.124      50.610892125
14 Sep 2023 18:06:56.626    14 Sep 2023 18:09:48.269      171.64315752
15 Sep 2023 00:35:27.316    15 Sep 2023 00:38:12.174      164.85744857
15 Sep 2023 17:15:19.577    15 Sep 2023 17:17:24.335      124.75789993
15 Sep 2023 23:43:21.570    15 Sep 2023 23:46:08.268      166.69814656
16 Sep 2023 17:59:37.752    16 Sep 2023 18:01:41.307      123.55590578
16 Sep 2023 22:51:37.654    16 Sep 2023 22:53:22.772      105.11776996
17 Sep 2023 17:06:57.007    17 Sep 2023 17:09:46.560      169.55343214
17 Sep 2023 23:35:30.591    17 Sep 2023 23:37:55.610      145.01835726
18 Sep 2023 16:14:47.106    18 Sep 2023 16:17:19.664      152.55766301
18 Sep 2023 22:42:57.662    18 Sep 2023 22:45:49.745      172.08376725
19 Sep 2023 16:59:24.247    19 Sep 2023 17:00:50.001      85.753894527
19 Sep 2023 21:50:46.781    19 Sep 2023 21:53:01.196      134.41503234
20 Sep 2023 16:06:10.426    20 Sep 2023 16:08:51.247      160.82099075
20 Sep 2023 22:34:49.559    20 Sep 2023 22:36:40.305      110.74569816
21 Sep 2023 15:13:30.749    21 Sep 2023 15:16:16.517      165.76748311
21 Sep 2023 21:41:44.576    21 Sep 2023 21:44:35.147      170.57120599
22 Sep 2023 14:21:40.813    22 Sep 2023 14:22:50.183      69.370095909
22 Sep 2023 20:49:08.023    22 Sep 2023 20:51:40.140      152.11688293
23 Sep 2023 15:04:32.997    23 Sep 2023 15:07:00.018      147.02075411
23 Sep 2023 19:57:07.773    23 Sep 2023 19:57:47.302      39.528866136
23 Sep 2023 21:33:33.064    23 Sep 2023 21:34:11.890      38.825561386
24 Sep 2023 14:11:24.415    24 Sep 2023 14:14:15.067      170.65190140
24 Sep 2023 20:39:39.165    24 Sep 2023 20:42:22.337      163.17174369
25 Sep 2023 13:18:52.727    25 Sep 2023 13:20:51.059      118.33169981
25 Sep 2023 19:46:36.696    25 Sep 2023 19:49:19.276      162.58045271
26 Sep 2023 14:02:01.603    26 Sep 2023 14:04:10.699      129.09678770
26 Sep 2023 18:53:58.771    26 Sep 2023 18:55:29.423      90.651692217
27 Sep 2023 13:08:24.103    27 Sep 2023 13:11:14.404      170.30105054
27 Sep 2023 19:36:38.919    27 Sep 2023 19:39:09.550      150.63089880
28 Sep 2023 12:15:20.094    28 Sep 2023 12:17:42.256      142.16290478
28 Sep 2023 18:43:09.743    28 Sep 2023 18:45:57.711      167.96816520
29 Sep 2023 12:58:33.970    29 Sep 2023 13:00:21.379      107.40953672
29 Sep 2023 17:50:03.754    29 Sep 2023 17:51:59.843      116.08841240
30 Sep 2023 12:04:26.917    30 Sep 2023 12:07:13.580      166.66327449
30 Sep 2023 18:32:41.925    30 Sep 2023 18:34:55.433      133.50799957
01 Oct 2023 11:10:53.778    01 Oct 2023 11:13:29.374      155.59660593
01 Oct 2023 17:38:44.923    01 Oct 2023 17:41:34.664      169.74124544
02 Oct 2023 11:54:08.731    02 Oct 2023 11:55:30.107      81.375678862
02 Oct 2023 16:45:13.119    02 Oct 2023 16:47:25.318      132.19887841
03 Oct 2023 10:59:30.580    03 Oct 2023 11:02:11.728      161.14763792
03 Oct 2023 17:27:46.678    03 Oct 2023 17:29:38.820      112.14218494
04 Oct 2023 10:05:29.977    04 Oct 2023 10:08:13.175      163.19793169
04 Oct 2023 16:33:20.332    04 Oct 2023 16:36:09.402      169.06956362
05 Oct 2023 09:12:44.643    05 Oct 2023 09:12:56.790      12.146370008
05 Oct 2023 10:48:46.340    05 Oct 2023 10:49:33.381      47.040962661
05 Oct 2023 15:39:23.610    05 Oct 2023 15:41:46.422      142.81231913
06 Oct 2023 09:53:32.975    06 Oct 2023 09:56:07.850      154.87535092
06 Oct 2023 16:21:51.835    06 Oct 2023 16:23:18.273      86.437894288
07 Oct 2023 08:59:05.913    07 Oct 2023 09:01:53.186      167.27300169
07 Oct 2023 15:26:53.972    07 Oct 2023 15:29:40.949      166.97699960
08 Oct 2023 08:05:30.508    08 Oct 2023 08:06:44.125      73.617378809
08 Oct 2023 14:32:32.703    08 Oct 2023 14:35:02.431      149.72862422
09 Oct 2023 08:46:31.730    09 Oct 2023 08:49:00.532      148.80254829
09 Oct 2023 15:14:56.426    09 Oct 2023 15:15:51.202      54.776529735
10 Oct 2023 07:51:38.835    10 Oct 2023 07:54:28.050      169.21533518
10 Oct 2023 14:19:23.412    10 Oct 2023 14:22:07.805      164.39291616
11 Oct 2023 06:57:32.054    11 Oct 2023 06:59:06.416      94.361522351
11 Oct 2023 13:24:37.700    11 Oct 2023 13:27:11.700      154.00012810
12 Oct 2023 07:38:23.970    12 Oct 2023 07:40:47.744      143.77417364
12 Oct 2023 12:30:30.313    12 Oct 2023 12:31:11.655      41.342737118
13 Oct 2023 06:43:05.657    13 Oct 2023 06:45:55.580      169.92341982
13 Oct 2023 13:10:45.649    13 Oct 2023 13:13:27.791      162.14112227
14 Oct 2023 05:48:31.482    14 Oct 2023 05:50:15.837      104.35433302
14 Oct 2023 12:15:35.488    14 Oct 2023 12:18:11.761      156.27365636
15 Oct 2023 06:29:06.324    15 Oct 2023 06:31:26.834      140.51082538
15 Oct 2023 11:21:00.316    15 Oct 2023 11:21:54.146      53.830089234
16 Oct 2023 05:33:22.958    16 Oct 2023 05:36:12.912      169.95343217
16 Oct 2023 12:00:57.254    16 Oct 2023 12:03:38.122      160.86826626
17 Oct 2023 04:38:23.655    17 Oct 2023 04:40:11.054      107.39902990
17 Oct 2023 11:05:22.671    17 Oct 2023 11:07:59.563      156.89167032
18 Oct 2023 05:18:35.212    18 Oct 2023 05:20:54.740      139.52852081
18 Oct 2023 10:10:23.212    18 Oct 2023 10:11:18.298      55.086048902
19 Oct 2023 04:22:27.287    19 Oct 2023 04:25:16.850      169.56302177
19 Oct 2023 10:49:54.753    19 Oct 2023 10:52:35.683      160.92954918
20 Oct 2023 03:27:04.926    20 Oct 2023 03:28:49.161      104.23490095
20 Oct 2023 09:53:55.960    20 Oct 2023 09:56:31.866      155.90586170
21 Oct 2023 04:06:47.336    21 Oct 2023 04:09:08.362      141.02596196
21 Oct 2023 08:58:35.603    21 Oct 2023 08:59:21.139      45.536856644
22 Oct 2023 03:10:15.623    22 Oct 2023 03:13:04.322      168.69933140
22 Oct 2023 09:37:35.150    22 Oct 2023 09:40:17.432      162.28191279
23 Oct 2023 02:14:33.061    23 Oct 2023 02:16:06.699      93.638164841
23 Oct 2023 08:41:12.647    23 Oct 2023 08:43:45.700      153.05310264
24 Oct 2023 02:53:40.184    24 Oct 2023 02:56:04.986      144.80279346
24 Oct 2023 09:21:36.345    24 Oct 2023 09:22:18.611      42.266235617
25 Oct 2023 01:56:45.838    25 Oct 2023 01:59:32.788      166.94987115
25 Oct 2023 08:23:56.361    25 Oct 2023 08:26:40.799      164.43784809
26 Oct 2023 01:00:48.560    26 Oct 2023 01:01:59.099      70.538914064
26 Oct 2023 07:27:10.997    26 Oct 2023 07:29:38.702      147.70479002
27 Oct 2023 01:39:12.341    27 Oct 2023 01:41:42.597      150.25507291
27 Oct 2023 08:06:47.016    27 Oct 2023 08:08:05.897      78.880789143
28 Oct 2023 00:41:56.963    28 Oct 2023 00:44:40.416      163.45296011
28 Oct 2023 07:08:57.394    28 Oct 2023 07:11:43.897      166.50348294
29 Oct 2023 01:21:53.249    29 Oct 2023 01:22:34.260      41.011802922
29 Oct 2023 06:11:50.399    29 Oct 2023 06:14:09.159      138.76006384
30 Oct 2023 00:23:23.488    30 Oct 2023 00:25:59.914      156.42588252
30 Oct 2023 06:50:41.247    30 Oct 2023 06:52:28.618      107.37120586
30 Oct 2023 23:25:49.199    30 Oct 2023 23:28:25.915      156.71608035
31 Oct 2023 05:52:38.189    31 Oct 2023 05:55:25.457      167.26841102
01 Nov 2023 00:04:52.546    01 Nov 2023 00:06:12.411      79.865320364
01 Nov 2023 04:55:11.315    01 Nov 2023 04:57:15.656      124.34139645
01 Nov 2023 23:06:14.103    01 Nov 2023 23:08:56.152      162.04859109
02 Nov 2023 05:33:17.267    02 Nov 2023 05:35:27.887      130.62034172
02 Nov 2023 22:08:23.802    02 Nov 2023 22:10:47.952      144.15060460
03 Nov 2023 04:34:59.234    03 Nov 2023 04:37:44.499      165.26505800
03 Nov 2023 22:46:36.156    03 Nov 2023 22:48:24.220      108.06421596
04 Nov 2023 03:37:15.413    04 Nov 2023 03:38:56.109      100.69578190
04 Nov 2023 21:47:45.036    04 Nov 2023 21:50:30.543      165.50712978
05 Nov 2023 04:14:34.875    05 Nov 2023 04:17:03.428      148.55220735
05 Nov 2023 20:49:43.384    05 Nov 2023 20:51:43.900      120.51548178
06 Nov 2023 03:16:01.108    06 Nov 2023 03:18:39.815      158.70743415
06 Nov 2023 21:27:01.310    06 Nov 2023 21:29:12.234      130.92445771
07 Nov 2023 02:18:08.712    07 Nov 2023 02:19:03.633      54.921660398
07 Nov 2023 20:27:57.134    07 Nov 2023 20:30:41.743      164.60932391
08 Nov 2023 02:54:33.828    08 Nov 2023 02:57:14.243      160.41518301
08 Nov 2023 19:29:56.309    08 Nov 2023 19:31:04.544      68.234636995
09 Nov 2023 01:55:44.206    09 Nov 2023 01:58:09.369      145.16299098
09 Nov 2023 20:06:07.222    09 Nov 2023 20:08:35.969      148.74694892
10 Nov 2023 02:33:01.995    10 Nov 2023 02:34:30.721      88.725672942
10 Nov 2023 19:06:51.250    10 Nov 2023 19:09:27.200      155.94988461
11 Nov 2023 01:33:13.419    11 Nov 2023 01:35:58.447      165.02730972
11 Nov 2023 19:44:12.248    11 Nov 2023 19:45:26.364      74.116424960
12 Nov 2023 00:34:09.127    12 Nov 2023 00:36:09.501      120.37320547
12 Nov 2023 18:43:53.194    12 Nov 2023 18:46:33.542      160.34783745
13 Nov 2023 01:10:26.330    13 Nov 2023 01:12:40.165      133.83483784
13 Nov 2023 17:44:29.239    13 Nov 2023 17:46:42.102      132.86312842
14 Nov 2023 00:10:32.563    14 Nov 2023 00:13:13.161      160.59862159
14 Nov 2023 18:20:42.190    14 Nov 2023 18:22:41.699      119.50881165
14 Nov 2023 23:11:20.229    14 Nov 2023 23:12:31.563      71.334098093
15 Nov 2023 17:20:18.762    15 Nov 2023 17:23:01.884      163.12225128
15 Nov 2023 23:46:35.600    15 Nov 2023 23:49:12.074      156.47368797
16 Nov 2023 16:21:00.819    16 Nov 2023 16:22:13.039      72.220130428
16 Nov 2023 22:46:30.429    16 Nov 2023 22:48:54.454      144.02516900
17 Nov 2023 16:55:54.720    17 Nov 2023 16:58:21.745      147.02524639
17 Nov 2023 23:22:27.161    17 Nov 2023 23:23:56.538      89.377157099
18 Nov 2023 15:55:24.722    18 Nov 2023 15:57:56.538      151.81548017
18 Nov 2023 22:21:24.207    18 Nov 2023 22:24:07.249      163.04215654
19 Nov 2023 16:31:16.079    19 Nov 2023 16:32:41.010      84.930560505
19 Nov 2023 21:21:08.414    19 Nov 2023 21:22:56.307      107.89211118
20 Nov 2023 15:29:46.185    20 Nov 2023 15:32:26.990      160.80531838
20 Nov 2023 21:55:54.385    20 Nov 2023 21:58:16.587      142.20179419
21 Nov 2023 14:29:16.636    21 Nov 2023 14:31:09.146      112.50998934
21 Nov 2023 20:54:50.406    21 Nov 2023 20:57:23.432      153.02562750
22 Nov 2023 15:03:47.403    22 Nov 2023 15:06:01.040      133.63711273
23 Nov 2023 14:02:17.510    23 Nov 2023 14:04:54.792      157.28270434
23 Nov 2023 20:28:07.409    23 Nov 2023 20:30:48.121      160.71229277
24 Nov 2023 14:37:36.845    24 Nov 2023 14:38:29.368      52.522542514
24 Nov 2023 19:26:55.847    24 Nov 2023 19:28:56.527      120.67990109
25 Nov 2023 13:35:02.165    25 Nov 2023 13:37:39.379      157.21417379
25 Nov 2023 20:00:59.502    25 Nov 2023 20:03:10.695      131.19321599
26 Nov 2023 12:33:35.289    26 Nov 2023 12:35:38.723      123.43400944
26 Nov 2023 18:59:00.518    26 Nov 2023 19:01:35.565      155.04672239
27 Nov 2023 13:07:23.322    27 Nov 2023 13:09:29.964      126.64188783
27 Nov 2023 17:58:07.182    27 Nov 2023 17:58:19.228      12.045738136
28 Nov 2023 12:05:00.100    28 Nov 2023 12:07:37.700      157.60006236
28 Nov 2023 18:30:37.413    28 Nov 2023 18:33:16.208      158.79435595
29 Nov 2023 12:39:33.161    29 Nov 2023 12:40:14.332      41.171033727
29 Nov 2023 17:28:35.869    29 Nov 2023 17:30:36.984      121.11538957
30 Nov 2023 11:36:04.223    30 Nov 2023 11:38:40.356      156.13255436
30 Nov 2023 18:01:47.897    30 Nov 2023 18:03:58.084      130.18724145
01 Dec 2023 10:33:49.957    01 Dec 2023 10:35:49.839      119.88175804
01 Dec 2023 16:59:00.674    01 Dec 2023 17:01:33.684      153.00951098
02 Dec 2023 11:06:42.733    02 Dec 2023 11:08:51.777      129.04382141
03 Dec 2023 10:03:34.131    03 Dec 2023 10:06:08.872      154.74128468
03 Dec 2023 16:28:56.474    03 Dec 2023 16:31:35.307      158.83316332
04 Dec 2023 10:37:01.892    04 Dec 2023 10:38:05.714      63.822408300
04 Dec 2023 15:26:11.507    04 Dec 2023 15:28:01.687      110.17928130
05 Dec 2023 09:32:56.084    05 Dec 2023 09:35:33.670      157.58582738
05 Dec 2023 15:58:23.383    05 Dec 2023 16:00:42.445      139.06158982
06 Dec 2023 08:30:05.889    06 Dec 2023 08:31:45.028      99.139475275
06 Dec 2023 14:54:55.059    06 Dec 2023 14:57:21.107      146.04803697
07 Dec 2023 09:01:50.369    07 Dec 2023 09:04:09.373      139.00314176
07 Dec 2023 15:27:32.095    07 Dec 2023 15:28:44.821      72.725460492
08 Dec 2023 07:58:04.512    08 Dec 2023 08:00:30.337      145.82561249
08 Dec 2023 14:23:08.790    08 Dec 2023 14:25:47.108      158.31766654
09 Dec 2023 08:30:17.728    09 Dec 2023 08:31:54.555      96.827324771
09 Dec 2023 13:19:48.853    09 Dec 2023 13:21:09.025      80.171928287
10 Dec 2023 07:25:41.665    10 Dec 2023 07:28:19.613      157.94811922
10 Dec 2023 13:50:50.566    10 Dec 2023 13:53:21.645      151.07880203
11 Dec 2023 12:46:46.402    11 Dec 2023 12:48:55.450      129.04876474
12 Dec 2023 06:52:49.076    12 Dec 2023 06:55:19.985      150.90845400
12 Dec 2023 13:18:02.367    12 Dec 2023 13:20:02.237      119.86965666
13 Dec 2023 05:48:35.413    13 Dec 2023 05:50:35.742      120.32840902
13 Dec 2023 12:13:15.032    13 Dec 2023 12:15:46.217      151.18491504
14 Dec 2023 06:19:24.413    14 Dec 2023 06:21:32.370      127.95667809
15 Dec 2023 05:14:21.580    15 Dec 2023 05:16:50.577      148.99643271
15 Dec 2023 11:39:09.009    15 Dec 2023 11:41:46.175      157.16618258
16 Dec 2023 05:45:29.224    16 Dec 2023 05:46:53.653      84.429212892
16 Dec 2023 10:34:35.893    16 Dec 2023 10:36:03.234      87.340857857
17 Dec 2023 04:39:37.448    17 Dec 2023 04:42:13.742      156.29487494
17 Dec 2023 11:04:27.072    17 Dec 2023 11:06:55.659      148.58742265
18 Dec 2023 09:59:12.381    18 Dec 2023 10:01:19.108      126.72678509
19 Dec 2023 04:04:18.320    19 Dec 2023 04:06:48.459      150.13969182
19 Dec 2023 10:29:10.125    19 Dec 2023 10:31:12.923      122.79803924
20 Dec 2023 02:58:58.857    20 Dec 2023 03:00:48.409      109.55216554
20 Dec 2023 09:23:14.596    20 Dec 2023 09:25:41.326      146.73025893
21 Dec 2023 03:28:22.275    21 Dec 2023 03:30:35.346      133.07143988
21 Dec 2023 09:53:26.255    21 Dec 2023 09:54:29.214      62.959149806
22 Dec 2023 02:22:15.369    22 Dec 2023 02:24:35.229      139.85996484
22 Dec 2023 08:46:38.473    22 Dec 2023 08:49:13.362      154.88895789
23 Dec 2023 02:51:49.139    23 Dec 2023 02:53:33.523      104.38344452
23 Dec 2023 07:41:10.548    23 Dec 2023 07:41:56.971      46.422679012
24 Dec 2023 01:44:58.114    24 Dec 2023 01:47:30.010      151.89673633
24 Dec 2023 08:09:22.726    24 Dec 2023 08:11:56.167      153.44110220
25 Dec 2023 02:14:43.660    25 Dec 2023 02:15:37.450      53.790042805
25 Dec 2023 07:03:08.644    25 Dec 2023 07:04:48.472      99.828251777
26 Dec 2023 01:07:02.880    26 Dec 2023 01:09:36.308      153.42724943
26 Dec 2023 07:31:27.053    26 Dec 2023 07:33:49.930      142.87640769
27 Dec 2023 00:01:22.673    27 Dec 2023 00:01:34.895      12.221869687
27 Dec 2023 06:24:35.702    27 Dec 2023 06:26:41.699      125.99639527
28 Dec 2023 00:28:27.831    28 Dec 2023 00:30:55.478      147.64684236
28 Dec 2023 06:52:51.998    28 Dec 2023 06:54:54.129      122.13085410
28 Dec 2023 23:21:38.376    28 Dec 2023 23:23:16.331      97.954853671
29 Dec 2023 05:45:23.591    29 Dec 2023 05:47:44.804      141.21224892
29 Dec 2023 23:49:11.952    29 Dec 2023 23:51:28.115      136.16271102
30 Dec 2023 06:13:40.062    30 Dec 2023 06:15:06.301      86.239494954
30 Dec 2023 22:41:39.303    30 Dec 2023 22:43:45.336      126.03287792
31 Dec 2023 05:05:30.363    31 Dec 2023 05:07:59.711      149.34843995
31 Dec 2023 23:09:14.643    31 Dec 2023 23:11:14.313      119.67029488
01 Jan 2024 22:01:03.119    01 Jan 2024 22:03:23.659      140.53958044
02 Jan 2024 04:24:54.995    02 Jan 2024 04:27:27.221      152.22601845
02 Jan 2024 22:28:35.662    02 Jan 2024 22:30:13.588      97.926152672
03 Jan 2024 03:17:33.822    03 Jan 2024 03:18:10.078      36.256270856
03 Jan 2024 21:19:46.286    03 Jan 2024 21:22:13.965      147.67950695
04 Jan 2024 03:43:36.642    04 Jan 2024 03:46:07.623      150.98127094
04 Jan 2024 21:47:15.656    04 Jan 2024 21:48:24.215      68.559511076
05 Jan 2024 02:35:33.418    05 Jan 2024 02:36:52.095      78.676835750
05 Jan 2024 20:37:46.782    05 Jan 2024 20:40:17.002      150.21965298
06 Jan 2024 03:01:34.378    06 Jan 2024 03:04:00.849      146.47102333
07 Jan 2024 01:52:57.410    07 Jan 2024 01:54:37.593      100.18235680
07 Jan 2024 19:55:02.922    07 Jan 2024 19:57:32.722      149.80000880
08 Jan 2024 02:18:47.084    08 Jan 2024 02:21:06.531      139.44727031
09 Jan 2024 01:09:38.382    09 Jan 2024 01:11:32.248      113.86566935
09 Jan 2024 19:11:33.042    09 Jan 2024 19:14:00.601      147.55901594
10 Jan 2024 01:35:13.402    10 Jan 2024 01:37:24.062      130.66031932
10 Jan 2024 18:02:52.531    10 Jan 2024 18:03:29.961      37.429897813
11 Jan 2024 00:25:33.651    11 Jan 2024 00:27:36.544      122.89388997
11 Jan 2024 18:27:15.409    11 Jan 2024 18:29:39.781      144.37227283
12 Jan 2024 00:50:51.723    12 Jan 2024 00:52:52.662      120.93872273
12 Jan 2024 17:17:51.831    12 Jan 2024 17:19:02.724      70.892860042
12 Jan 2024 23:40:41.185    12 Jan 2024 23:42:49.942      128.75678659
13 Jan 2024 17:42:08.221    13 Jan 2024 17:44:29.177      140.95609335
14 Jan 2024 00:05:40.209    14 Jan 2024 00:07:31.466      111.25699750
14 Jan 2024 16:32:09.845    14 Jan 2024 16:33:36.406      86.560830404
14 Jan 2024 22:54:59.136    14 Jan 2024 22:57:11.471      132.33494185
15 Jan 2024 16:56:09.658    15 Jan 2024 16:58:27.564      137.90597159
15 Jan 2024 23:19:36.842    15 Jan 2024 23:21:19.613      102.77137886
16 Jan 2024 15:45:39.818    16 Jan 2024 15:47:14.702      94.883726758
16 Jan 2024 22:08:25.755    16 Jan 2024 22:10:39.945      134.19026239
17 Jan 2024 16:09:17.951    17 Jan 2024 16:11:33.646      135.69448345
17 Jan 2024 22:32:39.523    17 Jan 2024 22:34:16.278      96.755216620
18 Jan 2024 14:58:18.967    18 Jan 2024 14:59:57.386      98.418690800
18 Jan 2024 21:20:59.418    18 Jan 2024 21:23:14.078      134.66014863
19 Jan 2024 15:21:31.461    19 Jan 2024 15:23:46.106      134.64443571
19 Jan 2024 21:44:46.265    19 Jan 2024 21:46:20.596      94.330237317
20 Jan 2024 14:10:05.452    20 Jan 2024 14:11:43.433      97.981598962
20 Jan 2024 20:32:38.654    20 Jan 2024 20:34:52.536      133.88272690
21 Jan 2024 14:32:48.729    21 Jan 2024 14:35:03.623      134.89377836
21 Jan 2024 20:55:55.448    21 Jan 2024 20:57:31.467      96.019282797
22 Jan 2024 13:20:58.013    22 Jan 2024 13:22:31.430      93.417102308
22 Jan 2024 19:43:22.161    22 Jan 2024 19:45:33.952      131.79109264
23 Jan 2024 13:43:08.495    23 Jan 2024 13:45:24.863      136.36801536
23 Jan 2024 20:06:05.954    23 Jan 2024 20:07:47.408      101.45446850
24 Jan 2024 12:30:56.032    24 Jan 2024 12:32:19.481      83.449649834
24 Jan 2024 18:53:08.801    24 Jan 2024 18:55:16.887      128.08601693
25 Jan 2024 12:52:29.668    25 Jan 2024 12:54:48.438      138.76926277
25 Jan 2024 19:15:17.048    25 Jan 2024 19:17:06.594      109.54610605
26 Jan 2024 11:40:00.239    26 Jan 2024 11:41:04.408      64.168391889
26 Jan 2024 18:01:57.572    26 Jan 2024 18:03:59.748      122.17641530
27 Jan 2024 12:00:51.271    27 Jan 2024 12:03:12.849      141.57732942
27 Jan 2024 18:23:28.101    27 Jan 2024 18:25:27.011      118.90993074
28 Jan 2024 17:09:47.607    28 Jan 2024 17:11:40.646      113.03908336
29 Jan 2024 11:08:12.357    29 Jan 2024 11:10:36.400      144.04319910
29 Jan 2024 17:30:38.345    29 Jan 2024 17:32:46.517      128.17151517
30 Jan 2024 16:16:38.277    30 Jan 2024 16:18:17.101      98.823597073
31 Jan 2024 10:14:31.945    31 Jan 2024 10:16:57.088      145.14331195
31 Jan 2024 16:36:46.748    31 Jan 2024 16:39:02.796      136.04768323
01 Feb 2024 10:35:55.060    01 Feb 2024 10:36:09.428      14.367961069
01 Feb 2024 15:22:29.868    01 Feb 2024 15:23:45.190      75.322300033
02 Feb 2024 09:19:49.000    02 Feb 2024 09:22:12.443      143.44333186
02 Feb 2024 15:41:51.948    02 Feb 2024 15:44:13.237      141.28858029
03 Feb 2024 09:40:06.257    03 Feb 2024 09:41:19.363      73.106114671
03 Feb 2024 14:27:33.227    03 Feb 2024 14:27:49.733      16.506603034
04 Feb 2024 08:24:02.538    04 Feb 2024 08:26:19.286      136.74839828
04 Feb 2024 14:45:52.250    04 Feb 2024 14:48:14.794      142.54339049
05 Feb 2024 08:43:24.564    05 Feb 2024 08:45:07.107      102.54308505
06 Feb 2024 07:27:12.086    06 Feb 2024 07:29:13.175      121.08904033
06 Feb 2024 13:48:45.698    06 Feb 2024 13:51:03.823      138.12502875
07 Feb 2024 07:45:36.989    07 Feb 2024 07:47:40.315      123.32555819
07 Feb 2024 14:07:36.411    07 Feb 2024 14:08:49.469      73.058624484
08 Feb 2024 06:29:19.941    08 Feb 2024 06:30:46.123      86.181994260
08 Feb 2024 12:50:30.325    08 Feb 2024 12:52:35.800      125.47483931
09 Feb 2024 06:46:39.850    09 Feb 2024 06:48:56.572      136.72192456
09 Feb 2024 13:08:17.237    09 Feb 2024 13:10:12.678      115.44151985
10 Feb 2024 11:51:05.113    10 Feb 2024 11:52:44.412      99.299270601
11 Feb 2024 05:46:30.538    11 Feb 2024 05:48:51.715      141.17643734
11 Feb 2024 12:07:50.929    11 Feb 2024 12:10:06.380      135.45087056
12 Feb 2024 06:04:05.700    12 Feb 2024 06:04:56.840      51.139266032
12 Feb 2024 10:50:39.406    12 Feb 2024 10:51:12.243      32.836515654
13 Feb 2024 04:45:07.610    13 Feb 2024 04:47:19.865      132.25532833
13 Feb 2024 11:06:09.883    13 Feb 2024 11:08:29.765      139.88242719
14 Feb 2024 05:01:24.133    14 Feb 2024 05:03:10.383      106.25023559
15 Feb 2024 03:42:33.626    15 Feb 2024 03:44:10.733      97.107298672
15 Feb 2024 10:03:10.191    15 Feb 2024 10:05:17.766      127.57440704
16 Feb 2024 03:57:30.814    16 Feb 2024 03:59:42.442      131.62780709
16 Feb 2024 10:18:27.559    16 Feb 2024 10:20:18.591      111.03247837
17 Feb 2024 08:58:51.699    17 Feb 2024 09:00:21.113      89.414859947
18 Feb 2024 02:52:17.141    18 Feb 2024 02:54:33.493      136.35142737
18 Feb 2024 09:12:52.556    18 Feb 2024 09:15:08.707      136.15114305
19 Feb 2024 03:06:51.929    19 Feb 2024 03:08:09.688      77.758809587
20 Feb 2024 01:45:44.067    20 Feb 2024 01:47:34.218      110.15104864
20 Feb 2024 08:05:53.841    20 Feb 2024 08:08:04.676      130.83517284
21 Feb 2024 01:58:46.890    21 Feb 2024 02:00:50.849      123.95894938
21 Feb 2024 08:19:11.490    21 Feb 2024 08:20:50.598      99.107842287
22 Feb 2024 06:57:29.587    22 Feb 2024 06:58:57.612      88.024538895
23 Feb 2024 00:49:18.728    23 Feb 2024 00:51:31.088      132.36006147
23 Feb 2024 07:09:17.794    23 Feb 2024 07:11:31.764      133.97057658
24 Feb 2024 01:01:32.442    24 Feb 2024 01:02:56.204      83.762563043
24 Feb 2024 23:38:30.110    24 Feb 2024 23:39:58.034      87.924511149
25 Feb 2024 05:57:55.617    25 Feb 2024 05:59:55.595      119.97783005
25 Feb 2024 23:48:56.062    25 Feb 2024 23:51:03.861      127.79940991
26 Feb 2024 06:08:36.710    26 Feb 2024 06:10:33.608      116.89800209
27 Feb 2024 22:34:52.319    27 Feb 2024 22:36:47.031      114.71139028
28 Feb 2024 04:54:03.675    28 Feb 2024 04:56:12.291      128.61571759
28 Feb 2024 22:44:03.606    28 Feb 2024 22:45:58.647      115.04039140
29 Feb 2024 05:03:23.516    29 Feb 2024 05:04:53.870      90.353419154
01 Mar 2024 03:37:57.670    01 Mar 2024 03:39:00.096      62.425785419
01 Mar 2024 21:26:33.800    01 Mar 2024 21:28:34.239      120.43853465
02 Mar 2024 03:45:20.933    02 Mar 2024 03:47:29.228      128.29470966
02 Mar 2024 21:34:07.041    02 Mar 2024 21:35:52.147      105.10525651
03 Mar 2024 03:53:02.239    03 Mar 2024 03:54:12.453      70.214800956
04 Mar 2024 02:25:41.071    04 Mar 2024 02:26:46.345      65.273871145
04 Mar 2024 20:12:54.184    04 Mar 2024 20:14:52.145      117.96149776
05 Mar 2024 02:31:10.376    05 Mar 2024 02:33:15.548      125.17194698
05 Mar 2024 20:18:25.438    05 Mar 2024 20:20:10.763      105.32506082
06 Mar 2024 02:36:45.271    06 Mar 2024 02:38:02.104      76.832528401
07 Mar 2024 01:07:46.573    07 Mar 2024 01:08:12.846      26.272983500
07 Mar 2024 18:53:09.604    07 Mar 2024 18:54:55.449      105.84532743
08 Mar 2024 01:10:46.791    08 Mar 2024 01:12:44.835      118.04399926
08 Mar 2024 18:56:10.350    08 Mar 2024 18:58:04.470      114.11938076
09 Mar 2024 01:13:46.217    09 Mar 2024 01:15:27.749      101.53162528
10 Mar 2024 17:26:36.915    10 Mar 2024 17:27:28.313      51.397442061
10 Mar 2024 23:43:15.074    10 Mar 2024 23:44:47.019      91.945253208
11 Mar 2024 17:26:23.311    11 Mar 2024 17:28:19.546      116.23481826
11 Mar 2024 23:43:09.229    11 Mar 2024 23:45:05.836      116.60718127
12 Mar 2024 17:25:52.900    12 Mar 2024 17:27:27.703      94.802934222
12 Mar 2024 23:42:33.371    12 Mar 2024 23:43:38.991      65.620222490
14 Mar 2024 15:48:04.239    14 Mar 2024 15:48:53.319      49.079561792
14 Mar 2024 22:03:34.673    14 Mar 2024 22:04:58.694      84.020858200
15 Mar 2024 15:43:14.540    15 Mar 2024 15:45:03.318      108.77858670
15 Mar 2024 21:58:43.492    15 Mar 2024 22:00:33.669      110.17688492
16 Mar 2024 15:37:33.513    16 Mar 2024 15:39:16.349      102.83625950
16 Mar 2024 21:52:44.158    16 Mar 2024 21:54:15.331      91.172999237
17 Mar 2024 15:30:41.944    17 Mar 2024 15:31:33.034      51.089969126
19 Mar 2024 19:51:25.304    19 Mar 2024 19:52:01.091      35.787359951
20 Mar 2024 13:24:19.400    20 Mar 2024 13:25:28.170      68.769466120
20 Mar 2024 19:37:10.992    20 Mar 2024 19:38:29.370      78.377959190
21 Mar 2024 13:08:10.053    21 Mar 2024 13:09:39.306      89.253078424
21 Mar 2024 19:20:19.686    21 Mar 2024 19:21:48.997      89.311391325
22 Mar 2024 12:48:47.011    22 Mar 2024 12:50:18.458      91.446473915
22 Mar 2024 18:59:55.819    22 Mar 2024 19:01:24.441      88.621380483
23 Mar 2024 12:24:51.949    23 Mar 2024 12:26:17.415      85.466051905
23 Mar 2024 18:34:27.525    23 Mar 2024 18:35:48.332      80.806874740
24 Mar 2024 11:52:54.526    24 Mar 2024 11:53:54.411      59.884517896


Number of events : 525
