02 Jul 2023 00:39:32.591    02 Jul 2023 00:40:58.494      85.902639886
02 Jul 2023 05:31:51.103    02 Jul 2023 05:34:22.154      151.05041221
02 Jul 2023 23:51:25.704    02 Jul 2023 23:54:03.779      158.07513994
03 Jul 2023 04:45:02.547    03 Jul 2023 04:46:07.119      64.572425606
03 Jul 2023 06:21:55.088    03 Jul 2023 06:22:49.284      54.196015571
03 Jul 2023 23:03:44.755    03 Jul 2023 23:06:44.317      179.56133368
04 Jul 2023 05:33:36.374    04 Jul 2023 05:36:18.742      162.36803338
04 Jul 2023 22:16:26.132    04 Jul 2023 22:19:03.908      157.77657016
05 Jul 2023 04:45:57.939    05 Jul 2023 04:48:55.886      177.94726957
05 Jul 2023 23:06:18.729    05 Jul 2023 23:07:43.909      85.180067236
06 Jul 2023 03:58:34.641    06 Jul 2023 04:01:05.835      151.19431671
06 Jul 2023 22:18:00.527    06 Jul 2023 22:20:38.729      158.20253973
07 Jul 2023 03:11:35.537    07 Jul 2023 03:12:39.659      64.122833521
07 Jul 2023 04:48:27.083    07 Jul 2023 04:49:21.405      54.322436568
07 Jul 2023 21:30:08.800    07 Jul 2023 21:33:08.496      179.69594275
08 Jul 2023 03:59:57.579    08 Jul 2023 04:02:40.200      162.62136509
08 Jul 2023 20:42:39.875    08 Jul 2023 20:45:17.047      157.17204404
09 Jul 2023 03:12:08.641    09 Jul 2023 03:15:06.391      177.74970538
09 Jul 2023 21:32:19.133    09 Jul 2023 21:33:47.259      88.126129447
10 Jul 2023 02:24:35.089    10 Jul 2023 02:27:05.101      150.01189944
10 Jul 2023 20:43:51.123    10 Jul 2023 20:46:30.656      159.53325697
11 Jul 2023 01:37:27.404    11 Jul 2023 01:38:25.950      58.545893908
11 Jul 2023 03:14:11.558    11 Jul 2023 03:15:14.484      62.925280107
11 Jul 2023 19:55:49.424    11 Jul 2023 19:58:49.268      179.84348803
12 Jul 2023 02:25:34.875    12 Jul 2023 02:28:18.981      164.10616077
12 Jul 2023 19:08:11.146    12 Jul 2023 19:10:46.111      154.96576012
13 Jul 2023 01:37:36.067    13 Jul 2023 01:40:33.420      177.35316226
13 Jul 2023 19:57:34.345    13 Jul 2023 19:59:08.611      94.266220427
14 Jul 2023 00:49:52.727    14 Jul 2023 00:52:20.122      147.39501845
14 Jul 2023 19:08:57.591    14 Jul 2023 19:11:39.517      161.92555125
15 Jul 2023 00:02:39.122    15 Jul 2023 00:03:24.904      45.782326232
15 Jul 2023 01:39:10.030    15 Jul 2023 01:40:26.850      76.820329903
15 Jul 2023 18:20:46.465    15 Jul 2023 18:23:46.312      179.84726869
16 Jul 2023 00:50:28.025    16 Jul 2023 00:53:14.629      166.60336736
16 Jul 2023 17:32:59.629    16 Jul 2023 17:35:30.429      150.79929584
17 Jul 2023 00:02:19.703    17 Jul 2023 00:05:16.284      176.58063829
17 Jul 2023 18:22:03.960    17 Jul 2023 18:23:46.871      102.91081873
17 Jul 2023 23:14:26.863    17 Jul 2023 23:16:49.926      143.06299231
18 Jul 2023 17:33:19.089    18 Jul 2023 17:36:04.259      165.16998773
18 Jul 2023 22:27:18.373    18 Jul 2023 22:27:26.777      8.4036442568
19 Jul 2023 00:03:22.886    19 Jul 2023 00:04:56.045      93.158910878
19 Jul 2023 16:44:58.941    19 Jul 2023 16:47:58.385      179.44380358
19 Jul 2023 23:14:35.999    19 Jul 2023 23:17:25.774      169.77515883
20 Jul 2023 15:57:04.426    20 Jul 2023 15:59:28.421      143.99496837
20 Jul 2023 22:26:18.366    20 Jul 2023 22:29:13.522      175.15555046
21 Jul 2023 16:45:47.006    21 Jul 2023 16:47:40.333      113.32775925
21 Jul 2023 21:38:16.327    21 Jul 2023 21:40:32.878      136.55087370
22 Jul 2023 15:56:54.395    22 Jul 2023 15:59:43.358      168.96352574
22 Jul 2023 22:26:49.564    22 Jul 2023 22:28:39.772      110.20888849
23 Jul 2023 15:08:25.695    23 Jul 2023 15:11:23.921      178.22576333
23 Jul 2023 21:37:57.603    23 Jul 2023 21:40:50.777      173.17330664
24 Jul 2023 14:20:24.823    24 Jul 2023 14:22:38.187      133.36468317
24 Jul 2023 20:49:30.886    24 Jul 2023 20:52:23.573      172.68635589
25 Jul 2023 15:08:42.619    25 Jul 2023 15:10:47.415      124.79582720
25 Jul 2023 20:01:20.216    25 Jul 2023 20:03:27.331      127.11505748
26 Jul 2023 14:19:42.622    26 Jul 2023 14:22:35.508      172.88607757
26 Jul 2023 20:49:29.478    26 Jul 2023 20:51:36.342      126.86375534
27 Jul 2023 13:31:06.077    27 Jul 2023 13:34:01.675      175.59815361
27 Jul 2023 20:00:32.120    27 Jul 2023 20:03:28.361      176.24055011
28 Jul 2023 12:43:01.145    28 Jul 2023 12:44:57.833      116.68798795
28 Jul 2023 19:11:56.686    28 Jul 2023 19:14:45.340      168.65376706
29 Jul 2023 13:30:50.530    29 Jul 2023 13:33:07.170      136.63955508
29 Jul 2023 18:23:38.470    29 Jul 2023 18:25:32.007      113.53660945
30 Jul 2023 12:41:43.612    30 Jul 2023 12:44:40.005      176.39363122
30 Jul 2023 19:11:22.556    30 Jul 2023 19:13:44.843      142.28669397
31 Jul 2023 11:53:00.250    31 Jul 2023 11:55:50.960      170.71044155
31 Jul 2023 18:22:19.536    31 Jul 2023 18:25:17.869      178.33300978
01 Aug 2023 11:04:55.897    01 Aug 2023 11:06:24.636      88.738496939
01 Aug 2023 12:42:05.458    01 Aug 2023 12:42:42.466      37.007358426
01 Aug 2023 17:33:35.906    01 Aug 2023 17:36:18.295      162.38910957
02 Aug 2023 11:52:11.094    02 Aug 2023 11:54:39.298      148.20457326
02 Aug 2023 16:45:12.204    02 Aug 2023 16:46:45.647      93.442677066
03 Aug 2023 11:02:57.838    03 Aug 2023 11:05:56.641      178.80280330
03 Aug 2023 17:32:29.167    03 Aug 2023 17:35:04.950      155.78228374
04 Aug 2023 10:14:09.040    04 Aug 2023 10:16:51.356      162.31615684
04 Aug 2023 16:43:20.283    04 Aug 2023 16:46:19.026      178.74271260
05 Aug 2023 09:26:28.305    05 Aug 2023 09:26:39.844      11.538841494
05 Aug 2023 11:02:33.804    05 Aug 2023 11:03:54.028      80.223779054
05 Aug 2023 15:54:29.095    05 Aug 2023 15:57:02.093      152.99821270
06 Aug 2023 10:12:44.872    06 Aug 2023 10:15:23.712      158.83989012
06 Aug 2023 15:06:05.030    06 Aug 2023 15:07:04.820      59.789702855
06 Aug 2023 16:42:43.773    06 Aug 2023 16:43:48.791      65.018335730
07 Aug 2023 09:23:25.922    07 Aug 2023 09:26:25.182      179.25993187
07 Aug 2023 15:52:49.637    07 Aug 2023 15:55:36.371      166.73333296
08 Aug 2023 08:34:33.561    08 Aug 2023 08:37:01.968      148.40752019
08 Aug 2023 15:03:34.672    08 Aug 2023 15:06:31.359      176.68703387
09 Aug 2023 09:22:22.162    09 Aug 2023 09:24:10.708      108.54623595
09 Aug 2023 14:14:36.692    09 Aug 2023 14:16:55.864      139.17141811
10 Aug 2023 08:32:32.023    10 Aug 2023 08:35:19.888      167.86546855
10 Aug 2023 15:02:11.278    10 Aug 2023 15:04:02.799      111.52109188
11 Aug 2023 07:43:08.057    11 Aug 2023 07:46:04.697      176.64019181
11 Aug 2023 14:12:23.668    11 Aug 2023 14:15:18.204      174.53562480
12 Aug 2023 06:54:15.179    12 Aug 2023 06:56:20.273      125.09344396
12 Aug 2023 13:23:02.344    12 Aug 2023 13:25:53.593      171.24808165
13 Aug 2023 07:41:25.179    13 Aug 2023 07:43:36.220      131.04112657
13 Aug 2023 12:33:58.800    13 Aug 2023 12:35:57.417      118.61705049
14 Aug 2023 06:51:31.904    14 Aug 2023 06:54:26.381      174.47772366
14 Aug 2023 13:20:58.508    14 Aug 2023 13:23:19.145      140.63729227
15 Aug 2023 06:02:03.793    15 Aug 2023 06:04:53.098      169.30500981
15 Aug 2023 12:31:10.064    15 Aug 2023 12:34:08.594      178.52917397
16 Aug 2023 05:13:18.125    16 Aug 2023 05:14:39.073      80.947657395
16 Aug 2023 06:50:19.025    16 Aug 2023 06:50:58.494      39.468953339
16 Aug 2023 11:41:42.160    16 Aug 2023 11:44:23.380      161.21997081
17 Aug 2023 05:59:40.363    17 Aug 2023 06:02:09.654      149.29066360
17 Aug 2023 10:52:36.277    17 Aug 2023 10:54:02.017      85.740122222
18 Aug 2023 05:09:43.176    18 Aug 2023 05:12:40.787      177.61174942
18 Aug 2023 11:38:59.264    18 Aug 2023 11:41:39.783      160.51898858
19 Aug 2023 04:20:12.492    19 Aug 2023 04:22:47.001      154.50898673
19 Aug 2023 10:49:06.971    19 Aug 2023 10:52:04.863      177.89149167
20 Aug 2023 05:07:35.218    20 Aug 2023 05:09:10.325      95.107096725
20 Aug 2023 09:59:32.667    20 Aug 2023 10:01:57.428      144.76107139
21 Aug 2023 04:17:05.460    21 Aug 2023 04:19:48.865      163.40501478
21 Aug 2023 10:46:37.467    21 Aug 2023 10:48:17.906      100.43909512
22 Aug 2023 03:27:04.401    22 Aug 2023 03:30:00.099      175.69740970
22 Aug 2023 09:56:10.212    22 Aug 2023 09:59:03.124      172.91188964
23 Aug 2023 02:37:34.818    23 Aug 2023 02:39:41.322      126.50367161
23 Aug 2023 09:06:12.505    23 Aug 2023 09:09:04.000      171.49497952
24 Aug 2023 03:24:09.037    24 Aug 2023 03:26:16.739      127.70239022
24 Aug 2023 08:16:33.242    24 Aug 2023 08:18:31.588      118.34550323
25 Aug 2023 02:33:38.745    25 Aug 2023 02:36:31.454      172.70880440
25 Aug 2023 09:02:53.732    25 Aug 2023 09:05:14.906      141.17379359
26 Aug 2023 01:43:34.924    26 Aug 2023 01:46:21.090      166.16571948
26 Aug 2023 08:12:29.095    26 Aug 2023 08:15:27.086      177.99076599
27 Aug 2023 00:54:19.913    27 Aug 2023 00:55:23.324      63.411049009
27 Aug 2023 02:31:04.260    27 Aug 2023 02:31:52.220      47.960333177
27 Aug 2023 07:22:25.497    27 Aug 2023 07:25:03.122      157.62492204
28 Aug 2023 01:39:51.980    28 Aug 2023 01:42:22.984      151.00437639
28 Aug 2023 06:32:47.588    28 Aug 2023 06:33:58.427      70.838739874
28 Aug 2023 08:09:41.059    28 Aug 2023 08:10:15.735      34.675802663
29 Aug 2023 00:49:19.476    29 Aug 2023 00:52:15.238      175.76149731
29 Aug 2023 07:18:21.938    29 Aug 2023 07:21:06.320      164.38161253
29 Aug 2023 23:59:15.921    30 Aug 2023 00:01:39.974      144.05302416
30 Aug 2023 06:27:54.675    30 Aug 2023 06:30:49.791      175.11633950
31 Aug 2023 00:45:44.875    31 Aug 2023 00:47:32.620      107.74494843
31 Aug 2023 05:37:46.105    31 Aug 2023 05:39:59.230      133.12441843
31 Aug 2023 23:54:42.181    31 Aug 2023 23:57:28.864      166.68239749
01 Sep 2023 06:23:54.936    01 Sep 2023 06:25:57.213      122.27715435
01 Sep 2023 23:04:08.000    01 Sep 2023 23:06:57.962      169.96195531
02 Sep 2023 05:32:58.143    02 Sep 2023 05:35:53.579      175.43663675
02 Sep 2023 22:14:13.680    02 Sep 2023 22:15:48.615      94.935062353
03 Sep 2023 04:42:26.455    03 Sep 2023 04:45:09.263      162.80804118
03 Sep 2023 22:59:41.140    03 Sep 2023 23:02:02.543      141.40343018
04 Sep 2023 03:52:17.475    04 Sep 2023 03:53:46.663      89.187266445
04 Sep 2023 22:08:39.034    04 Sep 2023 22:11:32.993      173.95826611
05 Sep 2023 04:37:36.098    05 Sep 2023 04:40:13.390      157.29219338
05 Sep 2023 21:18:05.797    05 Sep 2023 21:20:35.901      150.10441930
06 Sep 2023 03:46:40.364    06 Sep 2023 03:49:35.650      175.28602243
06 Sep 2023 22:04:17.878    06 Sep 2023 22:05:52.863      94.984926295
07 Sep 2023 02:56:04.349    07 Sep 2023 02:58:22.198      137.84859505
07 Sep 2023 21:12:44.607    07 Sep 2023 21:15:27.377      162.77011454
08 Sep 2023 03:41:52.529    08 Sep 2023 03:43:43.642      111.11348748
08 Sep 2023 20:21:42.070    08 Sep 2023 20:24:32.216      170.14624004
09 Sep 2023 02:50:25.583    09 Sep 2023 02:53:18.690      173.10693831
09 Sep 2023 19:31:18.353    09 Sep 2023 19:32:59.289      100.93623712
10 Sep 2023 01:59:26.507    10 Sep 2023 02:02:09.408      162.90144492
10 Sep 2023 20:16:22.409    10 Sep 2023 20:18:40.287      137.87884094
11 Sep 2023 01:08:50.409    11 Sep 2023 01:10:20.588      90.178388986
11 Sep 2023 19:24:51.962    11 Sep 2023 19:27:44.636      172.67378555
12 Sep 2023 01:53:41.207    12 Sep 2023 01:56:16.278      155.07085850
12 Sep 2023 18:33:51.161    12 Sep 2023 18:36:20.042      148.88106796
13 Sep 2023 01:02:17.566    13 Sep 2023 01:05:11.253      173.68781426
13 Sep 2023 19:19:32.369    13 Sep 2023 19:21:07.527      95.157267759
14 Sep 2023 00:11:14.242    14 Sep 2023 00:13:28.660      134.41746865
14 Sep 2023 18:27:30.636    14 Sep 2023 18:30:13.440      162.80389560
15 Sep 2023 00:56:28.763    15 Sep 2023 00:58:22.845      114.08147863
15 Sep 2023 17:36:00.231    15 Sep 2023 17:38:48.243      168.01222268
16 Sep 2023 00:04:34.238    16 Sep 2023 00:07:26.651      172.41298934
16 Sep 2023 16:45:12.674    16 Sep 2023 16:46:40.353      87.679152202
16 Sep 2023 23:13:06.957    16 Sep 2023 23:15:45.267      158.30961048
17 Sep 2023 17:29:34.581    17 Sep 2023 17:31:56.797      142.21612505
17 Sep 2023 22:22:05.971    17 Sep 2023 22:23:19.506      73.535093875
18 Sep 2023 16:37:35.813    18 Sep 2023 16:40:28.189      172.37656012
18 Sep 2023 23:06:14.135    18 Sep 2023 23:08:53.089      158.95477301
19 Sep 2023 15:46:08.547    19 Sep 2023 15:48:27.810      139.26308396
19 Sep 2023 22:14:21.904    19 Sep 2023 22:17:12.041      170.13695310
20 Sep 2023 16:31:01.638    20 Sep 2023 16:32:51.272      109.63463812
20 Sep 2023 21:22:50.470    20 Sep 2023 21:24:51.349      120.87902650
21 Sep 2023 15:38:32.769    21 Sep 2023 15:41:19.512      166.74260041
21 Sep 2023 22:07:16.189    21 Sep 2023 22:09:26.759      130.56975044
22 Sep 2023 14:46:34.610    22 Sep 2023 14:49:16.372      161.76245681
22 Sep 2023 21:14:55.394    22 Sep 2023 21:17:47.895      172.50124575
23 Sep 2023 13:55:47.643    23 Sep 2023 13:56:01.317      13.673912769
23 Sep 2023 15:31:55.447    23 Sep 2023 15:32:47.976      52.529907692
23 Sep 2023 20:22:58.701    23 Sep 2023 20:25:25.433      146.73177239
24 Sep 2023 14:38:47.485    24 Sep 2023 14:41:20.838      153.35317048
24 Sep 2023 21:07:44.773    24 Sep 2023 21:08:58.987      74.213756458
25 Sep 2023 13:46:20.715    25 Sep 2023 13:49:11.489      170.77319361
25 Sep 2023 20:14:44.875    25 Sep 2023 20:17:31.321      166.44633900
26 Sep 2023 12:54:31.619    26 Sep 2023 12:56:23.553      111.93409162
26 Sep 2023 19:22:23.447    26 Sep 2023 19:25:05.179      161.73155807
27 Sep 2023 13:38:17.471    27 Sep 2023 13:40:30.558      133.08713206
27 Sep 2023 18:30:26.500    27 Sep 2023 18:31:54.447      87.947627285
28 Sep 2023 12:45:22.432    28 Sep 2023 12:48:13.843      171.41083757
28 Sep 2023 19:13:48.718    28 Sep 2023 19:16:20.848      152.13076305
29 Sep 2023 11:52:59.747    29 Sep 2023 11:55:23.740      143.99231267
29 Sep 2023 18:21:01.627    29 Sep 2023 18:23:50.838      169.21032616
30 Sep 2023 12:37:01.495    30 Sep 2023 12:38:46.760      105.26427892
30 Sep 2023 17:28:36.881    30 Sep 2023 17:30:37.896      121.01561328
01 Oct 2023 11:43:37.005    01 Oct 2023 11:46:23.319      166.31369130
01 Oct 2023 18:12:06.274    01 Oct 2023 18:14:14.853      128.57958886
02 Oct 2023 10:50:45.361    02 Oct 2023 10:53:25.901      160.54044322
02 Oct 2023 17:18:51.322    02 Oct 2023 17:21:42.224      170.90175262
03 Oct 2023 11:35:00.976    03 Oct 2023 11:36:05.511      64.534502733
03 Oct 2023 16:26:01.866    03 Oct 2023 16:28:23.084      141.21807644
04 Oct 2023 10:41:02.407    04 Oct 2023 10:43:39.530      157.12232846
04 Oct 2023 17:09:38.669    04 Oct 2023 17:11:10.307      91.637853824
05 Oct 2023 09:47:43.703    05 Oct 2023 09:50:32.418      168.71515213
05 Oct 2023 16:15:50.984    05 Oct 2023 16:18:38.955      167.97099221
06 Oct 2023 08:55:10.866    06 Oct 2023 08:56:38.282      87.416232750
06 Oct 2023 15:22:37.628    06 Oct 2023 15:25:11.803      154.17511960
07 Oct 2023 09:37:36.781    07 Oct 2023 09:40:01.759      144.97729149
07 Oct 2023 14:29:58.172    07 Oct 2023 14:30:49.208      51.035813754
08 Oct 2023 08:43:51.803    08 Oct 2023 08:46:43.518      171.71422307
08 Oct 2023 15:11:58.956    08 Oct 2023 15:14:40.314      161.35758134
09 Oct 2023 07:50:44.854    09 Oct 2023 07:52:45.929      121.07445739
09 Oct 2023 14:18:21.657    09 Oct 2023 14:21:03.916      162.25858354
10 Oct 2023 08:33:18.048    10 Oct 2023 08:35:28.802      130.75376140
10 Oct 2023 13:25:10.491    10 Oct 2023 13:26:39.176      88.684333081
11 Oct 2023 07:39:06.922    11 Oct 2023 07:41:58.363      171.44101588
11 Oct 2023 14:07:13.151    11 Oct 2023 14:09:45.105      151.95444007
12 Oct 2023 06:45:31.203    12 Oct 2023 06:47:50.921      139.71770299
12 Oct 2023 13:13:11.418    12 Oct 2023 13:15:58.317      166.89911799
13 Oct 2023 07:28:03.692    13 Oct 2023 07:29:58.909      115.21752061
13 Oct 2023 12:19:34.348    13 Oct 2023 12:21:23.904      109.55636550
14 Oct 2023 06:33:26.112    14 Oct 2023 06:36:15.337      169.22481795
14 Oct 2023 13:01:30.928    14 Oct 2023 13:03:51.669      140.74101266
15 Oct 2023 05:39:23.749    15 Oct 2023 05:41:54.597      150.84819167
15 Oct 2023 12:07:04.086    15 Oct 2023 12:09:53.235      169.14881441
16 Oct 2023 06:21:50.756    16 Oct 2023 06:23:29.923      99.166951049
16 Oct 2023 11:13:02.664    16 Oct 2023 11:15:05.617      122.95231980
17 Oct 2023 05:26:46.225    17 Oct 2023 05:29:32.317      166.09254673
17 Oct 2023 11:54:49.198    17 Oct 2023 11:56:58.098      128.89987259
18 Oct 2023 04:32:18.331    18 Oct 2023 04:34:55.766      157.43453602
18 Oct 2023 10:59:56.680    18 Oct 2023 11:02:46.545      169.86518016
19 Oct 2023 05:14:36.038    19 Oct 2023 05:15:59.649      83.610790456
19 Oct 2023 10:05:31.507    19 Oct 2023 10:07:43.108      131.60109103
20 Oct 2023 04:19:04.186    20 Oct 2023 04:21:47.062      162.87538013
20 Oct 2023 10:47:04.712    20 Oct 2023 10:49:02.615      117.90393546
21 Oct 2023 03:24:11.585    21 Oct 2023 03:26:52.653      161.06791471
21 Oct 2023 09:51:46.408    21 Oct 2023 09:54:36.169      169.76100117
22 Oct 2023 04:06:16.343    22 Oct 2023 04:07:26.379      70.035887661
22 Oct 2023 08:56:57.917    22 Oct 2023 08:59:14.705      136.78860281
23 Oct 2023 03:10:17.390    23 Oct 2023 03:12:57.623      160.23246265
23 Oct 2023 09:38:14.475    23 Oct 2023 09:40:03.965      109.48977212
24 Oct 2023 02:15:00.975    24 Oct 2023 02:17:43.660      162.68524337
24 Oct 2023 08:42:31.066    24 Oct 2023 08:45:20.455      169.38913919
25 Oct 2023 02:56:48.718    25 Oct 2023 02:57:49.413      60.694390477
25 Oct 2023 07:47:19.849    25 Oct 2023 07:49:39.047      139.19810462
26 Oct 2023 02:00:24.035    26 Oct 2023 02:03:02.666      158.63085603
26 Oct 2023 08:28:16.221    26 Oct 2023 08:30:01.556      105.33494339
27 Oct 2023 01:04:44.946    27 Oct 2023 01:07:27.747      162.80054210
27 Oct 2023 07:32:09.306    27 Oct 2023 07:34:58.403      169.09674299
28 Oct 2023 01:46:10.851    28 Oct 2023 01:47:09.036      58.185197250
28 Oct 2023 06:36:36.227    28 Oct 2023 06:38:55.368      139.14177697
29 Oct 2023 00:49:23.250    29 Oct 2023 00:52:01.560      158.31048838
29 Oct 2023 07:17:08.819    29 Oct 2023 07:18:55.210      106.39087177
29 Oct 2023 23:53:22.910    29 Oct 2023 23:56:04.493      161.58297679
30 Oct 2023 06:20:40.651    30 Oct 2023 06:23:29.634      168.98301366
31 Oct 2023 00:34:22.014    31 Oct 2023 00:35:25.434      63.420286286
31 Oct 2023 05:24:46.823    31 Oct 2023 05:27:03.441      136.61781818
31 Oct 2023 23:37:14.958    31 Oct 2023 23:39:54.215      159.25720265
01 Nov 2023 06:04:52.371    01 Nov 2023 06:06:44.726      112.35495661
01 Nov 2023 22:40:55.015    01 Nov 2023 22:43:33.881      158.86597785
02 Nov 2023 05:08:05.260    02 Nov 2023 05:10:54.144      168.88399709
02 Nov 2023 23:21:23.297    02 Nov 2023 23:22:37.879      74.581291806
03 Nov 2023 04:11:51.972    03 Nov 2023 04:14:03.261      131.28968971
03 Nov 2023 22:23:59.535    03 Nov 2023 22:26:40.738      161.20288933
04 Nov 2023 04:51:27.759    04 Nov 2023 04:53:29.625      121.86610498
04 Nov 2023 21:27:21.790    04 Nov 2023 21:29:55.886      154.09686521
05 Nov 2023 03:54:23.532    05 Nov 2023 03:57:11.916      168.38337933
05 Nov 2023 22:07:16.218    05 Nov 2023 22:08:45.295      89.077320916
06 Nov 2023 02:57:52.196    06 Nov 2023 02:59:54.581      122.38506528
06 Nov 2023 21:09:37.379    06 Nov 2023 21:12:21.019      163.63965883
07 Nov 2023 03:36:55.894    07 Nov 2023 03:39:09.065      133.17094553
07 Nov 2023 20:12:43.811    07 Nov 2023 20:15:10.001      146.18947059
08 Nov 2023 02:39:35.696    08 Nov 2023 02:42:22.528      166.83175169
08 Nov 2023 20:52:01.618    08 Nov 2023 20:53:46.603      104.98492580
09 Nov 2023 01:42:48.003    09 Nov 2023 01:44:36.383      108.37984930
09 Nov 2023 19:54:08.586    09 Nov 2023 19:56:54.404      165.81806936
10 Nov 2023 02:21:17.159    10 Nov 2023 02:23:41.766      144.60733021
10 Nov 2023 18:57:01.630    10 Nov 2023 18:59:14.759      133.12893900
11 Nov 2023 01:23:41.552    11 Nov 2023 01:26:24.898      163.34665694
11 Nov 2023 19:35:39.492    11 Nov 2023 19:37:40.504      121.01174179
12 Nov 2023 00:26:40.272    12 Nov 2023 00:28:06.121      85.848686623
12 Nov 2023 18:37:32.851    12 Nov 2023 18:40:19.552      166.70118542
13 Nov 2023 01:04:31.254    13 Nov 2023 01:07:05.977      154.72321655
13 Nov 2023 17:40:16.381    13 Nov 2023 17:42:07.071      110.69016103
14 Nov 2023 00:06:40.489    14 Nov 2023 00:09:17.246      156.75738218
14 Nov 2023 18:18:09.227    14 Nov 2023 18:20:25.361      136.13376139
14 Nov 2023 23:09:34.648    14 Nov 2023 23:10:15.487      40.839405509
15 Nov 2023 17:19:49.684    15 Nov 2023 17:22:34.516      164.83221611
15 Nov 2023 23:46:37.393    15 Nov 2023 23:49:19.592      162.19814206
16 Nov 2023 16:22:33.749    16 Nov 2023 16:23:38.689      64.940156147
16 Nov 2023 22:48:31.813    16 Nov 2023 22:50:57.240      145.42744244
17 Nov 2023 16:59:30.037    17 Nov 2023 17:01:59.348      149.31158106
17 Nov 2023 23:26:38.075    17 Nov 2023 23:28:05.642      87.566840148
18 Nov 2023 16:00:58.906    18 Nov 2023 16:03:36.923      158.01699583
18 Nov 2023 22:27:34.730    18 Nov 2023 22:30:20.437      165.70727737
19 Nov 2023 16:39:16.126    19 Nov 2023 16:40:21.586      65.459059551
19 Nov 2023 21:29:15.395    19 Nov 2023 21:31:22.121      126.72596440
20 Nov 2023 15:39:41.484    20 Nov 2023 15:42:20.746      159.26206772
20 Nov 2023 22:06:30.820    20 Nov 2023 22:08:37.428      126.60843555
21 Nov 2023 14:41:01.489    21 Nov 2023 14:43:23.967      142.47813674
21 Nov 2023 21:07:22.838    21 Nov 2023 21:10:06.597      163.75894285
22 Nov 2023 15:18:21.517    22 Nov 2023 15:20:09.302      107.78426154
22 Nov 2023 20:08:53.145    22 Nov 2023 20:10:28.029      94.884509733
23 Nov 2023 14:18:43.985    23 Nov 2023 14:21:28.182      164.19666616
23 Nov 2023 20:45:19.246    23 Nov 2023 20:47:49.197      149.95087583
24 Nov 2023 13:20:01.510    24 Nov 2023 13:21:51.110      109.60038370
24 Nov 2023 19:46:02.174    24 Nov 2023 19:48:36.593      154.41926464
25 Nov 2023 13:56:22.535    25 Nov 2023 13:58:38.279      135.74416602
26 Nov 2023 12:56:39.234    26 Nov 2023 12:59:20.592      161.35774290
26 Nov 2023 19:23:01.163    26 Nov 2023 19:25:43.126      161.96313340
27 Nov 2023 13:34:24.884    27 Nov 2023 13:34:26.385      1.5010558418
27 Nov 2023 18:23:34.531    27 Nov 2023 18:25:49.100      134.56959988
28 Nov 2023 12:33:17.549    28 Nov 2023 12:35:51.796      154.24698918
28 Nov 2023 18:59:52.747    28 Nov 2023 19:01:45.972      113.22517324
29 Nov 2023 11:33:30.749    29 Nov 2023 11:35:56.502      145.75283389
29 Nov 2023 17:59:37.027    29 Nov 2023 18:02:20.027      162.99949590
30 Nov 2023 12:09:50.175    30 Nov 2023 12:11:31.250      101.07470700
30 Nov 2023 17:00:04.469    30 Nov 2023 17:01:41.154      96.684909216
01 Dec 2023 11:09:08.176    01 Dec 2023 11:11:50.913      162.73694892
01 Dec 2023 17:35:26.268    01 Dec 2023 17:37:54.572      148.30343267
02 Dec 2023 10:09:26.440    02 Dec 2023 10:11:10.817      104.37711943
02 Dec 2023 16:35:08.532    02 Dec 2023 16:37:40.110      151.57797611
03 Dec 2023 10:44:38.264    03 Dec 2023 10:46:56.036      137.77248559
03 Dec 2023 17:11:27.054    03 Dec 2023 17:12:09.075      42.021608097
04 Dec 2023 09:43:57.544    04 Dec 2023 09:46:35.390      157.84535027
04 Dec 2023 16:10:00.694    04 Dec 2023 16:12:42.710      162.01511147
05 Dec 2023 10:20:09.458    05 Dec 2023 10:21:03.527      54.068814742
05 Dec 2023 15:09:38.749    05 Dec 2023 15:11:41.998      123.24833320
06 Dec 2023 09:18:27.437    06 Dec 2023 09:21:05.034      157.59649985
06 Dec 2023 15:44:40.814    06 Dec 2023 15:46:49.886      129.07180858
07 Dec 2023 08:17:51.181    07 Dec 2023 08:20:01.951      130.77043206
07 Dec 2023 14:43:34.582    07 Dec 2023 14:46:12.903      158.32055201
08 Dec 2023 08:52:47.481    08 Dec 2023 08:54:48.218      120.73701831
08 Dec 2023 13:43:18.463    08 Dec 2023 13:44:15.670      57.207144191
09 Dec 2023 07:51:18.270    09 Dec 2023 07:53:59.188      160.91805288
09 Dec 2023 14:17:14.937    09 Dec 2023 14:19:52.296      157.35949902
10 Dec 2023 06:51:18.279    10 Dec 2023 06:51:42.455      24.175780721
10 Dec 2023 13:16:08.883    10 Dec 2023 13:18:24.012      135.12856448
11 Dec 2023 07:24:36.713    11 Dec 2023 07:27:08.316      151.60290400
11 Dec 2023 13:50:44.544    11 Dec 2023 13:52:35.556      111.01208049
12 Dec 2023 06:23:14.419    12 Dec 2023 06:25:35.030      140.61053504
12 Dec 2023 12:48:52.212    12 Dec 2023 12:51:32.346      160.13368276
13 Dec 2023 06:57:43.386    13 Dec 2023 06:59:31.613      108.22706051
13 Dec 2023 11:47:50.135    13 Dec 2023 11:49:07.974      77.839065262
14 Dec 2023 05:55:29.828    14 Dec 2023 05:58:10.567      160.73944102
14 Dec 2023 12:21:17.722    14 Dec 2023 12:23:51.108      153.38623049
15 Dec 2023 04:54:34.185    15 Dec 2023 04:55:33.301      59.116158367
15 Dec 2023 11:19:30.746    15 Dec 2023 11:21:49.627      138.88070636
16 Dec 2023 05:27:32.222    16 Dec 2023 05:30:00.371      148.14909773
16 Dec 2023 11:53:31.645    16 Dec 2023 11:55:13.746      102.10076604
17 Dec 2023 04:25:29.158    17 Dec 2023 04:27:51.313      142.15493737
17 Dec 2023 10:50:57.392    17 Dec 2023 10:53:37.161      159.76827380
18 Dec 2023 04:59:20.158    18 Dec 2023 05:01:04.841      104.68286423
18 Dec 2023 09:49:16.573    18 Dec 2023 09:50:35.329      78.756438894
19 Dec 2023 03:56:26.896    19 Dec 2023 03:59:06.615      159.71937922
19 Dec 2023 10:22:03.815    19 Dec 2023 10:24:36.502      152.68724294
20 Dec 2023 02:54:57.226    20 Dec 2023 02:55:46.687      49.460321898
20 Dec 2023 09:19:39.083    20 Dec 2023 09:21:55.443      136.36015230
21 Dec 2023 03:27:08.551    21 Dec 2023 03:29:37.260      148.70827168
21 Dec 2023 09:52:55.043    21 Dec 2023 09:54:42.500      107.45671730
22 Dec 2023 02:24:29.971    22 Dec 2023 02:26:46.912      136.94104585
22 Dec 2023 08:49:45.262    22 Dec 2023 08:52:23.132      157.87027313
23 Dec 2023 02:57:32.595    23 Dec 2023 02:59:24.137      111.54207692
23 Dec 2023 07:47:32.997    23 Dec 2023 07:48:33.738      60.741088260
24 Dec 2023 01:54:05.348    24 Dec 2023 01:56:43.206      157.85806866
24 Dec 2023 08:19:29.229    24 Dec 2023 08:22:04.397      155.16827172
25 Dec 2023 07:16:30.821    25 Dec 2023 07:18:37.349      126.52810318
26 Dec 2023 01:23:23.074    26 Dec 2023 01:25:55.583      152.50928581
26 Dec 2023 07:48:53.559    26 Dec 2023 07:50:57.025      123.46619123
27 Dec 2023 00:20:16.122    27 Dec 2023 00:22:17.899      121.77748019
27 Dec 2023 06:45:14.237    27 Dec 2023 06:47:47.110      152.87307036
28 Dec 2023 00:52:20.639    28 Dec 2023 00:54:26.412      125.77238032
28 Dec 2023 23:48:25.646    28 Dec 2023 23:50:58.183      152.53702122
29 Dec 2023 06:13:34.441    29 Dec 2023 06:16:12.294      157.85351791
30 Dec 2023 00:21:03.689    30 Dec 2023 00:22:09.948      66.258188314
30 Dec 2023 05:10:08.005    30 Dec 2023 05:11:52.512      104.50738175
30 Dec 2023 23:16:17.872    30 Dec 2023 23:18:54.269      156.39725507
31 Dec 2023 05:41:31.628    31 Dec 2023 05:43:53.214      141.58616782
31 Dec 2023 22:12:55.581    31 Dec 2023 22:14:18.323      82.741465245
01 Jan 2024 04:37:26.904    01 Jan 2024 04:39:47.680      140.77629021
01 Jan 2024 22:43:48.448    01 Jan 2024 22:46:10.366      141.91752572
02 Jan 2024 05:09:12.285    02 Jan 2024 05:10:43.791      91.506517469
02 Jan 2024 21:39:32.742    02 Jan 2024 21:41:49.893      137.15122689
03 Jan 2024 04:04:22.968    03 Jan 2024 04:06:58.665      155.69711836
03 Jan 2024 22:10:57.375    03 Jan 2024 22:12:46.116      108.74157002
04 Jan 2024 03:00:41.997    04 Jan 2024 03:01:31.486      49.489453202
04 Jan 2024 21:05:57.388    04 Jan 2024 21:08:32.016      154.62775400
05 Jan 2024 03:30:53.805    05 Jan 2024 03:33:27.863      154.05757190
05 Jan 2024 21:37:58.398    05 Jan 2024 21:38:27.117      28.719444468
06 Jan 2024 02:26:27.570    06 Jan 2024 02:28:21.043      113.47355470
06 Jan 2024 20:31:59.866    06 Jan 2024 20:34:33.593      153.72716796
07 Jan 2024 02:57:00.064    07 Jan 2024 02:59:14.331      134.26628447
07 Jan 2024 19:27:36.280    07 Jan 2024 19:29:08.770      92.489885702
08 Jan 2024 01:51:57.121    08 Jan 2024 01:54:18.818      141.69727697
08 Jan 2024 19:57:37.420    08 Jan 2024 19:59:56.277      138.85703073
09 Jan 2024 02:22:47.669    09 Jan 2024 02:24:11.520      83.851310739
09 Jan 2024 18:52:25.336    09 Jan 2024 18:54:41.565      136.22910512
10 Jan 2024 01:17:00.337    10 Jan 2024 01:19:34.287      153.94967826
10 Jan 2024 19:22:49.596    10 Jan 2024 19:24:39.100      109.50439246
11 Jan 2024 00:12:30.417    11 Jan 2024 00:13:04.354      33.937101555
11 Jan 2024 18:16:55.268    11 Jan 2024 18:19:27.774      152.50527067
12 Jan 2024 00:41:35.044    12 Jan 2024 00:44:08.525      153.48084028
12 Jan 2024 18:47:42.238    12 Jan 2024 18:48:34.536      52.298086567
12 Jan 2024 23:36:16.928    12 Jan 2024 23:37:59.164      102.23593146
13 Jan 2024 17:40:58.739    13 Jan 2024 17:43:33.009      154.27039512
14 Jan 2024 00:05:40.720    14 Jan 2024 00:08:00.767      140.04677766
14 Jan 2024 16:35:55.610    14 Jan 2024 16:36:54.472      58.861596405
14 Jan 2024 22:59:46.886    14 Jan 2024 23:01:58.583      131.69700054
15 Jan 2024 17:04:32.818    15 Jan 2024 17:06:58.363      145.54518062
15 Jan 2024 23:29:18.785    15 Jan 2024 23:31:08.223      109.43788018
16 Jan 2024 15:58:35.579    16 Jan 2024 16:00:33.789      118.21003103
16 Jan 2024 22:22:47.111    16 Jan 2024 22:25:14.368      147.25699460
17 Jan 2024 16:27:35.971    17 Jan 2024 16:29:43.536      127.56501135
17 Jan 2024 22:52:44.609    17 Jan 2024 22:53:14.170      29.561240156
18 Jan 2024 15:20:57.352    18 Jan 2024 15:23:19.660      142.30790752
18 Jan 2024 21:45:14.812    18 Jan 2024 21:47:47.971      153.15872311
19 Jan 2024 15:50:08.002    19 Jan 2024 15:51:46.992      98.990584700
19 Jan 2024 20:39:18.729    19 Jan 2024 20:40:09.964      51.235259150
20 Jan 2024 14:42:49.541    20 Jan 2024 14:45:21.849      152.30817609
20 Jan 2024 21:07:08.668    20 Jan 2024 21:09:39.524      150.85683708
21 Jan 2024 15:12:13.707    21 Jan 2024 15:13:02.384      48.677064164
21 Jan 2024 20:00:31.682    21 Jan 2024 20:02:10.473      98.790696112
22 Jan 2024 14:04:08.740    22 Jan 2024 14:06:42.326      153.58626649
22 Jan 2024 20:28:28.041    22 Jan 2024 20:30:48.658      140.61654046
23 Jan 2024 12:58:08.074    23 Jan 2024 12:58:21.131      13.057185325
23 Jan 2024 19:21:17.215    23 Jan 2024 19:23:20.765      123.55007826
24 Jan 2024 13:24:53.081    24 Jan 2024 13:27:21.696      148.61521369
24 Jan 2024 19:49:12.971    24 Jan 2024 19:51:14.484      121.51343012
25 Jan 2024 12:17:47.682    25 Jan 2024 12:19:23.574      95.891289879
25 Jan 2024 18:41:28.415    25 Jan 2024 18:43:46.933      138.51740712
26 Jan 2024 12:45:01.322    26 Jan 2024 12:47:20.059      138.73699926
26 Jan 2024 19:09:24.976    26 Jan 2024 19:10:54.722      89.745960420
27 Jan 2024 11:37:15.900    27 Jan 2024 11:39:20.099      124.19906828
27 Jan 2024 18:01:03.191    27 Jan 2024 18:03:30.298      147.10698661
28 Jan 2024 12:04:32.560    28 Jan 2024 12:06:37.200      124.64007122
28 Jan 2024 18:29:26.251    28 Jan 2024 18:29:26.403      0.1521962928
29 Jan 2024 10:56:11.390    29 Jan 2024 10:58:30.910      139.51917855
29 Jan 2024 17:20:00.303    29 Jan 2024 17:22:31.266      150.96304156
30 Jan 2024 11:23:26.139    30 Jan 2024 11:25:12.563      106.42411251
31 Jan 2024 10:14:30.563    31 Jan 2024 10:16:58.310      147.74676230
31 Jan 2024 16:38:18.722    31 Jan 2024 16:40:49.845      151.12339512
01 Feb 2024 10:41:41.778    01 Feb 2024 10:43:05.003      83.225219348
01 Feb 2024 15:30:11.576    01 Feb 2024 15:31:18.375      66.799412307
02 Feb 2024 09:32:11.333    02 Feb 2024 09:34:42.822      151.48887575
02 Feb 2024 15:55:57.387    02 Feb 2024 15:58:25.762      148.37492884
03 Feb 2024 09:59:20.722    03 Feb 2024 10:00:11.526      50.803547236
03 Feb 2024 14:47:17.624    03 Feb 2024 14:48:49.334      91.709586675
04 Feb 2024 08:49:11.973    04 Feb 2024 08:51:44.248      152.27487625
04 Feb 2024 15:12:55.089    04 Feb 2024 15:15:18.496      143.40656411
05 Feb 2024 14:03:45.564    05 Feb 2024 14:05:32.896      107.33168152
06 Feb 2024 08:05:30.783    06 Feb 2024 08:08:01.936      151.15285049
06 Feb 2024 14:29:10.399    06 Feb 2024 14:31:27.294      136.89502794
07 Feb 2024 13:19:32.102    07 Feb 2024 13:21:29.940      117.83778967
08 Feb 2024 07:21:05.976    08 Feb 2024 07:23:34.893      148.91684339
08 Feb 2024 13:44:41.641    08 Feb 2024 13:46:51.204      129.56296055
09 Feb 2024 06:11:54.270    09 Feb 2024 06:12:43.578      49.308002391
09 Feb 2024 12:34:34.965    09 Feb 2024 12:36:39.892      124.92716701
10 Feb 2024 06:35:55.653    10 Feb 2024 06:38:21.860      146.20637856
10 Feb 2024 12:59:26.899    10 Feb 2024 13:01:29.115      122.21608360
11 Feb 2024 05:26:08.093    11 Feb 2024 05:27:19.569      71.476366546
11 Feb 2024 11:48:52.091    11 Feb 2024 11:51:01.616      129.52555442
12 Feb 2024 05:49:57.833    12 Feb 2024 05:52:21.382      143.54836863
12 Feb 2024 12:13:24.067    12 Feb 2024 12:15:19.813      115.74658917
13 Feb 2024 04:39:39.465    13 Feb 2024 04:41:01.773      82.307582942
13 Feb 2024 11:02:21.486    13 Feb 2024 11:04:33.680      132.19332090
14 Feb 2024 05:03:10.512    14 Feb 2024 05:05:31.878      141.36596558
14 Feb 2024 11:26:30.948    14 Feb 2024 11:28:22.018      111.06926749
15 Feb 2024 03:52:24.048    15 Feb 2024 03:53:50.938      86.890464253
15 Feb 2024 10:15:01.226    15 Feb 2024 10:17:14.484      133.25811062
16 Feb 2024 04:15:31.740    16 Feb 2024 04:17:51.705      139.96520969
16 Feb 2024 10:38:45.402    16 Feb 2024 10:40:34.359      108.95666422
17 Feb 2024 03:04:19.402    17 Feb 2024 03:05:45.966      86.564475903
17 Feb 2024 09:26:49.493    17 Feb 2024 09:29:02.348      132.85528421
18 Feb 2024 03:26:59.693    18 Feb 2024 03:29:19.201      139.50851300
18 Feb 2024 09:50:05.514    18 Feb 2024 09:51:55.322      109.80793198
19 Feb 2024 02:15:23.890    19 Feb 2024 02:16:45.105      81.214390195
19 Feb 2024 08:37:44.626    19 Feb 2024 08:39:55.554      130.92754246
20 Feb 2024 02:37:32.725    20 Feb 2024 02:39:52.711      139.98604323
20 Feb 2024 09:00:29.708    20 Feb 2024 09:02:23.192      113.48400966
21 Feb 2024 01:25:36.791    21 Feb 2024 01:26:45.882      69.091797341
21 Feb 2024 07:47:45.150    21 Feb 2024 07:49:52.348      127.19817568
22 Feb 2024 01:47:09.385    22 Feb 2024 01:49:30.579      141.19389978
22 Feb 2024 08:09:56.735    22 Feb 2024 08:11:56.069      119.33373401
23 Feb 2024 00:35:00.131    23 Feb 2024 00:35:43.253      43.121505319
23 Feb 2024 06:56:49.784    23 Feb 2024 06:58:50.892      121.10854711
24 Feb 2024 00:55:48.394    24 Feb 2024 00:58:11.113      142.71897009
24 Feb 2024 07:18:25.543    24 Feb 2024 07:20:31.920      126.37676467
25 Feb 2024 06:04:57.470    25 Feb 2024 06:06:49.140      111.67084653
26 Feb 2024 00:03:28.597    26 Feb 2024 00:05:52.516      143.91831922
26 Feb 2024 06:25:55.117    26 Feb 2024 06:28:08.612      133.49547512
27 Feb 2024 05:12:07.495    27 Feb 2024 05:13:44.549      97.054378898
27 Feb 2024 23:10:08.900    27 Feb 2024 23:12:32.768      143.86751106
28 Feb 2024 05:32:24.333    28 Feb 2024 05:34:43.870      139.53676138
28 Feb 2024 23:31:35.483    28 Feb 2024 23:32:02.939      27.456026268
29 Feb 2024 04:18:20.211    29 Feb 2024 04:19:33.165      72.954519989
29 Feb 2024 22:15:48.237    29 Feb 2024 22:18:09.467      141.22942250
01 Mar 2024 04:37:51.856    01 Mar 2024 04:40:15.170      143.31345835
01 Mar 2024 22:36:15.764    01 Mar 2024 22:37:29.330      73.565545958
02 Mar 2024 21:20:25.635    02 Mar 2024 21:22:39.559      133.92383039
03 Mar 2024 03:42:16.080    03 Mar 2024 03:44:39.600      143.51971666
03 Mar 2024 21:39:59.761    03 Mar 2024 21:41:40.531      100.77001266
04 Mar 2024 20:24:00.613    04 Mar 2024 20:25:58.779      118.16597324
05 Mar 2024 02:45:35.139    05 Mar 2024 02:47:53.673      138.53356387
05 Mar 2024 20:42:39.146    05 Mar 2024 20:44:39.680      120.53377465
06 Mar 2024 03:04:39.983    06 Mar 2024 03:05:52.847      72.864123993
06 Mar 2024 19:26:35.271    06 Mar 2024 19:27:59.444      84.173056693
07 Mar 2024 01:47:47.090    07 Mar 2024 01:49:53.026      125.93673299
07 Mar 2024 19:44:10.471    07 Mar 2024 19:46:24.177      133.70578063
08 Mar 2024 02:05:49.880    08 Mar 2024 02:07:43.473      113.59227577
09 Mar 2024 00:48:50.709    09 Mar 2024 00:50:31.588      100.87940373
09 Mar 2024 18:44:31.012    09 Mar 2024 18:46:49.831      138.81899596
10 Mar 2024 01:05:53.873    10 Mar 2024 01:08:07.363      133.48997072
10 Mar 2024 19:02:31.011    10 Mar 2024 19:03:02.945      31.934568600
10 Mar 2024 23:48:52.343    10 Mar 2024 23:49:34.757      42.413420998
11 Mar 2024 17:43:38.880    11 Mar 2024 17:45:50.832      131.95198652
12 Mar 2024 00:04:44.476    12 Mar 2024 00:07:03.285      138.80881509
12 Mar 2024 18:00:16.514    12 Mar 2024 18:01:54.868      98.353338672
13 Mar 2024 16:41:35.177    13 Mar 2024 16:43:17.731      102.55379303
13 Mar 2024 23:02:17.387    13 Mar 2024 23:04:26.023      128.63567857
14 Mar 2024 16:56:55.430    14 Mar 2024 16:59:02.432      127.00130803
14 Mar 2024 23:17:57.319    14 Mar 2024 23:19:38.447      101.12864957
15 Mar 2024 21:58:31.201    15 Mar 2024 22:00:06.828      95.626524417
16 Mar 2024 15:52:14.284    16 Mar 2024 15:54:30.123      135.83925358
16 Mar 2024 22:12:54.715    16 Mar 2024 22:15:06.523      131.80803079
17 Mar 2024 16:07:16.828    17 Mar 2024 16:08:16.117      59.289170906
18 Mar 2024 14:46:11.907    18 Mar 2024 14:48:09.901      117.99397658
18 Mar 2024 21:06:29.217    18 Mar 2024 21:08:40.915      131.69767004
19 Mar 2024 14:59:40.929    19 Mar 2024 15:01:38.331      117.40239045
19 Mar 2024 21:20:14.789    19 Mar 2024 21:21:33.785      78.995864710
20 Mar 2024 19:58:36.431    20 Mar 2024 20:00:14.753      98.321927595
21 Mar 2024 13:50:43.772    21 Mar 2024 13:52:57.501      133.72954364
21 Mar 2024 20:10:49.857    21 Mar 2024 20:12:58.555      128.69798712
22 Mar 2024 14:03:27.558    22 Mar 2024 14:04:31.118      63.559997419
23 Mar 2024 12:40:21.346    23 Mar 2024 12:42:08.004      106.65859531
23 Mar 2024 18:59:59.212    23 Mar 2024 19:02:04.039      124.82665395
24 Mar 2024 12:51:18.186    24 Mar 2024 12:53:22.089      123.90300552
24 Mar 2024 19:11:08.136    24 Mar 2024 19:12:49.460      101.32398396
25 Mar 2024 17:47:40.616    25 Mar 2024 17:48:39.632      59.015930397
26 Mar 2024 11:37:42.838    26 Mar 2024 11:39:48.517      125.67890523
26 Mar 2024 17:57:04.780    26 Mar 2024 17:59:14.707      129.92707829
27 Mar 2024 11:47:25.265    27 Mar 2024 11:49:10.822      105.55704004
27 Mar 2024 18:07:02.993    27 Mar 2024 18:07:55.552      52.559652238
28 Mar 2024 16:41:26.832    28 Mar 2024 16:42:55.760      88.927146024
29 Mar 2024 10:30:25.977    29 Mar 2024 10:32:34.746      128.76920952
29 Mar 2024 16:49:24.475    29 Mar 2024 16:51:31.922      127.44642481
30 Mar 2024 10:38:34.936    30 Mar 2024 10:40:05.290      90.353539225
31 Mar 2024 09:12:18.516    31 Mar 2024 09:12:43.717      25.201471697
31 Mar 2024 15:30:17.689    31 Mar 2024 15:31:52.395      94.705921132
01 Apr 2024 09:17:57.978    01 Apr 2024 09:20:05.192      127.21345641
01 Apr 2024 15:36:27.715    01 Apr 2024 15:38:32.872      125.15701608
02 Apr 2024 09:24:12.819    02 Apr 2024 09:25:41.565      88.746423495
03 Apr 2024 14:13:38.067    03 Apr 2024 14:15:01.732      83.664827957
04 Apr 2024 07:59:44.354    04 Apr 2024 08:01:46.983      122.62916160
04 Apr 2024 14:17:39.510    04 Apr 2024 14:19:43.943      124.43363877
05 Apr 2024 08:03:41.671    05 Apr 2024 08:05:23.579      101.90832436
05 Apr 2024 14:21:40.599    05 Apr 2024 14:22:45.743      65.144606167
06 Apr 2024 12:51:00.114    06 Apr 2024 12:51:29.184      29.069613875
07 Apr 2024 06:35:07.078    07 Apr 2024 06:36:51.706      104.62840365
07 Apr 2024 12:52:18.850    07 Apr 2024 12:54:15.505      116.65460451
08 Apr 2024 06:36:20.269    08 Apr 2024 06:38:17.626      117.35728628
08 Apr 2024 12:53:29.083    08 Apr 2024 12:55:17.158      108.07593857
09 Apr 2024 06:37:22.536    09 Apr 2024 06:38:12.247      49.710203300
10 Apr 2024 11:19:39.225    10 Apr 2024 11:20:51.749      72.524347622
11 Apr 2024 05:01:18.589    11 Apr 2024 05:03:07.588      108.99823071
11 Apr 2024 11:17:33.461    11 Apr 2024 11:19:29.569      116.10844473
12 Apr 2024 04:58:43.347    12 Apr 2024 05:00:33.112      109.76545208
12 Apr 2024 11:14:47.797    12 Apr 2024 11:16:29.097      101.30033693
13 Apr 2024 04:55:31.434    13 Apr 2024 04:56:21.273      49.838155042
15 Apr 2024 03:10:52.794    15 Apr 2024 03:12:06.718      73.924112460
15 Apr 2024 09:25:40.640    15 Apr 2024 09:27:15.375      94.734708569
16 Apr 2024 03:02:53.025    16 Apr 2024 03:04:39.113      106.08781662
16 Apr 2024 09:17:27.342    16 Apr 2024 09:19:17.160      109.81800598
17 Apr 2024 02:53:37.879    17 Apr 2024 02:55:16.978      99.098919018
17 Apr 2024 09:07:48.500    17 Apr 2024 09:09:23.164      94.664016122
18 Apr 2024 02:42:50.429    18 Apr 2024 02:43:54.267      63.838219608
18 Apr 2024 08:56:43.963    18 Apr 2024 08:57:10.870      26.906804997
