02 Jul 2023 00:39:32.760    02 Jul 2023 00:40:58.676      85.915869044
02 Jul 2023 05:31:51.422    02 Jul 2023 05:34:22.503      151.08111984
02 Jul 2023 23:51:27.089    02 Jul 2023 23:54:05.172      158.08257395
03 Jul 2023 04:45:04.187    03 Jul 2023 04:46:09.069      64.882513694
03 Jul 2023 06:21:57.149    03 Jul 2023 06:22:51.066      53.917370306
03 Jul 2023 23:03:48.467    03 Jul 2023 23:06:48.093      179.62533549
04 Jul 2023 05:33:41.003    04 Jul 2023 05:36:23.311      162.30861250
04 Jul 2023 22:16:33.181    04 Jul 2023 22:19:11.310      158.12827282
05 Jul 2023 04:46:06.301    05 Jul 2023 04:49:04.377      178.07580626
05 Jul 2023 23:06:31.418    05 Jul 2023 23:07:55.800      84.381674300
06 Jul 2023 03:58:47.765    06 Jul 2023 04:01:19.518      151.75254737
06 Jul 2023 22:18:18.807    06 Jul 2023 22:20:56.670      157.86230288
07 Jul 2023 03:11:53.790    07 Jul 2023 03:13:00.472      66.682768275
07 Jul 2023 04:48:48.844    07 Jul 2023 04:49:39.285      50.440894871
07 Jul 2023 21:30:33.756    07 Jul 2023 21:33:33.596      179.84024927
08 Jul 2023 04:00:24.997    08 Jul 2023 04:03:07.030      162.03316357
08 Jul 2023 20:43:12.231    08 Jul 2023 20:45:50.757      158.52558163
09 Jul 2023 03:12:44.045    09 Jul 2023 03:15:42.154      178.10944745
09 Jul 2023 21:33:03.880    09 Jul 2023 21:34:28.879      84.998959349
10 Jul 2023 02:25:19.443    10 Jul 2023 02:27:51.159      151.71648780
10 Jul 2023 20:44:45.233    10 Jul 2023 20:47:23.578      158.34491788
11 Jul 2023 01:38:19.741    11 Jul 2023 01:39:25.607      65.866221394
11 Jul 2023 03:15:12.980    11 Jul 2023 03:16:05.618      52.638267784
11 Jul 2023 19:56:54.235    11 Jul 2023 19:59:54.314      180.07972694
12 Jul 2023 02:26:43.894    12 Jul 2023 02:29:26.434      162.53996843
12 Jul 2023 19:09:27.018    12 Jul 2023 19:12:05.081      158.06254382
13 Jul 2023 01:38:57.079    13 Jul 2023 01:41:55.177      178.09813722
13 Jul 2023 19:59:10.472    13 Jul 2023 20:00:38.119      87.646171718
14 Jul 2023 00:51:26.685    14 Jul 2023 00:53:57.642      150.95684126
14 Jul 2023 19:10:46.500    14 Jul 2023 19:13:25.982      159.48254279
15 Jul 2023 00:04:22.185    15 Jul 2023 00:05:24.453      62.267623306
15 Jul 2023 01:41:09.971    15 Jul 2023 01:42:09.752      59.781119053
15 Jul 2023 18:22:49.883    15 Jul 2023 18:25:50.181      180.29877342
16 Jul 2023 00:52:37.615    16 Jul 2023 00:55:21.392      163.77650304
16 Jul 2023 17:35:17.395    16 Jul 2023 17:37:54.052      156.65679682
17 Jul 2023 00:04:45.182    17 Jul 2023 00:07:43.174      177.99129310
17 Jul 2023 18:24:50.970    17 Jul 2023 18:26:23.081      92.111664056
17 Jul 2023 23:17:09.155    17 Jul 2023 23:19:38.551      149.39583836
18 Jul 2023 17:36:22.189    18 Jul 2023 17:39:03.409      161.22057620
18 Jul 2023 22:30:00.992    18 Jul 2023 22:30:56.169      55.176956928
19 Jul 2023 00:06:40.142    19 Jul 2023 00:07:50.379      70.236464613
19 Jul 2023 16:48:20.193    19 Jul 2023 16:51:20.623      180.43014026
19 Jul 2023 23:18:05.626    19 Jul 2023 23:20:51.277      165.65124455
20 Jul 2023 16:00:42.828    20 Jul 2023 16:03:16.980      154.15221249
20 Jul 2023 22:30:07.744    20 Jul 2023 22:33:05.456      177.71168193
21 Jul 2023 16:50:04.840    21 Jul 2023 16:51:42.959      98.118585243
21 Jul 2023 21:42:26.221    21 Jul 2023 21:44:53.136      146.91486176
22 Jul 2023 16:01:31.652    22 Jul 2023 16:04:15.130      163.47776729
22 Jul 2023 20:55:16.445    22 Jul 2023 20:55:59.052      42.606590339
22 Jul 2023 22:31:43.507    22 Jul 2023 22:33:06.072      82.564278832
23 Jul 2023 15:13:24.537    23 Jul 2023 15:16:24.906      180.36913520
23 Jul 2023 21:43:07.295    23 Jul 2023 21:45:55.327      168.03184797
24 Jul 2023 14:25:42.793    24 Jul 2023 14:28:13.095      150.30247351
24 Jul 2023 20:55:04.157    24 Jul 2023 20:58:01.304      177.14728679
25 Jul 2023 15:14:51.657    25 Jul 2023 15:16:36.984      105.32651361
25 Jul 2023 20:07:17.362    25 Jul 2023 20:09:40.700      143.33751808
26 Jul 2023 14:26:14.429    26 Jul 2023 14:29:00.561      166.13160241
26 Jul 2023 19:20:13.946    26 Jul 2023 19:20:26.628      12.681469135
26 Jul 2023 20:56:20.040    26 Jul 2023 20:57:55.801      95.760810049
27 Jul 2023 13:38:02.554    27 Jul 2023 13:41:02.520      179.96652630
27 Jul 2023 20:07:42.273    27 Jul 2023 20:10:33.005      170.73189713
28 Jul 2023 12:50:17.129    28 Jul 2023 12:52:41.870      144.74062101
28 Jul 2023 19:19:34.145    28 Jul 2023 19:22:30.294      176.14840711
29 Jul 2023 13:39:11.352    29 Jul 2023 13:41:04.742      113.39001028
29 Jul 2023 18:31:42.440    29 Jul 2023 18:34:00.872      138.43188216
30 Jul 2023 12:50:30.457    30 Jul 2023 12:53:19.478      169.02168650
30 Jul 2023 19:20:29.940    30 Jul 2023 19:22:19.062      109.12186084
31 Jul 2023 12:02:14.293    31 Jul 2023 12:05:13.318      179.02477799
31 Jul 2023 18:31:50.614    31 Jul 2023 18:34:44.130      173.51594459
01 Aug 2023 11:14:26.146    01 Aug 2023 11:16:43.073      136.92654809
01 Aug 2023 17:43:37.820    01 Aug 2023 17:46:32.349      174.52985606
02 Aug 2023 12:03:04.209    02 Aug 2023 12:05:06.179      121.97014662
02 Aug 2023 16:55:41.699    02 Aug 2023 16:57:53.585      131.88559839
03 Aug 2023 11:14:20.008    03 Aug 2023 11:17:11.957      171.94857228
03 Aug 2023 17:44:13.600    03 Aug 2023 17:46:15.744      122.14432403
04 Aug 2023 10:26:00.096    04 Aug 2023 10:28:57.388      177.29196860
04 Aug 2023 16:55:32.627    04 Aug 2023 16:58:28.746      176.11895080
05 Aug 2023 09:38:10.499    05 Aug 2023 09:40:16.517      126.01795646
05 Aug 2023 16:07:15.485    05 Aug 2023 16:10:07.551      172.06602066
06 Aug 2023 10:26:30.618    06 Aug 2023 10:28:41.375      130.75670785
06 Aug 2023 15:19:15.556    06 Aug 2023 15:21:18.795      123.23916036
07 Aug 2023 09:37:43.409    07 Aug 2023 09:40:38.094      174.68515470
07 Aug 2023 16:07:31.353    07 Aug 2023 16:09:45.814      134.46182254
08 Aug 2023 08:49:20.288    08 Aug 2023 08:52:14.733      174.44551609
08 Aug 2023 15:18:48.548    08 Aug 2023 15:21:46.807      178.25842132
09 Aug 2023 08:01:31.037    09 Aug 2023 08:03:21.544      110.50677588
09 Aug 2023 14:30:27.297    09 Aug 2023 14:33:15.782      168.48503494
10 Aug 2023 08:49:30.707    10 Aug 2023 08:51:50.199      139.49187283
10 Aug 2023 13:42:24.295    10 Aug 2023 13:44:16.071      111.77583238
11 Aug 2023 08:00:40.678    11 Aug 2023 08:03:37.657      176.97967147
11 Aug 2023 14:30:23.150    11 Aug 2023 14:32:48.935      145.78471016
12 Aug 2023 07:12:14.858    12 Aug 2023 07:15:04.917      170.05887850
12 Aug 2023 13:41:38.213    12 Aug 2023 13:44:37.852      179.63859482
13 Aug 2023 06:24:29.081    13 Aug 2023 06:25:56.135      87.054485630
13 Aug 2023 08:01:37.509    13 Aug 2023 08:02:17.364      39.854789420
13 Aug 2023 12:53:12.985    13 Aug 2023 12:55:56.436      163.45044082
14 Aug 2023 07:12:04.107    14 Aug 2023 07:14:32.048      147.94107545
14 Aug 2023 12:05:08.000    14 Aug 2023 12:06:44.197      96.196711867
15 Aug 2023 06:23:11.353    15 Aug 2023 06:26:09.893      178.54003001
15 Aug 2023 12:52:48.413    15 Aug 2023 12:55:24.287      155.87427272
16 Aug 2023 05:34:43.377    16 Aug 2023 05:37:26.916      163.53947864
16 Aug 2023 12:04:00.961    16 Aug 2023 12:07:00.905      179.94474635
17 Aug 2023 04:47:10.552    17 Aug 2023 04:47:52.705      42.152732599
17 Aug 2023 06:23:37.149    17 Aug 2023 06:24:50.153      73.004625645
17 Aug 2023 11:15:31.843    17 Aug 2023 11:18:08.367      156.52411391
18 Aug 2023 05:34:09.996    18 Aug 2023 05:36:45.870      155.87454240
18 Aug 2023 10:27:27.142    18 Aug 2023 10:28:40.667      73.524729442
18 Aug 2023 12:04:22.655    18 Aug 2023 12:05:09.586      46.930872859
19 Aug 2023 04:45:14.597    19 Aug 2023 04:48:13.608      179.01082181
19 Aug 2023 11:14:46.161    19 Aug 2023 11:17:30.657      164.49532489
20 Aug 2023 03:56:45.214    20 Aug 2023 03:59:19.220      154.00534552
20 Aug 2023 10:25:55.816    20 Aug 2023 10:28:54.640      178.82423970
21 Aug 2023 04:45:13.043    21 Aug 2023 04:46:49.305      96.262770589
21 Aug 2023 09:37:22.984    21 Aug 2023 09:39:50.096      147.11241054
22 Aug 2023 03:55:47.376    22 Aug 2023 03:58:30.412      163.03634474
22 Aug 2023 08:49:27.463    22 Aug 2023 08:49:57.353      29.889985104
22 Aug 2023 10:25:40.379    22 Aug 2023 10:27:13.120      92.741374543
23 Aug 2023 03:06:49.527    23 Aug 2023 03:09:47.462      177.93502392
23 Aug 2023 09:36:15.354    23 Aug 2023 09:39:06.738      171.38387917
24 Aug 2023 02:18:20.005    24 Aug 2023 02:20:40.036      140.03102261
24 Aug 2023 08:47:21.843    24 Aug 2023 08:50:17.712      175.86892135
25 Aug 2023 03:06:21.275    25 Aug 2023 03:08:16.681      115.40627311
25 Aug 2023 07:58:45.754    25 Aug 2023 08:01:00.106      134.35193044
26 Aug 2023 02:16:55.451    26 Aug 2023 02:19:44.560      169.10950255
26 Aug 2023 08:46:36.797    26 Aug 2023 08:48:37.789      120.99283253
27 Aug 2023 01:27:55.579    27 Aug 2023 01:30:50.281      174.70183983
27 Aug 2023 07:57:15.221    27 Aug 2023 08:00:11.459      176.23849539
28 Aug 2023 00:39:28.307    28 Aug 2023 00:41:27.252      118.94496060
28 Aug 2023 07:08:18.457    28 Aug 2023 07:11:09.049      170.59196283
29 Aug 2023 01:27:00.487    29 Aug 2023 01:29:12.290      131.80295764
29 Aug 2023 06:19:40.141    29 Aug 2023 06:21:36.948      116.80759698
30 Aug 2023 00:37:33.841    30 Aug 2023 00:40:27.535      173.69399099
30 Aug 2023 07:07:06.253    30 Aug 2023 07:09:27.982      141.72931826
30 Aug 2023 23:48:32.683    30 Aug 2023 23:51:21.140      168.45706726
31 Aug 2023 06:17:45.380    31 Aug 2023 06:20:44.095      178.71539147
31 Aug 2023 23:00:13.186    31 Aug 2023 23:01:36.949      83.762724919
01 Sep 2023 00:37:24.388    01 Sep 2023 00:37:50.256      25.867813826
01 Sep 2023 05:28:45.474    01 Sep 2023 05:31:27.858      162.38411909
01 Sep 2023 23:47:10.098    01 Sep 2023 23:49:35.965      145.86741943
02 Sep 2023 04:40:07.211    02 Sep 2023 04:41:38.663      91.451542662
02 Sep 2023 22:57:42.454    02 Sep 2023 23:00:38.732      176.27808668
03 Sep 2023 05:27:07.203    03 Sep 2023 05:29:44.384      157.18084284
03 Sep 2023 22:08:41.135    03 Sep 2023 22:11:19.042      157.90662031
04 Sep 2023 04:37:45.586    04 Sep 2023 04:40:44.005      178.41898925
04 Sep 2023 22:56:49.561    04 Sep 2023 22:58:09.641      80.079707026
05 Sep 2023 03:48:42.829    05 Sep 2023 03:51:13.238      150.40896937
05 Sep 2023 22:06:49.656    05 Sep 2023 22:09:27.270      157.61377306
06 Sep 2023 03:00:12.257    06 Sep 2023 03:00:58.865      46.607924940
06 Sep 2023 04:36:38.717    06 Sep 2023 04:37:54.792      76.074195094
06 Sep 2023 21:17:21.095    06 Sep 2023 21:20:17.270      176.17526273
07 Sep 2023 03:46:38.605    07 Sep 2023 03:49:26.724      168.11859815
07 Sep 2023 20:28:21.394    07 Sep 2023 20:30:42.213      140.81944339
08 Sep 2023 02:57:15.297    08 Sep 2023 03:00:10.165      174.86846064
08 Sep 2023 21:15:54.828    08 Sep 2023 21:17:45.012      110.18405459
09 Sep 2023 02:08:10.262    09 Sep 2023 02:10:23.575      133.31328628
09 Sep 2023 20:25:58.296    09 Sep 2023 20:28:45.103      166.80712807
10 Sep 2023 02:55:30.348    10 Sep 2023 02:57:29.232      118.88494093
10 Sep 2023 19:36:29.085    10 Sep 2023 19:39:21.486      172.40097220
11 Sep 2023 02:05:39.026    11 Sep 2023 02:08:33.789      174.76309289
11 Sep 2023 18:47:34.522    11 Sep 2023 18:49:26.837      112.31547408
12 Sep 2023 01:16:13.300    12 Sep 2023 01:19:00.709      167.40869674
12 Sep 2023 19:34:30.231    12 Sep 2023 19:36:43.101      132.86999508
13 Sep 2023 00:27:07.378    13 Sep 2023 00:28:55.742      108.36382048
13 Sep 2023 18:44:34.428    13 Sep 2023 18:47:27.398      172.96942365
14 Sep 2023 01:13:55.601    14 Sep 2023 01:16:20.773      145.17201169
14 Sep 2023 17:55:05.162    14 Sep 2023 17:57:48.558      163.39569138
15 Sep 2023 00:24:06.309    15 Sep 2023 00:27:03.311      177.00221208
15 Sep 2023 17:06:28.402    15 Sep 2023 17:07:20.543      52.140830015
15 Sep 2023 18:43:06.624    15 Sep 2023 18:43:58.996      52.372046385
15 Sep 2023 23:34:37.678    15 Sep 2023 23:37:12.713      155.03452295
16 Sep 2023 17:52:32.075    16 Sep 2023 17:55:02.705      150.62936082
16 Sep 2023 22:45:35.888    16 Sep 2023 22:46:42.817      66.928136651
17 Sep 2023 00:22:31.204    17 Sep 2023 00:23:02.784      31.579827075
17 Sep 2023 17:02:35.854    17 Sep 2023 17:05:31.139      175.28479784
17 Sep 2023 23:31:48.034    17 Sep 2023 23:34:30.327      162.29341286
18 Sep 2023 16:13:08.000    18 Sep 2023 16:15:34.344      146.34374203
18 Sep 2023 22:41:57.763    18 Sep 2023 22:44:52.184      174.42138533
19 Sep 2023 17:00:22.882    19 Sep 2023 17:02:03.686      100.80397980
19 Sep 2023 21:52:26.325    19 Sep 2023 21:54:42.297      135.97173312
20 Sep 2023 16:09:57.215    20 Sep 2023 16:12:41.172      163.95741290
20 Sep 2023 22:39:24.241    20 Sep 2023 22:41:13.663      109.42199940
21 Sep 2023 15:20:00.345    21 Sep 2023 15:22:52.738      172.39371546
21 Sep 2023 21:49:03.623    21 Sep 2023 21:51:55.812      172.18891592
22 Sep 2023 14:30:37.954    22 Sep 2023 14:32:32.728      114.77397984
22 Sep 2023 20:59:10.760    22 Sep 2023 21:01:56.976      166.21515721
23 Sep 2023 15:17:07.047    23 Sep 2023 15:19:18.229      131.18115203
23 Sep 2023 20:09:38.245    23 Sep 2023 20:11:24.523      106.27850000
24 Sep 2023 14:26:43.139    24 Sep 2023 14:29:35.585      172.44560332
24 Sep 2023 20:55:56.476    24 Sep 2023 20:58:20.415      143.93907292
25 Sep 2023 13:36:46.509    25 Sep 2023 13:39:28.434      161.92495341
25 Sep 2023 20:05:39.437    25 Sep 2023 20:08:34.723      175.28609536
26 Sep 2023 12:47:50.514    26 Sep 2023 12:48:23.399      32.885162858
26 Sep 2023 14:24:12.830    26 Sep 2023 14:25:12.613      59.783540899
26 Sep 2023 19:15:43.467    26 Sep 2023 19:18:14.395      150.92729882
27 Sep 2023 13:33:12.134    27 Sep 2023 13:35:45.167      153.03339878
27 Sep 2023 18:26:19.395    27 Sep 2023 18:27:08.677      49.282263557
27 Sep 2023 20:02:53.644    27 Sep 2023 20:03:47.266      53.622302064
28 Sep 2023 12:42:48.424    28 Sep 2023 12:45:43.335      174.91068909
28 Sep 2023 19:11:51.374    28 Sep 2023 19:14:35.242      163.86824527
29 Sep 2023 11:52:54.913    29 Sep 2023 11:55:14.048      139.13498009
29 Sep 2023 18:21:33.692    29 Sep 2023 18:24:24.901      171.20865507
30 Sep 2023 12:39:27.683    30 Sep 2023 12:41:19.667      111.98362741
30 Sep 2023 17:31:35.598    30 Sep 2023 17:33:41.184      125.58653529
01 Oct 2023 11:48:36.043    01 Oct 2023 11:51:23.835      167.79185480
01 Oct 2023 18:17:50.316    01 Oct 2023 18:19:54.041      123.72474005
02 Oct 2023 10:58:12.989    02 Oct 2023 11:01:02.106      169.11713365
02 Oct 2023 17:27:05.505    02 Oct 2023 17:29:58.766      173.26032619
03 Oct 2023 10:08:31.615    03 Oct 2023 10:10:01.442      89.826540160
03 Oct 2023 16:36:45.710    03 Oct 2023 16:39:24.500      158.78999537
04 Oct 2023 10:54:07.412    04 Oct 2023 10:56:30.889      143.47693312
04 Oct 2023 15:46:50.509    04 Oct 2023 15:48:11.702      81.193413644
05 Oct 2023 10:03:18.254    05 Oct 2023 10:06:13.129      174.87442269
05 Oct 2023 16:32:19.360    05 Oct 2023 16:34:55.031      155.67056764
06 Oct 2023 09:12:58.270    06 Oct 2023 09:15:28.933      150.66341409
06 Oct 2023 15:41:37.391    06 Oct 2023 15:44:30.370      172.97880803
07 Oct 2023 09:59:24.497    07 Oct 2023 10:01:01.455      96.958473476
07 Oct 2023 14:51:15.761    07 Oct 2023 14:53:31.147      135.38588367
08 Oct 2023 09:08:06.349    08 Oct 2023 09:10:50.370      164.02081529
08 Oct 2023 15:37:20.564    08 Oct 2023 15:39:07.718      107.15404311
09 Oct 2023 08:17:18.950    09 Oct 2023 08:20:11.143      172.19317277
09 Oct 2023 14:46:08.777    09 Oct 2023 14:48:59.819      171.04151468
10 Oct 2023 07:27:09.235    10 Oct 2023 07:28:56.904      107.66984071
10 Oct 2023 13:55:26.032    10 Oct 2023 13:58:08.396      162.36407891
11 Oct 2023 08:12:35.844    11 Oct 2023 08:14:53.715      137.87065004
11 Oct 2023 13:05:06.293    11 Oct 2023 13:06:39.453      93.160490028
12 Oct 2023 07:21:22.776    12 Oct 2023 07:24:17.291      174.51463945
12 Oct 2023 13:50:20.273    12 Oct 2023 13:52:51.158      150.88576188
13 Oct 2023 06:30:39.005    13 Oct 2023 06:33:14.113      155.10840230
13 Oct 2023 12:59:14.924    13 Oct 2023 13:02:08.348      173.42359100
14 Oct 2023 07:16:48.684    14 Oct 2023 07:18:19.159      90.474824526
14 Oct 2023 12:08:30.702    14 Oct 2023 12:10:49.508      138.80519159
15 Oct 2023 06:25:06.091    15 Oct 2023 06:27:48.874      162.78294073
15 Oct 2023 12:54:16.791    15 Oct 2023 12:55:57.747      100.95564143
16 Oct 2023 05:33:55.699    16 Oct 2023 05:36:48.710      173.01094708
16 Oct 2023 12:02:40.574    16 Oct 2023 12:05:30.988      170.41369483
17 Oct 2023 04:43:22.916    17 Oct 2023 04:45:13.319      110.40335064
17 Oct 2023 11:11:35.247    17 Oct 2023 11:14:18.097      162.85054372
18 Oct 2023 05:28:27.217    18 Oct 2023 05:30:45.134      137.91628259
18 Oct 2023 10:20:53.220    18 Oct 2023 10:22:26.618      93.398789631
19 Oct 2023 04:36:51.403    19 Oct 2023 04:39:46.200      174.79657849
19 Oct 2023 11:05:42.817    19 Oct 2023 11:08:14.500      151.68377889
20 Oct 2023 03:45:45.603    20 Oct 2023 03:48:19.514      153.91045409
20 Oct 2023 10:14:14.954    20 Oct 2023 10:17:08.222      173.26813079
21 Oct 2023 04:31:27.194    21 Oct 2023 04:33:02.689      95.495025557
21 Oct 2023 09:23:08.537    21 Oct 2023 09:25:24.853      136.31663010
22 Oct 2023 03:39:22.919    22 Oct 2023 03:42:07.608      164.68941834
22 Oct 2023 10:08:24.901    22 Oct 2023 10:10:13.968      109.06659937
23 Oct 2023 02:47:50.792    23 Oct 2023 02:50:42.536      171.74433883
23 Oct 2023 09:16:28.182    23 Oct 2023 09:19:20.006      171.82484219
24 Oct 2023 01:56:59.984    24 Oct 2023 01:58:38.403      98.418852990
24 Oct 2023 08:25:00.818    24 Oct 2023 08:27:40.831      160.01215040
25 Oct 2023 02:41:28.888    25 Oct 2023 02:43:52.757      143.86812524
25 Oct 2023 07:33:59.335    25 Oct 2023 07:35:19.952      80.616902991
26 Oct 2023 01:49:32.094    26 Oct 2023 01:52:27.530      175.43525782
26 Oct 2023 08:18:14.870    26 Oct 2023 08:20:52.767      157.89738083
27 Oct 2023 00:58:07.105    27 Oct 2023 01:00:32.847      145.74184050
27 Oct 2023 07:26:26.133    27 Oct 2023 07:29:17.985      171.85241666
28 Oct 2023 01:43:09.918    28 Oct 2023 01:45:00.342      110.42403518
28 Oct 2023 06:34:59.146    28 Oct 2023 06:37:05.463      126.31670415
29 Oct 2023 00:50:47.312    29 Oct 2023 00:53:36.299      168.98695305
29 Oct 2023 07:19:37.025    29 Oct 2023 07:21:44.607      127.58161569
29 Oct 2023 23:58:56.276    30 Oct 2023 00:01:43.151      166.87431489
30 Oct 2023 06:27:23.604    30 Oct 2023 06:30:17.527      173.92232534
30 Oct 2023 23:08:00.316    30 Oct 2023 23:08:57.507      57.191612944
31 Oct 2023 00:44:33.860    31 Oct 2023 00:45:22.602      48.742464068
31 Oct 2023 05:35:36.240    31 Oct 2023 05:38:08.357      152.11674494
31 Oct 2023 23:51:35.800    31 Oct 2023 23:54:09.799      153.99868536
01 Nov 2023 04:44:25.894    01 Nov 2023 04:45:06.276      40.381912014
01 Nov 2023 06:20:45.104    01 Nov 2023 06:21:45.854      60.749849654
01 Nov 2023 22:59:21.337    01 Nov 2023 23:02:15.972      174.63549507
02 Nov 2023 05:27:53.531    02 Nov 2023 05:30:40.082      166.55148359
02 Nov 2023 22:07:43.159    02 Nov 2023 22:09:48.665      125.50586157
03 Nov 2023 04:35:46.618    03 Nov 2023 04:38:33.636      167.01854502
03 Nov 2023 22:51:57.945    03 Nov 2023 22:54:08.332      130.38697885
04 Nov 2023 03:44:03.326    04 Nov 2023 03:45:47.577      104.25114320
04 Nov 2023 21:59:20.493    04 Nov 2023 22:02:13.832      173.33891219
05 Nov 2023 04:27:57.037    05 Nov 2023 04:30:25.637      148.60058738
05 Nov 2023 21:07:15.428    05 Nov 2023 21:09:49.919      154.49141177
06 Nov 2023 03:35:29.479    06 Nov 2023 03:38:23.161      173.68110475
06 Nov 2023 21:51:55.608    06 Nov 2023 21:53:30.664      95.056073251
07 Nov 2023 02:43:25.485    07 Nov 2023 02:45:41.040      135.55491753
07 Nov 2023 20:58:53.012    07 Nov 2023 21:01:38.007      164.99445277
08 Nov 2023 03:27:36.652    08 Nov 2023 03:29:32.534      115.88145692
08 Nov 2023 20:06:25.072    08 Nov 2023 20:09:13.740      168.66790052
09 Nov 2023 02:34:44.671    09 Nov 2023 02:37:37.799      173.12785168
09 Nov 2023 19:14:47.695    09 Nov 2023 19:16:02.058      74.363013217
09 Nov 2023 20:51:43.736    09 Nov 2023 20:52:02.075      18.339055439
10 Nov 2023 01:42:22.245    10 Nov 2023 01:44:57.320      155.07465990
10 Nov 2023 19:57:58.478    10 Nov 2023 20:00:28.974      150.49611151
11 Nov 2023 00:50:34.201    11 Nov 2023 00:51:26.354      52.153565059
11 Nov 2023 02:27:04.429    11 Nov 2023 02:27:49.091      44.662431884
11 Nov 2023 19:05:09.147    11 Nov 2023 19:08:02.965      173.81723294
12 Nov 2023 01:33:32.175    12 Nov 2023 01:36:17.749      165.57461489
12 Nov 2023 18:12:57.407    12 Nov 2023 18:15:02.584      125.17712857
13 Nov 2023 00:40:51.550    13 Nov 2023 00:43:38.459      166.90923662
13 Nov 2023 18:56:36.677    13 Nov 2023 18:58:46.487      129.80964405
13 Nov 2023 23:48:35.802    13 Nov 2023 23:50:17.941      102.13823535
14 Nov 2023 18:03:26.050    14 Nov 2023 18:06:18.612      172.56259531
15 Nov 2023 00:31:52.102    15 Nov 2023 00:34:22.603      150.50078609
15 Nov 2023 17:10:49.568    15 Nov 2023 17:13:19.829      150.26055247
15 Nov 2023 23:38:52.342    15 Nov 2023 23:41:45.103      172.76081359
16 Nov 2023 17:54:48.016    16 Nov 2023 17:56:29.355      101.33975535
16 Nov 2023 22:46:17.001    16 Nov 2023 22:48:26.615      129.61369265
17 Nov 2023 17:01:14.643    17 Nov 2023 17:04:01.014      166.37083555
17 Nov 2023 23:29:45.121    17 Nov 2023 23:31:51.205      126.08460516
18 Nov 2023 16:08:16.624    18 Nov 2023 16:11:00.564      163.93984579
18 Nov 2023 22:36:23.933    18 Nov 2023 22:39:17.461      173.52823016
19 Nov 2023 15:16:32.357    19 Nov 2023 15:16:49.683      17.325211549
19 Nov 2023 16:52:36.066    19 Nov 2023 16:53:33.268      57.202237635
19 Nov 2023 21:43:31.029    19 Nov 2023 21:45:58.712      147.68373866
20 Nov 2023 15:58:34.173    20 Nov 2023 16:01:10.292      156.11899453
20 Nov 2023 22:27:14.187    20 Nov 2023 22:28:40.308      86.120606668
21 Nov 2023 15:05:16.140    21 Nov 2023 15:08:06.739      170.59890964
21 Nov 2023 21:33:25.989    21 Nov 2023 21:36:15.717      169.72764067
22 Nov 2023 14:12:43.063    22 Nov 2023 14:14:21.708      98.644418805
22 Nov 2023 20:40:16.209    22 Nov 2023 20:42:55.924      159.71459085
23 Nov 2023 14:55:24.358    23 Nov 2023 14:57:46.631      142.27380585
23 Nov 2023 19:47:37.259    23 Nov 2023 19:48:48.605      71.346043877
24 Nov 2023 14:01:47.096    24 Nov 2023 14:04:39.513      172.41709594
24 Nov 2023 20:29:58.620    24 Nov 2023 20:32:40.237      161.61662363
25 Nov 2023 13:08:48.342    25 Nov 2023 13:10:57.583      129.24147297
25 Nov 2023 19:36:32.112    25 Nov 2023 19:39:19.391      167.27940536
26 Nov 2023 13:51:45.497    26 Nov 2023 13:53:50.381      124.88456232
26 Nov 2023 18:43:31.954    26 Nov 2023 18:45:15.478      103.52414679
27 Nov 2023 12:57:49.282    27 Nov 2023 13:00:39.990      170.70798544
27 Nov 2023 19:26:02.436    27 Nov 2023 19:28:31.625      149.18914157
28 Nov 2023 12:04:29.668    28 Nov 2023 12:06:56.956      147.28811618
28 Nov 2023 18:32:18.978    28 Nov 2023 18:35:10.298      171.31913463
29 Nov 2023 12:47:38.558    29 Nov 2023 12:49:21.913      103.35444877
29 Nov 2023 17:39:01.831    29 Nov 2023 17:41:05.997      124.16597464
30 Nov 2023 11:53:23.014    30 Nov 2023 11:56:09.359      166.34530040
30 Nov 2023 18:21:38.527    30 Nov 2023 18:23:50.565      132.03770762
01 Dec 2023 10:59:45.028    01 Dec 2023 11:02:23.476      158.44849023
01 Dec 2023 17:27:37.429    01 Dec 2023 17:30:29.908      172.47898708
02 Dec 2023 11:43:05.536    02 Dec 2023 11:44:20.968      75.431623205
02 Dec 2023 16:34:05.130    02 Dec 2023 16:36:23.875      138.74500125
03 Dec 2023 10:48:28.871    03 Dec 2023 10:51:08.814      159.94330585
03 Dec 2023 17:16:48.510    03 Dec 2023 17:18:37.416      108.90594438
04 Dec 2023 09:54:34.087    04 Dec 2023 09:57:19.248      165.16119962
04 Dec 2023 16:22:28.206    04 Dec 2023 16:25:19.444      171.23863127
05 Dec 2023 09:01:41.510    05 Dec 2023 09:02:32.119      50.608685589
05 Dec 2023 10:38:14.039    05 Dec 2023 10:38:41.670      27.630880417
05 Dec 2023 15:28:41.779    05 Dec 2023 15:31:11.082      149.30315976
06 Dec 2023 09:43:07.450    06 Dec 2023 09:45:39.400      151.94984281
06 Dec 2023 16:11:35.287    06 Dec 2023 16:12:51.066      75.779539556
07 Dec 2023 08:48:56.920    07 Dec 2023 08:51:45.714      168.79381263
07 Dec 2023 15:16:51.943    07 Dec 2023 15:19:39.923      167.97970394
08 Dec 2023 07:55:35.267    08 Dec 2023 07:57:08.015      92.747947318
08 Dec 2023 14:22:51.981    08 Dec 2023 14:25:28.903      156.92171096
09 Dec 2023 08:37:19.168    09 Dec 2023 08:39:41.874      142.70636486
09 Dec 2023 13:29:28.498    09 Dec 2023 13:30:25.010      56.512232136
10 Dec 2023 07:42:53.575    10 Dec 2023 07:45:43.803      170.22886192
10 Dec 2023 14:10:49.019    10 Dec 2023 14:13:32.048      163.02904557
11 Dec 2023 06:49:11.627    11 Dec 2023 06:51:07.093      115.46526777
11 Dec 2023 13:16:35.827    11 Dec 2023 13:19:18.116      162.28942475
12 Dec 2023 07:31:04.164    12 Dec 2023 07:33:16.655      132.49139751
12 Dec 2023 12:22:53.738    12 Dec 2023 12:24:16.567      82.828331727
13 Dec 2023 06:36:23.913    13 Dec 2023 06:39:14.008      170.09429623
13 Dec 2023 13:04:19.502    13 Dec 2023 13:06:56.197      156.69428530
14 Dec 2023 05:42:24.881    14 Dec 2023 05:44:35.230      130.34946774
14 Dec 2023 12:09:53.200    14 Dec 2023 12:12:39.102      165.90252626
15 Dec 2023 06:24:22.316    15 Dec 2023 06:26:23.862      121.54568327
15 Dec 2023 11:15:56.209    15 Dec 2023 11:17:36.029      99.819753156
16 Dec 2023 05:29:27.633    16 Dec 2023 05:32:16.500      168.86717083
16 Dec 2023 11:57:23.225    16 Dec 2023 11:59:52.506      149.28141406
17 Dec 2023 04:35:13.298    17 Dec 2023 04:37:33.936      140.63814440
17 Dec 2023 11:02:43.843    17 Dec 2023 11:05:31.991      168.14728375
18 Dec 2023 05:17:13.375    18 Dec 2023 05:19:03.460      110.08592880
18 Dec 2023 10:08:33.560    18 Dec 2023 10:10:25.565      112.00514679
19 Dec 2023 04:22:04.392    19 Dec 2023 04:24:51.322      166.93017388
19 Dec 2023 10:49:59.932    19 Dec 2023 10:52:21.044      141.11138916
20 Dec 2023 03:27:35.964    20 Dec 2023 03:30:03.845      147.88116957
20 Dec 2023 09:55:07.518    20 Dec 2023 09:57:56.863      169.34496132
21 Dec 2023 04:09:37.124    21 Dec 2023 04:11:15.446      98.321972543
21 Dec 2023 09:00:44.917    21 Dec 2023 09:02:45.948      121.03159432
22 Dec 2023 03:14:13.962    22 Dec 2023 03:16:58.566      164.60376859
22 Dec 2023 09:42:09.446    22 Dec 2023 09:44:21.981      132.53519348
23 Dec 2023 02:19:32.411    23 Dec 2023 02:22:05.401      152.99080540
23 Dec 2023 08:47:04.135    23 Dec 2023 08:49:53.911      169.77569066
24 Dec 2023 03:01:33.510    24 Dec 2023 03:02:59.989      86.479190143
24 Dec 2023 07:52:29.963    24 Dec 2023 07:54:37.726      127.76336479
25 Dec 2023 02:05:56.336    25 Dec 2023 02:08:38.493      162.15706025
25 Dec 2023 08:33:51.769    25 Dec 2023 08:35:55.702      123.93240746
26 Dec 2023 01:11:02.538    26 Dec 2023 01:13:39.106      156.56793094
26 Dec 2023 07:38:33.839    26 Dec 2023 07:41:23.522      169.68326101
27 Dec 2023 01:53:02.685    27 Dec 2023 01:54:17.497      74.812117161
27 Dec 2023 06:43:48.765    27 Dec 2023 06:46:01.502      132.73686144
28 Dec 2023 00:57:11.751    28 Dec 2023 00:59:51.562      159.81159797
28 Dec 2023 07:25:07.097    28 Dec 2023 07:27:02.812      115.71461828
29 Dec 2023 00:02:06.543    29 Dec 2023 00:04:45.576      159.03237266
29 Dec 2023 06:29:36.984    29 Dec 2023 06:32:26.259      169.27495220
30 Dec 2023 00:44:04.953    30 Dec 2023 00:45:08.595      63.642437942
30 Dec 2023 05:34:41.649    30 Dec 2023 05:36:57.961      136.31236885
30 Dec 2023 23:48:00.616    30 Dec 2023 23:50:38.360      157.74427301
31 Dec 2023 06:15:55.742    31 Dec 2023 06:17:44.070      108.32797559
31 Dec 2023 22:52:44.795    31 Dec 2023 22:55:25.475      160.68046176
01 Jan 2024 05:20:14.035    01 Jan 2024 05:23:02.757      168.72121948
01 Jan 2024 23:34:40.595    01 Jan 2024 23:35:34.050      53.455410933
02 Jan 2024 04:25:09.035    02 Jan 2024 04:27:27.775      138.74042064
02 Jan 2024 22:38:23.370    02 Jan 2024 22:40:59.462      156.09208988
03 Jan 2024 05:06:17.990    03 Jan 2024 05:08:00.232      102.24211479
03 Jan 2024 21:42:57.663    03 Jan 2024 21:45:39.379      161.71607240
04 Jan 2024 04:10:25.410    04 Jan 2024 04:13:13.565      168.15530586
04 Jan 2024 22:24:49.628    04 Jan 2024 22:25:34.689      45.061007410
05 Jan 2024 03:15:11.267    05 Jan 2024 03:17:31.459      140.19200199
05 Jan 2024 21:28:20.315    05 Jan 2024 21:30:55.271      154.95593977
06 Jan 2024 03:56:13.962    06 Jan 2024 03:57:51.881      97.919120674
06 Jan 2024 20:32:45.356    06 Jan 2024 20:35:27.626      162.27011379
07 Jan 2024 03:00:11.328    07 Jan 2024 03:02:59.001      167.67342291
07 Jan 2024 21:14:31.601    07 Jan 2024 21:15:11.326      39.724720095
08 Jan 2024 02:04:48.469    08 Jan 2024 02:07:09.240      140.77148424
08 Jan 2024 20:17:51.504    08 Jan 2024 20:20:25.907      154.40257386
09 Jan 2024 02:45:43.531    09 Jan 2024 02:47:19.285      95.753489190
09 Jan 2024 19:22:07.826    09 Jan 2024 19:24:50.239      162.41255166
10 Jan 2024 01:49:31.730    10 Jan 2024 01:52:19.065      167.33536085
10 Jan 2024 20:03:45.714    10 Jan 2024 20:04:24.526      38.812899264
11 Jan 2024 00:54:00.488    11 Jan 2024 00:56:21.011      140.52281234
11 Jan 2024 19:06:56.708    11 Jan 2024 19:09:31.173      154.46522031
12 Jan 2024 01:34:46.346    12 Jan 2024 01:36:22.333      95.986440300
12 Jan 2024 18:11:04.767    12 Jan 2024 18:13:46.926      162.15842409
13 Jan 2024 00:38:26.285    13 Jan 2024 00:41:13.449      167.16402395
13 Jan 2024 18:52:31.408    13 Jan 2024 18:53:14.077      42.669370375
13 Jan 2024 23:42:46.935    13 Jan 2024 23:45:06.369      139.43471254
14 Jan 2024 17:55:35.479    14 Jan 2024 17:58:10.622      155.14365061
15 Jan 2024 00:23:21.943    15 Jan 2024 00:25:00.567      98.624194111
15 Jan 2024 16:59:35.701    15 Jan 2024 17:02:17.169      161.46831110
15 Jan 2024 23:26:54.491    15 Jan 2024 23:29:41.634      167.14267179
16 Jan 2024 17:40:48.672    16 Jan 2024 17:41:38.914      50.241268426
16 Jan 2024 22:31:07.291    16 Jan 2024 22:33:24.738      137.44623447
17 Jan 2024 16:43:47.280    17 Jan 2024 16:46:23.679      156.39948864
17 Jan 2024 23:11:29.886    17 Jan 2024 23:13:13.303      103.41737748
18 Jan 2024 15:47:40.120    18 Jan 2024 15:50:20.367      160.24661246
18 Jan 2024 22:14:55.816    18 Jan 2024 22:17:43.028      167.21189541
19 Jan 2024 16:28:37.675    19 Jan 2024 16:29:37.787      60.112547991
19 Jan 2024 21:19:01.071    19 Jan 2024 21:21:15.513      134.44167768
20 Jan 2024 15:31:31.649    20 Jan 2024 15:34:09.797      158.14784530
20 Jan 2024 21:59:09.887    20 Jan 2024 22:00:59.819      109.93171519
21 Jan 2024 14:35:17.649    21 Jan 2024 14:37:55.985      158.33579313
21 Jan 2024 21:02:29.854    21 Jan 2024 21:05:17.122      167.26792414
22 Jan 2024 15:15:58.541    22 Jan 2024 15:17:09.779      71.238547855
22 Jan 2024 20:06:27.965    22 Jan 2024 20:08:38.204      130.23871346
23 Jan 2024 14:18:48.326    23 Jan 2024 14:21:28.582      160.25617757
23 Jan 2024 20:46:21.879    23 Jan 2024 20:48:19.523      117.64411270
24 Jan 2024 13:22:28.148    24 Jan 2024 13:25:03.651      155.50217876
24 Jan 2024 19:49:36.416    24 Jan 2024 19:52:23.578      167.16194346
25 Jan 2024 14:02:51.411    25 Jan 2024 14:04:14.381      82.969611953
25 Jan 2024 18:53:27.908    25 Jan 2024 18:55:32.480      124.57193389
26 Jan 2024 13:05:37.281    26 Jan 2024 13:08:19.827      162.54610713
26 Jan 2024 19:33:05.998    26 Jan 2024 19:35:12.017      126.01939448
27 Jan 2024 12:09:11.725    27 Jan 2024 12:11:43.138      151.41316548
27 Jan 2024 18:36:15.518    27 Jan 2024 18:39:02.220      166.70187850
28 Jan 2024 12:49:16.483    28 Jan 2024 12:50:51.371      94.887973240
28 Jan 2024 17:40:01.055    28 Jan 2024 17:41:58.107      117.05194067
29 Jan 2024 11:51:58.651    29 Jan 2024 11:54:43.445      164.79444788
29 Jan 2024 18:19:22.480    29 Jan 2024 18:21:37.042      134.56127570
30 Jan 2024 10:55:28.657    30 Jan 2024 10:57:54.254      145.59697387
30 Jan 2024 17:22:27.277    30 Jan 2024 17:25:12.932      165.65447578
31 Jan 2024 11:35:13.949    31 Jan 2024 11:37:00.643      106.69423213
31 Jan 2024 16:26:07.708    31 Jan 2024 16:27:54.778      107.06940800
01 Feb 2024 10:37:52.596    01 Feb 2024 10:40:39.330      166.73381733
01 Feb 2024 17:05:11.518    01 Feb 2024 17:07:34.350      142.83260355
02 Feb 2024 09:41:19.289    02 Feb 2024 09:43:36.648      137.35895340
02 Feb 2024 16:08:11.763    02 Feb 2024 16:10:55.506      163.74319535
03 Feb 2024 10:20:43.868    03 Feb 2024 10:22:42.020      118.15117844
03 Feb 2024 15:11:48.275    03 Feb 2024 15:13:21.835      93.559670309
04 Feb 2024 09:23:19.151    04 Feb 2024 09:26:07.199      168.04845765
04 Feb 2024 15:50:33.098    04 Feb 2024 15:53:03.548      150.44948633
05 Feb 2024 08:26:43.972    05 Feb 2024 08:28:49.562      125.59023360
05 Feb 2024 14:53:28.851    05 Feb 2024 14:56:09.490      160.63862055
06 Feb 2024 09:05:46.041    06 Feb 2024 09:07:55.092      129.05072139
06 Feb 2024 13:57:03.510    06 Feb 2024 13:58:17.758      74.248257314
07 Feb 2024 08:08:18.104    07 Feb 2024 08:11:06.462      168.35815095
07 Feb 2024 14:35:26.902    07 Feb 2024 14:38:03.964      157.06148181
08 Feb 2024 07:11:43.217    08 Feb 2024 07:13:31.471      108.25428169
08 Feb 2024 13:38:18.138    08 Feb 2024 13:40:54.077      155.93871080
09 Feb 2024 07:50:19.948    09 Feb 2024 07:52:39.131      139.18303574
09 Feb 2024 12:41:56.747    09 Feb 2024 12:42:37.782      41.035834677
10 Feb 2024 06:52:48.968    10 Feb 2024 06:55:36.152      167.18329563
10 Feb 2024 13:19:52.271    10 Feb 2024 13:22:34.600      162.32850024
11 Feb 2024 05:56:18.668    11 Feb 2024 05:57:39.085      80.416522489
11 Feb 2024 12:22:38.952    11 Feb 2024 12:25:08.080      149.12866362
12 Feb 2024 06:34:24.790    12 Feb 2024 06:36:53.091      148.30044913
12 Feb 2024 13:01:56.886    12 Feb 2024 13:03:07.813      70.926523546
13 Feb 2024 05:36:51.072    13 Feb 2024 05:39:34.955      163.88304667
13 Feb 2024 12:03:48.289    13 Feb 2024 12:06:34.183      165.89404398
14 Feb 2024 06:16:38.350    14 Feb 2024 06:17:13.554      35.203870735
14 Feb 2024 11:06:30.500    14 Feb 2024 11:08:49.995      139.49450873
15 Feb 2024 05:17:59.637    15 Feb 2024 05:20:35.727      156.08961083
15 Feb 2024 11:45:17.360    15 Feb 2024 11:47:02.868      105.50814075
16 Feb 2024 04:20:23.770    16 Feb 2024 04:23:01.321      157.55074471
16 Feb 2024 10:47:13.963    16 Feb 2024 10:50:01.319      167.35534288
17 Feb 2024 04:59:33.205    17 Feb 2024 05:00:51.572      78.366857045
17 Feb 2024 09:49:52.139    17 Feb 2024 09:51:58.087      125.94759814
18 Feb 2024 04:01:03.621    18 Feb 2024 04:03:45.767      162.14649120
18 Feb 2024 10:28:11.299    18 Feb 2024 10:30:20.316      129.01681303
19 Feb 2024 03:03:26.736    19 Feb 2024 03:05:53.527      146.79021448
19 Feb 2024 09:30:08.416    19 Feb 2024 09:32:54.652      166.23559281
20 Feb 2024 03:42:03.794    20 Feb 2024 03:43:48.930      105.13606503
20 Feb 2024 08:32:43.789    20 Feb 2024 08:34:30.330      106.54066759
21 Feb 2024 02:43:36.126    21 Feb 2024 02:46:22.056      165.92943468
21 Feb 2024 09:10:35.448    21 Feb 2024 09:13:01.464      146.01597902
22 Feb 2024 01:46:00.402    22 Feb 2024 01:48:09.542      129.14048906
22 Feb 2024 08:12:31.053    22 Feb 2024 08:15:12.997      161.94418170
23 Feb 2024 02:24:04.339    23 Feb 2024 02:26:10.003      125.66375557
23 Feb 2024 07:15:07.068    23 Feb 2024 07:16:23.511      76.442893432
24 Feb 2024 01:25:36.921    24 Feb 2024 01:28:23.613      166.69212762
24 Feb 2024 07:52:28.459    24 Feb 2024 07:55:06.262      157.80265003
25 Feb 2024 00:28:07.079    25 Feb 2024 00:29:46.029      98.949959921
25 Feb 2024 06:54:21.657    25 Feb 2024 06:56:55.352      153.69540453
26 Feb 2024 01:05:33.486    26 Feb 2024 01:07:55.308      141.82238850
26 Feb 2024 07:33:00.605    26 Feb 2024 07:33:45.514      44.908864552
27 Feb 2024 00:07:06.198    27 Feb 2024 00:09:49.560      163.36175976
27 Feb 2024 06:33:49.697    27 Feb 2024 06:36:34.434      164.73745450
27 Feb 2024 23:10:04.659    27 Feb 2024 23:10:24.527      19.868407119
28 Feb 2024 05:35:40.415    28 Feb 2024 05:38:00.732      140.31657478
28 Feb 2024 23:46:30.805    28 Feb 2024 23:49:04.805      154.00024974
29 Feb 2024 06:13:33.093    29 Feb 2024 06:15:18.827      105.73397437
29 Feb 2024 22:48:04.581    29 Feb 2024 22:50:38.843      154.26187324
01 Mar 2024 05:14:38.851    01 Mar 2024 05:17:25.588      166.73630675
01 Mar 2024 23:26:14.505    01 Mar 2024 23:27:37.654      83.149705525
02 Mar 2024 04:16:28.023    02 Mar 2024 04:18:27.724      119.70067781
02 Mar 2024 22:26:56.185    02 Mar 2024 22:29:38.120      161.93513365
03 Mar 2024 04:53:46.015    03 Mar 2024 04:56:02.244      136.22887441
03 Mar 2024 21:28:33.294    03 Mar 2024 21:30:49.647      136.35309264
04 Mar 2024 03:54:55.676    04 Mar 2024 03:57:39.053      163.37766254
04 Mar 2024 22:06:02.568    04 Mar 2024 22:07:58.667      116.09877966
05 Mar 2024 02:56:46.598    05 Mar 2024 02:58:13.147      86.549550353
05 Mar 2024 21:06:49.553    05 Mar 2024 21:09:34.400      164.84676667
06 Mar 2024 03:33:29.699    06 Mar 2024 03:36:04.143      154.44412526
06 Mar 2024 20:08:35.470    06 Mar 2024 20:10:17.686      102.21650640
07 Mar 2024 02:34:39.830    07 Mar 2024 02:37:13.641      153.81104745
07 Mar 2024 20:45:20.634    07 Mar 2024 20:47:39.359      138.72546303
08 Mar 2024 03:12:38.072    08 Mar 2024 03:13:14.614      36.542056245
08 Mar 2024 19:46:10.803    08 Mar 2024 19:48:52.078      161.27480606
09 Mar 2024 02:12:41.434    09 Mar 2024 02:15:25.148      163.71426426
09 Mar 2024 20:24:27.577    09 Mar 2024 20:24:42.327      14.749837643
10 Mar 2024 01:13:50.974    10 Mar 2024 01:16:07.333      136.35918387
10 Mar 2024 19:24:06.084    10 Mar 2024 19:26:40.117      154.03262672
11 Mar 2024 01:50:53.093    11 Mar 2024 01:52:45.264      112.17164031
11 Mar 2024 18:25:00.061    11 Mar 2024 18:27:28.529      148.46751094
12 Mar 2024 00:51:19.330    12 Mar 2024 00:54:04.221      164.89134498
12 Mar 2024 19:02:14.002    12 Mar 2024 19:03:47.817      93.814973754
12 Mar 2024 23:52:29.512    12 Mar 2024 23:54:16.554      107.04174520
13 Mar 2024 18:02:17.345    13 Mar 2024 18:04:59.557      162.21204260
14 Mar 2024 00:28:51.032    14 Mar 2024 00:31:15.102      144.07023262
14 Mar 2024 17:03:18.907    14 Mar 2024 17:05:19.042      120.13527614
14 Mar 2024 23:29:21.768    14 Mar 2024 23:31:59.409      157.64078113
15 Mar 2024 17:39:43.782    15 Mar 2024 17:41:51.942      128.15983279
15 Mar 2024 22:30:42.624    15 Mar 2024 22:31:30.448      47.824551689
16 Mar 2024 16:39:53.395    16 Mar 2024 16:42:35.379      161.98352248
16 Mar 2024 23:06:16.175    16 Mar 2024 23:08:56.074      159.89951806
17 Mar 2024 15:41:20.620    17 Mar 2024 15:42:06.999      46.378945909
17 Mar 2024 22:06:47.670    17 Mar 2024 22:09:08.016      140.34580038
18 Mar 2024 16:16:39.328    18 Mar 2024 16:19:09.017      149.68962291
18 Mar 2024 22:43:19.310    18 Mar 2024 22:44:59.177      99.866890360
19 Mar 2024 15:16:54.239    19 Mar 2024 15:19:24.407      150.16809390
19 Mar 2024 21:43:04.703    19 Mar 2024 21:45:48.382      163.67936831
20 Mar 2024 15:53:34.304    20 Mar 2024 15:55:01.136      86.831819743
20 Mar 2024 20:43:37.647    20 Mar 2024 20:45:25.987      108.33992672
21 Mar 2024 14:52:58.027    21 Mar 2024 14:55:38.882      160.85519175
21 Mar 2024 21:19:21.519    21 Mar 2024 21:21:43.104      141.58482944
22 Mar 2024 13:53:22.665    22 Mar 2024 13:55:21.315      118.64939259
22 Mar 2024 20:19:14.894    22 Mar 2024 20:21:50.749      155.85486023
23 Mar 2024 14:29:06.487    23 Mar 2024 14:31:15.037      128.55030480
23 Mar 2024 19:20:04.453    23 Mar 2024 19:20:37.864      33.410917211
24 Mar 2024 13:28:39.534    24 Mar 2024 13:31:19.949      160.41488283
24 Mar 2024 19:54:50.815    24 Mar 2024 19:57:30.390      159.57502368
25 Mar 2024 18:54:46.689    25 Mar 2024 18:57:01.095      134.40657050
26 Mar 2024 13:04:04.221    26 Mar 2024 13:06:36.317      152.09591424
26 Mar 2024 19:30:29.782    26 Mar 2024 19:32:20.422      110.64060732
27 Mar 2024 12:03:45.684    27 Mar 2024 12:06:09.356      143.67238884
27 Mar 2024 18:29:42.592    27 Mar 2024 18:32:24.047      161.45525042
28 Mar 2024 12:39:32.651    28 Mar 2024 12:41:13.977      101.32557002
28 Mar 2024 17:29:43.575    28 Mar 2024 17:31:14.614      91.039492493
29 Mar 2024 11:38:25.216    29 Mar 2024 11:41:06.767      161.55126113
29 Mar 2024 18:04:34.964    29 Mar 2024 18:07:03.902      148.93725542
30 Mar 2024 10:38:24.205    30 Mar 2024 10:39:59.028      94.822967495
30 Mar 2024 17:03:56.027    30 Mar 2024 17:06:23.925      147.89782860
31 Mar 2024 11:13:06.841    31 Mar 2024 11:15:26.774      139.93350535
31 Mar 2024 17:39:41.359    31 Mar 2024 17:40:43.258      61.898977461
01 Apr 2024 10:12:10.621    01 Apr 2024 10:14:45.156      154.53419436
01 Apr 2024 16:38:06.898    01 Apr 2024 16:40:48.262      161.36378793
02 Apr 2024 10:47:55.544    02 Apr 2024 10:49:03.932      68.387638894
02 Apr 2024 15:37:32.923    02 Apr 2024 15:39:27.461      114.53720721
03 Apr 2024 09:46:06.981    03 Apr 2024 09:48:45.613      158.63220887
03 Apr 2024 16:12:14.356    03 Apr 2024 16:14:29.476      135.11961607
04 Apr 2024 08:45:25.403    04 Apr 2024 08:47:26.382      120.97915106
04 Apr 2024 15:11:01.805    04 Apr 2024 15:13:36.355      154.54982745
05 Apr 2024 09:20:02.824    05 Apr 2024 09:22:10.356      127.53159176
05 Apr 2024 14:10:54.828    05 Apr 2024 14:11:12.120      17.292246467
06 Apr 2024 08:18:32.182    06 Apr 2024 08:21:11.030      158.84776575
06 Apr 2024 14:44:25.248    06 Apr 2024 14:47:03.912      158.66390378
07 Apr 2024 08:54:18.429    07 Apr 2024 08:54:38.380      19.951443910
07 Apr 2024 13:43:19.864    07 Apr 2024 13:45:26.607      126.74319550
08 Apr 2024 07:51:41.443    08 Apr 2024 07:54:16.188      154.74496130
08 Apr 2024 14:17:45.680    08 Apr 2024 14:19:47.466      121.78612906
09 Apr 2024 06:50:25.844    09 Apr 2024 06:52:38.702      132.85754418
09 Apr 2024 13:16:00.702    09 Apr 2024 13:18:38.059      157.35701462
10 Apr 2024 07:24:48.267    10 Apr 2024 07:26:45.960      117.69283565
10 Apr 2024 12:15:10.701    10 Apr 2024 12:16:07.441      56.740021775
11 Apr 2024 06:22:45.748    11 Apr 2024 06:25:25.858      160.11034691
11 Apr 2024 12:48:33.785    11 Apr 2024 12:51:09.583      155.79744126
12 Apr 2024 11:46:59.014    12 Apr 2024 11:49:11.316      132.30229360
13 Apr 2024 05:55:03.933    13 Apr 2024 05:57:35.861      151.92826968
13 Apr 2024 12:21:03.420    13 Apr 2024 12:22:56.488      113.06782271
14 Apr 2024 04:53:18.197    14 Apr 2024 04:55:35.417      137.22066268
14 Apr 2024 11:18:48.057    14 Apr 2024 11:21:26.118      158.06169956
15 Apr 2024 05:27:17.684    15 Apr 2024 05:29:10.582      112.89778459
15 Apr 2024 10:17:28.132    15 Apr 2024 10:18:33.363      65.230539429
16 Apr 2024 04:24:46.052    16 Apr 2024 04:27:26.116      160.06489825
16 Apr 2024 10:50:27.424    16 Apr 2024 10:53:01.901      154.47700673
17 Apr 2024 03:23:49.334    17 Apr 2024 03:24:13.025      23.690819624
17 Apr 2024 09:48:25.235    17 Apr 2024 09:50:38.111      132.87598825
18 Apr 2024 03:56:09.461    18 Apr 2024 03:58:40.797      151.33615768
18 Apr 2024 10:22:01.648    18 Apr 2024 10:23:54.012      112.36431145
19 Apr 2024 02:53:57.241    19 Apr 2024 02:56:13.309      136.06786486
19 Apr 2024 09:19:19.428    19 Apr 2024 09:21:56.848      157.41949637
20 Apr 2024 03:27:26.444    20 Apr 2024 03:29:21.009      114.56494199
20 Apr 2024 08:17:35.401    20 Apr 2024 08:18:34.057      58.656565205
21 Apr 2024 02:24:29.348    21 Apr 2024 02:27:08.582      159.23373825
21 Apr 2024 08:50:02.568    21 Apr 2024 08:52:37.848      155.28055768
22 Apr 2024 07:47:35.678    22 Apr 2024 07:49:44.275      128.59676590
23 Apr 2024 01:54:55.688    23 Apr 2024 01:57:28.778      153.08939010
23 Apr 2024 08:20:38.142    23 Apr 2024 08:22:38.045      119.90339812
24 Apr 2024 00:52:21.629    24 Apr 2024 00:54:30.600      128.97038682
24 Apr 2024 07:17:33.535    24 Apr 2024 07:20:08.705      155.17012967
25 Apr 2024 01:25:14.071    25 Apr 2024 01:27:16.221      122.14960400
25 Apr 2024 06:15:37.139    25 Apr 2024 06:16:03.568      26.428358839
26 Apr 2024 00:21:56.011    26 Apr 2024 00:24:32.975      156.96418049
26 Apr 2024 06:47:19.779    26 Apr 2024 06:49:57.163      157.38382906
27 Apr 2024 00:55:36.684    27 Apr 2024 00:56:18.960      42.276338534
27 Apr 2024 05:44:31.913    27 Apr 2024 05:46:30.066      118.15277551
27 Apr 2024 23:51:24.775    27 Apr 2024 23:54:00.948      156.17308170
28 Apr 2024 06:16:56.215    28 Apr 2024 06:19:08.615      132.39997305
28 Apr 2024 22:48:35.348    28 Apr 2024 22:50:27.994      112.64585915
29 Apr 2024 05:13:33.358    29 Apr 2024 05:16:03.366      150.00782269
29 Apr 2024 23:20:44.705    29 Apr 2024 23:22:58.103      133.39860379
30 Apr 2024 05:46:44.233    30 Apr 2024 05:47:22.474      38.241588743
30 Apr 2024 22:17:10.550    30 Apr 2024 22:19:41.804      151.25341824
01 May 2024 04:42:23.427    01 May 2024 04:45:02.199      158.77180622
01 May 2024 22:49:59.659    01 May 2024 22:51:20.861      81.201825826
02 May 2024 03:39:19.475    02 May 2024 03:40:57.345      97.870321339
02 May 2024 21:45:41.911    02 May 2024 21:48:20.428      158.51696609
03 May 2024 04:11:01.950    03 May 2024 04:13:27.357      145.40682201
03 May 2024 20:42:48.368    03 May 2024 20:44:03.985      75.617091358
04 May 2024 03:07:24.019    04 May 2024 03:09:43.525      139.50515133
04 May 2024 21:14:04.038    04 May 2024 21:16:29.377      145.33882675
05 May 2024 03:39:35.286    05 May 2024 03:41:12.957      97.671577823
05 May 2024 20:10:19.001    05 May 2024 20:12:37.035      138.03348391
06 May 2024 02:35:18.430    06 May 2024 02:37:55.092      156.66271832
06 May 2024 20:42:17.048    06 May 2024 20:44:08.427      111.37954448
07 May 2024 01:32:08.241    07 May 2024 01:33:02.587      54.346736125
07 May 2024 19:37:51.935    07 May 2024 19:40:28.852      156.91704360
08 May 2024 02:02:59.964    08 May 2024 02:05:34.920      154.95639303
08 May 2024 20:10:39.388    08 May 2024 20:10:58.802      19.413951540
09 May 2024 00:59:09.756    09 May 2024 01:01:09.087      119.33057540
09 May 2024 19:05:15.779    09 May 2024 19:07:50.477      154.69779423
10 May 2024 01:30:30.204    10 May 2024 01:32:41.392      131.18800643
10 May 2024 18:01:27.568    10 May 2024 18:03:15.298      107.73044375
11 May 2024 00:26:07.263    11 May 2024 00:28:34.757      147.49438644
11 May 2024 18:32:28.221    11 May 2024 18:34:43.705      135.48380672
12 May 2024 00:58:01.633    12 May 2024 00:59:01.872      60.238692071
12 May 2024 17:27:57.541    12 May 2024 17:30:23.623      146.08235175
12 May 2024 23:52:51.318    12 May 2024 23:55:28.776      157.45866930
13 May 2024 17:59:30.757    13 May 2024 18:01:06.421      95.663711778
13 May 2024 22:48:54.862    13 May 2024 22:50:13.025      78.162775410
14 May 2024 16:54:20.817    14 May 2024 16:56:58.151      157.33434985
14 May 2024 23:19:20.909    14 May 2024 23:21:51.886      150.97699366
15 May 2024 22:14:50.221    15 May 2024 22:16:55.948      125.72757098
16 May 2024 16:20:31.888    16 May 2024 16:23:03.836      151.94722263
16 May 2024 22:45:38.050    16 May 2024 22:47:41.864      123.81486761
17 May 2024 15:16:02.322    17 May 2024 15:17:56.486      114.16380757
17 May 2024 21:40:34.956    17 May 2024 21:43:03.700      148.74388052
18 May 2024 15:46:29.400    18 May 2024 15:48:41.566      132.16597557
18 May 2024 22:11:57.791    18 May 2024 22:12:43.575      45.783420699
19 May 2024 14:41:20.149    19 May 2024 14:43:46.452      146.30274698
19 May 2024 21:06:04.258    19 May 2024 21:08:41.021      156.76286897
20 May 2024 15:12:14.990    20 May 2024 15:13:49.374      94.383763731
20 May 2024 20:01:31.677    20 May 2024 20:02:47.996      76.319158624
21 May 2024 14:06:28.088    21 May 2024 14:09:04.597      156.50904252
21 May 2024 20:31:17.598    21 May 2024 20:33:48.554      150.95579299
22 May 2024 19:26:11.893    22 May 2024 19:28:13.555      121.66175618
23 May 2024 13:31:22.155    23 May 2024 13:33:54.861      152.70584354
23 May 2024 19:56:16.556    23 May 2024 19:58:25.009      128.45316755
24 May 2024 12:26:22.031    24 May 2024 12:28:05.593      103.56216459
24 May 2024 18:50:40.456    24 May 2024 18:53:05.346      144.89005285
25 May 2024 12:56:01.313    25 May 2024 12:58:18.376      137.06326783
25 May 2024 19:21:08.759    25 May 2024 19:22:23.195      74.436727236
26 May 2024 11:50:22.059    26 May 2024 11:52:41.579      139.51993607
26 May 2024 18:14:53.027    26 May 2024 18:17:28.156      155.12893471
27 May 2024 12:20:26.353    27 May 2024 12:22:14.552      108.19965295
27 May 2024 17:09:57.484    27 May 2024 17:10:43.110      45.626492612
28 May 2024 11:14:12.368    28 May 2024 11:16:46.153      153.78547583
28 May 2024 17:38:48.967    28 May 2024 17:41:23.151      154.18346043
29 May 2024 11:44:44.008    29 May 2024 11:45:36.894      52.886085038
29 May 2024 16:33:15.825    29 May 2024 16:35:00.655      104.82948823
30 May 2024 10:37:48.653    30 May 2024 10:40:23.892      155.23908486
30 May 2024 17:02:28.948    30 May 2024 17:04:50.198      141.24927535
31 May 2024 09:32:36.882    31 May 2024 09:33:37.563      60.681278876
31 May 2024 15:56:27.626    31 May 2024 15:58:40.938      133.31217327
01 Jun 2024 10:01:09.572    01 Jun 2024 10:03:36.361      146.78886667
01 Jun 2024 16:25:55.457    01 Jun 2024 16:27:47.295      111.83835121
02 Jun 2024 08:55:11.669    02 Jun 2024 08:57:10.636      118.96695147
02 Jun 2024 15:19:24.139    02 Jun 2024 15:21:53.113      148.97398513
03 Jun 2024 09:24:14.896    03 Jun 2024 09:26:23.915      129.01931031
03 Jun 2024 15:49:22.876    03 Jun 2024 15:50:00.440      37.564198847
04 Jun 2024 08:17:43.244    04 Jun 2024 08:20:06.611      143.36750308
04 Jun 2024 14:42:03.823    04 Jun 2024 14:44:39.014      155.19161479
05 Jun 2024 08:47:05.651    05 Jun 2024 08:48:45.519      99.867660762
05 Jun 2024 13:36:16.623    05 Jun 2024 13:37:15.468      58.845287212
06 Jun 2024 07:40:01.775    06 Jun 2024 07:42:35.269      153.49443342
06 Jun 2024 14:04:26.351    06 Jun 2024 14:06:59.131      152.77992940
07 Jun 2024 08:09:48.872    07 Jun 2024 08:10:34.000      45.128418971
07 Jun 2024 12:58:07.152    07 Jun 2024 12:59:52.279      105.12765097
08 Jun 2024 07:02:04.753    08 Jun 2024 07:04:38.948      154.19508718
08 Jun 2024 13:26:32.046    08 Jun 2024 13:28:53.185      141.13925250
09 Jun 2024 05:56:13.791    09 Jun 2024 05:57:01.736      47.944971349
09 Jun 2024 12:19:46.716    09 Jun 2024 12:21:56.994      130.27843048
10 Jun 2024 06:23:51.052    10 Jun 2024 06:26:18.499      147.44662311
10 Jun 2024 12:48:22.217    10 Jun 2024 12:50:19.815      117.59814351
11 Jun 2024 05:17:13.845    11 Jun 2024 05:19:02.586      108.74028162
11 Jun 2024 11:41:09.773    11 Jun 2024 11:43:35.055      145.28177963
12 Jun 2024 05:45:20.178    12 Jun 2024 05:47:34.093      133.91542041
12 Jun 2024 12:10:02.099    12 Jun 2024 12:11:13.696      71.597488085
13 Jun 2024 04:38:10.694    13 Jun 2024 04:40:25.540      134.84615490
13 Jun 2024 11:02:14.869    13 Jun 2024 11:04:47.805      152.93565866
14 Jun 2024 05:06:32.256    14 Jun 2024 05:08:25.294      113.03814134
15 Jun 2024 03:58:53.359    15 Jun 2024 04:01:21.308      147.94869806
15 Jun 2024 10:23:01.455    15 Jun 2024 10:25:35.734      154.27967923
16 Jun 2024 04:27:28.825    16 Jun 2024 04:28:50.324      81.499281339
16 Jun 2024 09:16:09.237    16 Jun 2024 09:17:27.381      78.144313744
17 Jun 2024 03:19:19.295    17 Jun 2024 03:21:52.262      152.96724167
17 Jun 2024 09:43:29.425    17 Jun 2024 09:45:58.991      149.56581329
18 Jun 2024 08:36:11.041    18 Jun 2024 08:38:00.377      109.33599793
19 Jun 2024 02:39:27.403    19 Jun 2024 02:41:59.459      152.05576943
19 Jun 2024 09:03:39.068    19 Jun 2024 09:05:57.463      138.39473315
20 Jun 2024 01:32:40.592    20 Jun 2024 01:33:25.971      45.378510025
20 Jun 2024 07:55:57.133    20 Jun 2024 07:58:05.942      128.80844751
21 Jun 2024 01:59:17.175    21 Jun 2024 02:01:43.507      146.33177362
21 Jun 2024 08:23:31.251    21 Jun 2024 08:25:30.592      119.34124252
22 Jun 2024 00:51:48.557    22 Jun 2024 00:53:27.766      99.208833114
22 Jun 2024 07:15:25.253    22 Jun 2024 07:17:46.694      141.44090860
23 Jun 2024 01:18:48.451    23 Jun 2024 01:21:04.788      136.33633743
23 Jun 2024 07:43:08.363    23 Jun 2024 07:44:36.409      88.046047906
24 Jun 2024 00:10:50.391    24 Jun 2024 00:12:54.742      124.35045205
24 Jun 2024 06:34:34.719    24 Jun 2024 06:37:03.760      149.04138695
25 Jun 2024 00:38:01.348    25 Jun 2024 00:40:03.475      122.12709545
25 Jun 2024 23:29:37.242    25 Jun 2024 23:31:56.063      138.82027902
26 Jun 2024 05:53:25.320    26 Jun 2024 05:55:57.823      152.50294061
26 Jun 2024 23:56:56.326    26 Jun 2024 23:58:39.412      103.08650174
27 Jun 2024 04:46:04.890    27 Jun 2024 04:46:23.833      18.943245232
27 Jun 2024 22:48:07.120    27 Jun 2024 22:50:34.004      146.88385804
28 Jun 2024 05:11:57.031    28 Jun 2024 05:14:29.345      152.31408973
28 Jun 2024 23:15:34.642    28 Jun 2024 23:16:51.582      76.939399866
29 Jun 2024 04:04:00.783    29 Jun 2024 04:05:14.712      73.928815650
29 Jun 2024 22:06:19.150    29 Jun 2024 22:08:49.632      150.48256803
30 Jun 2024 04:30:09.886    30 Jun 2024 04:32:38.615      148.72940790
30 Jun 2024 22:34:02.712    30 Jun 2024 22:34:33.691      30.978169141
01 Jul 2024 03:21:50.994    01 Jul 2024 03:23:30.114      99.120015325
01 Jul 2024 21:24:12.800    01 Jul 2024 21:26:43.526      150.72598101
02 Jul 2024 03:48:03.931    02 Jul 2024 03:50:25.755      141.82427003
03 Jul 2024 02:39:24.822    03 Jul 2024 02:41:20.803      115.98177573
03 Jul 2024 20:41:47.639    03 Jul 2024 20:44:15.971      148.33122119
04 Jul 2024 03:05:39.205    04 Jul 2024 03:07:50.687      131.48181267
04 Jul 2024 19:33:40.069    04 Jul 2024 19:34:34.135      54.066145211
05 Jul 2024 01:56:40.464    05 Jul 2024 01:58:48.436      127.97197768
05 Jul 2024 19:59:03.241    05 Jul 2024 20:01:27.040      143.79861559
06 Jul 2024 02:22:55.790    06 Jul 2024 02:24:53.084      117.29352744
06 Jul 2024 18:50:24.056    06 Jul 2024 18:51:54.250      90.193691407
07 Jul 2024 01:13:37.020    07 Jul 2024 01:15:53.559      136.53902222
07 Jul 2024 19:15:59.151    07 Jul 2024 19:18:16.645      137.49483421
08 Jul 2024 01:39:53.973    08 Jul 2024 01:41:32.216      98.242860998
08 Jul 2024 18:06:55.327    08 Jul 2024 18:08:45.783      110.45576184
09 Jul 2024 00:30:13.825    09 Jul 2024 00:32:36.317      142.49197914
09 Jul 2024 18:32:34.883    09 Jul 2024 18:34:44.582      129.69836328
10 Jul 2024 00:56:34.906    10 Jul 2024 00:57:46.346      71.440393722
10 Jul 2024 17:23:09.076    10 Jul 2024 17:25:12.803      123.72702076
10 Jul 2024 23:46:30.288    10 Jul 2024 23:48:56.658      146.36984988
11 Jul 2024 17:48:49.942    11 Jul 2024 17:50:50.564      120.62288539
12 Jul 2024 00:13:08.727    12 Jul 2024 00:13:24.665      15.937658097
12 Jul 2024 16:39:03.527    12 Jul 2024 16:41:16.292      132.76463016
12 Jul 2024 23:02:25.861    12 Jul 2024 23:04:54.438      148.57703873
13 Jul 2024 17:04:43.848    13 Jul 2024 17:06:34.273      110.42509193
14 Jul 2024 15:54:37.608    14 Jul 2024 15:56:56.544      138.93577075
14 Jul 2024 22:18:00.043    14 Jul 2024 22:20:29.488      149.44498313
15 Jul 2024 16:20:16.179    15 Jul 2024 16:21:55.387      99.207647808
16 Jul 2024 15:09:50.556    16 Jul 2024 15:12:13.626      143.07028174
16 Jul 2024 21:33:12.393    16 Jul 2024 21:35:41.656      149.26329092
17 Jul 2024 15:35:26.595    17 Jul 2024 15:36:53.602      87.006582739
17 Jul 2024 20:23:52.635    17 Jul 2024 20:24:34.775      42.139512557
18 Jul 2024 14:24:41.800    18 Jul 2024 14:27:07.533      145.73330762
18 Jul 2024 20:48:02.542    18 Jul 2024 20:50:30.837      148.29539799
19 Jul 2024 14:50:14.879    19 Jul 2024 14:51:28.631      73.752383608
19 Jul 2024 19:38:21.807    19 Jul 2024 19:39:24.470      62.662959751
20 Jul 2024 13:39:10.915    20 Jul 2024 13:41:38.252      147.33759445
20 Jul 2024 20:02:30.195    20 Jul 2024 20:04:56.981      146.78611321
21 Jul 2024 14:04:40.989    21 Jul 2024 14:05:40.147      59.157830151
21 Jul 2024 18:52:31.858    21 Jul 2024 18:53:47.434      75.575661915
22 Jul 2024 12:53:17.591    22 Jul 2024 12:55:45.788      148.19707229
22 Jul 2024 19:16:35.127    22 Jul 2024 19:19:00.091      144.96438105
23 Jul 2024 13:18:45.258    23 Jul 2024 13:19:27.566      42.307337536
23 Jul 2024 18:06:20.829    23 Jul 2024 18:07:45.446      84.616684215
24 Jul 2024 12:07:01.603    24 Jul 2024 12:09:30.158      148.55507836
24 Jul 2024 18:30:17.158    24 Jul 2024 18:32:40.201      143.04265132
25 Jul 2024 12:32:29.974    25 Jul 2024 12:32:48.428      18.453524995
25 Jul 2024 17:19:48.002    25 Jul 2024 17:21:19.101      91.098432150
26 Jul 2024 11:20:22.778    26 Jul 2024 11:22:51.379      148.60055092
26 Jul 2024 17:43:36.138    26 Jul 2024 17:45:57.351      141.21332830
27 Jul 2024 16:32:52.991    27 Jul 2024 16:34:28.661      95.669223717
28 Jul 2024 10:33:20.954    28 Jul 2024 10:35:49.432      148.47774901
28 Jul 2024 16:56:31.906    28 Jul 2024 16:58:51.550      139.64342319
29 Jul 2024 15:45:35.518    29 Jul 2024 15:47:14.210      98.692435166
30 Jul 2024 09:45:55.949    30 Jul 2024 09:48:24.241      148.29190368
30 Jul 2024 16:09:04.270    30 Jul 2024 16:11:22.738      138.46860621
31 Jul 2024 14:57:55.319    31 Jul 2024 14:59:35.692      100.37227700
01 Aug 2024 08:58:07.531    01 Aug 2024 09:00:35.643      148.11227279
01 Aug 2024 15:21:12.979    01 Aug 2024 15:23:30.765      137.78685071
02 Aug 2024 14:09:52.104    02 Aug 2024 14:11:32.908      100.80453584
03 Aug 2024 08:09:55.400    03 Aug 2024 08:12:23.373      147.97350933
03 Aug 2024 14:32:57.714    03 Aug 2024 14:35:15.366      137.65194209
04 Aug 2024 13:21:25.528    04 Aug 2024 13:23:05.525      99.996775179
05 Aug 2024 07:21:19.183    05 Aug 2024 07:23:47.059      147.87550770
05 Aug 2024 13:44:18.086    05 Aug 2024 13:46:36.154      138.06802846
06 Aug 2024 12:32:35.198    06 Aug 2024 12:34:13.069      97.870423808
07 Aug 2024 06:32:18.445    07 Aug 2024 06:34:46.227      147.78170886
07 Aug 2024 12:55:13.647    07 Aug 2024 12:57:32.633      138.98662732
08 Aug 2024 11:43:20.696    08 Aug 2024 11:44:54.942      94.245768478
09 Aug 2024 05:42:52.705    09 Aug 2024 05:45:20.320      147.61585342
09 Aug 2024 12:05:43.909    09 Aug 2024 12:08:04.216      140.30671294
10 Aug 2024 10:53:41.623    10 Aug 2024 10:55:10.424      88.801298977
11 Aug 2024 04:53:01.472    11 Aug 2024 04:55:28.729      147.25706060
11 Aug 2024 11:15:48.376    11 Aug 2024 11:18:10.254      141.87752518
12 Aug 2024 05:16:27.445    12 Aug 2024 05:17:03.435      35.989586776
12 Aug 2024 10:03:37.680    12 Aug 2024 10:04:58.657      80.976643169
13 Aug 2024 04:02:44.286    13 Aug 2024 04:05:10.818      146.53258537
13 Aug 2024 10:25:26.576    13 Aug 2024 10:27:50.079      143.50305040
14 Aug 2024 04:25:46.306    14 Aug 2024 04:26:40.879      54.573524022
14 Aug 2024 09:13:08.839    14 Aug 2024 09:14:18.547      69.708399370
15 Aug 2024 03:12:00.747    15 Aug 2024 03:14:25.954      145.20667914
15 Aug 2024 09:34:38.084    15 Aug 2024 09:37:03.031      144.94682809
16 Aug 2024 03:34:39.656    16 Aug 2024 03:35:49.798      70.142452978
16 Aug 2024 08:22:15.859    16 Aug 2024 08:23:08.295      52.436613024
17 Aug 2024 02:20:50.553    17 Aug 2024 02:23:13.516      142.96246825
17 Aug 2024 08:43:22.546    17 Aug 2024 08:45:48.481      145.93558599
18 Aug 2024 02:43:06.349    18 Aug 2024 02:44:30.472      84.122940351
18 Aug 2024 07:31:06.083    18 Aug 2024 07:31:19.627      13.544347300
19 Aug 2024 01:29:13.517    19 Aug 2024 01:31:32.887      139.37032570
19 Aug 2024 07:51:39.676    19 Aug 2024 07:54:05.836      146.16006897
20 Aug 2024 01:51:05.817    20 Aug 2024 01:52:42.717      96.900360170
21 Aug 2024 00:37:09.584    21 Aug 2024 00:39:23.413      133.82871863
21 Aug 2024 06:59:29.248    21 Aug 2024 07:01:54.519      145.27089813
22 Aug 2024 00:58:37.682    22 Aug 2024 01:00:26.227      108.54527601
22 Aug 2024 23:44:38.869    22 Aug 2024 23:46:44.311      125.44246609
23 Aug 2024 06:06:51.070    23 Aug 2024 06:09:13.936      142.86537532
24 Aug 2024 00:05:41.646    24 Aug 2024 00:07:40.622      118.97550541
24 Aug 2024 06:28:32.547    24 Aug 2024 06:29:19.170      46.622262709
24 Aug 2024 22:51:41.760    24 Aug 2024 22:53:34.489      112.72969998
25 Aug 2024 05:13:44.962    25 Aug 2024 05:16:03.420      138.45748049
25 Aug 2024 23:12:17.425    25 Aug 2024 23:14:25.428      128.00309990
26 Aug 2024 05:34:51.591    26 Aug 2024 05:36:15.903      84.312090150
26 Aug 2024 21:58:19.333    26 Aug 2024 21:59:52.043      92.709512101
27 Aug 2024 04:20:10.740    27 Aug 2024 04:22:22.156      131.41570366
27 Aug 2024 22:18:24.699    27 Aug 2024 22:20:40.037      135.33874175
28 Aug 2024 04:40:48.260    28 Aug 2024 04:42:35.796      107.53596023
28 Aug 2024 21:04:35.833    28 Aug 2024 21:05:31.685      55.852288334
29 Aug 2024 03:26:08.241    29 Aug 2024 03:28:09.067      120.82653515
29 Aug 2024 21:24:03.079    29 Aug 2024 21:26:23.647      140.56821638
30 Aug 2024 03:46:18.083    30 Aug 2024 03:48:21.924      123.84053258
31 Aug 2024 02:31:37.456    31 Aug 2024 02:33:22.595      105.13896622
31 Aug 2024 20:29:12.105    31 Aug 2024 20:31:35.204      143.09866119
01 Sep 2024 02:51:19.305    01 Sep 2024 02:53:34.288      134.98305349
02 Sep 2024 01:36:39.143    02 Sep 2024 01:38:00.039      80.895615206
02 Sep 2024 19:33:51.277    02 Sep 2024 19:36:13.329      142.05194808
03 Sep 2024 01:55:50.605    03 Sep 2024 01:58:12.067      141.46238649
03 Sep 2024 19:54:05.020    03 Sep 2024 19:55:11.056      66.035523685
04 Sep 2024 00:41:20.420    04 Sep 2024 00:41:51.959      31.539177464
04 Sep 2024 18:38:00.174    04 Sep 2024 18:40:16.208      136.03480391
05 Sep 2024 00:59:50.754    05 Sep 2024 01:02:13.972      143.21784682
05 Sep 2024 18:57:35.666    05 Sep 2024 18:59:13.218      97.552329954
06 Sep 2024 17:41:38.775    06 Sep 2024 17:43:41.318      122.54301114
07 Sep 2024 00:03:18.573    07 Sep 2024 00:05:38.331      139.75828125
07 Sep 2024 18:00:36.696    07 Sep 2024 18:02:35.203      118.50699401
08 Sep 2024 00:22:48.087    08 Sep 2024 00:23:48.456      60.369609436
08 Sep 2024 16:44:48.591    08 Sep 2024 16:46:24.365      95.773967542
08 Sep 2024 23:06:13.035    08 Sep 2024 23:08:23.063      130.02776894
09 Sep 2024 17:03:04.881    09 Sep 2024 17:05:17.378      132.49764999
09 Sep 2024 23:24:57.719    09 Sep 2024 23:26:43.823      106.10339502
10 Sep 2024 15:47:47.180    10 Sep 2024 15:48:04.884      17.704256088
10 Sep 2024 22:08:33.623    10 Sep 2024 22:10:25.426      111.80390662
11 Sep 2024 16:04:58.590    11 Sep 2024 16:07:18.437      139.84691044
11 Sep 2024 22:26:40.022    11 Sep 2024 22:28:48.893      128.87069414
12 Sep 2024 21:10:21.784    12 Sep 2024 21:11:40.669      78.884999163
13 Sep 2024 15:06:16.960    13 Sep 2024 15:08:36.335      139.37427766
13 Sep 2024 21:27:48.024    13 Sep 2024 21:30:07.342      139.31806537
14 Sep 2024 15:24:38.194    14 Sep 2024 15:25:51.869      73.674585298
15 Sep 2024 14:07:00.138    15 Sep 2024 14:09:08.137      127.99926046
15 Sep 2024 20:28:19.153    15 Sep 2024 20:30:38.522      139.36909230
16 Sep 2024 14:24:32.679    16 Sep 2024 14:26:23.367      110.68762885
16 Sep 2024 20:46:30.207    16 Sep 2024 20:46:59.553      29.345715023
17 Sep 2024 13:07:10.989    17 Sep 2024 13:08:48.348      97.358533856
17 Sep 2024 19:28:12.185    17 Sep 2024 19:30:20.555      128.37073960
18 Sep 2024 13:23:52.652    18 Sep 2024 13:26:03.781      131.12861478
18 Sep 2024 19:45:19.406    18 Sep 2024 19:47:05.560      106.15366098
19 Sep 2024 18:27:27.553    19 Sep 2024 18:29:10.029      102.47593217
20 Sep 2024 12:22:34.937    20 Sep 2024 12:24:53.914      138.97738595
20 Sep 2024 18:43:48.345    20 Sep 2024 18:46:00.475      132.12922228
21 Sep 2024 12:39:56.728    21 Sep 2024 12:40:31.131      34.402725287
21 Sep 2024 17:26:14.984    21 Sep 2024 17:26:54.312      39.327176800
22 Sep 2024 11:20:39.476    22 Sep 2024 11:22:51.532      132.05670866
22 Sep 2024 17:41:39.931    22 Sep 2024 17:43:58.458      138.52708036
23 Sep 2024 11:36:56.662    23 Sep 2024 11:38:38.520      101.85876625
24 Sep 2024 10:18:09.978    24 Sep 2024 10:19:50.614      100.63645405
24 Sep 2024 16:38:51.367    24 Sep 2024 16:40:59.294      127.92721895
25 Sep 2024 10:33:29.364    25 Sep 2024 10:35:38.882      129.51834672
25 Sep 2024 16:54:33.627    25 Sep 2024 16:56:18.641      105.01447296
26 Sep 2024 15:35:23.589    26 Sep 2024 15:36:58.841      95.252160751
27 Sep 2024 09:29:23.539    27 Sep 2024 09:31:40.986      137.44742103
27 Sep 2024 15:50:12.727    27 Sep 2024 15:52:26.253      133.52673501
28 Sep 2024 09:45:01.031    28 Sep 2024 09:46:03.017      61.986399035
29 Sep 2024 08:24:39.594    29 Sep 2024 08:26:41.578      121.98454379
29 Sep 2024 14:45:12.662    29 Sep 2024 14:47:27.393      134.73052990
30 Sep 2024 08:39:11.407    30 Sep 2024 08:41:07.733      116.32593123
30 Sep 2024 15:00:06.932    30 Sep 2024 15:01:17.480      70.547607250
01 Oct 2024 07:19:32.564    01 Oct 2024 07:20:22.374      49.809731275
01 Oct 2024 13:39:30.409    01 Oct 2024 13:41:20.853      110.44408700
02 Oct 2024 07:32:46.810    02 Oct 2024 07:35:02.211      135.40117572
02 Oct 2024 13:53:20.041    02 Oct 2024 13:55:26.385      126.34381594
03 Oct 2024 07:47:35.693    03 Oct 2024 07:47:53.803      18.109782203
03 Oct 2024 12:33:22.771    03 Oct 2024 12:33:45.123      22.351366142
04 Oct 2024 06:25:42.081    04 Oct 2024 06:27:47.752      125.67076210
04 Oct 2024 12:45:58.389    04 Oct 2024 12:48:13.250      134.86048796
05 Oct 2024 06:39:05.937    05 Oct 2024 06:40:56.334      110.39646448
05 Oct 2024 12:59:46.090    05 Oct 2024 13:00:41.713      55.622765841
06 Oct 2024 05:18:11.784    06 Oct 2024 05:19:05.514      53.729965305
06 Oct 2024 11:37:52.273    06 Oct 2024 11:39:42.293      110.02020986
07 Oct 2024 05:30:12.493    07 Oct 2024 05:32:26.325      133.83200832
07 Oct 2024 11:50:25.005    07 Oct 2024 11:52:30.933      125.92825008
08 Oct 2024 05:43:34.187    08 Oct 2024 05:44:08.049      33.862061414
09 Oct 2024 04:20:37.858    09 Oct 2024 04:22:36.683      118.82537515
09 Oct 2024 10:40:30.790    09 Oct 2024 10:42:42.527      131.73724059
10 Oct 2024 04:32:32.890    10 Oct 2024 04:34:29.407      116.51713669
10 Oct 2024 10:52:42.569    10 Oct 2024 10:54:04.580      82.010666805
11 Oct 2024 09:29:50.662    11 Oct 2024 09:31:23.112      92.450097331
12 Oct 2024 03:21:00.935    12 Oct 2024 03:23:12.864      131.92877012
12 Oct 2024 09:40:47.593    12 Oct 2024 09:42:58.883      131.29022374
13 Oct 2024 03:32:30.329    13 Oct 2024 03:33:49.689      79.360041220
14 Oct 2024 02:08:51.759    14 Oct 2024 02:10:20.473      88.713879604
14 Oct 2024 08:28:10.590    14 Oct 2024 08:30:09.429      118.83843394
15 Oct 2024 02:18:53.628    15 Oct 2024 02:21:01.445      127.81670513
15 Oct 2024 08:38:30.124    15 Oct 2024 08:40:26.263      116.13897665
17 Oct 2024 01:04:37.535    17 Oct 2024 01:06:32.367      114.83197716
17 Oct 2024 07:23:51.250    17 Oct 2024 07:25:59.457      128.20630143
18 Oct 2024 01:14:01.443    18 Oct 2024 01:15:57.636      116.19206679
18 Oct 2024 07:33:27.686    18 Oct 2024 07:34:58.190      90.504545183
19 Oct 2024 06:08:29.155    19 Oct 2024 06:09:35.306      66.150995926
19 Oct 2024 23:57:37.860    19 Oct 2024 23:59:41.087      123.22627727
20 Oct 2024 06:16:39.609    20 Oct 2024 06:18:49.169      129.55951276
21 Oct 2024 00:06:11.961    21 Oct 2024 00:07:55.138      103.17770020
21 Oct 2024 06:25:29.907    21 Oct 2024 06:26:27.988      58.081246144
22 Oct 2024 04:59:09.567    22 Oct 2024 05:00:32.579      83.012486645
22 Oct 2024 22:47:37.884    22 Oct 2024 22:49:42.675      124.79007638
23 Oct 2024 05:06:24.384    23 Oct 2024 05:08:32.243      127.85936671
23 Oct 2024 22:55:12.937    23 Oct 2024 22:56:47.032      94.094612903
24 Oct 2024 05:14:24.467    24 Oct 2024 05:14:49.899      25.432244875
25 Oct 2024 03:46:45.081    25 Oct 2024 03:48:10.803      85.721894098
25 Oct 2024 21:34:25.453    25 Oct 2024 21:36:29.018      123.56527947
26 Oct 2024 03:52:54.253    26 Oct 2024 03:55:00.269      126.01621260
26 Oct 2024 21:40:51.699    26 Oct 2024 21:42:24.776      93.076834967
27 Oct 2024 03:59:42.217    27 Oct 2024 04:00:12.242      30.025002477
28 Oct 2024 02:31:03.428    28 Oct 2024 02:32:20.018      76.589476573
28 Oct 2024 20:17:48.567    28 Oct 2024 20:19:48.628      120.06061790
29 Oct 2024 02:35:57.160    29 Oct 2024 02:38:01.568      124.40808759
29 Oct 2024 20:22:55.553    29 Oct 2024 20:24:36.029      100.47592196
30 Oct 2024 02:41:14.477    30 Oct 2024 02:42:18.259      63.782568695
31 Oct 2024 01:11:56.046    31 Oct 2024 01:12:41.381      45.334545895
31 Oct 2024 18:57:34.892    31 Oct 2024 18:59:25.541      110.64886234
01 Nov 2024 01:15:19.858    01 Nov 2024 01:17:19.945      120.08686122
01 Nov 2024 19:01:11.561    01 Nov 2024 19:03:03.441      111.88004751
02 Nov 2024 01:19:01.499    02 Nov 2024 01:20:36.111      94.611721218
03 Nov 2024 17:33:34.072    03 Nov 2024 17:34:55.983      81.911390286
03 Nov 2024 23:50:47.950    03 Nov 2024 23:52:33.501      105.55043741
04 Nov 2024 17:35:25.514    04 Nov 2024 17:37:24.895      119.38064396
04 Nov 2024 23:52:47.823    04 Nov 2024 23:54:42.572      114.74824352
05 Nov 2024 17:37:32.284    05 Nov 2024 17:38:44.702      72.417716926
06 Nov 2024 22:22:10.891    06 Nov 2024 22:23:09.063      58.171434689
07 Nov 2024 16:05:23.311    07 Nov 2024 16:07:11.984      108.67255165
07 Nov 2024 22:22:14.815    07 Nov 2024 22:24:10.068      115.25276798
08 Nov 2024 16:05:26.968    08 Nov 2024 16:07:17.388      110.41927038
08 Nov 2024 22:22:18.969    08 Nov 2024 22:23:55.585      96.616580780
09 Nov 2024 16:05:47.635    09 Nov 2024 16:06:02.601      14.966709015
10 Nov 2024 20:47:06.928    10 Nov 2024 20:48:20.071      73.143421160
11 Nov 2024 14:28:41.416    11 Nov 2024 14:30:31.432      110.01628524
11 Nov 2024 20:44:57.708    11 Nov 2024 20:46:51.085      113.37702661
12 Nov 2024 14:26:23.210    12 Nov 2024 14:28:10.367      107.15693550
12 Nov 2024 20:42:36.984    12 Nov 2024 20:44:10.086      93.102009280
13 Nov 2024 14:24:04.867    13 Nov 2024 14:24:35.106      30.239339790
14 Nov 2024 19:02:41.060    14 Nov 2024 19:03:24.071      43.011467694
15 Nov 2024 12:42:10.087    15 Nov 2024 12:43:45.652      95.565127081
15 Nov 2024 18:57:40.637    15 Nov 2024 18:59:24.578      103.94079611
16 Nov 2024 12:36:55.660    16 Nov 2024 12:38:47.373      111.71282132
16 Nov 2024 18:52:22.129    16 Nov 2024 18:54:08.669      106.54003141
17 Nov 2024 12:31:18.853    17 Nov 2024 12:32:43.012      84.158996784
17 Nov 2024 18:46:44.714    17 Nov 2024 18:47:33.845      49.131143501
19 Nov 2024 16:59:07.178    19 Nov 2024 16:59:51.820      44.641797314
20 Nov 2024 10:35:42.330    20 Nov 2024 10:37:09.831      87.501185015
20 Nov 2024 16:50:08.625    20 Nov 2024 16:51:44.709      96.083983337
21 Nov 2024 10:26:15.039    21 Nov 2024 10:28:02.265      107.22583977
21 Nov 2024 16:40:32.969    21 Nov 2024 16:42:18.309      105.34005489
22 Nov 2024 10:16:04.698    22 Nov 2024 10:17:42.119      97.420466482
22 Nov 2024 16:30:09.950    22 Nov 2024 16:31:36.583      86.632697470
23 Nov 2024 10:05:06.534    23 Nov 2024 10:06:06.121      59.587058926
26 Nov 2024 14:04:24.461    26 Nov 2024 14:05:02.170      37.708860857
27 Nov 2024 07:35:13.350    27 Nov 2024 07:36:13.287      59.936818772
27 Nov 2024 13:47:26.184    27 Nov 2024 13:48:38.884      72.699815012
28 Nov 2024 07:17:07.928    28 Nov 2024 07:18:29.837      81.908988871
28 Nov 2024 13:28:59.814    28 Nov 2024 13:30:25.422      85.607615649
29 Nov 2024 06:57:22.261    29 Nov 2024 06:58:51.050      88.788744039
29 Nov 2024 13:08:45.383    29 Nov 2024 13:10:15.073      89.689988899
30 Nov 2024 06:35:34.861    30 Nov 2024 06:37:03.951      89.090449805
30 Nov 2024 12:46:22.291    30 Nov 2024 12:47:51.353      89.061219175
01 Dec 2024 06:11:19.105    01 Dec 2024 06:12:45.185      86.079427111
01 Dec 2024 12:21:21.701    01 Dec 2024 12:22:47.395      85.693839344
02 Dec 2024 05:43:52.532    02 Dec 2024 05:45:12.472      79.940268095
02 Dec 2024 11:52:53.386    02 Dec 2024 11:54:11.966      78.580098320
03 Dec 2024 05:11:47.806    03 Dec 2024 05:12:50.175      62.369399623
03 Dec 2024 11:19:04.828    03 Dec 2024 11:19:59.196      54.368898610


Number of events : 1026
