02 Jul 2023 00:39:32.683    02 Jul 2023 00:40:58.593      85.909825901
02 Jul 2023 05:31:51.276    02 Jul 2023 05:34:22.343      151.06709513
02 Jul 2023 23:51:26.457    02 Jul 2023 23:54:04.536      158.07918368
03 Jul 2023 04:45:03.438    03 Jul 2023 04:46:08.179      64.741088566
03 Jul 2023 06:21:56.208    03 Jul 2023 06:22:50.252      54.044862511
03 Jul 2023 23:03:46.772    03 Jul 2023 23:06:46.368      179.59614666
04 Jul 2023 05:33:38.889    04 Jul 2023 05:36:21.225      162.33582299
04 Jul 2023 22:16:29.963    04 Jul 2023 22:19:07.931      157.96796484
05 Jul 2023 04:46:02.483    05 Jul 2023 04:49:00.500      178.01730037
05 Jul 2023 23:06:25.625    05 Jul 2023 23:07:50.373      84.747413930
06 Jul 2023 03:58:41.774    06 Jul 2023 04:01:13.272      151.49831891
06 Jul 2023 22:18:10.463    06 Jul 2023 22:20:48.482      158.01831158
07 Jul 2023 03:11:45.453    07 Jul 2023 03:12:50.980      65.527726198
07 Jul 2023 04:48:38.892    07 Jul 2023 04:49:31.145      52.253056574
07 Jul 2023 21:30:22.367    07 Jul 2023 21:33:22.143      179.77584733
08 Jul 2023 04:00:12.485    08 Jul 2023 04:02:54.789      162.30419346
08 Jul 2023 20:42:57.466    08 Jul 2023 20:45:35.379      157.91304944
09 Jul 2023 03:12:27.892    09 Jul 2023 03:15:25.840      177.94822762
09 Jul 2023 21:32:43.459    09 Jul 2023 21:34:09.902      86.443413142
10 Jul 2023 02:24:59.209    10 Jul 2023 02:27:30.154      150.94499825
10 Jul 2023 20:44:20.551    10 Jul 2023 20:46:59.444      158.89335618
11 Jul 2023 01:37:55.816    11 Jul 2023 01:38:58.457      62.641248317
11 Jul 2023 03:14:44.837    11 Jul 2023 03:15:42.430      57.593178609
11 Jul 2023 19:56:24.676    11 Jul 2023 19:59:24.657      179.98165648
12 Jul 2023 02:26:12.416    12 Jul 2023 02:28:55.686      163.27055565
12 Jul 2023 19:08:52.412    12 Jul 2023 19:11:29.090      156.67820557
13 Jul 2023 01:38:20.140    13 Jul 2023 01:41:17.913      177.77335618
13 Jul 2023 19:58:26.614    13 Jul 2023 19:59:57.355      90.740939055
14 Jul 2023 00:50:43.846    14 Jul 2023 00:53:13.206      149.36010316
14 Jul 2023 19:09:56.849    14 Jul 2023 19:12:37.472      160.62213534
15 Jul 2023 00:03:34.896    15 Jul 2023 00:04:30.295      55.398680165
15 Jul 2023 01:40:14.991    15 Jul 2023 01:41:23.182      68.191235501
15 Jul 2023 18:21:53.625    15 Jul 2023 18:24:53.753      180.12837038
16 Jul 2023 00:51:38.543    16 Jul 2023 00:54:23.664      165.12057579
16 Jul 2023 17:34:14.580    16 Jul 2023 17:36:48.663      154.08366874
17 Jul 2023 00:03:38.888    17 Jul 2023 00:06:36.284      177.39590179
17 Jul 2023 18:23:34.793    17 Jul 2023 18:25:12.023      97.229506820
17 Jul 2023 23:15:55.198    17 Jul 2023 23:18:21.792      146.59343578
18 Jul 2023 17:34:58.759    18 Jul 2023 17:37:41.852      163.09240867
18 Jul 2023 22:28:43.267    18 Jul 2023 22:29:24.493      41.225654923
19 Jul 2023 00:05:09.788    19 Jul 2023 00:06:31.527      81.738830684
19 Jul 2023 16:46:48.500    19 Jul 2023 16:49:48.577      180.07712688
19 Jul 2023 23:16:30.119    19 Jul 2023 23:19:17.787      167.66820549
20 Jul 2023 15:59:03.259    20 Jul 2023 16:01:33.052      149.79280770
20 Jul 2023 22:28:23.277    20 Jul 2023 22:31:19.941      176.66445114
21 Jul 2023 16:48:07.279    21 Jul 2023 16:49:52.708      105.42921717
21 Jul 2023 21:40:32.392    21 Jul 2023 21:42:54.796      142.40481594
22 Jul 2023 15:59:25.382    22 Jul 2023 16:02:11.521      166.13932340
22 Jul 2023 22:29:29.021    22 Jul 2023 22:31:05.646      96.625413210
23 Jul 2023 15:11:08.439    23 Jul 2023 15:14:08.053      179.61384516
23 Jul 2023 21:40:46.269    23 Jul 2023 21:43:36.926      170.65640154
24 Jul 2023 14:23:17.796    24 Jul 2023 14:25:41.051      143.25520863
24 Jul 2023 20:52:32.455    24 Jul 2023 20:55:27.818      175.36280957
25 Jul 2023 15:12:03.467    25 Jul 2023 15:13:58.291      114.82389407
25 Jul 2023 20:04:34.720    25 Jul 2023 20:06:51.150      136.43002908
26 Jul 2023 14:23:16.070    26 Jul 2023 14:26:05.597      169.52769896
26 Jul 2023 20:53:12.426    26 Jul 2023 20:55:04.240      111.81345130
27 Jul 2023 13:34:52.943    27 Jul 2023 13:37:51.376      178.43230453
27 Jul 2023 20:04:26.491    27 Jul 2023 20:07:20.240      173.74938824
28 Jul 2023 12:46:58.111    28 Jul 2023 12:49:11.693      133.58196064
28 Jul 2023 19:16:06.018    28 Jul 2023 19:18:59.223      173.20550352
29 Jul 2023 13:35:23.216    29 Jul 2023 13:37:28.135      124.91901634
29 Jul 2023 18:28:02.026    29 Jul 2023 18:30:10.172      128.14578357
30 Jul 2023 12:46:30.721    30 Jul 2023 12:49:23.674      172.95328828
30 Jul 2023 19:16:20.093    30 Jul 2023 19:18:26.656      126.56251194
31 Jul 2023 11:58:02.095    31 Jul 2023 12:00:58.211      176.11580507
31 Jul 2023 18:27:30.823    31 Jul 2023 18:30:27.369      176.54640366
01 Aug 2023 11:10:04.959    01 Aug 2023 11:12:04.203      119.24389248
01 Aug 2023 17:39:04.090    01 Aug 2023 17:41:53.926      169.83643987
02 Aug 2023 11:58:06.856    02 Aug 2023 12:00:22.100      135.24383053
02 Aug 2023 16:50:54.752    02 Aug 2023 16:52:51.502      116.74980774
03 Aug 2023 11:09:09.697    03 Aug 2023 11:12:05.738      176.04096861
03 Aug 2023 17:38:52.416    03 Aug 2023 17:41:12.723      140.30671169
04 Aug 2023 10:20:36.404    04 Aug 2023 10:23:28.509      172.10527500
04 Aug 2023 16:49:59.643    04 Aug 2023 16:52:58.249      178.60635370
05 Aug 2023 09:32:40.176    05 Aug 2023 09:34:17.256      97.079359903
05 Aug 2023 11:10:05.268    05 Aug 2023 11:10:22.545      17.277630209
05 Aug 2023 16:01:27.071    05 Aug 2023 16:04:11.882      164.81078662
06 Aug 2023 10:20:14.861    06 Aug 2023 10:22:40.221      145.36015755
06 Aug 2023 15:13:13.780    06 Aug 2023 15:14:54.594      100.81430589
07 Aug 2023 09:31:13.441    07 Aug 2023 09:34:11.790      178.34925642
07 Aug 2023 16:00:49.740    07 Aug 2023 16:03:22.332      152.59211767
08 Aug 2023 08:42:36.415    08 Aug 2023 08:45:22.039      165.62410982
08 Aug 2023 15:11:53.230    08 Aug 2023 15:14:52.688      179.45793201
09 Aug 2023 07:54:49.154    09 Aug 2023 07:55:45.589      56.435680110
09 Aug 2023 09:31:25.484    09 Aug 2023 09:32:33.270      67.785930354
09 Aug 2023 14:23:15.188    09 Aug 2023 14:25:52.747      157.55889412
10 Aug 2023 08:41:47.367    10 Aug 2023 08:44:22.233      154.86609761
10 Aug 2023 13:35:00.546    10 Aug 2023 13:36:17.646      77.099546290
10 Aug 2023 15:12:04.472    10 Aug 2023 15:12:36.036      31.564509880
11 Aug 2023 07:52:42.011    11 Aug 2023 07:55:41.364      179.35263184
11 Aug 2023 14:22:11.916    11 Aug 2023 14:24:54.936      163.02022822
12 Aug 2023 07:04:02.348    12 Aug 2023 07:06:37.858      155.51045107
12 Aug 2023 13:33:11.327    12 Aug 2023 13:36:09.918      178.59110849
13 Aug 2023 07:52:20.645    13 Aug 2023 07:53:56.315      95.670071128
13 Aug 2023 12:44:28.149    13 Aug 2023 12:46:55.445      147.29655226
14 Aug 2023 07:02:43.865    14 Aug 2023 07:05:27.215      163.34937236
14 Aug 2023 11:56:22.025    14 Aug 2023 11:56:51.972      29.947115213
14 Aug 2023 13:32:34.718    14 Aug 2023 13:34:06.359      91.641763353
15 Aug 2023 06:13:34.854    15 Aug 2023 06:16:33.240      178.38583651
15 Aug 2023 12:42:58.092    15 Aug 2023 12:45:49.303      171.21053439
16 Aug 2023 05:24:54.133    16 Aug 2023 05:27:13.943      139.80978846
16 Aug 2023 11:53:53.023    16 Aug 2023 11:56:48.446      175.42243728
17 Aug 2023 06:12:41.172    17 Aug 2023 06:14:38.833      117.66104016
17 Aug 2023 11:05:05.208    17 Aug 2023 11:07:18.022      132.81427313
18 Aug 2023 05:23:03.253    18 Aug 2023 05:25:53.593      170.33952882
18 Aug 2023 11:52:40.719    18 Aug 2023 11:54:44.530      123.81157761
19 Aug 2023 04:33:50.985    19 Aug 2023 04:36:45.525      174.54045655
19 Aug 2023 11:03:06.893    19 Aug 2023 11:06:03.635      176.74231828
20 Aug 2023 03:45:12.263    20 Aug 2023 03:47:06.761      114.49796765
20 Aug 2023 10:13:57.013    20 Aug 2023 10:16:46.244      169.23120464
21 Aug 2023 04:32:24.360    21 Aug 2023 04:34:40.372      136.01121220
21 Aug 2023 09:25:05.751    21 Aug 2023 09:26:57.670      111.91924873
22 Aug 2023 03:42:44.236    22 Aug 2023 03:45:39.474      175.23748084
22 Aug 2023 10:12:11.543    22 Aug 2023 10:14:38.036      146.49284352
23 Aug 2023 02:53:29.497    23 Aug 2023 02:56:15.965      166.46731147
23 Aug 2023 09:22:36.863    23 Aug 2023 09:25:35.971      179.10775915
24 Aug 2023 02:05:01.948    24 Aug 2023 02:06:08.031      66.083300218
24 Aug 2023 03:41:48.543    24 Aug 2023 03:42:41.556      53.013662423
24 Aug 2023 08:33:22.114    24 Aug 2023 08:36:01.169      159.05498023
25 Aug 2023 02:51:28.468    25 Aug 2023 02:53:59.739      151.27097057
25 Aug 2023 07:44:30.964    25 Aug 2023 07:45:50.028      79.063879768
25 Aug 2023 09:21:43.823    25 Aug 2023 09:21:53.898      10.075301479
26 Aug 2023 02:01:45.854    26 Aug 2023 02:04:43.078      177.22392683
26 Aug 2023 08:31:04.248    26 Aug 2023 08:33:46.851      162.60279153
27 Aug 2023 01:12:30.246    27 Aug 2023 01:15:02.188      151.94155887
27 Aug 2023 07:41:26.946    27 Aug 2023 07:44:24.620      177.67401837
28 Aug 2023 02:00:05.941    28 Aug 2023 02:01:42.870      96.929165837
28 Aug 2023 06:52:07.798    28 Aug 2023 06:54:31.251      143.45260528
29 Aug 2023 01:09:52.549    29 Aug 2023 01:12:35.884      163.33439400
29 Aug 2023 07:39:27.601    29 Aug 2023 07:41:09.978      102.37679207
30 Aug 2023 00:20:07.819    30 Aug 2023 00:23:02.946      175.12696293
30 Aug 2023 06:49:17.430    30 Aug 2023 06:52:10.377      172.94760001
30 Aug 2023 23:30:54.689    30 Aug 2023 23:33:01.210      126.52065062
31 Aug 2023 05:59:36.656    31 Aug 2023 06:02:28.273      171.61728479
01 Sep 2023 00:17:48.716    01 Sep 2023 00:19:54.412      125.69603260
01 Sep 2023 05:10:14.568    01 Sep 2023 05:12:14.364      119.79587475
01 Sep 2023 23:27:36.269    01 Sep 2023 23:30:27.943      171.67364198
02 Sep 2023 05:56:56.628    02 Sep 2023 05:59:15.088      138.45986053
02 Sep 2023 22:37:50.464    02 Sep 2023 22:40:37.603      167.13908161
03 Sep 2023 05:06:50.324    03 Sep 2023 05:09:47.902      177.57828520
03 Sep 2023 21:48:49.378    03 Sep 2023 21:50:05.321      75.942187349
03 Sep 2023 23:25:51.477    03 Sep 2023 23:26:20.585      29.108078324
04 Sep 2023 04:17:05.825    04 Sep 2023 04:19:45.587      159.76247677
04 Sep 2023 22:34:52.331    04 Sep 2023 22:37:19.476      147.14446409
05 Sep 2023 03:27:45.198    05 Sep 2023 03:29:06.119      80.920591182
05 Sep 2023 21:44:39.404    05 Sep 2023 21:47:34.724      175.32054529
06 Sep 2023 04:13:48.926    06 Sep 2023 04:16:29.362      160.43555920
06 Sep 2023 20:54:54.553    06 Sep 2023 20:57:24.610      150.05714411
07 Sep 2023 03:23:42.066    07 Sep 2023 03:26:38.165      176.09945188
07 Sep 2023 21:41:58.125    07 Sep 2023 21:43:33.916      95.790269505
08 Sep 2023 02:33:54.216    08 Sep 2023 02:36:14.320      140.10389268
08 Sep 2023 20:51:14.873    08 Sep 2023 20:53:57.547      162.67433296
09 Sep 2023 03:20:38.945    09 Sep 2023 03:22:24.945      106.00072823
09 Sep 2023 20:01:01.314    09 Sep 2023 20:03:53.961      172.64703648
10 Sep 2023 02:30:00.617    10 Sep 2023 02:32:53.236      172.61863000
10 Sep 2023 19:11:22.110    10 Sep 2023 19:13:18.510      116.40056369
11 Sep 2023 01:39:51.104    11 Sep 2023 01:42:38.720      167.61635535
11 Sep 2023 19:57:35.056    11 Sep 2023 19:59:45.391      130.33467106
12 Sep 2023 00:50:01.827    12 Sep 2023 00:51:49.890      108.06271161
12 Sep 2023 19:06:54.142    12 Sep 2023 19:09:46.183      172.04112515
13 Sep 2023 01:36:02.322    13 Sep 2023 01:38:27.655      145.33266857
13 Sep 2023 18:16:40.856    13 Sep 2023 18:19:21.554      160.69883478
14 Sep 2023 00:45:28.243    14 Sep 2023 00:48:24.309      176.06584872
14 Sep 2023 19:03:45.780    14 Sep 2023 19:04:49.108      63.327835884
14 Sep 2023 23:55:15.105    14 Sep 2023 23:57:45.433      150.32789771
15 Sep 2023 18:12:28.466    15 Sep 2023 18:15:02.373      153.90719961
15 Sep 2023 23:05:36.615    15 Sep 2023 23:06:17.312      40.697784873
16 Sep 2023 00:41:59.345    16 Sep 2023 00:43:06.277      66.932326870
16 Sep 2023 17:21:47.376    16 Sep 2023 17:24:41.204      173.82835394
16 Sep 2023 23:50:43.621    16 Sep 2023 23:53:29.899      166.27784075
17 Sep 2023 16:31:37.602    17 Sep 2023 16:33:50.546      132.94401714
17 Sep 2023 23:00:07.957    17 Sep 2023 23:02:58.399      170.44135008
18 Sep 2023 17:17:42.896    18 Sep 2023 17:19:39.967      117.07116268
18 Sep 2023 22:09:51.975    18 Sep 2023 22:11:52.005      120.03025445
19 Sep 2023 16:26:33.241    19 Sep 2023 16:29:21.933      168.69224439
19 Sep 2023 22:55:38.299    19 Sep 2023 22:57:51.000      132.70098480
20 Sep 2023 15:35:52.033    20 Sep 2023 15:38:36.951      164.91760276
20 Sep 2023 22:04:35.669    20 Sep 2023 22:07:30.030      174.36117078
21 Sep 2023 14:46:00.880    21 Sep 2023 14:47:03.364      62.483894953
21 Sep 2023 16:22:49.591    21 Sep 2023 16:23:22.807      33.215862885
21 Sep 2023 21:13:56.179    21 Sep 2023 21:16:30.206      154.02755043
22 Sep 2023 15:30:54.822    22 Sep 2023 15:33:23.524      148.70227411
22 Sep 2023 20:23:45.999    22 Sep 2023 20:24:45.344      59.345162858
22 Sep 2023 22:00:35.132    22 Sep 2023 22:01:01.541      26.409390173
23 Sep 2023 14:39:45.870    23 Sep 2023 14:42:39.570      173.69964720
23 Sep 2023 21:08:36.686    23 Sep 2023 21:11:18.767      162.08136161
24 Sep 2023 13:49:07.868    24 Sep 2023 13:51:25.936      138.06842545
24 Sep 2023 20:17:33.886    24 Sep 2023 20:20:24.261      170.37481957
25 Sep 2023 14:34:51.315    25 Sep 2023 14:36:43.431      112.11613398
25 Sep 2023 19:26:51.247    25 Sep 2023 19:28:53.383      122.13640187
26 Sep 2023 13:43:13.403    26 Sep 2023 13:46:01.036      167.63315991
26 Sep 2023 20:12:12.355    26 Sep 2023 20:14:20.812      128.45681934
27 Sep 2023 12:52:04.977    27 Sep 2023 12:54:50.267      165.29001544
27 Sep 2023 19:20:41.958    27 Sep 2023 19:23:35.053      173.09472850
28 Sep 2023 12:01:47.365    28 Sep 2023 12:02:49.821      62.456020620
28 Sep 2023 13:38:34.865    28 Sep 2023 13:39:06.876      32.010523102
28 Sep 2023 18:29:35.832    28 Sep 2023 18:32:08.477      152.64468163
29 Sep 2023 12:46:12.133    29 Sep 2023 12:48:41.501      149.36739322
29 Sep 2023 17:39:01.450    29 Sep 2023 17:39:53.652      52.202048502
29 Sep 2023 19:15:41.708    29 Sep 2023 19:16:15.429      33.720363141
30 Sep 2023 11:54:36.452    30 Sep 2023 11:57:30.023      173.57075344
30 Sep 2023 18:23:19.526    30 Sep 2023 18:26:01.934      162.40824923
01 Oct 2023 11:03:33.244    01 Oct 2023 11:05:47.200      133.95642615
01 Oct 2023 17:31:50.350    01 Oct 2023 17:34:38.655      168.30447963
02 Oct 2023 11:48:41.597    02 Oct 2023 11:50:39.667      118.06974784
02 Oct 2023 16:40:42.364    02 Oct 2023 16:42:37.325      114.96090519
03 Oct 2023 10:56:38.172    03 Oct 2023 10:59:27.724      169.55180521
03 Oct 2023 17:25:27.589    03 Oct 2023 17:27:42.856      135.26677567
04 Oct 2023 10:05:04.915    04 Oct 2023 10:07:46.688      161.77368971
04 Oct 2023 16:33:32.488    04 Oct 2023 16:36:25.204      172.71501131
05 Oct 2023 10:50:46.468    05 Oct 2023 10:51:49.320      62.852044799
05 Oct 2023 15:42:00.995    05 Oct 2023 15:44:26.774      145.77927995
06 Oct 2023 09:58:08.077    06 Oct 2023 10:00:43.887      155.81005780
06 Oct 2023 16:27:13.066    06 Oct 2023 16:28:29.871      76.805329858
07 Oct 2023 09:06:08.224    07 Oct 2023 09:09:00.844      172.61989452
07 Oct 2023 15:34:41.237    07 Oct 2023 15:37:27.985      166.74842258
08 Oct 2023 08:14:45.157    08 Oct 2023 08:16:42.065      116.90827757
08 Oct 2023 14:42:47.398    08 Oct 2023 14:45:30.617      163.21898808
09 Oct 2023 08:59:04.961    09 Oct 2023 09:01:17.795      132.83407821
09 Oct 2023 13:51:17.265    09 Oct 2023 13:52:51.966      94.701364415
10 Oct 2023 08:06:38.945    10 Oct 2023 08:09:31.805      172.86016429
10 Oct 2023 14:35:16.155    10 Oct 2023 14:37:45.766      149.61139115
11 Oct 2023 07:14:44.342    11 Oct 2023 07:17:15.293      150.95132806
11 Oct 2023 13:42:58.617    11 Oct 2023 13:45:49.885      171.26837550
12 Oct 2023 07:59:28.760    12 Oct 2023 08:01:06.925      98.165384552
12 Oct 2023 12:51:03.405    12 Oct 2023 12:53:13.601      130.19601982
13 Oct 2023 07:06:34.264    13 Oct 2023 07:09:19.585      165.32032953
13 Oct 2023 13:35:17.905    13 Oct 2023 13:37:15.507      117.60187796
14 Oct 2023 06:14:12.730    14 Oct 2023 06:16:59.917      167.18705900
14 Oct 2023 12:42:32.554    14 Oct 2023 12:45:24.050      171.49641502
15 Oct 2023 05:22:43.164    15 Oct 2023 05:23:48.923      65.759370360
15 Oct 2023 06:59:28.727    15 Oct 2023 06:59:58.764      30.036978121
15 Oct 2023 11:50:14.879    15 Oct 2023 11:52:46.330      151.45102391
16 Oct 2023 06:05:51.769    16 Oct 2023 06:08:23.195      151.42565472
16 Oct 2023 10:58:35.036    16 Oct 2023 10:59:12.151      37.115084531
16 Oct 2023 12:34:55.220    16 Oct 2023 12:35:45.506      50.286478526
17 Oct 2023 05:13:04.688    17 Oct 2023 05:15:58.066      173.37809172
17 Oct 2023 11:41:27.337    17 Oct 2023 11:44:11.889      164.55167485
18 Oct 2023 04:20:54.469    18 Oct 2023 04:22:56.521      122.05234228
18 Oct 2023 10:48:47.245    18 Oct 2023 10:51:31.408      164.16279771
19 Oct 2023 05:04:29.400    19 Oct 2023 05:06:41.077      131.67666740
19 Oct 2023 09:56:31.512    19 Oct 2023 09:58:07.364      95.852210303
20 Oct 2023 04:11:16.762    20 Oct 2023 04:14:09.652      172.88951499
20 Oct 2023 10:39:41.413    20 Oct 2023 10:42:11.871      150.45875064
21 Oct 2023 03:18:37.148    21 Oct 2023 03:21:05.491      148.34247264
21 Oct 2023 09:46:37.869    21 Oct 2023 09:49:28.499      170.62979958
22 Oct 2023 04:02:25.882    22 Oct 2023 04:04:11.255      105.37277731
22 Oct 2023 08:53:57.586    22 Oct 2023 08:56:02.201      124.61482021
23 Oct 2023 03:08:46.487    23 Oct 2023 03:11:34.149      167.66240689
23 Oct 2023 09:37:13.955    23 Oct 2023 09:39:22.332      128.37675068
24 Oct 2023 02:15:40.895    24 Oct 2023 02:18:23.462      162.56661534
24 Oct 2023 08:43:44.984    24 Oct 2023 08:46:37.168      172.18427811
25 Oct 2023 02:59:42.180    25 Oct 2023 03:00:50.426      68.246784259
25 Oct 2023 07:50:42.515    25 Oct 2023 07:53:05.527      143.01178276
26 Oct 2023 02:05:32.241    26 Oct 2023 02:08:11.226      158.98504027
26 Oct 2023 08:34:05.845    26 Oct 2023 08:35:40.947      95.102341357
27 Oct 2023 01:12:02.396    27 Oct 2023 01:14:52.195      169.79871690
27 Oct 2023 07:40:07.581    27 Oct 2023 07:42:57.360      169.77861165
28 Oct 2023 00:19:20.214    28 Oct 2023 00:20:45.962      85.747868044
28 Oct 2023 06:46:43.882    28 Oct 2023 06:49:19.066      155.18416035
29 Oct 2023 01:01:33.186    29 Oct 2023 01:04:00.965      147.77819286
29 Oct 2023 05:53:55.324    29 Oct 2023 05:54:45.563      50.239306118
29 Oct 2023 07:30:28.241    29 Oct 2023 07:30:56.272      28.031534236
30 Oct 2023 00:07:40.197    30 Oct 2023 00:10:32.757      172.55996664
30 Oct 2023 06:35:45.303    30 Oct 2023 06:38:29.487      164.18455441
30 Oct 2023 23:14:27.173    30 Oct 2023 23:16:25.287      118.11413819
31 Oct 2023 05:42:00.898    31 Oct 2023 05:44:43.961      163.06328208
31 Oct 2023 23:56:49.102    31 Oct 2023 23:59:03.825      134.72206837
01 Nov 2023 04:48:43.999    01 Nov 2023 04:50:10.738      86.738914833
01 Nov 2023 23:02:33.756    01 Nov 2023 23:05:26.157      172.40125132
02 Nov 2023 05:30:38.227    02 Nov 2023 05:33:14.310      156.08292207
02 Nov 2023 22:08:55.627    02 Nov 2023 22:11:12.235      136.60819272
03 Nov 2023 04:36:33.455    03 Nov 2023 04:39:21.296      167.84075189
03 Nov 2023 22:51:20.105    03 Nov 2023 22:53:20.437      120.33193444
04 Nov 2023 03:42:54.584    04 Nov 2023 03:44:42.090      107.50613774
04 Nov 2023 21:56:42.926    04 Nov 2023 21:59:33.318      170.39147797
05 Nov 2023 04:24:46.558    05 Nov 2023 04:27:12.681      146.12291021
05 Nov 2023 21:02:42.505    05 Nov 2023 21:05:10.620      148.11469840
06 Nov 2023 03:30:21.623    06 Nov 2023 03:33:11.996      170.37298204
06 Nov 2023 21:45:06.310    06 Nov 2023 21:46:51.335      105.02455984
07 Nov 2023 02:36:23.113    07 Nov 2023 02:38:24.456      121.34210706
07 Nov 2023 20:50:07.558    07 Nov 2023 20:52:54.885      167.32641463
08 Nov 2023 03:18:10.302    08 Nov 2023 03:20:25.281      134.97896385
08 Nov 2023 19:55:46.590    08 Nov 2023 19:58:21.962      155.37217293
09 Nov 2023 02:23:25.304    09 Nov 2023 02:26:16.636      171.33203343
09 Nov 2023 20:38:07.558    09 Nov 2023 20:39:36.744      89.185863943
10 Nov 2023 01:29:08.393    10 Nov 2023 01:31:19.257      130.86367801
10 Nov 2023 19:42:47.245    10 Nov 2023 19:45:31.080      163.83433471
11 Nov 2023 02:10:49.053    11 Nov 2023 02:12:52.474      123.42095159
11 Nov 2023 18:48:06.928    11 Nov 2023 18:50:46.780      159.85180282
12 Nov 2023 01:15:44.067    12 Nov 2023 01:18:35.339      171.27228157
12 Nov 2023 19:30:23.277    12 Nov 2023 19:31:36.541      73.263862822
13 Nov 2023 00:21:09.512    13 Nov 2023 00:23:26.839      137.32676280
13 Nov 2023 18:34:41.269    13 Nov 2023 18:37:21.699      160.42995988
14 Nov 2023 01:02:41.940    14 Nov 2023 01:04:34.332      112.39207451
14 Nov 2023 17:39:42.514    14 Nov 2023 17:42:24.968      162.45449439
15 Nov 2023 00:07:17.183    15 Nov 2023 00:10:07.842      170.65908207
15 Nov 2023 18:21:52.489    15 Nov 2023 18:22:50.437      57.948143303
15 Nov 2023 23:12:25.539    15 Nov 2023 23:14:46.991      141.45255703
16 Nov 2023 17:25:48.740    16 Nov 2023 17:28:26.275      157.53532442
16 Nov 2023 23:53:47.767    16 Nov 2023 23:55:30.821      103.05336473
17 Nov 2023 16:30:32.362    17 Nov 2023 16:33:16.121      163.75894442
17 Nov 2023 22:58:03.832    17 Nov 2023 23:00:53.704      169.87181925
18 Nov 2023 17:12:33.832    18 Nov 2023 17:13:18.430      44.597925281
18 Nov 2023 22:02:55.633    18 Nov 2023 22:05:19.317      143.68388420
19 Nov 2023 16:16:08.858    19 Nov 2023 16:18:44.335      155.47629409
19 Nov 2023 22:44:05.329    19 Nov 2023 22:45:42.023      96.694159065
20 Nov 2023 15:20:35.737    20 Nov 2023 15:23:19.862      164.12494493
20 Nov 2023 21:48:03.390    20 Nov 2023 21:50:52.579      169.18830355
21 Nov 2023 14:26:16.868    21 Nov 2023 14:26:42.807      25.939012330
21 Nov 2023 16:02:25.437    21 Nov 2023 16:03:01.501      36.064052652
21 Nov 2023 20:52:39.287    21 Nov 2023 20:55:03.569      144.28191487
22 Nov 2023 15:05:41.211    22 Nov 2023 15:08:15.673      154.46142016
22 Nov 2023 21:33:33.847    22 Nov 2023 21:35:08.248      94.400954596
23 Nov 2023 14:09:52.390    23 Nov 2023 14:12:36.128      163.73816526
23 Nov 2023 20:37:15.698    23 Nov 2023 20:40:04.461      168.76306885
24 Nov 2023 13:15:21.978    24 Nov 2023 13:15:40.104      18.126199837
24 Nov 2023 14:51:25.435    24 Nov 2023 14:52:01.579      36.144451972
24 Nov 2023 19:41:36.525    24 Nov 2023 19:43:59.884      143.35930652
25 Nov 2023 13:54:25.970    25 Nov 2023 13:57:00.530      154.55974869
25 Nov 2023 20:22:13.389    25 Nov 2023 20:23:49.962      96.572345390
26 Nov 2023 12:58:22.694    26 Nov 2023 13:01:05.320      162.62615095
26 Nov 2023 19:25:41.188    26 Nov 2023 19:28:29.800      168.61264596
27 Nov 2023 13:39:34.494    27 Nov 2023 13:40:19.150      44.656235981
27 Nov 2023 18:29:47.971    27 Nov 2023 18:32:08.861      140.88952731
28 Nov 2023 12:42:23.914    28 Nov 2023 12:44:59.611      155.69658150
28 Nov 2023 19:10:04.989    28 Nov 2023 19:11:47.673      102.68481004
29 Nov 2023 11:46:07.599    29 Nov 2023 11:48:48.258      160.65936419
29 Nov 2023 18:13:20.826    29 Nov 2023 18:16:09.441      168.61468905
30 Nov 2023 12:26:55.584    30 Nov 2023 12:27:53.284      57.700438262
30 Nov 2023 17:17:14.727    30 Nov 2023 17:19:31.430      136.70296753
01 Dec 2023 11:29:36.255    01 Dec 2023 11:32:13.921      157.66554022
01 Dec 2023 17:57:10.314    01 Dec 2023 17:59:01.900      111.58599610
02 Dec 2023 10:33:08.418    02 Dec 2023 10:35:45.960      157.54181453
02 Dec 2023 17:00:15.879    02 Dec 2023 17:03:04.402      168.52286321
03 Dec 2023 11:13:31.294    03 Dec 2023 11:14:43.794      72.499814525
03 Dec 2023 16:03:58.122    03 Dec 2023 16:06:08.579      130.45748051
04 Dec 2023 10:16:04.346    04 Dec 2023 10:18:44.495      160.14908231
04 Dec 2023 16:43:31.138    04 Dec 2023 16:45:33.135      121.99732661
05 Dec 2023 09:19:26.555    05 Dec 2023 09:21:59.335      152.78000326
05 Dec 2023 15:46:27.606    05 Dec 2023 15:49:15.595      167.98888464
06 Dec 2023 09:59:23.369    06 Dec 2023 10:00:51.116      87.747193978
06 Dec 2023 14:49:59.466    06 Dec 2023 14:52:01.030      121.56382810
07 Dec 2023 09:01:49.387    07 Dec 2023 09:04:32.127      162.73993560
07 Dec 2023 15:29:08.913    07 Dec 2023 15:31:21.721      132.80849936
08 Dec 2023 08:05:03.276    08 Dec 2023 08:07:28.878      145.60181190
08 Dec 2023 14:31:57.002    08 Dec 2023 14:34:43.580      166.57813647
09 Dec 2023 08:44:32.879    09 Dec 2023 08:46:15.667      102.78793102
09 Dec 2023 13:35:19.908    09 Dec 2023 13:37:08.911      109.00380897
10 Dec 2023 07:46:52.223    10 Dec 2023 07:49:37.171      164.94789046
10 Dec 2023 14:14:04.559    10 Dec 2023 14:16:27.688      143.12832275
11 Dec 2023 06:49:59.652    11 Dec 2023 06:52:14.414      134.76137866
11 Dec 2023 13:16:44.649    11 Dec 2023 13:19:28.420      163.77122652
12 Dec 2023 07:29:00.325    12 Dec 2023 07:30:57.528      117.20257855
12 Dec 2023 12:20:00.618    12 Dec 2023 12:21:31.400      90.782116097
13 Dec 2023 06:31:13.300    13 Dec 2023 06:33:59.479      166.17939372
13 Dec 2023 12:58:18.455    13 Dec 2023 13:00:50.690      152.23480593
14 Dec 2023 05:34:16.826    14 Dec 2023 05:36:14.837      118.01096188
14 Dec 2023 12:00:50.746    14 Dec 2023 12:03:29.688      158.94186383
15 Dec 2023 06:12:45.792    15 Dec 2023 06:14:56.412      130.61996831
15 Dec 2023 11:04:04.146    15 Dec 2023 11:05:05.503      61.357494467
16 Dec 2023 05:14:52.806    16 Dec 2023 05:17:38.488      165.68110666
16 Dec 2023 11:41:50.600    16 Dec 2023 11:44:30.089      159.48865477
17 Dec 2023 04:17:57.154    17 Dec 2023 04:19:27.292      90.138634876
17 Dec 2023 10:44:15.312    17 Dec 2023 10:46:46.602      151.29063012
18 Dec 2023 04:55:49.201    18 Dec 2023 04:58:11.824      142.62265699
18 Dec 2023 11:23:19.752    18 Dec 2023 11:24:13.069      53.317887476
19 Dec 2023 03:57:50.958    19 Dec 2023 04:00:33.404      162.44666590
19 Dec 2023 10:24:40.886    19 Dec 2023 10:27:25.155      164.26903456
20 Dec 2023 03:01:17.237    20 Dec 2023 03:01:34.644      17.406773544
20 Dec 2023 09:26:58.509    20 Dec 2023 09:29:18.220      139.71149923
21 Dec 2023 03:38:10.596    21 Dec 2023 03:40:43.292      152.69548853
21 Dec 2023 10:05:20.164    21 Dec 2023 10:07:01.967      101.80281767
22 Dec 2023 02:40:08.332    22 Dec 2023 02:42:43.360      155.02800109
22 Dec 2023 09:06:49.375    22 Dec 2023 09:09:35.295      165.92081662
23 Dec 2023 03:18:48.755    23 Dec 2023 03:20:03.905      75.149747659
23 Dec 2023 08:09:01.041    23 Dec 2023 08:11:03.484      122.44291361
24 Dec 2023 02:19:50.364    24 Dec 2023 02:22:30.531      160.16768856
24 Dec 2023 08:46:47.421    24 Dec 2023 08:48:57.525      130.10362317
25 Dec 2023 01:21:46.269    25 Dec 2023 01:24:07.336      141.06681179
25 Dec 2023 07:48:16.472    25 Dec 2023 07:51:00.165      163.69272225
26 Dec 2023 01:59:45.866    26 Dec 2023 02:01:33.542      107.67601586
26 Dec 2023 06:50:24.881    26 Dec 2023 06:52:00.710      95.828218467
27 Dec 2023 01:00:49.354    27 Dec 2023 01:03:33.479      164.12523914
27 Dec 2023 07:27:36.508    27 Dec 2023 07:30:05.255      148.74745121
28 Dec 2023 00:02:47.643    28 Dec 2023 00:04:43.436      115.79268125
28 Dec 2023 06:29:02.999    28 Dec 2023 06:31:39.635      156.63569737
29 Dec 2023 00:40:05.329    29 Dec 2023 00:42:16.336      131.00668292
29 Dec 2023 05:31:17.926    29 Dec 2023 05:32:02.871      44.944844604
29 Dec 2023 23:41:08.877    29 Dec 2023 23:43:52.137      163.26030343
30 Dec 2023 06:07:46.805    30 Dec 2023 06:10:26.750      159.94438995
30 Dec 2023 22:43:21.633    30 Dec 2023 22:44:23.877      62.243608525
31 Dec 2023 05:09:10.178    31 Dec 2023 05:11:33.539      143.36041859
31 Dec 2023 23:19:46.419    31 Dec 2023 23:22:14.474      148.05482144
01 Jan 2024 05:46:45.494    01 Jan 2024 05:48:13.468      87.973955472
01 Jan 2024 22:20:50.680    01 Jan 2024 22:23:26.203      155.52249304
02 Jan 2024 04:47:18.572    02 Jan 2024 04:50:02.790      164.21738622
02 Jan 2024 22:58:40.653    02 Jan 2024 22:59:50.011      69.357451703
03 Jan 2024 03:48:39.767    03 Jan 2024 03:50:41.092      121.32476124
03 Jan 2024 21:58:49.606    03 Jan 2024 22:01:28.753      159.14741931
04 Jan 2024 04:25:32.212    04 Jan 2024 04:27:41.898      129.68649294
04 Jan 2024 20:59:57.206    04 Jan 2024 21:02:14.320      137.11384905
05 Jan 2024 03:26:12.250    05 Jan 2024 03:28:53.556      161.30619734
05 Jan 2024 21:36:58.654    05 Jan 2024 21:38:51.093      112.43866574
06 Jan 2024 02:27:35.429    06 Jan 2024 02:28:59.043      83.614074485
06 Jan 2024 20:37:15.603    06 Jan 2024 20:39:59.081      163.47873855
07 Jan 2024 03:03:47.091    07 Jan 2024 03:06:19.033      151.94157427
07 Jan 2024 19:38:33.608    07 Jan 2024 19:40:11.661      98.053562525
08 Jan 2024 02:04:28.252    08 Jan 2024 02:06:58.449      150.19713374
08 Jan 2024 20:14:44.052    08 Jan 2024 20:17:03.270      139.21766075
09 Jan 2024 02:41:48.237    09 Jan 2024 02:42:33.603      45.365979918
09 Jan 2024 19:15:05.246    09 Jan 2024 19:17:44.332      159.08615116
10 Jan 2024 01:41:26.107    10 Jan 2024 01:44:08.054      161.94678806
10 Jan 2024 19:52:33.962    10 Jan 2024 19:53:14.710      40.748354781
11 Jan 2024 00:42:07.228    11 Jan 2024 00:44:15.678      128.45017333
11 Jan 2024 18:51:53.290    11 Jan 2024 18:54:29.209      155.91888906
12 Jan 2024 01:18:28.587    12 Jan 2024 01:20:27.955      119.36846464
12 Jan 2024 17:52:20.047    12 Jan 2024 17:54:41.827      141.78003652
13 Jan 2024 00:18:27.597    13 Jan 2024 00:21:08.885      161.28860100
13 Jan 2024 18:28:48.428    13 Jan 2024 18:30:34.713      106.28460129
13 Jan 2024 23:19:11.897    13 Jan 2024 23:20:40.572      88.675228448
14 Jan 2024 17:28:25.395    14 Jan 2024 17:31:08.293      162.89838217
14 Jan 2024 23:54:47.427    14 Jan 2024 23:57:16.845      149.41843743
15 Jan 2024 16:29:05.105    15 Jan 2024 16:30:44.718      99.612791080
15 Jan 2024 22:54:50.672    15 Jan 2024 22:57:20.095      149.42278827
16 Jan 2024 17:04:36.457    16 Jan 2024 17:06:55.593      139.13633324
16 Jan 2024 23:31:29.361    16 Jan 2024 23:32:16.515      47.153453564
17 Jan 2024 16:04:20.526    17 Jan 2024 16:06:58.487      157.96099193
17 Jan 2024 22:30:30.627    17 Jan 2024 22:33:11.933      161.30629729
18 Jan 2024 16:41:01.388    18 Jan 2024 16:41:54.577      53.189307090
18 Jan 2024 21:30:35.688    18 Jan 2024 21:32:38.888      123.20050638
19 Jan 2024 15:39:48.028    19 Jan 2024 15:42:25.598      157.56982716
19 Jan 2024 22:06:10.838    19 Jan 2024 22:08:16.628      125.79025609
20 Jan 2024 14:39:40.928    20 Jan 2024 14:41:55.864      134.93602630
20 Jan 2024 21:05:35.210    20 Jan 2024 21:08:13.915      158.70493467
21 Jan 2024 15:15:18.107    21 Jan 2024 15:17:14.797      116.68993297
21 Jan 2024 20:05:48.453    21 Jan 2024 20:06:57.358      68.905046443
22 Jan 2024 14:14:21.992    22 Jan 2024 14:17:04.565      162.57365299
22 Jan 2024 20:40:31.049    22 Jan 2024 20:43:05.328      154.27857408
23 Jan 2024 13:14:38.744    23 Jan 2024 13:15:47.148      68.403778668
23 Jan 2024 19:40:00.663    23 Jan 2024 19:42:21.560      140.89695001
24 Jan 2024 13:49:06.183    24 Jan 2024 13:51:34.162      147.97897569
24 Jan 2024 20:15:32.423    24 Jan 2024 20:17:03.893      91.469872312
25 Jan 2024 12:48:19.904    25 Jan 2024 12:50:50.266      150.36241523
25 Jan 2024 19:14:14.967    25 Jan 2024 19:16:56.274      161.30719531
26 Jan 2024 13:23:53.354    26 Jan 2024 13:25:24.304      90.949461737
26 Jan 2024 18:13:49.721    26 Jan 2024 18:15:30.971      101.25015490
27 Jan 2024 12:22:18.085    27 Jan 2024 12:24:59.921      161.83636759
27 Jan 2024 18:48:24.589    27 Jan 2024 18:50:48.306      143.71649127
28 Jan 2024 11:21:48.513    28 Jan 2024 11:23:35.751      107.23733042
28 Jan 2024 17:47:20.469    28 Jan 2024 17:49:50.641      150.17197325
29 Jan 2024 11:56:15.743    29 Jan 2024 11:58:33.284      137.54044444
29 Jan 2024 18:22:54.315    29 Jan 2024 18:23:33.005      38.690697402
30 Jan 2024 10:54:54.349    30 Jan 2024 10:57:31.488      157.13897020
30 Jan 2024 17:20:46.799    30 Jan 2024 17:23:27.368      160.56871328
31 Jan 2024 11:30:19.472    31 Jan 2024 11:31:23.241      63.768081937
31 Jan 2024 16:19:48.933    31 Jan 2024 16:21:46.136      117.20322040
01 Feb 2024 10:28:05.423    01 Feb 2024 10:30:44.669      159.24558062
01 Feb 2024 16:54:08.334    01 Feb 2024 16:56:21.472      133.13708244
02 Feb 2024 09:27:00.020    02 Feb 2024 09:29:03.511      123.49149159
02 Feb 2024 15:52:32.112    02 Feb 2024 15:55:06.790      154.67828242
03 Feb 2024 10:01:13.710    03 Feb 2024 10:03:22.667      128.95733903
03 Feb 2024 14:52:03.369    03 Feb 2024 14:52:18.389      15.020336327
04 Feb 2024 08:59:20.243    04 Feb 2024 09:01:59.910      159.66695482
04 Feb 2024 15:25:07.926    04 Feb 2024 15:27:46.890      158.96348536
05 Feb 2024 09:34:32.944    05 Feb 2024 09:35:10.813      37.868710246
05 Feb 2024 14:23:40.162    05 Feb 2024 14:25:44.946      124.78426646
06 Feb 2024 08:31:40.360    06 Feb 2024 08:34:17.312      156.95211275
06 Feb 2024 14:57:38.109    06 Feb 2024 14:59:44.179      126.07033246
07 Feb 2024 07:30:03.956    07 Feb 2024 07:32:13.590      129.63468649
07 Feb 2024 13:55:31.623    07 Feb 2024 13:58:07.987      156.36360822
08 Feb 2024 08:03:55.240    08 Feb 2024 08:05:59.654      124.41458744
08 Feb 2024 12:54:25.060    08 Feb 2024 12:55:04.714      39.654430607
09 Feb 2024 07:01:32.151    09 Feb 2024 07:04:12.130      159.97952007
09 Feb 2024 13:27:13.096    09 Feb 2024 13:29:51.248      158.15203269
10 Feb 2024 07:36:22.504    10 Feb 2024 07:36:47.838      25.334269018
10 Feb 2024 12:25:17.048    10 Feb 2024 12:27:23.343      126.29540636
11 Feb 2024 06:32:56.331    11 Feb 2024 06:35:32.491      156.15996947
11 Feb 2024 12:58:46.490    11 Feb 2024 13:00:51.807      125.31696197
12 Feb 2024 05:30:52.204    12 Feb 2024 05:33:00.726      128.52189580
12 Feb 2024 11:56:11.793    12 Feb 2024 11:58:47.804      156.01150668
13 Feb 2024 06:04:12.146    13 Feb 2024 06:06:17.429      125.28326672
13 Feb 2024 10:54:41.343    13 Feb 2024 10:55:11.245      29.901950690
14 Feb 2024 05:01:21.652    14 Feb 2024 05:04:00.296      158.64431842
14 Feb 2024 11:26:53.724    14 Feb 2024 11:29:32.472      158.74826009
15 Feb 2024 05:35:30.964    15 Feb 2024 05:36:13.892      42.927860096
15 Feb 2024 10:24:30.687    15 Feb 2024 10:26:32.442      121.75546261
16 Feb 2024 04:31:43.974    16 Feb 2024 04:34:21.067      157.09270587
16 Feb 2024 10:57:23.822    16 Feb 2024 10:59:35.269      131.44659391
17 Feb 2024 03:29:15.639    17 Feb 2024 03:31:14.902      119.26363909
17 Feb 2024 09:54:23.065    17 Feb 2024 09:56:56.287      153.22183130
18 Feb 2024 04:01:54.610    18 Feb 2024 04:04:06.086      131.47594807
19 Feb 2024 02:58:39.279    19 Feb 2024 03:01:14.063      154.78360334
19 Feb 2024 09:24:00.141    19 Feb 2024 09:26:40.122      159.98131862
20 Feb 2024 03:31:58.275    20 Feb 2024 03:33:09.231      70.955980488
20 Feb 2024 08:21:12.161    20 Feb 2024 08:23:01.103      108.94204513
21 Feb 2024 02:27:54.122    21 Feb 2024 02:30:32.878      158.75560138
21 Feb 2024 08:53:21.529    21 Feb 2024 08:55:43.570      142.04142995
22 Feb 2024 01:25:07.983    22 Feb 2024 01:26:43.755      95.771732088
22 Feb 2024 07:49:56.832    22 Feb 2024 07:52:23.021      146.18945299
23 Feb 2024 01:56:54.614    23 Feb 2024 01:59:15.810      141.19679657
23 Feb 2024 08:22:36.454    23 Feb 2024 08:23:56.852      80.397746817
24 Feb 2024 00:53:18.112    24 Feb 2024 00:55:43.585      145.47239668
24 Feb 2024 07:18:24.915    24 Feb 2024 07:21:04.459      159.54416423
25 Feb 2024 01:25:41.462    25 Feb 2024 01:27:21.176      99.713591742
25 Feb 2024 06:15:16.932    25 Feb 2024 06:16:37.726      80.794239650
26 Feb 2024 00:21:20.862    26 Feb 2024 00:23:59.431      158.56826585
26 Feb 2024 06:46:34.342    26 Feb 2024 06:49:07.063      152.72080272
27 Feb 2024 05:42:48.050    27 Feb 2024 05:44:59.178      131.12827500
27 Feb 2024 23:49:07.757    27 Feb 2024 23:51:38.933      151.17553443
28 Feb 2024 06:14:27.794    28 Feb 2024 06:16:27.791      119.99766153
28 Feb 2024 22:45:16.205    28 Feb 2024 22:47:19.747      123.54165759
29 Feb 2024 05:10:03.971    29 Feb 2024 05:12:37.588      153.61699361
29 Feb 2024 23:16:37.037    29 Feb 2024 23:18:42.935      125.89768579
01 Mar 2024 22:12:01.821    01 Mar 2024 22:14:33.399      151.57809493
02 Mar 2024 04:36:59.327    02 Mar 2024 04:39:37.770      158.44383042
02 Mar 2024 22:43:52.386    02 Mar 2024 22:45:06.661      74.275041895
03 Mar 2024 03:32:55.538    03 Mar 2024 03:34:35.098      99.559337273
03 Mar 2024 21:38:31.637    03 Mar 2024 21:41:08.347      156.71024717
04 Mar 2024 04:03:33.629    04 Mar 2024 04:05:59.470      145.84050818
04 Mar 2024 20:34:42.508    04 Mar 2024 20:35:43.710      61.202601297
05 Mar 2024 02:58:54.445    05 Mar 2024 03:01:10.698      136.25231304
05 Mar 2024 21:04:41.298    05 Mar 2024 21:07:07.513      146.21511167
06 Mar 2024 03:29:49.900    06 Mar 2024 03:31:38.658      108.75813381
06 Mar 2024 19:59:56.455    06 Mar 2024 20:02:03.599      127.14336400
07 Mar 2024 02:24:32.372    07 Mar 2024 02:27:05.900      153.52809881
07 Mar 2024 20:30:29.440    07 Mar 2024 20:32:30.499      121.05936524
08 Mar 2024 19:25:02.678    08 Mar 2024 19:27:32.814      150.13596994
09 Mar 2024 01:49:45.843    09 Mar 2024 01:52:22.659      156.81588681
09 Mar 2024 19:55:58.699    09 Mar 2024 19:57:12.575      73.876309523
10 Mar 2024 00:44:53.315    10 Mar 2024 00:46:27.425      94.109981961
10 Mar 2024 18:49:47.561    10 Mar 2024 18:52:22.791      155.22905864
11 Mar 2024 01:14:33.795    11 Mar 2024 01:17:00.256      146.46154968
11 Mar 2024 17:45:24.393    11 Mar 2024 17:45:49.550      25.156995538
12 Mar 2024 00:09:05.878    12 Mar 2024 00:11:15.127      129.24947119
12 Mar 2024 18:14:07.080    12 Mar 2024 18:16:35.134      148.05434587
13 Mar 2024 00:38:57.026    13 Mar 2024 00:40:55.898      118.87216094
13 Mar 2024 17:08:37.767    13 Mar 2024 17:10:30.288      112.52147370
13 Mar 2024 23:32:52.874    13 Mar 2024 23:35:20.444      147.57042581
14 Mar 2024 17:37:59.121    14 Mar 2024 17:40:09.397      130.27622929
15 Mar 2024 00:03:05.276    15 Mar 2024 00:03:57.750      52.473781211
15 Mar 2024 16:31:47.426    15 Mar 2024 16:34:08.224      140.79792463
15 Mar 2024 22:56:10.384    15 Mar 2024 22:58:45.145      154.76115828
16 Mar 2024 17:01:23.138    16 Mar 2024 17:03:03.552      100.41321265
16 Mar 2024 21:50:39.184    16 Mar 2024 21:51:32.063      52.878255607
17 Mar 2024 15:54:31.103    17 Mar 2024 15:57:03.132      152.02964649
17 Mar 2024 22:18:56.562    17 Mar 2024 22:21:29.007      152.44538711
18 Mar 2024 16:24:25.008    18 Mar 2024 16:25:09.264      44.255812559
18 Mar 2024 21:12:44.326    18 Mar 2024 21:14:26.989      102.66335540
19 Mar 2024 15:16:44.255    19 Mar 2024 15:19:17.222      152.96696507
19 Mar 2024 21:41:10.472    19 Mar 2024 21:43:31.088      140.61612933
20 Mar 2024 14:10:56.106    20 Mar 2024 14:11:35.899      39.792994782
20 Mar 2024 20:34:24.062    20 Mar 2024 20:36:32.161      128.09903047
21 Mar 2024 14:38:24.441    21 Mar 2024 14:40:50.854      146.41274123
21 Mar 2024 21:02:52.242    21 Mar 2024 21:04:49.634      117.39183711
22 Mar 2024 13:31:39.929    22 Mar 2024 13:33:24.744      104.81530133
22 Mar 2024 19:55:30.800    22 Mar 2024 19:57:53.647      142.84730782
23 Mar 2024 13:59:30.103    23 Mar 2024 14:01:43.782      133.67955711
23 Mar 2024 20:24:05.255    23 Mar 2024 20:25:19.912      74.656463019
24 Mar 2024 12:52:05.281    24 Mar 2024 12:54:16.394      131.11324635
24 Mar 2024 19:16:02.176    24 Mar 2024 19:18:32.563      150.38696184
25 Mar 2024 13:20:00.334    25 Mar 2024 13:21:55.392      115.05784378
26 Mar 2024 12:11:58.547    26 Mar 2024 12:14:23.074      144.52755953
26 Mar 2024 18:35:56.884    26 Mar 2024 18:38:29.204      152.32049497
27 Mar 2024 12:39:55.082    27 Mar 2024 12:41:24.429      89.346868778
27 Mar 2024 17:28:41.160    27 Mar 2024 17:29:40.375      59.215747635
28 Mar 2024 11:31:16.362    28 Mar 2024 11:33:46.929      150.56693943
28 Mar 2024 17:55:14.023    28 Mar 2024 17:57:43.605      149.58289195
29 Mar 2024 11:59:17.237    29 Mar 2024 12:00:06.824      49.587387883
29 Mar 2024 16:47:22.419    29 Mar 2024 16:48:55.527      93.107828626
30 Mar 2024 10:49:56.881    30 Mar 2024 10:52:28.662      151.78123863
30 Mar 2024 17:13:52.869    30 Mar 2024 17:16:15.661      142.79181187
31 Mar 2024 16:05:29.999    31 Mar 2024 16:07:22.960      112.96097890
01 Apr 2024 10:07:58.747    01 Apr 2024 10:10:28.441      149.69393288
01 Apr 2024 16:31:52.756    01 Apr 2024 16:34:05.131      132.37462429
02 Apr 2024 09:00:00.238    02 Apr 2024 09:00:49.323      49.085164885
02 Apr 2024 15:22:59.774    02 Apr 2024 15:25:05.804      126.02968065
03 Apr 2024 09:25:20.771    03 Apr 2024 09:27:46.132      145.36034991
03 Apr 2024 15:49:13.004    03 Apr 2024 15:51:11.610      118.60570255
04 Apr 2024 08:16:39.405    04 Apr 2024 08:18:06.987      87.582457205
04 Apr 2024 14:39:49.906    04 Apr 2024 14:42:04.687      134.78169639
05 Apr 2024 08:42:01.774    05 Apr 2024 08:44:21.369      139.59529493
05 Apr 2024 15:05:52.903    05 Apr 2024 15:07:34.475      101.57204953
06 Apr 2024 07:32:46.033    06 Apr 2024 07:34:33.251      107.21772588
06 Apr 2024 13:55:59.002    06 Apr 2024 13:58:19.529      140.52736780
07 Apr 2024 07:58:00.518    07 Apr 2024 08:00:13.605      133.08669326
07 Apr 2024 14:21:51.793    07 Apr 2024 14:23:12.784      80.990248884
08 Apr 2024 06:48:13.600    08 Apr 2024 06:50:12.751      119.15151972
08 Apr 2024 13:11:25.768    08 Apr 2024 13:13:49.891      144.12373861
09 Apr 2024 07:13:15.691    09 Apr 2024 07:15:22.150      126.45825500
09 Apr 2024 13:37:09.500    09 Apr 2024 13:38:04.874      55.373234279
10 Apr 2024 06:02:59.459    10 Apr 2024 06:05:06.062      126.60219942
10 Apr 2024 12:26:08.925    10 Apr 2024 12:28:35.122      146.19689140
11 Apr 2024 06:27:45.927    11 Apr 2024 06:29:46.229      120.30171056
11 Apr 2024 12:51:52.866    11 Apr 2024 12:52:01.910      9.0440589585
12 Apr 2024 05:17:01.769    12 Apr 2024 05:19:12.867      131.09791595
12 Apr 2024 11:40:07.219    12 Apr 2024 11:42:34.443      147.22407446
13 Apr 2024 05:41:29.863    13 Apr 2024 05:43:25.044      115.18053913
14 Apr 2024 04:30:19.046    14 Apr 2024 04:32:32.533      133.48705759
14 Apr 2024 10:53:19.467    14 Apr 2024 10:55:47.027      147.56025908
15 Apr 2024 04:54:26.219    15 Apr 2024 04:56:17.818      111.59846775
16 Apr 2024 03:42:50.081    16 Apr 2024 03:45:04.322      134.24079206
16 Apr 2024 10:05:44.628    16 Apr 2024 10:08:12.068      147.43946161
17 Apr 2024 04:06:33.900    17 Apr 2024 04:08:23.834      109.93440327
18 Apr 2024 02:54:33.948    18 Apr 2024 02:56:47.508      133.56042334
18 Apr 2024 09:17:21.861    18 Apr 2024 09:19:48.827      146.96592389
19 Apr 2024 03:17:52.080    19 Apr 2024 03:19:42.446      110.36637921
20 Apr 2024 02:05:30.025    20 Apr 2024 02:07:41.431      131.40636046
20 Apr 2024 08:28:10.564    20 Apr 2024 08:30:36.668      146.10380701
21 Apr 2024 02:28:20.254    21 Apr 2024 02:30:13.077      112.82340358
22 Apr 2024 01:15:38.018    22 Apr 2024 01:17:45.495      127.47743544
22 Apr 2024 07:38:10.382    22 Apr 2024 07:40:35.052      144.66949669
23 Apr 2024 01:37:58.223    23 Apr 2024 01:39:55.216      116.99353316
23 Apr 2024 08:01:17.943    23 Apr 2024 08:01:40.874      22.930491006
24 Apr 2024 00:24:57.972    24 Apr 2024 00:26:59.100      121.12852600
24 Apr 2024 06:47:21.181    24 Apr 2024 06:49:43.506      142.32546519
25 Apr 2024 00:46:46.026    25 Apr 2024 00:48:48.405      122.37863678
25 Apr 2024 07:09:44.102    25 Apr 2024 07:10:44.235      60.132872325
25 Apr 2024 23:33:30.328    25 Apr 2024 23:35:21.482      111.15377750
26 Apr 2024 05:55:42.995    26 Apr 2024 05:58:01.562      138.56783055
26 Apr 2024 23:54:43.846    26 Apr 2024 23:56:52.203      128.35717318
27 Apr 2024 06:17:27.057    27 Apr 2024 06:18:51.638      84.580896841
27 Apr 2024 22:41:16.172    27 Apr 2024 22:42:51.315      95.143269456
28 Apr 2024 05:03:15.971    28 Apr 2024 05:05:28.661      132.68948441
28 Apr 2024 23:01:51.905    28 Apr 2024 23:04:06.125      134.21953671
29 Apr 2024 05:24:22.628    29 Apr 2024 05:26:06.801      104.17288441
29 Apr 2024 21:48:18.592    29 Apr 2024 21:49:25.193      66.601144359
30 Apr 2024 04:10:00.340    30 Apr 2024 04:12:04.017      123.67715210
30 Apr 2024 22:08:10.399    30 Apr 2024 22:10:29.559      139.15971906
01 May 2024 04:30:29.963    01 May 2024 04:32:29.885      119.92164322
02 May 2024 03:15:56.482    02 May 2024 03:17:46.402      109.92016797
02 May 2024 21:13:39.448    02 May 2024 21:16:01.663      142.21543511
03 May 2024 03:35:48.530    03 May 2024 03:38:00.373      131.84265423
04 May 2024 02:21:05.373    04 May 2024 02:22:33.579      88.205584546
04 May 2024 20:18:19.123    04 May 2024 20:20:41.256      142.13375619
05 May 2024 02:40:17.765    05 May 2024 02:42:37.329      139.56463697
05 May 2024 20:38:32.808    05 May 2024 20:39:26.067      53.258995595
06 May 2024 01:25:31.856    06 May 2024 01:26:18.976      47.120797460
06 May 2024 19:22:09.569    06 May 2024 19:24:26.649      137.08037005
07 May 2024 01:43:57.004    07 May 2024 01:46:19.432      142.42819579
07 May 2024 19:41:32.165    07 May 2024 19:43:04.006      91.841535643
08 May 2024 18:25:11.395    08 May 2024 18:27:15.283      123.88738910
09 May 2024 00:46:45.543    09 May 2024 00:49:04.947      139.40430855
09 May 2024 18:43:45.167    09 May 2024 18:45:41.307      116.14013870
10 May 2024 01:05:50.684    10 May 2024 01:06:44.190      53.505356598
10 May 2024 17:27:27.159    10 May 2024 17:29:02.331      95.171412849
10 May 2024 23:48:42.839    10 May 2024 23:50:51.615      128.77584830
11 May 2024 17:45:07.724    11 May 2024 17:47:19.675      131.95036934
12 May 2024 00:06:49.839    12 May 2024 00:08:36.298      106.45826353
12 May 2024 22:49:49.130    12 May 2024 22:51:36.167      107.03718911
13 May 2024 16:45:38.547    13 May 2024 16:47:57.917      139.36985264
13 May 2024 23:07:06.395    13 May 2024 23:09:16.765      130.36944538
14 May 2024 21:50:08.850    14 May 2024 21:51:11.077      62.226870912
15 May 2024 15:45:17.584    15 May 2024 15:47:33.658      136.07390014
15 May 2024 22:06:31.902    15 May 2024 22:08:50.951      139.04921561
16 May 2024 16:02:29.104    16 May 2024 16:03:58.619      89.514585002
17 May 2024 14:44:06.879    17 May 2024 14:46:02.619      115.73937424
17 May 2024 21:05:04.162    17 May 2024 21:07:18.097      133.93544143
18 May 2024 15:00:17.850    18 May 2024 15:02:20.084      122.23396974
18 May 2024 21:21:37.713    18 May 2024 21:23:00.607      82.894375990
19 May 2024 13:42:19.940    19 May 2024 13:43:09.333      49.393087928
19 May 2024 20:02:43.283    19 May 2024 20:04:35.351      112.06749275
20 May 2024 13:57:15.700    20 May 2024 13:59:32.554      136.85400649
20 May 2024 20:18:16.159    20 May 2024 20:20:21.639      125.48028367
21 May 2024 18:59:36.585    21 May 2024 19:00:32.900      56.315575086
22 May 2024 12:53:22.108    22 May 2024 12:55:35.096      132.98788634
22 May 2024 19:14:07.011    22 May 2024 19:16:24.016      137.00511680
23 May 2024 13:08:35.863    23 May 2024 13:10:13.653      97.790034860
24 May 2024 11:48:42.565    24 May 2024 11:50:20.968      98.402311513
24 May 2024 18:09:05.125    24 May 2024 18:11:10.599      125.47432068
25 May 2024 12:02:46.631    25 May 2024 12:04:56.480      129.84945537
25 May 2024 18:23:29.993    25 May 2024 18:25:18.031      108.03786954
26 May 2024 17:03:13.565    26 May 2024 17:04:36.093      82.528587640
27 May 2024 10:56:08.380    27 May 2024 10:58:23.451      135.07119046
27 May 2024 17:16:34.288    27 May 2024 17:18:48.770      134.48285598
28 May 2024 11:10:07.572    28 May 2024 11:11:31.663      84.091142658
29 May 2024 09:48:45.175    29 May 2024 09:50:29.322      104.14668383
29 May 2024 16:08:48.850    29 May 2024 16:10:55.314      126.46370156
30 May 2024 10:01:29.237    30 May 2024 10:03:36.650      127.41319318
30 May 2024 16:21:50.923    30 May 2024 16:23:35.825      104.90230140
31 May 2024 15:00:15.695    31 May 2024 15:01:32.824      77.129309066
01 Jun 2024 08:52:05.544    01 Jun 2024 08:54:18.043      132.49897014
01 Jun 2024 15:12:08.127    01 Jun 2024 15:14:22.063      133.93571866
02 Jun 2024 09:04:31.650    02 Jun 2024 09:06:04.734      93.083949946
03 Jun 2024 07:42:03.061    03 Jun 2024 07:43:27.268      84.207419562
03 Jun 2024 14:01:37.190    03 Jun 2024 14:03:34.978      117.78853991
04 Jun 2024 07:53:05.772    04 Jun 2024 07:55:16.928      131.15612733
04 Jun 2024 14:13:00.404    04 Jun 2024 14:14:59.188      118.78406829
05 Jun 2024 12:50:38.753    05 Jun 2024 12:50:49.794      11.040953931
06 Jun 2024 06:40:56.590    06 Jun 2024 06:42:56.908      120.31825046
06 Jun 2024 13:00:30.149    06 Jun 2024 13:02:41.212      131.06298259
07 Jun 2024 06:51:31.497    07 Jun 2024 06:53:27.086      115.58862696
07 Jun 2024 13:11:19.874    07 Jun 2024 13:12:41.483      81.609060278
08 Jun 2024 11:47:12.613    08 Jun 2024 11:48:38.013      85.400120798
09 Jun 2024 05:37:17.158    09 Jun 2024 05:39:27.133      129.97539262
09 Jun 2024 11:56:40.849    09 Jun 2024 11:58:52.305      131.45640482
10 Jun 2024 05:47:11.645    10 Jun 2024 05:48:43.880      92.234727787
11 Jun 2024 04:22:34.285    11 Jun 2024 04:23:30.946      56.661071791
11 Jun 2024 10:41:18.893    11 Jun 2024 10:43:05.593      106.69948224
12 Jun 2024 04:30:47.938    12 Jun 2024 04:32:57.835      129.89680662
12 Jun 2024 10:49:58.256    12 Jun 2024 10:52:03.992      125.73597750
13 Jun 2024 04:39:55.323    13 Jun 2024 04:41:00.711      65.388079814
14 Jun 2024 03:13:50.038    14 Jun 2024 03:15:14.669      84.631192032
14 Jun 2024 09:32:29.237    14 Jun 2024 09:34:24.413      115.17693764
15 Jun 2024 03:21:16.501    15 Jun 2024 03:23:23.318      126.81657696
15 Jun 2024 09:40:11.245    15 Jun 2024 09:42:10.562      119.31666291
16 Jun 2024 03:29:30.445    16 Jun 2024 03:30:11.295      40.850546316
17 Jun 2024 02:02:07.287    17 Jun 2024 02:03:38.330      91.043393221
17 Jun 2024 08:20:31.907    17 Jun 2024 08:22:28.676      116.76888390
18 Jun 2024 02:08:31.760    18 Jun 2024 02:10:36.099      124.33886491
18 Jun 2024 08:27:08.810    18 Jun 2024 08:29:05.249      116.43842559
19 Jun 2024 02:15:39.593    19 Jun 2024 02:16:14.341      34.747621638
20 Jun 2024 00:47:12.325    20 Jun 2024 00:48:36.883      84.558020532
20 Jun 2024 07:05:16.909    20 Jun 2024 07:07:09.909      113.00089709
21 Jun 2024 00:52:23.651    21 Jun 2024 00:54:27.225      123.57404967
21 Jun 2024 07:10:40.828    21 Jun 2024 07:12:39.298      118.46967620
22 Jun 2024 00:58:09.247    22 Jun 2024 00:59:03.965      54.718038300
22 Jun 2024 23:28:58.978    22 Jun 2024 23:29:56.731      57.752888126
23 Jun 2024 05:46:35.146    23 Jun 2024 05:48:16.937      101.79130031
23 Jun 2024 23:32:42.862    23 Jun 2024 23:34:45.504      122.64242345
24 Jun 2024 05:50:38.084    24 Jun 2024 05:52:40.706      122.62234900
24 Jun 2024 23:36:58.276    24 Jun 2024 23:38:19.822      81.545653485
26 Jun 2024 04:24:19.183    26 Jun 2024 04:25:33.254      74.070526182
26 Jun 2024 22:09:20.483    26 Jun 2024 22:11:15.916      115.43289644
27 Jun 2024 04:26:50.921    27 Jun 2024 04:28:53.436      122.51500542
27 Jun 2024 22:11:58.852    27 Jun 2024 22:13:44.005      105.15273381
28 Jun 2024 04:29:33.652    28 Jun 2024 04:30:58.028      84.375743999
29 Jun 2024 20:42:10.142    29 Jun 2024 20:43:34.958      84.816864179
30 Jun 2024 02:59:08.063    30 Jun 2024 03:00:55.862      107.79942975
30 Jun 2024 20:42:58.675    30 Jun 2024 20:44:56.216      117.54052589
01 Jul 2024 03:00:03.261    01 Jul 2024 03:01:58.326      115.06530326
01 Jul 2024 20:43:58.553    01 Jul 2024 20:45:11.130      72.577140725
03 Jul 2024 01:27:24.181    03 Jul 2024 01:28:10.226      46.045411332
03 Jul 2024 19:09:45.388    03 Jul 2024 19:11:26.623      101.23438257
04 Jul 2024 01:26:16.740    04 Jul 2024 01:28:09.580      112.83947357
04 Jul 2024 19:08:36.868    04 Jul 2024 19:10:28.836      111.96796226
05 Jul 2024 01:25:08.382    05 Jul 2024 01:26:53.747      105.36479701
05 Jul 2024 19:07:29.844    05 Jul 2024 19:08:24.045      54.201014538
06 Jul 2024 23:48:02.814    06 Jul 2024 23:48:41.492      38.677732588
07 Jul 2024 17:28:37.061    07 Jul 2024 17:30:11.692      94.631407480
07 Jul 2024 23:44:29.193    07 Jul 2024 23:46:15.979      106.78568267
08 Jul 2024 17:24:55.435    08 Jul 2024 17:26:46.817      111.38164321
08 Jul 2024 23:40:45.540    08 Jul 2024 23:42:33.370      107.82982651
09 Jul 2024 17:20:59.784    09 Jul 2024 17:22:16.227      76.443384716
09 Jul 2024 23:36:59.248    09 Jul 2024 23:37:22.912      23.663789243
11 Jul 2024 15:37:28.618    11 Jul 2024 15:38:00.503      31.885312870
11 Jul 2024 21:52:15.868    11 Jul 2024 21:53:32.376      76.508109143
12 Jul 2024 15:30:19.603    12 Jul 2024 15:32:02.193      102.59004120
12 Jul 2024 21:45:17.387    12 Jul 2024 21:47:04.379      106.99199599
13 Jul 2024 15:22:54.848    13 Jul 2024 15:24:40.036      105.18816632
13 Jul 2024 21:37:43.673    13 Jul 2024 21:39:23.135      99.462333927
14 Jul 2024 15:14:54.591    14 Jul 2024 15:16:07.153      72.561850562
14 Jul 2024 21:29:44.016    14 Jul 2024 21:30:13.544      29.527820880
17 Jul 2024 13:11:15.788    17 Jul 2024 13:12:13.186      57.397773501
17 Jul 2024 19:24:45.243    17 Jul 2024 19:26:02.334      77.091224631
18 Jul 2024 12:58:23.616    18 Jul 2024 12:59:57.869      94.252793875
18 Jul 2024 19:11:44.013    18 Jul 2024 19:13:21.308      97.295546054
19 Jul 2024 12:44:29.268    19 Jul 2024 12:46:10.067      100.79923763
19 Jul 2024 18:57:31.068    19 Jul 2024 18:59:10.112      99.044814880
20 Jul 2024 12:29:16.612    20 Jul 2024 12:30:49.668      93.055979745
20 Jul 2024 18:41:55.846    20 Jul 2024 18:43:23.122      87.276774645
21 Jul 2024 12:12:33.382    21 Jul 2024 12:13:48.585      75.202593254
21 Jul 2024 18:24:48.230    21 Jul 2024 18:25:49.757      61.527214176
22 Jul 2024 11:54:06.554    22 Jul 2024 11:54:53.426      46.871986322


Number of events : 765
