(kicad_sch (version 20211123) (generator eeschema)

  (uuid e63e39d7-6ac0-4ffd-8aa3-1841a4541b55)

  (paper "A4")

  (lib_symbols
    (symbol "Connector:Conn_01x03_Male" (pin_names (offset 1.016) hide) (in_bom yes) (on_board yes)
      (property "Reference" "J" (id 0) (at 0 5.08 0)
        (effects (font (size 1.27 1.27)))
      )
      (property "Value" "Conn_01x03_Male" (id 1) (at 0 -5.08 0)
        (effects (font (size 1.27 1.27)))
      )
      (property "Footprint" "" (id 2) (at 0 0 0)
        (effects (font (size 1.27 1.27)) hide)
      )
      (property "Datasheet" "~" (id 3) (at 0 0 0)
        (effects (font (size 1.27 1.27)) hide)
      )
      (property "ki_keywords" "connector" (id 4) (at 0 0 0)
        (effects (font (size 1.27 1.27)) hide)
      )
      (property "ki_description" "Generic connector, single row, 01x03, script generated (kicad-library-utils/schlib/autogen/connector/)" (id 5) (at 0 0 0)
        (effects (font (size 1.27 1.27)) hide)
      )
      (property "ki_fp_filters" "Connector*:*_1x??_*" (id 6) (at 0 0 0)
        (effects (font (size 1.27 1.27)) hide)
      )
      (symbol "Conn_01x03_Male_1_1"
        (polyline
          (pts
            (xy 1.27 -2.54)
            (xy 0.8636 -2.54)
          )
          (stroke (width 0.1524) (type default) (color 0 0 0 0))
          (fill (type none))
        )
        (polyline
          (pts
            (xy 1.27 0)
            (xy 0.8636 0)
          )
          (stroke (width 0.1524) (type default) (color 0 0 0 0))
          (fill (type none))
        )
        (polyline
          (pts
            (xy 1.27 2.54)
            (xy 0.8636 2.54)
          )
          (stroke (width 0.1524) (type default) (color 0 0 0 0))
          (fill (type none))
        )
        (rectangle (start 0.8636 -2.413) (end 0 -2.667)
          (stroke (width 0.1524) (type default) (color 0 0 0 0))
          (fill (type outline))
        )
        (rectangle (start 0.8636 0.127) (end 0 -0.127)
          (stroke (width 0.1524) (type default) (color 0 0 0 0))
          (fill (type outline))
        )
        (rectangle (start 0.8636 2.667) (end 0 2.413)
          (stroke (width 0.1524) (type default) (color 0 0 0 0))
          (fill (type outline))
        )
        (pin passive line (at 5.08 2.54 180) (length 3.81)
          (name "Pin_1" (effects (font (size 1.27 1.27))))
          (number "1" (effects (font (size 1.27 1.27))))
        )
        (pin passive line (at 5.08 0 180) (length 3.81)
          (name "Pin_2" (effects (font (size 1.27 1.27))))
          (number "2" (effects (font (size 1.27 1.27))))
        )
        (pin passive line (at 5.08 -2.54 180) (length 3.81)
          (name "Pin_3" (effects (font (size 1.27 1.27))))
          (number "3" (effects (font (size 1.27 1.27))))
        )
      )
    )
    (symbol "Device:C" (pin_numbers hide) (pin_names (offset 0.254)) (in_bom yes) (on_board yes)
      (property "Reference" "C" (id 0) (at 0.635 2.54 0)
        (effects (font (size 1.27 1.27)) (justify left))
      )
      (property "Value" "C" (id 1) (at 0.635 -2.54 0)
        (effects (font (size 1.27 1.27)) (justify left))
      )
      (property "Footprint" "" (id 2) (at 0.9652 -3.81 0)
        (effects (font (size 1.27 1.27)) hide)
      )
      (property "Datasheet" "~" (id 3) (at 0 0 0)
        (effects (font (size 1.27 1.27)) hide)
      )
      (property "ki_keywords" "cap capacitor" (id 4) (at 0 0 0)
        (effects (font (size 1.27 1.27)) hide)
      )
      (property "ki_description" "Unpolarized capacitor" (id 5) (at 0 0 0)
        (effects (font (size 1.27 1.27)) hide)
      )
      (property "ki_fp_filters" "C_*" (id 6) (at 0 0 0)
        (effects (font (size 1.27 1.27)) hide)
      )
      (symbol "C_0_1"
        (polyline
          (pts
            (xy -2.032 -0.762)
            (xy 2.032 -0.762)
          )
          (stroke (width 0.508) (type default) (color 0 0 0 0))
          (fill (type none))
        )
        (polyline
          (pts
            (xy -2.032 0.762)
            (xy 2.032 0.762)
          )
          (stroke (width 0.508) (type default) (color 0 0 0 0))
          (fill (type none))
        )
      )
      (symbol "C_1_1"
        (pin passive line (at 0 3.81 270) (length 2.794)
          (name "~" (effects (font (size 1.27 1.27))))
          (number "1" (effects (font (size 1.27 1.27))))
        )
        (pin passive line (at 0 -3.81 90) (length 2.794)
          (name "~" (effects (font (size 1.27 1.27))))
          (number "2" (effects (font (size 1.27 1.27))))
        )
      )
    )
    (symbol "Device:R" (pin_numbers hide) (pin_names (offset 0)) (in_bom yes) (on_board yes)
      (property "Reference" "R" (id 0) (at 2.032 0 90)
        (effects (font (size 1.27 1.27)))
      )
      (property "Value" "R" (id 1) (at 0 0 90)
        (effects (font (size 1.27 1.27)))
      )
      (property "Footprint" "" (id 2) (at -1.778 0 90)
        (effects (font (size 1.27 1.27)) hide)
      )
      (property "Datasheet" "~" (id 3) (at 0 0 0)
        (effects (font (size 1.27 1.27)) hide)
      )
      (property "ki_keywords" "R res resistor" (id 4) (at 0 0 0)
        (effects (font (size 1.27 1.27)) hide)
      )
      (property "ki_description" "Resistor" (id 5) (at 0 0 0)
        (effects (font (size 1.27 1.27)) hide)
      )
      (property "ki_fp_filters" "R_*" (id 6) (at 0 0 0)
        (effects (font (size 1.27 1.27)) hide)
      )
      (symbol "R_0_1"
        (rectangle (start -1.016 -2.54) (end 1.016 2.54)
          (stroke (width 0.254) (type default) (color 0 0 0 0))
          (fill (type none))
        )
      )
      (symbol "R_1_1"
        (pin passive line (at 0 3.81 270) (length 1.27)
          (name "~" (effects (font (size 1.27 1.27))))
          (number "1" (effects (font (size 1.27 1.27))))
        )
        (pin passive line (at 0 -3.81 90) (length 1.27)
          (name "~" (effects (font (size 1.27 1.27))))
          (number "2" (effects (font (size 1.27 1.27))))
        )
      )
    )
    (symbol "Mechanical:MountingHole" (pin_names (offset 1.016)) (in_bom yes) (on_board yes)
      (property "Reference" "H" (id 0) (at 0 5.08 0)
        (effects (font (size 1.27 1.27)))
      )
      (property "Value" "MountingHole" (id 1) (at 0 3.175 0)
        (effects (font (size 1.27 1.27)))
      )
      (property "Footprint" "" (id 2) (at 0 0 0)
        (effects (font (size 1.27 1.27)) hide)
      )
      (property "Datasheet" "~" (id 3) (at 0 0 0)
        (effects (font (size 1.27 1.27)) hide)
      )
      (property "ki_keywords" "mounting hole" (id 4) (at 0 0 0)
        (effects (font (size 1.27 1.27)) hide)
      )
      (property "ki_description" "Mounting Hole without connection" (id 5) (at 0 0 0)
        (effects (font (size 1.27 1.27)) hide)
      )
      (property "ki_fp_filters" "MountingHole*" (id 6) (at 0 0 0)
        (effects (font (size 1.27 1.27)) hide)
      )
      (symbol "MountingHole_0_1"
        (circle (center 0 0) (radius 1.27)
          (stroke (width 1.27) (type default) (color 0 0 0 0))
          (fill (type none))
        )
      )
    )
    (symbol "SFH2430:SFH_2430-Z" (pin_names (offset 0.762)) (in_bom yes) (on_board yes)
      (property "Reference" "IC" (id 0) (at 16.51 7.62 0)
        (effects (font (size 1.27 1.27)) (justify left))
      )
      (property "Value" "SFH_2430-Z" (id 1) (at 16.51 5.08 0)
        (effects (font (size 1.27 1.27)) (justify left))
      )
      (property "Footprint" "SFH2430Z" (id 2) (at 16.51 2.54 0)
        (effects (font (size 1.27 1.27)) (justify left) hide)
      )
      (property "Datasheet" "https://datasheet.datasheetarchive.com/originals/distributors/DKDS-18/344320.pdf" (id 3) (at 16.51 0 0)
        (effects (font (size 1.27 1.27)) (justify left) hide)
      )
      (property "Description" "Photodiodes PHOTODIODE (ALS) SMT Silicon Photodiode with V Characteristic" (id 4) (at 16.51 -2.54 0)
        (effects (font (size 1.27 1.27)) (justify left) hide)
      )
      (property "Height" "1.3" (id 5) (at 16.51 -5.08 0)
        (effects (font (size 1.27 1.27)) (justify left) hide)
      )
      (property "Mouser Part Number" "720-SFH2430-Z" (id 6) (at 16.51 -7.62 0)
        (effects (font (size 1.27 1.27)) (justify left) hide)
      )
      (property "Mouser Price/Stock" "https://www.mouser.co.uk/ProductDetail/OSRAM-Opto-Semiconductors/SFH-2430-Z?qs=K5ta8V%252BWhtZplGU0%252BI7tvA%3D%3D" (id 7) (at 16.51 -10.16 0)
        (effects (font (size 1.27 1.27)) (justify left) hide)
      )
      (property "Manufacturer_Name" "OSRAM" (id 8) (at 16.51 -12.7 0)
        (effects (font (size 1.27 1.27)) (justify left) hide)
      )
      (property "Manufacturer_Part_Number" "SFH 2430-Z" (id 9) (at 16.51 -15.24 0)
        (effects (font (size 1.27 1.27)) (justify left) hide)
      )
      (property "ki_description" "Photodiodes PHOTODIODE (ALS) SMT Silicon Photodiode with V Characteristic" (id 10) (at 0 0 0)
        (effects (font (size 1.27 1.27)) hide)
      )
      (symbol "SFH_2430-Z_0_0"
        (pin passive line (at 0 0 0) (length 5.08)
          (name "A" (effects (font (size 1.27 1.27))))
          (number "1" (effects (font (size 1.27 1.27))))
        )
        (pin passive line (at 0 -2.54 0) (length 5.08)
          (name "K" (effects (font (size 1.27 1.27))))
          (number "2" (effects (font (size 1.27 1.27))))
        )
      )
      (symbol "SFH_2430-Z_0_1"
        (polyline
          (pts
            (xy 5.08 2.54)
            (xy 15.24 2.54)
            (xy 15.24 -5.08)
            (xy 5.08 -5.08)
            (xy 5.08 2.54)
          )
          (stroke (width 0.1524) (type default) (color 0 0 0 0))
          (fill (type none))
        )
      )
    )
    (symbol "TLV2254AIDR_lib:TLV2254AIDR" (pin_names (offset 0.762)) (in_bom yes) (on_board yes)
      (property "Reference" "IC" (id 0) (at 29.21 7.62 0)
        (effects (font (size 1.27 1.27)) (justify left))
      )
      (property "Value" "TLV2254AIDR" (id 1) (at 29.21 5.08 0)
        (effects (font (size 1.27 1.27)) (justify left))
      )
      (property "Footprint" "SOIC127P600X175-14N" (id 2) (at 29.21 2.54 0)
        (effects (font (size 1.27 1.27)) (justify left) hide)
      )
      (property "Datasheet" "http://www.ti.com/lit/gpn/TLV2254A" (id 3) (at 29.21 0 0)
        (effects (font (size 1.27 1.27)) (justify left) hide)
      )
      (property "Description" "Quad Low-Voltage Rail-To-Rail Operational Amplifier" (id 4) (at 29.21 -2.54 0)
        (effects (font (size 1.27 1.27)) (justify left) hide)
      )
      (property "Height" "1.75" (id 5) (at 29.21 -5.08 0)
        (effects (font (size 1.27 1.27)) (justify left) hide)
      )
      (property "Mouser Part Number" "595-TLV2254AIDR" (id 6) (at 29.21 -7.62 0)
        (effects (font (size 1.27 1.27)) (justify left) hide)
      )
      (property "Mouser Price/Stock" "https://www.mouser.co.uk/ProductDetail/Texas-Instruments/TLV2254AIDR?qs=Fg5TsMy7H4tEDlpHSjkW%252BQ%3D%3D" (id 7) (at 29.21 -10.16 0)
        (effects (font (size 1.27 1.27)) (justify left) hide)
      )
      (property "Manufacturer_Name" "Texas Instruments" (id 8) (at 29.21 -12.7 0)
        (effects (font (size 1.27 1.27)) (justify left) hide)
      )
      (property "Manufacturer_Part_Number" "TLV2254AIDR" (id 9) (at 29.21 -15.24 0)
        (effects (font (size 1.27 1.27)) (justify left) hide)
      )
      (property "ki_description" "Quad Low-Voltage Rail-To-Rail Operational Amplifier" (id 10) (at 0 0 0)
        (effects (font (size 1.27 1.27)) hide)
      )
      (symbol "TLV2254AIDR_0_0"
        (pin passive line (at 0 0 0) (length 5.08)
          (name "1OUT" (effects (font (size 1.27 1.27))))
          (number "1" (effects (font (size 1.27 1.27))))
        )
        (pin passive line (at 33.02 -10.16 180) (length 5.08)
          (name "3IN+" (effects (font (size 1.27 1.27))))
          (number "10" (effects (font (size 1.27 1.27))))
        )
        (pin passive line (at 33.02 -7.62 180) (length 5.08)
          (name "VDD-/GND" (effects (font (size 1.27 1.27))))
          (number "11" (effects (font (size 1.27 1.27))))
        )
        (pin passive line (at 33.02 -5.08 180) (length 5.08)
          (name "4IN+" (effects (font (size 1.27 1.27))))
          (number "12" (effects (font (size 1.27 1.27))))
        )
        (pin passive line (at 33.02 -2.54 180) (length 5.08)
          (name "4IN-" (effects (font (size 1.27 1.27))))
          (number "13" (effects (font (size 1.27 1.27))))
        )
        (pin passive line (at 33.02 0 180) (length 5.08)
          (name "4OUT" (effects (font (size 1.27 1.27))))
          (number "14" (effects (font (size 1.27 1.27))))
        )
        (pin passive line (at 0 -2.54 0) (length 5.08)
          (name "1IN-" (effects (font (size 1.27 1.27))))
          (number "2" (effects (font (size 1.27 1.27))))
        )
        (pin passive line (at 0 -5.08 0) (length 5.08)
          (name "1IN+" (effects (font (size 1.27 1.27))))
          (number "3" (effects (font (size 1.27 1.27))))
        )
        (pin passive line (at 0 -7.62 0) (length 5.08)
          (name "VDD+" (effects (font (size 1.27 1.27))))
          (number "4" (effects (font (size 1.27 1.27))))
        )
        (pin passive line (at 0 -10.16 0) (length 5.08)
          (name "2IN+" (effects (font (size 1.27 1.27))))
          (number "5" (effects (font (size 1.27 1.27))))
        )
        (pin passive line (at 0 -12.7 0) (length 5.08)
          (name "2IN-" (effects (font (size 1.27 1.27))))
          (number "6" (effects (font (size 1.27 1.27))))
        )
        (pin passive line (at 0 -15.24 0) (length 5.08)
          (name "2OUT" (effects (font (size 1.27 1.27))))
          (number "7" (effects (font (size 1.27 1.27))))
        )
        (pin passive line (at 33.02 -15.24 180) (length 5.08)
          (name "3OUT" (effects (font (size 1.27 1.27))))
          (number "8" (effects (font (size 1.27 1.27))))
        )
        (pin passive line (at 33.02 -12.7 180) (length 5.08)
          (name "3IN-" (effects (font (size 1.27 1.27))))
          (number "9" (effects (font (size 1.27 1.27))))
        )
      )
      (symbol "TLV2254AIDR_0_1"
        (polyline
          (pts
            (xy 5.08 2.54)
            (xy 27.94 2.54)
            (xy 27.94 -17.78)
            (xy 5.08 -17.78)
            (xy 5.08 2.54)
          )
          (stroke (width 0.1524) (type default) (color 0 0 0 0))
          (fill (type none))
        )
      )
    )
    (symbol "power:+3.3V" (power) (pin_names (offset 0)) (in_bom yes) (on_board yes)
      (property "Reference" "#PWR" (id 0) (at 0 -3.81 0)
        (effects (font (size 1.27 1.27)) hide)
      )
      (property "Value" "+3.3V" (id 1) (at 0 3.556 0)
        (effects (font (size 1.27 1.27)))
      )
      (property "Footprint" "" (id 2) (at 0 0 0)
        (effects (font (size 1.27 1.27)) hide)
      )
      (property "Datasheet" "" (id 3) (at 0 0 0)
        (effects (font (size 1.27 1.27)) hide)
      )
      (property "ki_keywords" "power-flag" (id 4) (at 0 0 0)
        (effects (font (size 1.27 1.27)) hide)
      )
      (property "ki_description" "Power symbol creates a global label with name \"+3.3V\"" (id 5) (at 0 0 0)
        (effects (font (size 1.27 1.27)) hide)
      )
      (symbol "+3.3V_0_1"
        (polyline
          (pts
            (xy -0.762 1.27)
            (xy 0 2.54)
          )
          (stroke (width 0) (type default) (color 0 0 0 0))
          (fill (type none))
        )
        (polyline
          (pts
            (xy 0 0)
            (xy 0 2.54)
          )
          (stroke (width 0) (type default) (color 0 0 0 0))
          (fill (type none))
        )
        (polyline
          (pts
            (xy 0 2.54)
            (xy 0.762 1.27)
          )
          (stroke (width 0) (type default) (color 0 0 0 0))
          (fill (type none))
        )
      )
      (symbol "+3.3V_1_1"
        (pin power_in line (at 0 0 90) (length 0) hide
          (name "+3V3" (effects (font (size 1.27 1.27))))
          (number "1" (effects (font (size 1.27 1.27))))
        )
      )
    )
    (symbol "power:GND" (power) (pin_names (offset 0)) (in_bom yes) (on_board yes)
      (property "Reference" "#PWR" (id 0) (at 0 -6.35 0)
        (effects (font (size 1.27 1.27)) hide)
      )
      (property "Value" "GND" (id 1) (at 0 -3.81 0)
        (effects (font (size 1.27 1.27)))
      )
      (property "Footprint" "" (id 2) (at 0 0 0)
        (effects (font (size 1.27 1.27)) hide)
      )
      (property "Datasheet" "" (id 3) (at 0 0 0)
        (effects (font (size 1.27 1.27)) hide)
      )
      (property "ki_keywords" "power-flag" (id 4) (at 0 0 0)
        (effects (font (size 1.27 1.27)) hide)
      )
      (property "ki_description" "Power symbol creates a global label with name \"GND\" , ground" (id 5) (at 0 0 0)
        (effects (font (size 1.27 1.27)) hide)
      )
      (symbol "GND_0_1"
        (polyline
          (pts
            (xy 0 0)
            (xy 0 -1.27)
            (xy 1.27 -1.27)
            (xy 0 -2.54)
            (xy -1.27 -1.27)
            (xy 0 -1.27)
          )
          (stroke (width 0) (type default) (color 0 0 0 0))
          (fill (type none))
        )
      )
      (symbol "GND_1_1"
        (pin power_in line (at 0 0 270) (length 0) hide
          (name "GND" (effects (font (size 1.27 1.27))))
          (number "1" (effects (font (size 1.27 1.27))))
        )
      )
    )
    (symbol "power:PWR_FLAG" (power) (pin_numbers hide) (pin_names (offset 0) hide) (in_bom yes) (on_board yes)
      (property "Reference" "#FLG" (id 0) (at 0 1.905 0)
        (effects (font (size 1.27 1.27)) hide)
      )
      (property "Value" "PWR_FLAG" (id 1) (at 0 3.81 0)
        (effects (font (size 1.27 1.27)))
      )
      (property "Footprint" "" (id 2) (at 0 0 0)
        (effects (font (size 1.27 1.27)) hide)
      )
      (property "Datasheet" "~" (id 3) (at 0 0 0)
        (effects (font (size 1.27 1.27)) hide)
      )
      (property "ki_keywords" "power-flag" (id 4) (at 0 0 0)
        (effects (font (size 1.27 1.27)) hide)
      )
      (property "ki_description" "Special symbol for telling ERC where power comes from" (id 5) (at 0 0 0)
        (effects (font (size 1.27 1.27)) hide)
      )
      (symbol "PWR_FLAG_0_0"
        (pin power_out line (at 0 0 90) (length 0)
          (name "pwr" (effects (font (size 1.27 1.27))))
          (number "1" (effects (font (size 1.27 1.27))))
        )
      )
      (symbol "PWR_FLAG_0_1"
        (polyline
          (pts
            (xy 0 0)
            (xy 0 1.27)
            (xy -1.016 1.905)
            (xy 0 2.54)
            (xy 1.016 1.905)
            (xy 0 1.27)
          )
          (stroke (width 0) (type default) (color 0 0 0 0))
          (fill (type none))
        )
      )
    )
  )

  (junction (at 123.9012 69.596) (diameter 0) (color 0 0 0 0)
    (uuid 05fd0e7d-77e8-42a3-89ae-0967740bbd43)
  )
  (junction (at 172.3136 68.6308) (diameter 0) (color 0 0 0 0)
    (uuid 08a955b3-8b83-4407-ba99-5268cc6f517e)
  )
  (junction (at 94.5388 108.6104) (diameter 0) (color 0 0 0 0)
    (uuid 20768afd-1998-4af8-b463-a20d0569a32e)
  )
  (junction (at 86.5124 97.9424) (diameter 0) (color 0 0 0 0)
    (uuid 21644d85-96e2-4e73-9994-663f733c850a)
  )
  (junction (at 96.52 140.1572) (diameter 0) (color 0 0 0 0)
    (uuid 261baef5-0c78-4963-b46b-0ebc033ef06f)
  )
  (junction (at 115.316 69.596) (diameter 0) (color 0 0 0 0)
    (uuid 2e3d7390-3fe0-402c-b766-bf4e38b7598a)
  )
  (junction (at 103.2256 97.9424) (diameter 0) (color 0 0 0 0)
    (uuid 3db3295d-39dc-4308-b49c-bca53e0560e7)
  )
  (junction (at 158.6484 103.3272) (diameter 0) (color 0 0 0 0)
    (uuid 64e9843f-34e2-493d-a603-c75388b73a1a)
  )
  (junction (at 103.2256 108.6104) (diameter 0) (color 0 0 0 0)
    (uuid 8933fe81-948a-488b-aeea-d4f0aa4dc6ab)
  )
  (junction (at 94.5388 97.9424) (diameter 0) (color 0 0 0 0)
    (uuid 8e132b43-8cf8-49a3-af19-ecec660997d5)
  )
  (junction (at 89.2556 97.9424) (diameter 0) (color 0 0 0 0)
    (uuid a88da653-766a-48a7-80ed-e08e6fe79a26)
  )
  (junction (at 144.018 68.6308) (diameter 0) (color 0 0 0 0)
    (uuid b0c26981-e7cc-4d44-93da-8c8abee7b43f)
  )
  (junction (at 148.5392 68.6308) (diameter 0) (color 0 0 0 0)
    (uuid c15e77ab-2602-4896-8795-40b71ab7b752)
  )
  (junction (at 109.22 69.596) (diameter 0) (color 0 0 0 0)
    (uuid cd8e1129-fe10-46e4-9ae2-6e724ec47889)
  )
  (junction (at 134.3152 140.1064) (diameter 0) (color 0 0 0 0)
    (uuid cfc88e54-76f3-47c4-aab0-f76449b316c4)
  )
  (junction (at 76.6572 140.1064) (diameter 0) (color 0 0 0 0)
    (uuid e29eb7bb-9ead-437a-906d-7fbde2f6842c)
  )
  (junction (at 105.5624 108.6104) (diameter 0) (color 0 0 0 0)
    (uuid e3fc567f-4f55-474d-9bc6-864833b7c867)
  )

  (wire (pts (xy 123.7996 110.9472) (xy 117.6528 110.9472))
    (stroke (width 0) (type default) (color 0 0 0 0))
    (uuid 05867d82-49d9-4eeb-bb17-3e929c0177c3)
  )
  (wire (pts (xy 134.3152 153.5684) (xy 134.3152 155.448))
    (stroke (width 0) (type default) (color 0 0 0 0))
    (uuid 05c615cc-c093-470b-9a65-c28087c1eb84)
  )
  (wire (pts (xy 172.3136 68.6308) (xy 172.3136 73.0504))
    (stroke (width 0) (type default) (color 0 0 0 0))
    (uuid 081ce624-92c8-4034-a2a6-058432630e7c)
  )
  (wire (pts (xy 112.3188 123.9012) (xy 112.3188 140.1064))
    (stroke (width 0) (type default) (color 0 0 0 0))
    (uuid 0846736d-ec07-421c-ac66-8014b27cf4ee)
  )
  (wire (pts (xy 94.5388 107.5436) (xy 94.5388 108.6104))
    (stroke (width 0) (type default) (color 0 0 0 0))
    (uuid 0857032c-d271-43c6-a4f2-2d2bb9766aeb)
  )
  (wire (pts (xy 156.8196 98.2472) (xy 164.2364 98.2472))
    (stroke (width 0) (type default) (color 0 0 0 0))
    (uuid 0a833a7e-0ac8-4569-9dc2-49ad9e8d917c)
  )
  (wire (pts (xy 76.6572 140.1064) (xy 71.7296 140.1064))
    (stroke (width 0) (type default) (color 0 0 0 0))
    (uuid 153d287b-d256-4a10-87d5-6577b8175b1d)
  )
  (wire (pts (xy 123.9012 75.2348) (xy 123.9012 69.596))
    (stroke (width 0) (type default) (color 0 0 0 0))
    (uuid 15dfdd0f-8f86-48e1-bef4-033654d9612f)
  )
  (wire (pts (xy 71.7296 83.4136) (xy 109.22 83.4136))
    (stroke (width 0) (type default) (color 0 0 0 0))
    (uuid 161c20ce-1f97-4877-812f-d87dcb7ef7ac)
  )
  (wire (pts (xy 94.5388 97.9424) (xy 94.5388 99.9236))
    (stroke (width 0) (type default) (color 0 0 0 0))
    (uuid 188e9c15-178b-4776-931d-cad5796f043f)
  )
  (wire (pts (xy 156.8196 110.9472) (xy 163.7284 110.9472))
    (stroke (width 0) (type default) (color 0 0 0 0))
    (uuid 22da8f69-ba24-456e-b295-8a9562b4077f)
  )
  (wire (pts (xy 156.8196 105.8672) (xy 158.6484 105.8672))
    (stroke (width 0) (type default) (color 0 0 0 0))
    (uuid 261046f5-8dea-4dbe-bbc8-b5ca6e29690d)
  )
  (wire (pts (xy 123.9012 69.596) (xy 123.9012 62.738))
    (stroke (width 0) (type default) (color 0 0 0 0))
    (uuid 27bccd92-c2c0-4be4-8ebb-dda1dc5a43cf)
  )
  (wire (pts (xy 109.22 83.4136) (xy 109.22 69.596))
    (stroke (width 0) (type default) (color 0 0 0 0))
    (uuid 2f5e03cd-8fdb-45e3-8482-a33e5584c2fd)
  )
  (wire (pts (xy 164.2364 99.06) (xy 176.022 99.06))
    (stroke (width 0) (type default) (color 0 0 0 0))
    (uuid 31dd03fa-f91d-4e4d-a492-4ce6baabc3e5)
  )
  (wire (pts (xy 148.5392 68.6308) (xy 157.9372 68.6308))
    (stroke (width 0) (type default) (color 0 0 0 0))
    (uuid 3c33e8fa-a199-4302-86a9-2d92f9cd5f23)
  )
  (wire (pts (xy 94.5388 108.6104) (xy 103.2256 108.6104))
    (stroke (width 0) (type default) (color 0 0 0 0))
    (uuid 40e50401-26ee-4d82-aa11-6b3be454b16a)
  )
  (wire (pts (xy 102.4636 121.0056) (xy 102.4636 140.1572))
    (stroke (width 0) (type default) (color 0 0 0 0))
    (uuid 4376807d-ee75-4d47-b7c3-1d0deb9e3e78)
  )
  (wire (pts (xy 89.2556 97.9424) (xy 94.5388 97.9424))
    (stroke (width 0) (type default) (color 0 0 0 0))
    (uuid 45edc1ae-a6cb-4d39-bbe5-e5b663eb8d81)
  )
  (wire (pts (xy 110.49 108.6104) (xy 110.49 103.3272))
    (stroke (width 0) (type default) (color 0 0 0 0))
    (uuid 474435d5-e7c1-41e9-8b28-e22836023735)
  )
  (wire (pts (xy 110.3884 100.7872) (xy 123.7996 100.7872))
    (stroke (width 0) (type default) (color 0 0 0 0))
    (uuid 47ddeb09-2e56-4015-b3a4-63e4da7d1df6)
  )
  (wire (pts (xy 172.0596 96.52) (xy 176.022 96.52))
    (stroke (width 0) (type default) (color 0 0 0 0))
    (uuid 47ea9520-1f9a-4371-8f21-e1294d82bfa9)
  )
  (wire (pts (xy 76.6572 140.1064) (xy 76.6572 146.304))
    (stroke (width 0) (type default) (color 0 0 0 0))
    (uuid 4850b43c-ffd0-4ad1-a966-2729c13a0d5b)
  )
  (wire (pts (xy 90.3732 146.304) (xy 96.52 146.304))
    (stroke (width 0) (type default) (color 0 0 0 0))
    (uuid 4b8f8df5-02a7-4896-8f82-beb8ba83a571)
  )
  (wire (pts (xy 164.1348 95.7072) (xy 164.1348 93.98))
    (stroke (width 0) (type default) (color 0 0 0 0))
    (uuid 4c268738-d959-4ba6-a7e9-f64e2b0cab0e)
  )
  (wire (pts (xy 129.6416 75.2348) (xy 123.9012 75.2348))
    (stroke (width 0) (type default) (color 0 0 0 0))
    (uuid 4c6ef830-6cc2-4b00-ae47-bdc332075703)
  )
  (wire (pts (xy 110.49 103.3272) (xy 123.7996 103.3272))
    (stroke (width 0) (type default) (color 0 0 0 0))
    (uuid 4d866345-2c7a-4725-ac47-900c5dc70308)
  )
  (wire (pts (xy 109.22 69.596) (xy 115.316 69.596))
    (stroke (width 0) (type default) (color 0 0 0 0))
    (uuid 4dad51e0-5a19-4d24-9371-4606c8737316)
  )
  (wire (pts (xy 105.5624 108.6104) (xy 105.5624 110.49))
    (stroke (width 0) (type default) (color 0 0 0 0))
    (uuid 4e622699-90eb-446c-8087-08ad86cbd2a3)
  )
  (wire (pts (xy 158.6484 105.8672) (xy 158.6484 103.3272))
    (stroke (width 0) (type default) (color 0 0 0 0))
    (uuid 50eb801a-f7e0-4621-8b2a-0938bab52619)
  )
  (wire (pts (xy 163.7284 110.9472) (xy 163.7284 112.0648))
    (stroke (width 0) (type default) (color 0 0 0 0))
    (uuid 57c2754e-6265-4b2c-962a-183a20725b71)
  )
  (wire (pts (xy 76.6572 134.2644) (xy 76.6572 140.1064))
    (stroke (width 0) (type default) (color 0 0 0 0))
    (uuid 585df03e-97bd-4285-a498-4fc2aa1b20ce)
  )
  (wire (pts (xy 71.7296 140.1064) (xy 71.7296 83.4136))
    (stroke (width 0) (type default) (color 0 0 0 0))
    (uuid 59188f45-94ca-423b-987e-29a29ea84410)
  )
  (wire (pts (xy 163.6776 108.4072) (xy 163.6776 106.9848))
    (stroke (width 0) (type default) (color 0 0 0 0))
    (uuid 5d53b6e1-2a72-4615-8540-ad8d459674ec)
  )
  (wire (pts (xy 134.3152 140.1064) (xy 134.3152 145.9484))
    (stroke (width 0) (type default) (color 0 0 0 0))
    (uuid 60e500e7-9137-4414-be5f-1c9e11391976)
  )
  (wire (pts (xy 83.3628 98.9076) (xy 83.3628 97.9424))
    (stroke (width 0) (type default) (color 0 0 0 0))
    (uuid 611fe7a6-a9ea-4b45-b5ac-911a6f29aea0)
  )
  (wire (pts (xy 134.3152 140.1064) (xy 150.3172 140.1064))
    (stroke (width 0) (type default) (color 0 0 0 0))
    (uuid 612dab8a-40de-4f5c-9347-35b8028a9a08)
  )
  (wire (pts (xy 89.2556 118.2624) (xy 89.2556 97.9424))
    (stroke (width 0) (type default) (color 0 0 0 0))
    (uuid 624f44ad-5d88-4bb0-bc6d-e01174b1fb61)
  )
  (wire (pts (xy 175.8188 66.0908) (xy 180.8988 66.0908))
    (stroke (width 0) (type default) (color 0 0 0 0))
    (uuid 64d88152-1d24-448d-b3ed-b75f9e5923fb)
  )
  (wire (pts (xy 123.7996 80.8736) (xy 148.5392 80.8736))
    (stroke (width 0) (type default) (color 0 0 0 0))
    (uuid 6d42eb9b-b2ef-41d2-b9d1-41a00779161a)
  )
  (wire (pts (xy 148.5392 80.8736) (xy 148.5392 68.6308))
    (stroke (width 0) (type default) (color 0 0 0 0))
    (uuid 6f2fa448-76b2-4a81-bdfe-e3aeae352ca8)
  )
  (wire (pts (xy 115.1636 121.0056) (xy 102.4636 121.0056))
    (stroke (width 0) (type default) (color 0 0 0 0))
    (uuid 71e48abf-74ee-46f7-9974-677487f09159)
  )
  (wire (pts (xy 112.776 118.2624) (xy 89.2556 118.2624))
    (stroke (width 0) (type default) (color 0 0 0 0))
    (uuid 74e63f31-8e52-4880-aec9-97808ef8c786)
  )
  (wire (pts (xy 82.6008 134.2644) (xy 76.6572 134.2644))
    (stroke (width 0) (type default) (color 0 0 0 0))
    (uuid 75952c82-bbb3-4986-8c60-f02bab1914c7)
  )
  (wire (pts (xy 112.776 105.8672) (xy 112.776 118.2624))
    (stroke (width 0) (type default) (color 0 0 0 0))
    (uuid 796f5d4d-6711-444a-9b47-5848bccfdcb0)
  )
  (wire (pts (xy 110.3884 97.9424) (xy 110.3884 100.7872))
    (stroke (width 0) (type default) (color 0 0 0 0))
    (uuid 7a59773b-4a81-409b-94e9-4f305d0aa7b8)
  )
  (wire (pts (xy 146.9644 135.0264) (xy 146.9644 129.8956))
    (stroke (width 0) (type default) (color 0 0 0 0))
    (uuid 7b413310-da01-4437-8b0e-ee55290632ee)
  )
  (wire (pts (xy 137.2616 75.2348) (xy 144.018 75.2348))
    (stroke (width 0) (type default) (color 0 0 0 0))
    (uuid 7edbe6c8-e035-4381-9120-6175188667ef)
  )
  (wire (pts (xy 123.7996 108.4072) (xy 115.1636 108.4072))
    (stroke (width 0) (type default) (color 0 0 0 0))
    (uuid 803c3b39-b69c-4d49-ac8b-5f6d4be85e29)
  )
  (wire (pts (xy 105.5624 108.6104) (xy 110.49 108.6104))
    (stroke (width 0) (type default) (color 0 0 0 0))
    (uuid 8498a421-f13f-4299-8dc1-7a506ad0cd78)
  )
  (wire (pts (xy 76.6572 146.304) (xy 82.7532 146.304))
    (stroke (width 0) (type default) (color 0 0 0 0))
    (uuid 8826e7aa-18f6-4e5b-9c6b-665ff483839a)
  )
  (wire (pts (xy 103.2256 108.6104) (xy 105.5624 108.6104))
    (stroke (width 0) (type default) (color 0 0 0 0))
    (uuid 8e851ac1-e0df-40bf-835a-47b1c8d51a0c)
  )
  (wire (pts (xy 103.2256 97.9424) (xy 110.3884 97.9424))
    (stroke (width 0) (type default) (color 0 0 0 0))
    (uuid 9004ab82-4af8-49a3-a5e6-2fb05962ad46)
  )
  (wire (pts (xy 123.9012 62.738) (xy 129.5908 62.738))
    (stroke (width 0) (type default) (color 0 0 0 0))
    (uuid 90411194-c13f-4a5e-ad4e-4640a7af510f)
  )
  (wire (pts (xy 144.018 62.738) (xy 137.2108 62.738))
    (stroke (width 0) (type default) (color 0 0 0 0))
    (uuid 90d010d1-e4d4-48d5-82ab-3810ba1e812e)
  )
  (wire (pts (xy 115.316 69.596) (xy 123.9012 69.596))
    (stroke (width 0) (type default) (color 0 0 0 0))
    (uuid 97c23923-2367-4bf1-acfa-ff853c38d97a)
  )
  (wire (pts (xy 115.316 98.2472) (xy 115.316 69.596))
    (stroke (width 0) (type default) (color 0 0 0 0))
    (uuid 9aaa6664-9f34-4bc1-8e00-aa19f305d4fa)
  )
  (wire (pts (xy 102.4636 140.1572) (xy 96.52 140.1572))
    (stroke (width 0) (type default) (color 0 0 0 0))
    (uuid 9c7d5215-2bc2-4069-976f-a78389711422)
  )
  (wire (pts (xy 172.3136 68.6308) (xy 180.8988 68.6308))
    (stroke (width 0) (type default) (color 0 0 0 0))
    (uuid 9f32c03c-5ae6-4101-8e07-770072f65cc0)
  )
  (wire (pts (xy 103.2256 107.5944) (xy 103.2256 108.6104))
    (stroke (width 0) (type default) (color 0 0 0 0))
    (uuid 9fc0b8e5-baeb-45ca-89f2-353a22519f3e)
  )
  (wire (pts (xy 156.8196 103.3272) (xy 158.6484 103.3272))
    (stroke (width 0) (type default) (color 0 0 0 0))
    (uuid a0f81edb-e91f-47bd-849f-58cd77916d06)
  )
  (wire (pts (xy 107.0356 69.596) (xy 109.22 69.596))
    (stroke (width 0) (type default) (color 0 0 0 0))
    (uuid a6627ab5-f6df-493e-84e2-ed176944c1aa)
  )
  (wire (pts (xy 163.6776 106.9848) (xy 176.1744 106.9848))
    (stroke (width 0) (type default) (color 0 0 0 0))
    (uuid a878799f-4b71-480f-8d4a-2e27eba8163b)
  )
  (wire (pts (xy 178.6128 63.5508) (xy 178.6128 60.0964))
    (stroke (width 0) (type default) (color 0 0 0 0))
    (uuid af540fc8-977e-47e4-9007-36dfff3badc7)
  )
  (wire (pts (xy 172.2628 109.5248) (xy 176.1744 109.5248))
    (stroke (width 0) (type default) (color 0 0 0 0))
    (uuid af7ad025-1ec4-49f2-9413-0142eefc5fae)
  )
  (wire (pts (xy 123.7996 95.7072) (xy 123.7996 80.8736))
    (stroke (width 0) (type default) (color 0 0 0 0))
    (uuid aff4ba34-16d8-4ea1-855d-a8d3dd38ce78)
  )
  (wire (pts (xy 164.1348 93.98) (xy 176.022 93.98))
    (stroke (width 0) (type default) (color 0 0 0 0))
    (uuid b126b949-43f6-4c44-86b7-3181a8a50ed6)
  )
  (wire (pts (xy 123.7996 98.2472) (xy 115.316 98.2472))
    (stroke (width 0) (type default) (color 0 0 0 0))
    (uuid b412eac9-24e8-4f33-bfef-89b3afa30316)
  )
  (wire (pts (xy 117.6528 110.9472) (xy 117.6528 123.9012))
    (stroke (width 0) (type default) (color 0 0 0 0))
    (uuid b4261817-8434-4b8b-89ba-7243bc2d3943)
  )
  (wire (pts (xy 144.018 68.6308) (xy 148.5392 68.6308))
    (stroke (width 0) (type default) (color 0 0 0 0))
    (uuid b4d50b2d-49aa-49f0-988b-ac9dbc88ff20)
  )
  (wire (pts (xy 90.2208 134.2644) (xy 96.52 134.2644))
    (stroke (width 0) (type default) (color 0 0 0 0))
    (uuid b7e33eba-6af0-4572-9df2-4f131aa42a96)
  )
  (wire (pts (xy 163.7284 112.0648) (xy 176.1744 112.0648))
    (stroke (width 0) (type default) (color 0 0 0 0))
    (uuid bd272c24-1d5a-475e-a283-5dd25d9619ed)
  )
  (wire (pts (xy 123.7996 105.8672) (xy 112.776 105.8672))
    (stroke (width 0) (type default) (color 0 0 0 0))
    (uuid be806ad0-d36c-4fdb-b345-e6846bcec89a)
  )
  (wire (pts (xy 115.1636 108.4072) (xy 115.1636 121.0056))
    (stroke (width 0) (type default) (color 0 0 0 0))
    (uuid c3a16824-7b4a-4456-b988-3b70a10175fe)
  )
  (wire (pts (xy 94.5388 97.9424) (xy 103.2256 97.9424))
    (stroke (width 0) (type default) (color 0 0 0 0))
    (uuid c8fa22bf-9f7d-4a3d-8da3-a1f24f794fe0)
  )
  (wire (pts (xy 156.8196 95.7072) (xy 164.1348 95.7072))
    (stroke (width 0) (type default) (color 0 0 0 0))
    (uuid cae00ee4-ebcf-4e2d-a741-c38cb39bddbf)
  )
  (wire (pts (xy 125.2728 140.1064) (xy 134.3152 140.1064))
    (stroke (width 0) (type default) (color 0 0 0 0))
    (uuid cee0d633-8af5-4565-83cc-6584797236c4)
  )
  (wire (pts (xy 83.3628 97.9424) (xy 86.5124 97.9424))
    (stroke (width 0) (type default) (color 0 0 0 0))
    (uuid cf0f68bf-548b-4ed9-ae02-6c9c1db602bb)
  )
  (wire (pts (xy 96.52 140.1572) (xy 96.52 146.304))
    (stroke (width 0) (type default) (color 0 0 0 0))
    (uuid cf4ef03c-b769-49ee-9f85-05745c1e133c)
  )
  (wire (pts (xy 144.018 68.6308) (xy 144.018 62.738))
    (stroke (width 0) (type default) (color 0 0 0 0))
    (uuid d1789d0b-3fde-446b-a4d1-5772d5221248)
  )
  (wire (pts (xy 164.2364 98.2472) (xy 164.2364 99.06))
    (stroke (width 0) (type default) (color 0 0 0 0))
    (uuid d7a8bcfe-4092-4524-bc5e-4764f48d3c08)
  )
  (wire (pts (xy 180.8988 63.5508) (xy 178.6128 63.5508))
    (stroke (width 0) (type default) (color 0 0 0 0))
    (uuid dbbadb28-b628-4c11-b328-0e7c00ebef95)
  )
  (wire (pts (xy 96.52 134.2644) (xy 96.52 140.1572))
    (stroke (width 0) (type default) (color 0 0 0 0))
    (uuid e21a9ff8-b6eb-4b11-b527-34aaf8db3558)
  )
  (wire (pts (xy 117.6528 123.9012) (xy 112.3188 123.9012))
    (stroke (width 0) (type default) (color 0 0 0 0))
    (uuid e24175b5-23f4-47df-82b6-24893a018628)
  )
  (wire (pts (xy 172.3136 80.6704) (xy 172.3136 82.55))
    (stroke (width 0) (type default) (color 0 0 0 0))
    (uuid e38b6853-bdca-4f8b-864b-9f909d27b0df)
  )
  (wire (pts (xy 109.728 67.056) (xy 109.728 62.8396))
    (stroke (width 0) (type default) (color 0 0 0 0))
    (uuid e5703861-164f-455c-9aad-f6214c77e7f6)
  )
  (wire (pts (xy 158.6484 103.3272) (xy 161.3916 103.3272))
    (stroke (width 0) (type default) (color 0 0 0 0))
    (uuid e7e41df4-870e-4629-8a92-99bcfb9ce8bf)
  )
  (wire (pts (xy 94.5388 108.6104) (xy 94.5388 110.7948))
    (stroke (width 0) (type default) (color 0 0 0 0))
    (uuid e8d08dd5-bcd4-4d06-9a93-af2956095b0e)
  )
  (wire (pts (xy 107.0356 67.056) (xy 109.728 67.056))
    (stroke (width 0) (type default) (color 0 0 0 0))
    (uuid e944133d-c31d-4ba3-86b0-a4cbb6305cab)
  )
  (wire (pts (xy 156.8196 100.7872) (xy 158.6484 100.7872))
    (stroke (width 0) (type default) (color 0 0 0 0))
    (uuid ebb0f19b-d61f-476c-975d-740ee4ad2102)
  )
  (wire (pts (xy 165.5572 68.6308) (xy 172.3136 68.6308))
    (stroke (width 0) (type default) (color 0 0 0 0))
    (uuid ebe00973-e944-4c87-acbb-adee561a4c1d)
  )
  (wire (pts (xy 148.1328 137.5664) (xy 150.3172 137.5664))
    (stroke (width 0) (type default) (color 0 0 0 0))
    (uuid ef647f0d-7fc3-4665-bbb2-c20bcc522c3e)
  )
  (wire (pts (xy 150.3172 135.0264) (xy 146.9644 135.0264))
    (stroke (width 0) (type default) (color 0 0 0 0))
    (uuid f0ba9606-1539-4b9d-9bcb-c728b33ebc81)
  )
  (wire (pts (xy 156.8196 108.4072) (xy 163.6776 108.4072))
    (stroke (width 0) (type default) (color 0 0 0 0))
    (uuid f2553af3-f4eb-418f-a775-15f0f931e86b)
  )
  (wire (pts (xy 103.2256 97.9424) (xy 103.2256 99.9744))
    (stroke (width 0) (type default) (color 0 0 0 0))
    (uuid f5379707-fd4b-4869-b47c-234534192f08)
  )
  (wire (pts (xy 144.018 75.2348) (xy 144.018 68.6308))
    (stroke (width 0) (type default) (color 0 0 0 0))
    (uuid f57731fc-6f4a-44ee-8b8a-7639f1684f3a)
  )
  (wire (pts (xy 158.6484 100.7872) (xy 158.6484 103.3272))
    (stroke (width 0) (type default) (color 0 0 0 0))
    (uuid f920a321-c0b2-4728-9f5d-ddd7a76af9c2)
  )
  (wire (pts (xy 86.5124 97.9424) (xy 89.2556 97.9424))
    (stroke (width 0) (type default) (color 0 0 0 0))
    (uuid fc854c6b-6685-4ac8-b678-1467af47b1bc)
  )
  (wire (pts (xy 112.3188 140.1064) (xy 117.6528 140.1064))
    (stroke (width 0) (type default) (color 0 0 0 0))
    (uuid fda36790-73f5-479f-8831-02ca75d6d8f6)
  )
  (wire (pts (xy 86.5124 96.4184) (xy 86.5124 97.9424))
    (stroke (width 0) (type default) (color 0 0 0 0))
    (uuid ff7b2244-a5d2-4983-bec8-264724f8dd18)
  )

  (symbol (lib_id "Device:C") (at 134.3152 149.7584 0) (unit 1)
    (in_bom yes) (on_board yes)
    (uuid 0a80616c-6898-4cc5-a3f0-bc547bb20ee9)
    (property "Reference" "C6" (id 0) (at 129.032 148.5392 0)
      (effects (font (size 1.27 1.27)) (justify left))
    )
    (property "Value" "100n" (id 1) (at 127.4064 151.13 0)
      (effects (font (size 1.27 1.27)) (justify left))
    )
    (property "Footprint" "Capacitor_SMD:C_0603_1608Metric_Pad1.08x0.95mm_HandSolder" (id 2) (at 135.2804 153.5684 0)
      (effects (font (size 1.27 1.27)) hide)
    )
    (property "Datasheet" "~" (id 3) (at 134.3152 149.7584 0)
      (effects (font (size 1.27 1.27)) hide)
    )
    (pin "1" (uuid 1d8b8df3-af40-490a-8fda-ba72d51bc935))
    (pin "2" (uuid 081c1148-2f93-437d-90e2-0122c301959b))
  )

  (symbol (lib_id "power:GND") (at 134.3152 155.448 0) (unit 1)
    (in_bom yes) (on_board yes) (fields_autoplaced)
    (uuid 0fdfb0ca-fb2e-49d4-924b-642c245af407)
    (property "Reference" "#PWR0105" (id 0) (at 134.3152 161.798 0)
      (effects (font (size 1.27 1.27)) hide)
    )
    (property "Value" "GND" (id 1) (at 134.3152 160.1724 0))
    (property "Footprint" "" (id 2) (at 134.3152 155.448 0)
      (effects (font (size 1.27 1.27)) hide)
    )
    (property "Datasheet" "" (id 3) (at 134.3152 155.448 0)
      (effects (font (size 1.27 1.27)) hide)
    )
    (pin "1" (uuid 5af6c398-bbec-47cb-b75c-b3a813666494))
  )

  (symbol (lib_id "Device:C") (at 94.5388 103.7336 0) (unit 1)
    (in_bom yes) (on_board yes) (fields_autoplaced)
    (uuid 102c4f15-f7f0-47b3-b463-90324a621426)
    (property "Reference" "C1" (id 0) (at 97.79 102.4635 0)
      (effects (font (size 1.27 1.27)) (justify left))
    )
    (property "Value" "10u" (id 1) (at 97.79 105.0035 0)
      (effects (font (size 1.27 1.27)) (justify left))
    )
    (property "Footprint" "Capacitor_SMD:C_0603_1608Metric_Pad1.08x0.95mm_HandSolder" (id 2) (at 95.504 107.5436 0)
      (effects (font (size 1.27 1.27)) hide)
    )
    (property "Datasheet" "~" (id 3) (at 94.5388 103.7336 0)
      (effects (font (size 1.27 1.27)) hide)
    )
    (pin "1" (uuid 7f8398d1-1fcb-4b17-b71c-c5df98433848))
    (pin "2" (uuid 447c289f-e3ea-4183-b81d-b7026faccfd7))
  )

  (symbol (lib_id "power:GND") (at 172.3136 82.55 0) (unit 1)
    (in_bom yes) (on_board yes) (fields_autoplaced)
    (uuid 24587fcd-cc31-4cad-9b1b-ca9128ef77b0)
    (property "Reference" "#PWR04" (id 0) (at 172.3136 88.9 0)
      (effects (font (size 1.27 1.27)) hide)
    )
    (property "Value" "GND" (id 1) (at 172.3136 87.2744 0))
    (property "Footprint" "" (id 2) (at 172.3136 82.55 0)
      (effects (font (size 1.27 1.27)) hide)
    )
    (property "Datasheet" "" (id 3) (at 172.3136 82.55 0)
      (effects (font (size 1.27 1.27)) hide)
    )
    (pin "1" (uuid dfc40f91-a734-4293-bf46-99478e8cc1b1))
  )

  (symbol (lib_id "power:PWR_FLAG") (at 105.5624 110.49 180) (unit 1)
    (in_bom yes) (on_board yes) (fields_autoplaced)
    (uuid 24ec63ca-04d3-4a13-83bf-b57fb455da98)
    (property "Reference" "#FLG0101" (id 0) (at 105.5624 112.395 0)
      (effects (font (size 1.27 1.27)) hide)
    )
    (property "Value" "PWR_FLAG" (id 1) (at 105.5624 115.57 0))
    (property "Footprint" "" (id 2) (at 105.5624 110.49 0)
      (effects (font (size 1.27 1.27)) hide)
    )
    (property "Datasheet" "~" (id 3) (at 105.5624 110.49 0)
      (effects (font (size 1.27 1.27)) hide)
    )
    (pin "1" (uuid ab6758b3-43a4-4fe4-9656-4d27692c0f6b))
  )

  (symbol (lib_id "power:GND") (at 172.0596 96.52 270) (unit 1)
    (in_bom yes) (on_board yes)
    (uuid 256352e3-9c87-4744-8712-54d43e853184)
    (property "Reference" "#PWR0104" (id 0) (at 165.7096 96.52 0)
      (effects (font (size 1.27 1.27)) hide)
    )
    (property "Value" "GND" (id 1) (at 165.2016 96.6216 90)
      (effects (font (size 1.27 1.27)) (justify left))
    )
    (property "Footprint" "" (id 2) (at 172.0596 96.52 0)
      (effects (font (size 1.27 1.27)) hide)
    )
    (property "Datasheet" "" (id 3) (at 172.0596 96.52 0)
      (effects (font (size 1.27 1.27)) hide)
    )
    (pin "1" (uuid 627b8805-6f5d-43a4-8ac5-b4fd555481ba))
  )

  (symbol (lib_id "Connector:Conn_01x03_Male") (at 185.9788 66.0908 180) (unit 1)
    (in_bom yes) (on_board yes) (fields_autoplaced)
    (uuid 3593ac02-64b6-4a09-b5ce-5df341f1aa56)
    (property "Reference" "J2" (id 0) (at 187.5536 64.8207 0)
      (effects (font (size 1.27 1.27)) (justify right))
    )
    (property "Value" "Conn_01x03_Male" (id 1) (at 187.5536 67.3607 0)
      (effects (font (size 1.27 1.27)) (justify right))
    )
    (property "Footprint" "Connector_PinHeader_2.54mm:PinHeader_1x03_P2.54mm_Vertical" (id 2) (at 185.9788 66.0908 0)
      (effects (font (size 1.27 1.27)) hide)
    )
    (property "Datasheet" "~" (id 3) (at 185.9788 66.0908 0)
      (effects (font (size 1.27 1.27)) hide)
    )
    (pin "1" (uuid adc96850-caed-4b02-bf54-48579742a2e6))
    (pin "2" (uuid 0cbb4dd4-56b4-4faf-a07a-b5320483313b))
    (pin "3" (uuid 8c110246-3185-465e-87b6-fc62f78275a6))
  )

  (symbol (lib_id "Device:R") (at 86.4108 134.2644 270) (unit 1)
    (in_bom yes) (on_board yes) (fields_autoplaced)
    (uuid 38ecdee2-49d2-4ec9-b664-af6f843820c3)
    (property "Reference" "R3" (id 0) (at 86.4108 127.7112 90))
    (property "Value" "3.97k" (id 1) (at 86.4108 130.2512 90))
    (property "Footprint" "Resistor_SMD:R_0603_1608Metric_Pad0.98x0.95mm_HandSolder" (id 2) (at 86.4108 132.4864 90)
      (effects (font (size 1.27 1.27)) hide)
    )
    (property "Datasheet" "~" (id 3) (at 86.4108 134.2644 0)
      (effects (font (size 1.27 1.27)) hide)
    )
    (pin "1" (uuid d02d23f0-499f-4e9a-b7cb-898d512a90ec))
    (pin "2" (uuid 64453496-9e85-405b-b551-1fff319609d5))
  )

  (symbol (lib_id "Device:C") (at 103.2256 103.7844 0) (unit 1)
    (in_bom yes) (on_board yes) (fields_autoplaced)
    (uuid 39359626-337e-4b41-b424-df5574ba1763)
    (property "Reference" "C2" (id 0) (at 106.68 102.5143 0)
      (effects (font (size 1.27 1.27)) (justify left))
    )
    (property "Value" "100n" (id 1) (at 106.68 105.0543 0)
      (effects (font (size 1.27 1.27)) (justify left))
    )
    (property "Footprint" "Capacitor_SMD:C_0603_1608Metric_Pad1.08x0.95mm_HandSolder" (id 2) (at 104.1908 107.5944 0)
      (effects (font (size 1.27 1.27)) hide)
    )
    (property "Datasheet" "~" (id 3) (at 103.2256 103.7844 0)
      (effects (font (size 1.27 1.27)) hide)
    )
    (pin "1" (uuid 81433a35-d995-4aaa-8bfc-a08150eef518))
    (pin "2" (uuid 8974d6ce-05d3-4be6-9678-d0054aa0b32f))
  )

  (symbol (lib_id "Mechanical:MountingHole") (at 40.5892 81.6356 0) (unit 1)
    (in_bom yes) (on_board yes) (fields_autoplaced)
    (uuid 471f517c-6d52-459f-9d7a-aedf176fc9e0)
    (property "Reference" "H1" (id 0) (at 43.8404 80.3655 0)
      (effects (font (size 1.27 1.27)) (justify left))
    )
    (property "Value" "MountingHole" (id 1) (at 43.8404 82.9055 0)
      (effects (font (size 1.27 1.27)) (justify left))
    )
    (property "Footprint" "MountingHole:MountingHole_3mm" (id 2) (at 40.5892 81.6356 0)
      (effects (font (size 1.27 1.27)) hide)
    )
    (property "Datasheet" "~" (id 3) (at 40.5892 81.6356 0)
      (effects (font (size 1.27 1.27)) hide)
    )
  )

  (symbol (lib_id "power:GND") (at 109.728 62.8396 180) (unit 1)
    (in_bom yes) (on_board yes) (fields_autoplaced)
    (uuid 4cf7764b-d277-44f4-82d4-f33c22eb65ab)
    (property "Reference" "#PWR01" (id 0) (at 109.728 56.4896 0)
      (effects (font (size 1.27 1.27)) hide)
    )
    (property "Value" "GND" (id 1) (at 109.728 57.8104 0))
    (property "Footprint" "" (id 2) (at 109.728 62.8396 0)
      (effects (font (size 1.27 1.27)) hide)
    )
    (property "Datasheet" "" (id 3) (at 109.728 62.8396 0)
      (effects (font (size 1.27 1.27)) hide)
    )
    (pin "1" (uuid 7a0f3731-20f2-423e-91f2-43a1f716970a))
  )

  (symbol (lib_id "TLV2254AIDR_lib:TLV2254AIDR") (at 123.7996 95.7072 0) (unit 1)
    (in_bom yes) (on_board yes) (fields_autoplaced)
    (uuid 51f6fa2f-597e-4858-b790-78a6a3037757)
    (property "Reference" "IC1" (id 0) (at 140.3096 87.63 0))
    (property "Value" "TLV2254AIDR" (id 1) (at 140.3096 90.17 0))
    (property "Footprint" "TLV2254AIDR:TLV2254AIDR" (id 2) (at 153.0096 93.1672 0)
      (effects (font (size 1.27 1.27)) (justify left) hide)
    )
    (property "Datasheet" "http://www.ti.com/lit/gpn/TLV2254A" (id 3) (at 153.0096 95.7072 0)
      (effects (font (size 1.27 1.27)) (justify left) hide)
    )
    (property "Description" "Quad Low-Voltage Rail-To-Rail Operational Amplifier" (id 4) (at 153.0096 98.2472 0)
      (effects (font (size 1.27 1.27)) (justify left) hide)
    )
    (property "Height" "1.75" (id 5) (at 153.0096 100.7872 0)
      (effects (font (size 1.27 1.27)) (justify left) hide)
    )
    (property "Mouser Part Number" "595-TLV2254AIDR" (id 6) (at 153.0096 103.3272 0)
      (effects (font (size 1.27 1.27)) (justify left) hide)
    )
    (property "Mouser Price/Stock" "https://www.mouser.co.uk/ProductDetail/Texas-Instruments/TLV2254AIDR?qs=Fg5TsMy7H4tEDlpHSjkW%252BQ%3D%3D" (id 7) (at 153.0096 105.8672 0)
      (effects (font (size 1.27 1.27)) (justify left) hide)
    )
    (property "Manufacturer_Name" "Texas Instruments" (id 8) (at 153.0096 108.4072 0)
      (effects (font (size 1.27 1.27)) (justify left) hide)
    )
    (property "Manufacturer_Part_Number" "TLV2254AIDR" (id 9) (at 153.0096 110.9472 0)
      (effects (font (size 1.27 1.27)) (justify left) hide)
    )
    (pin "1" (uuid 63fd5567-4ab6-4b10-893c-2df58a9b762e))
    (pin "10" (uuid ee2c0b31-b534-4bb9-b60b-5b0655ad95b4))
    (pin "11" (uuid f71baefb-cc9d-4d48-aa9a-87096b58a971))
    (pin "12" (uuid 3069d8fb-468a-4ca7-b61b-8bfd51868335))
    (pin "13" (uuid 88598267-9715-4396-b405-7173b32b98fa))
    (pin "14" (uuid 5ff470ca-3d2a-4912-822c-d2f1ff29acdb))
    (pin "2" (uuid 491a861c-bbf5-46fd-9c94-06f2c1e9aa78))
    (pin "3" (uuid 09f4b046-b430-416a-aeca-2d0287d2a7f1))
    (pin "4" (uuid c0ba5626-e871-4646-ab23-523088ecd1c9))
    (pin "5" (uuid fed75cda-4544-4b2c-b0e2-28fe80909344))
    (pin "6" (uuid 3a72d0b9-feaa-4a37-b116-e8b23a9f98ff))
    (pin "7" (uuid 76b1efaf-1570-4eb9-ba84-6db209471c1f))
    (pin "8" (uuid ec8612ec-0458-4c10-b209-6efecc853f58))
    (pin "9" (uuid de7a64c0-d0b4-492c-b2bd-a84f8c9b91c8))
  )

  (symbol (lib_id "Device:C") (at 172.3136 76.8604 0) (unit 1)
    (in_bom yes) (on_board yes)
    (uuid 596a0134-78fe-4dbe-b5ad-ac5040289e55)
    (property "Reference" "C4" (id 0) (at 167.0304 75.6412 0)
      (effects (font (size 1.27 1.27)) (justify left))
    )
    (property "Value" "100n" (id 1) (at 165.4048 78.232 0)
      (effects (font (size 1.27 1.27)) (justify left))
    )
    (property "Footprint" "Capacitor_SMD:C_0603_1608Metric_Pad1.08x0.95mm_HandSolder" (id 2) (at 173.2788 80.6704 0)
      (effects (font (size 1.27 1.27)) hide)
    )
    (property "Datasheet" "~" (id 3) (at 172.3136 76.8604 0)
      (effects (font (size 1.27 1.27)) hide)
    )
    (pin "1" (uuid 955e7d06-0262-4af9-8bb7-d8c4ea04846a))
    (pin "2" (uuid 439e3f45-e1bb-4f24-bea1-334b47ca4202))
  )

  (symbol (lib_id "power:GND") (at 83.3628 98.9076 0) (unit 1)
    (in_bom yes) (on_board yes) (fields_autoplaced)
    (uuid 596b86b4-65fa-47ca-9614-4f75bca4c762)
    (property "Reference" "#PWR02" (id 0) (at 83.3628 105.2576 0)
      (effects (font (size 1.27 1.27)) hide)
    )
    (property "Value" "GND" (id 1) (at 83.3628 103.632 0))
    (property "Footprint" "" (id 2) (at 83.3628 98.9076 0)
      (effects (font (size 1.27 1.27)) hide)
    )
    (property "Datasheet" "" (id 3) (at 83.3628 98.9076 0)
      (effects (font (size 1.27 1.27)) hide)
    )
    (pin "1" (uuid 611b4ae6-e8b5-45eb-8302-dfb24d13039c))
  )

  (symbol (lib_id "power:GND") (at 161.3916 103.3272 90) (unit 1)
    (in_bom yes) (on_board yes) (fields_autoplaced)
    (uuid 5c15ce3e-b822-434e-9649-e012dab833ed)
    (property "Reference" "#PWR03" (id 0) (at 167.7416 103.3272 0)
      (effects (font (size 1.27 1.27)) hide)
    )
    (property "Value" "GND" (id 1) (at 165.2016 103.3271 90)
      (effects (font (size 1.27 1.27)) (justify right))
    )
    (property "Footprint" "" (id 2) (at 161.3916 103.3272 0)
      (effects (font (size 1.27 1.27)) hide)
    )
    (property "Datasheet" "" (id 3) (at 161.3916 103.3272 0)
      (effects (font (size 1.27 1.27)) hide)
    )
    (pin "1" (uuid 2b8f9035-c4ba-4acb-8c8e-2b186e0ff025))
  )

  (symbol (lib_id "Device:R") (at 133.4008 62.738 270) (unit 1)
    (in_bom yes) (on_board yes) (fields_autoplaced)
    (uuid 609c70f4-1479-4ca4-a93e-8230d97706fb)
    (property "Reference" "R1" (id 0) (at 133.4008 55.88 90))
    (property "Value" "3.97k" (id 1) (at 133.4008 58.42 90))
    (property "Footprint" "Resistor_SMD:R_0603_1608Metric_Pad0.98x0.95mm_HandSolder" (id 2) (at 133.4008 60.96 90)
      (effects (font (size 1.27 1.27)) hide)
    )
    (property "Datasheet" "~" (id 3) (at 133.4008 62.738 0)
      (effects (font (size 1.27 1.27)) hide)
    )
    (pin "1" (uuid 679644e3-5194-49c9-bc2f-670fb057cc6d))
    (pin "2" (uuid 00285115-56ef-45e8-8528-f99553a17b5e))
  )

  (symbol (lib_id "Device:R") (at 121.4628 140.1064 90) (unit 1)
    (in_bom yes) (on_board yes) (fields_autoplaced)
    (uuid 702c6266-7281-4661-be01-a57edaa7a2ef)
    (property "Reference" "R4" (id 0) (at 121.4628 133.35 90))
    (property "Value" "7.87k" (id 1) (at 121.4628 135.89 90))
    (property "Footprint" "Resistor_SMD:R_0603_1608Metric_Pad0.98x0.95mm_HandSolder" (id 2) (at 121.4628 141.8844 90)
      (effects (font (size 1.27 1.27)) hide)
    )
    (property "Datasheet" "~" (id 3) (at 121.4628 140.1064 0)
      (effects (font (size 1.27 1.27)) hide)
    )
    (pin "1" (uuid aed74ebc-4715-4218-99f7-c3f4c3551cba))
    (pin "2" (uuid 19d3ea82-3552-48c3-9afe-8be671130865))
  )

  (symbol (lib_id "Mechanical:MountingHole") (at 40.7924 105.156 0) (unit 1)
    (in_bom yes) (on_board yes) (fields_autoplaced)
    (uuid 773a6110-b6de-4760-af86-4512c04abc39)
    (property "Reference" "H4" (id 0) (at 43.8404 103.8859 0)
      (effects (font (size 1.27 1.27)) (justify left))
    )
    (property "Value" "MountingHole" (id 1) (at 43.8404 106.4259 0)
      (effects (font (size 1.27 1.27)) (justify left))
    )
    (property "Footprint" "MountingHole:MountingHole_3mm" (id 2) (at 40.7924 105.156 0)
      (effects (font (size 1.27 1.27)) hide)
    )
    (property "Datasheet" "~" (id 3) (at 40.7924 105.156 0)
      (effects (font (size 1.27 1.27)) hide)
    )
  )

  (symbol (lib_id "Connector:Conn_01x03_Male") (at 181.2544 109.5248 180) (unit 1)
    (in_bom yes) (on_board yes)
    (uuid 79fc1ef9-e921-4832-95d3-5ae7ff6b03fb)
    (property "Reference" "J4" (id 0) (at 190.0428 108.0008 0)
      (effects (font (size 1.27 1.27)) (justify right))
    )
    (property "Value" "Conn_01x03_Male" (id 1) (at 182.88 110.7947 0)
      (effects (font (size 1.27 1.27)) (justify right))
    )
    (property "Footprint" "Connector_PinHeader_2.54mm:PinHeader_1x03_P2.54mm_Vertical" (id 2) (at 181.2544 109.5248 0)
      (effects (font (size 1.27 1.27)) hide)
    )
    (property "Datasheet" "~" (id 3) (at 181.2544 109.5248 0)
      (effects (font (size 1.27 1.27)) hide)
    )
    (pin "1" (uuid ef546906-3f95-4037-a4d5-06936948161a))
    (pin "2" (uuid 9c5eb8ba-0370-4530-b0dd-d326ff9cd796))
    (pin "3" (uuid 5ce1aa0c-f98f-4b94-80bd-f188cf4c57de))
  )

  (symbol (lib_id "Mechanical:MountingHole") (at 41.7576 98.5012 0) (unit 1)
    (in_bom yes) (on_board yes) (fields_autoplaced)
    (uuid 83d289e8-09e9-450f-aa29-e4a965c20aed)
    (property "Reference" "H3" (id 0) (at 45.1104 97.2311 0)
      (effects (font (size 1.27 1.27)) (justify left))
    )
    (property "Value" "MountingHole" (id 1) (at 45.1104 99.7711 0)
      (effects (font (size 1.27 1.27)) (justify left))
    )
    (property "Footprint" "MountingHole:MountingHole_3mm" (id 2) (at 41.7576 98.5012 0)
      (effects (font (size 1.27 1.27)) hide)
    )
    (property "Datasheet" "~" (id 3) (at 41.7576 98.5012 0)
      (effects (font (size 1.27 1.27)) hide)
    )
  )

  (symbol (lib_id "Device:C") (at 86.5632 146.304 90) (unit 1)
    (in_bom yes) (on_board yes) (fields_autoplaced)
    (uuid 956f43ca-d962-4f66-809d-7ccdbee7cad2)
    (property "Reference" "C5" (id 0) (at 86.5632 139.446 90))
    (property "Value" "100p" (id 1) (at 86.5632 141.986 90))
    (property "Footprint" "Capacitor_SMD:C_0603_1608Metric_Pad1.08x0.95mm_HandSolder" (id 2) (at 90.3732 145.3388 0)
      (effects (font (size 1.27 1.27)) hide)
    )
    (property "Datasheet" "~" (id 3) (at 86.5632 146.304 0)
      (effects (font (size 1.27 1.27)) hide)
    )
    (pin "1" (uuid 0f6346b2-7658-4e48-966f-3efbd180acd9))
    (pin "2" (uuid 32e7e7e4-f453-4990-af74-2d882b93879b))
  )

  (symbol (lib_id "power:+3.3V") (at 94.5388 110.7948 180) (unit 1)
    (in_bom yes) (on_board yes)
    (uuid 9a6c11e2-95e1-44f3-9517-31f899b5aae2)
    (property "Reference" "#PWR0101" (id 0) (at 94.5388 106.9848 0)
      (effects (font (size 1.27 1.27)) hide)
    )
    (property "Value" "+3.3V" (id 1) (at 91.5924 114.8588 0)
      (effects (font (size 1.27 1.27)) (justify right))
    )
    (property "Footprint" "" (id 2) (at 94.5388 110.7948 0)
      (effects (font (size 1.27 1.27)) hide)
    )
    (property "Datasheet" "" (id 3) (at 94.5388 110.7948 0)
      (effects (font (size 1.27 1.27)) hide)
    )
    (pin "1" (uuid 2832c3c3-f31a-4734-8388-37e1fbc6f915))
  )

  (symbol (lib_id "power:+3.3V") (at 178.6128 60.0964 0) (unit 1)
    (in_bom yes) (on_board yes)
    (uuid 9ff6cec6-084d-4226-a193-70e960a252af)
    (property "Reference" "#PWR05" (id 0) (at 178.6128 63.9064 0)
      (effects (font (size 1.27 1.27)) hide)
    )
    (property "Value" "+3.3V" (id 1) (at 178.7652 55.626 0))
    (property "Footprint" "" (id 2) (at 178.6128 60.0964 0)
      (effects (font (size 1.27 1.27)) hide)
    )
    (property "Datasheet" "" (id 3) (at 178.6128 60.0964 0)
      (effects (font (size 1.27 1.27)) hide)
    )
    (pin "1" (uuid 9e81fdc6-137d-4412-812c-6d96a90f40fd))
  )

  (symbol (lib_id "Device:C") (at 133.4516 75.2348 90) (unit 1)
    (in_bom yes) (on_board yes) (fields_autoplaced)
    (uuid a11ea8f7-3b1d-466a-a03d-fdf0b7a8fceb)
    (property "Reference" "C3" (id 0) (at 133.4516 67.31 90))
    (property "Value" "100p" (id 1) (at 133.4516 69.85 90))
    (property "Footprint" "Capacitor_SMD:C_0603_1608Metric_Pad1.08x0.95mm_HandSolder" (id 2) (at 137.2616 74.2696 0)
      (effects (font (size 1.27 1.27)) hide)
    )
    (property "Datasheet" "~" (id 3) (at 133.4516 75.2348 0)
      (effects (font (size 1.27 1.27)) hide)
    )
    (pin "1" (uuid ed0b182c-31e1-4e75-8726-ffb5b665ed77))
    (pin "2" (uuid 3fada296-287e-4c5d-a2d7-b65eae35a9a0))
  )

  (symbol (lib_id "power:GND") (at 148.1328 137.5664 270) (unit 1)
    (in_bom yes) (on_board yes)
    (uuid a78b8bf3-8413-411b-9720-d23a20532c49)
    (property "Reference" "#PWR0102" (id 0) (at 141.7828 137.5664 0)
      (effects (font (size 1.27 1.27)) hide)
    )
    (property "Value" "GND" (id 1) (at 142.7988 137.4648 90))
    (property "Footprint" "" (id 2) (at 148.1328 137.5664 0)
      (effects (font (size 1.27 1.27)) hide)
    )
    (property "Datasheet" "" (id 3) (at 148.1328 137.5664 0)
      (effects (font (size 1.27 1.27)) hide)
    )
    (pin "1" (uuid 99938d05-ebc2-4749-8778-8dc766bc1d65))
  )

  (symbol (lib_id "Device:R") (at 161.7472 68.6308 90) (unit 1)
    (in_bom yes) (on_board yes) (fields_autoplaced)
    (uuid b08a5218-3c22-4695-ab71-ac0793f0ef12)
    (property "Reference" "R2" (id 0) (at 161.7472 62.23 90))
    (property "Value" "7.87k" (id 1) (at 161.7472 64.77 90))
    (property "Footprint" "Resistor_SMD:R_0603_1608Metric_Pad0.98x0.95mm_HandSolder" (id 2) (at 161.7472 70.4088 90)
      (effects (font (size 1.27 1.27)) hide)
    )
    (property "Datasheet" "~" (id 3) (at 161.7472 68.6308 0)
      (effects (font (size 1.27 1.27)) hide)
    )
    (pin "1" (uuid 8f1fd0e6-3131-44eb-8cae-19bdab9edcfb))
    (pin "2" (uuid 01dda118-d275-4b9e-b88e-1696961e25a6))
  )

  (symbol (lib_id "power:GND") (at 175.8188 66.0908 270) (unit 1)
    (in_bom yes) (on_board yes)
    (uuid b2a9f409-eaca-4fbd-83ce-7334f0a6ed51)
    (property "Reference" "#PWR06" (id 0) (at 169.4688 66.0908 0)
      (effects (font (size 1.27 1.27)) hide)
    )
    (property "Value" "GND" (id 1) (at 173.5328 64.262 90)
      (effects (font (size 1.27 1.27)) (justify right))
    )
    (property "Footprint" "" (id 2) (at 175.8188 66.0908 0)
      (effects (font (size 1.27 1.27)) hide)
    )
    (property "Datasheet" "" (id 3) (at 175.8188 66.0908 0)
      (effects (font (size 1.27 1.27)) hide)
    )
    (pin "1" (uuid 6301ccc7-226e-456b-8070-ecc65d94db48))
  )

  (symbol (lib_id "Connector:Conn_01x03_Male") (at 155.3972 137.5664 180) (unit 1)
    (in_bom yes) (on_board yes)
    (uuid c42ea107-1c70-4c02-b72d-5d09545e9247)
    (property "Reference" "J1" (id 0) (at 157.7848 137.5664 0))
    (property "Value" "Conn_01x03_Male" (id 1) (at 165.8112 140.0048 0))
    (property "Footprint" "Connector_PinHeader_2.54mm:PinHeader_1x03_P2.54mm_Vertical" (id 2) (at 155.3972 137.5664 0)
      (effects (font (size 1.27 1.27)) hide)
    )
    (property "Datasheet" "~" (id 3) (at 155.3972 137.5664 0)
      (effects (font (size 1.27 1.27)) hide)
    )
    (pin "1" (uuid 2a67b763-b5a6-47fb-be1a-16d3f0a02946))
    (pin "2" (uuid 75b6fc25-9d7a-40c1-a0c6-88c0daca7fee))
    (pin "3" (uuid bc3ca981-f833-494e-a5e1-7ee051789021))
  )

  (symbol (lib_id "Connector:Conn_01x03_Male") (at 181.102 96.52 0) (mirror y) (unit 1)
    (in_bom yes) (on_board yes)
    (uuid ca221485-8dbb-436e-8b3e-94c2d532aee3)
    (property "Reference" "J3" (id 0) (at 191.0842 94.1832 0))
    (property "Value" "Conn_01x03_Male" (id 1) (at 190.1952 96.9772 0))
    (property "Footprint" "Connector_PinHeader_2.54mm:PinHeader_1x03_P2.54mm_Vertical" (id 2) (at 181.102 96.52 0)
      (effects (font (size 1.27 1.27)) hide)
    )
    (property "Datasheet" "~" (id 3) (at 181.102 96.52 0)
      (effects (font (size 1.27 1.27)) hide)
    )
    (pin "1" (uuid f7a980e1-d757-405b-965e-cb3c9b1ceca1))
    (pin "2" (uuid f3c28ff0-c3be-47ce-bf6f-f3061324a07d))
    (pin "3" (uuid c665bf8f-ade8-4a9d-95ae-f4e3ccaa66bf))
  )

  (symbol (lib_id "Mechanical:MountingHole") (at 40.6908 90.6272 0) (unit 1)
    (in_bom yes) (on_board yes) (fields_autoplaced)
    (uuid ccbccc68-d102-4809-a3c8-c848af50e594)
    (property "Reference" "H2" (id 0) (at 43.8404 89.3571 0)
      (effects (font (size 1.27 1.27)) (justify left))
    )
    (property "Value" "MountingHole" (id 1) (at 43.8404 91.8971 0)
      (effects (font (size 1.27 1.27)) (justify left))
    )
    (property "Footprint" "MountingHole:MountingHole_3mm" (id 2) (at 40.6908 90.6272 0)
      (effects (font (size 1.27 1.27)) hide)
    )
    (property "Datasheet" "~" (id 3) (at 40.6908 90.6272 0)
      (effects (font (size 1.27 1.27)) hide)
    )
  )

  (symbol (lib_id "power:+3.3V") (at 146.9644 129.8956 0) (unit 1)
    (in_bom yes) (on_board yes)
    (uuid d97f9f9f-fff8-410e-87ab-ef5c1f9ba5e2)
    (property "Reference" "#PWR0106" (id 0) (at 146.9644 133.7056 0)
      (effects (font (size 1.27 1.27)) hide)
    )
    (property "Value" "+3.3V" (id 1) (at 147.1168 125.4252 0))
    (property "Footprint" "" (id 2) (at 146.9644 129.8956 0)
      (effects (font (size 1.27 1.27)) hide)
    )
    (property "Datasheet" "" (id 3) (at 146.9644 129.8956 0)
      (effects (font (size 1.27 1.27)) hide)
    )
    (pin "1" (uuid 20a7f6e0-14da-480a-a407-87642edb9ade))
  )

  (symbol (lib_id "SFH2430:SFH_2430-Z") (at 107.0356 69.596 180) (unit 1)
    (in_bom yes) (on_board yes) (fields_autoplaced)
    (uuid e6e21e28-5b87-4f18-9845-b234eefd55d4)
    (property "Reference" "IC2" (id 0) (at 96.8756 59.69 0))
    (property "Value" "SFH_2430-Z" (id 1) (at 96.8756 62.23 0))
    (property "Footprint" "SFH2430:SFH2430" (id 2) (at 90.5256 72.136 0)
      (effects (font (size 1.27 1.27)) (justify left) hide)
    )
    (property "Datasheet" "https://datasheet.datasheetarchive.com/originals/distributors/DKDS-18/344320.pdf" (id 3) (at 90.5256 69.596 0)
      (effects (font (size 1.27 1.27)) (justify left) hide)
    )
    (property "Description" "Photodiodes PHOTODIODE (ALS) SMT Silicon Photodiode with V Characteristic" (id 4) (at 90.5256 67.056 0)
      (effects (font (size 1.27 1.27)) (justify left) hide)
    )
    (property "Height" "1.3" (id 5) (at 90.5256 64.516 0)
      (effects (font (size 1.27 1.27)) (justify left) hide)
    )
    (property "Mouser Part Number" "720-SFH2430-Z" (id 6) (at 90.5256 61.976 0)
      (effects (font (size 1.27 1.27)) (justify left) hide)
    )
    (property "Mouser Price/Stock" "https://www.mouser.co.uk/ProductDetail/OSRAM-Opto-Semiconductors/SFH-2430-Z?qs=K5ta8V%252BWhtZplGU0%252BI7tvA%3D%3D" (id 7) (at 90.5256 59.436 0)
      (effects (font (size 1.27 1.27)) (justify left) hide)
    )
    (property "Manufacturer_Name" "OSRAM" (id 8) (at 90.5256 56.896 0)
      (effects (font (size 1.27 1.27)) (justify left) hide)
    )
    (property "Manufacturer_Part_Number" "SFH 2430-Z" (id 9) (at 90.5256 54.356 0)
      (effects (font (size 1.27 1.27)) (justify left) hide)
    )
    (pin "1" (uuid 9b5a4427-31bd-4f5e-8e20-8a57d87845dd))
    (pin "2" (uuid cadad188-503f-4000-849b-729c0b1afd0f))
  )

  (symbol (lib_id "power:PWR_FLAG") (at 86.5124 96.4184 0) (unit 1)
    (in_bom yes) (on_board yes) (fields_autoplaced)
    (uuid ef533fc2-b06e-4fb0-bad6-5831fe8240f6)
    (property "Reference" "#FLG0102" (id 0) (at 86.5124 94.5134 0)
      (effects (font (size 1.27 1.27)) hide)
    )
    (property "Value" "PWR_FLAG" (id 1) (at 86.5124 91.44 0))
    (property "Footprint" "" (id 2) (at 86.5124 96.4184 0)
      (effects (font (size 1.27 1.27)) hide)
    )
    (property "Datasheet" "~" (id 3) (at 86.5124 96.4184 0)
      (effects (font (size 1.27 1.27)) hide)
    )
    (pin "1" (uuid f2eeb289-74f8-46da-801f-0aafb6af9995))
  )

  (symbol (lib_id "power:GND") (at 172.2628 109.5248 270) (unit 1)
    (in_bom yes) (on_board yes)
    (uuid f9121552-8c74-4191-959d-3cb8cb2ac991)
    (property "Reference" "#PWR0103" (id 0) (at 165.9128 109.5248 0)
      (effects (font (size 1.27 1.27)) hide)
    )
    (property "Value" "GND" (id 1) (at 165.4048 109.6264 90)
      (effects (font (size 1.27 1.27)) (justify left))
    )
    (property "Footprint" "" (id 2) (at 172.2628 109.5248 0)
      (effects (font (size 1.27 1.27)) hide)
    )
    (property "Datasheet" "" (id 3) (at 172.2628 109.5248 0)
      (effects (font (size 1.27 1.27)) hide)
    )
    (pin "1" (uuid 5483e496-0091-4a78-a8d6-7428f05304e0))
  )

  (sheet_instances
    (path "/" (page "1"))
  )

  (symbol_instances
    (path "/24ec63ca-04d3-4a13-83bf-b57fb455da98"
      (reference "#FLG0101") (unit 1) (value "PWR_FLAG") (footprint "")
    )
    (path "/ef533fc2-b06e-4fb0-bad6-5831fe8240f6"
      (reference "#FLG0102") (unit 1) (value "PWR_FLAG") (footprint "")
    )
    (path "/4cf7764b-d277-44f4-82d4-f33c22eb65ab"
      (reference "#PWR01") (unit 1) (value "GND") (footprint "")
    )
    (path "/596b86b4-65fa-47ca-9614-4f75bca4c762"
      (reference "#PWR02") (unit 1) (value "GND") (footprint "")
    )
    (path "/5c15ce3e-b822-434e-9649-e012dab833ed"
      (reference "#PWR03") (unit 1) (value "GND") (footprint "")
    )
    (path "/24587fcd-cc31-4cad-9b1b-ca9128ef77b0"
      (reference "#PWR04") (unit 1) (value "GND") (footprint "")
    )
    (path "/9ff6cec6-084d-4226-a193-70e960a252af"
      (reference "#PWR05") (unit 1) (value "+3.3V") (footprint "")
    )
    (path "/b2a9f409-eaca-4fbd-83ce-7334f0a6ed51"
      (reference "#PWR06") (unit 1) (value "GND") (footprint "")
    )
    (path "/9a6c11e2-95e1-44f3-9517-31f899b5aae2"
      (reference "#PWR0101") (unit 1) (value "+3.3V") (footprint "")
    )
    (path "/a78b8bf3-8413-411b-9720-d23a20532c49"
      (reference "#PWR0102") (unit 1) (value "GND") (footprint "")
    )
    (path "/f9121552-8c74-4191-959d-3cb8cb2ac991"
      (reference "#PWR0103") (unit 1) (value "GND") (footprint "")
    )
    (path "/256352e3-9c87-4744-8712-54d43e853184"
      (reference "#PWR0104") (unit 1) (value "GND") (footprint "")
    )
    (path "/0fdfb0ca-fb2e-49d4-924b-642c245af407"
      (reference "#PWR0105") (unit 1) (value "GND") (footprint "")
    )
    (path "/d97f9f9f-fff8-410e-87ab-ef5c1f9ba5e2"
      (reference "#PWR0106") (unit 1) (value "+3.3V") (footprint "")
    )
    (path "/102c4f15-f7f0-47b3-b463-90324a621426"
      (reference "C1") (unit 1) (value "10u") (footprint "Capacitor_SMD:C_0603_1608Metric_Pad1.08x0.95mm_HandSolder")
    )
    (path "/39359626-337e-4b41-b424-df5574ba1763"
      (reference "C2") (unit 1) (value "100n") (footprint "Capacitor_SMD:C_0603_1608Metric_Pad1.08x0.95mm_HandSolder")
    )
    (path "/a11ea8f7-3b1d-466a-a03d-fdf0b7a8fceb"
      (reference "C3") (unit 1) (value "100p") (footprint "Capacitor_SMD:C_0603_1608Metric_Pad1.08x0.95mm_HandSolder")
    )
    (path "/596a0134-78fe-4dbe-b5ad-ac5040289e55"
      (reference "C4") (unit 1) (value "100n") (footprint "Capacitor_SMD:C_0603_1608Metric_Pad1.08x0.95mm_HandSolder")
    )
    (path "/956f43ca-d962-4f66-809d-7ccdbee7cad2"
      (reference "C5") (unit 1) (value "100p") (footprint "Capacitor_SMD:C_0603_1608Metric_Pad1.08x0.95mm_HandSolder")
    )
    (path "/0a80616c-6898-4cc5-a3f0-bc547bb20ee9"
      (reference "C6") (unit 1) (value "100n") (footprint "Capacitor_SMD:C_0603_1608Metric_Pad1.08x0.95mm_HandSolder")
    )
    (path "/471f517c-6d52-459f-9d7a-aedf176fc9e0"
      (reference "H1") (unit 1) (value "MountingHole") (footprint "MountingHole:MountingHole_3mm")
    )
    (path "/ccbccc68-d102-4809-a3c8-c848af50e594"
      (reference "H2") (unit 1) (value "MountingHole") (footprint "MountingHole:MountingHole_3mm")
    )
    (path "/83d289e8-09e9-450f-aa29-e4a965c20aed"
      (reference "H3") (unit 1) (value "MountingHole") (footprint "MountingHole:MountingHole_3mm")
    )
    (path "/773a6110-b6de-4760-af86-4512c04abc39"
      (reference "H4") (unit 1) (value "MountingHole") (footprint "MountingHole:MountingHole_3mm")
    )
    (path "/51f6fa2f-597e-4858-b790-78a6a3037757"
      (reference "IC1") (unit 1) (value "TLV2254AIDR") (footprint "TLV2254AIDR:TLV2254AIDR")
    )
    (path "/e6e21e28-5b87-4f18-9845-b234eefd55d4"
      (reference "IC2") (unit 1) (value "SFH_2430-Z") (footprint "SFH2430:SFH2430")
    )
    (path "/c42ea107-1c70-4c02-b72d-5d09545e9247"
      (reference "J1") (unit 1) (value "Conn_01x03_Male") (footprint "Connector_PinHeader_2.54mm:PinHeader_1x03_P2.54mm_Vertical")
    )
    (path "/3593ac02-64b6-4a09-b5ce-5df341f1aa56"
      (reference "J2") (unit 1) (value "Conn_01x03_Male") (footprint "Connector_PinHeader_2.54mm:PinHeader_1x03_P2.54mm_Vertical")
    )
    (path "/ca221485-8dbb-436e-8b3e-94c2d532aee3"
      (reference "J3") (unit 1) (value "Conn_01x03_Male") (footprint "Connector_PinHeader_2.54mm:PinHeader_1x03_P2.54mm_Vertical")
    )
    (path "/79fc1ef9-e921-4832-95d3-5ae7ff6b03fb"
      (reference "J4") (unit 1) (value "Conn_01x03_Male") (footprint "Connector_PinHeader_2.54mm:PinHeader_1x03_P2.54mm_Vertical")
    )
    (path "/609c70f4-1479-4ca4-a93e-8230d97706fb"
      (reference "R1") (unit 1) (value "3.97k") (footprint "Resistor_SMD:R_0603_1608Metric_Pad0.98x0.95mm_HandSolder")
    )
    (path "/b08a5218-3c22-4695-ab71-ac0793f0ef12"
      (reference "R2") (unit 1) (value "7.87k") (footprint "Resistor_SMD:R_0603_1608Metric_Pad0.98x0.95mm_HandSolder")
    )
    (path "/38ecdee2-49d2-4ec9-b664-af6f843820c3"
      (reference "R3") (unit 1) (value "3.97k") (footprint "Resistor_SMD:R_0603_1608Metric_Pad0.98x0.95mm_HandSolder")
    )
    (path "/702c6266-7281-4661-be01-a57edaa7a2ef"
      (reference "R4") (unit 1) (value "7.87k") (footprint "Resistor_SMD:R_0603_1608Metric_Pad0.98x0.95mm_HandSolder")
    )
  )
)
